##TITLE=c13 ikalashn
7174-N
25.10.2024
##JCAMPDX= 6.0         $$ Bruker NMR JCAMP-DX V2.0
##DATA TYPE= NMR SPECTRUM
##DATA CLASS= NTUPLES
##ORIGIN= UXNMR, Bruker Analytische Messtechnik GmbH
##OWNER= root
$$ TOPSPIN		Version 1.3
$$ 2024-10-25 09:36:10.312 +0400  Irina@DPX200
$$ Compression mode = diff/dup
##.OBSERVE FREQUENCY= 50.3282639994
##.OBSERVE NUCLEUS= ^13C
##.ACQUISITION MODE= SIMULTANEOUS
##.ACQUISITION SCHEME= undefined
##.AVERAGES= 19020
##.DIGITISER RES= 17
##SPECTROMETER/DATA SYSTEM= spect
##.PULSE SEQUENCE= zgpg
##.SOLVENT NAME= CDCl3
##.SHIFT REFERENCE= INTERNAL, CDCl3, 1, 234.9338
##AUDIT TRAIL= $$ (NUMBER, WHEN, WHO, WHERE, WHAT)
$$ ##TITLE= Audit trail, TOPSPIN		Version 1.3
$$ ##JCAMPDX= 5.01
$$ ##ORIGIN= Bruker BioSpin GmbH
$$ ##OWNER= Irina
$$ $$ F:/spectra/data/iren/nmr/c13zvl/1/pdata/1/auditp.txt
$$ ##AUDIT TRAIL=  $$ (NUMBER, WHEN, WHO, WHERE, VERSION, WHAT)
(   1,<2024-10-25 09:35:16.546 +0400>,<Irina>,<DPX200>,<TOPSPIN 1.3>,
      <created by zg
	started at 2024-10-24 15:47:40.390 +0400,
	POWCHK disabled, PULCHK disabled
       terminated by command 'halt'
       configuration hash MD5:
       BE 6D 3F 07 2A EA 11 49 91 17 2B D3 AF B3 58 0D
       data hash MD5: 32K
       1F 50 88 6A A3 62 47 DF E2 49 DB CC AB 41 35 20>)
(   2,<2024-10-25 09:35:33.843 +0400>,<Irina>,<DPX200>,<TOPSPIN 1.3>,
      <Start of raw data processing
       efp BC_mod = 2 LB = 2.5 FT_mod = 6 PKNL = 1 PHC0 = 131.4109 PHC1 = 33.00056 SI = 32K 
       data hash MD5: 32K
       EB 96 E8 97 5E AA B9 5B 5B 40 35 37 3B 0E 39 11>)
(   3,<2024-10-25 09:35:35.968 +0400>,<Irina>,<DPX200>,<TOPSPIN 1.3>,
      <apk 
       data hash MD5: 32K
       C6 4E 90 54 57 6D 04 88 56 A5 5D FA D7 CD 86 AD>)
(   4,<2024-10-25 09:35:37.656 +0400>,<Irina>,<DPX200>,<TOPSPIN 1.3>,
      <abs n ABSG = 5 
       data hash MD5: 32K
       71 32 18 D6 09 6D 45 EE 4E BD 63 C9 14 49 A9 76>)
(   5,<2024-10-25 09:35:54.828 +0400>,<Irina>,<DPX200>,<TOPSPIN 1.3>,
      <pk fgphup PHC0 = 7.2 PHC1 = 0 
       data hash MD5: 32K
       E5 3D 4E 4B 57 97 D5 4E 3D 0F 7D 1C 67 CF 62 CA>)
(   6,<2024-10-25 09:35:56.593 +0400>,<Irina>,<DPX200>,<TOPSPIN 1.3>,
      <abs n ABSG = 5 
       data hash MD5: 32K
       E2 56 D8 44 DD B5 B4 BE C6 85 39 51 AE 8F 34 15>)
$$ ##END=
$$ 
$$ $$ hash MD5
$$ $$ F9 74 A1 7E 1C 6B F6 32 C9 B6 F5 14 74 74 6C 9C
##$RELAX= 
##$RELAX= 
##$RELAX= 
##$RELAX= 
##$RELAX= 
##$RELAX= 
##$RELAX= 
##$RELAX= 
##$RELAX= 
$$ Bruker specific parameters
$$ --------------------------
##$DU= <F:/spectra>
##$EXPNO= 1
##$NAME= <c13zvl>
##$PROCNO= 1
##$TYPE= <nmr>
##$USER= <iren>
##$AMP= (0..31)
100 100 100 100 100 100 100 100 100 100 100 100 100 100 100 100 100 100 
100 100 100 100 100 100 100 100 100 100 100 100 100 100 
##$ANAVPT= -1
##$AQSEQ= 0
##$AQ_mod= 1
##$AUNM= <au_zg>
##$AUTOPOS= <>
##$BF1= 50.322709
##$BF2= 200.13
##$BF3= 200.13
##$BF4= 200.13
##$BF5= 200.13
##$BF6= 200.13
##$BF7= 200.13
##$BF8= 200.13
##$BYTORDA= 1
##$CFDGTYP= 0
##$CFRGTYP= 5
##$CHEMSTR= <none>
$$ [...]
##$SW= 249.617472808154
##$SWIBOX= (0..15)
0 1 3 0 0 0 0 0 0 0 0 0 0 0 0 0 
##$SW_h= 12562.8140703518
##$TD= 32768
##$TD0= 1
##$TE= 300
##$TE2= 300
##$TE3= 300
##$TEG= 300
##$TL= (0..7)
120 120 120 120 120 120 120 120 
##$TP= (0..7)
150 150 150 150 150 150 150 150 
##$TP07= 0
##$TPNAME0= <>
##$TPNAME1= <>
##$TPNAME2= <>
##$TPNAME3= <>
##$TPNAME4= <>
##$TPNAME5= <>
##$TPNAME6= <>
##$TPNAME7= <>
##$TPOAL= (0..7)
0.5 0.5 0.5 0.5 0.5 0.5 0.5 0.5 
##$TPOFFS= (0..7)
0 0 0 0 0 0 0 0 
##$TUNHIN= 0
##$TUNHOUT= 0
##$TUNXOUT= 0
##$USERA1= <user>
##$USERA2= <user>
##$USERA3= <user>
##$USERA4= <user>
##$USERA5= <user>
##$V9= 5
##$VALIST= <valist>
##$VCLIST= <CCCCCCCCCCCCCCC>
##$VD= 0
##$VDLIST= <DDDDDDDDDDDDDDD>
##$VPLIST= <PPPPPPPPPPPPPPP>
##$VTLIST= <TTTTTTTTTTTTTTT>
##$WBST= 1024
##$WBSW= 4
##$XGAIN= (0..3)
0 0 0 0 
##$XL= 0
##$YL= 0
##$YMAX_a= 4049223
##$YMIN_a= -22459159
##$ZGOPTNS= <>
##$ZL1= 120
##$ZL2= 120
##$ZL3= 120
##$ZL4= 120
##$ABSF1= 234.9338
##$ABSF2= -14.71115
##$ABSG= 5
##$ABSL= 3
##$ALPHA= 0
##$AQORDER= 0
##$ASSFAC= 0
##$ASSFACI= 0
##$ASSFACX= 0
##$ASSWID= 0
##$AUNMP= <proc_1d>
##$AXLEFT= 0
##$AXRIGHT= 0
##$AXTYPE= 0
##$AXUNIT= <>
##$AZFE= 0.1
##$AZFW= 0.5
##$BCFW= 0
##$BC_mod= 2
##$BYTORDP= 0
##$COROFFS= 0
##$CY= -3
##$DATMOD= 1
##$DC= 0
##$DFILT= <>
##$DTYPP= 0
##$F1P= 0
##$F2P= 0
##$FCOR= 0.5
##$FTSIZE= 32768
##$FT_mod= 6
##$GAMMA= 0
##$GB= 0
##$INTBC= 1
##$INTSCL= 1.406111e-010
##$ISEN= 30
##$LB= 2.5
##$LEV0= 0
##$LPBIN= 0
##$MAXI= 7.640843
##$MC2= 0
##$MEAN= 0
##$ME_mod= 0
##$MI= 1.154659
##$NCOEF= 0
##$NC_proc= -4
##$NLEV= 6
##$NOISF1= 0
##$NOISF2= 0
##$NSP= 0
##$NTH_PI= 0
##$NZP= 0
##$OFFSET= 234.9338
##$PC= 1.4
##$PHC0= 146.0159
##$PHC1= 19.05594
##$PH_mod= 1
##$PKNL= yes
##$PPARMOD= 0
##$PPDIAG= 0
##$PPIPTYP= 0
##$PPMPNUM= 100
##$PPRESOL= 1
##$PSCAL= 0
##$PSIGN= 0
##$REVERSE= no
##$SF= 50.3227228988183
##$SI= 32768
##$SIGF1= 0
##$SIGF2= 0
##$SINO= 80
##$SIOLD= 32768
##$SREGLST= <13C.CDCl3>
##$SSB= 0
##$STSI= 32768
##$STSR= 0
##$SW_p= 12562.8140703518
##$SYMM= 0
##$S_DEV= 0
##$TDeff= 32768
##$TDoff= 0
##$TI= <>
##$TILT= no
##$TM1= 0
##$TM2= 0
##$TOPLEV= 0
##$USERP1= <user>
##$USERP2= <user>
##$USERP3= <user>
##$USERP4= <user>
##$USERP5= <user>
##$WDW= 1
##$XDIM= 32768
##$YMAX_p= 57346600
##$YMIN_p= -1590528
$$ End of Bruker specific parameters
$$ ---------------------------------
##NTUPLES= NMR SPECTRUM
##VAR_NAME=  FREQUENCY,     SPECTRUM/REAL,   SPECTRUM/IMAG
##SYMBOL=    X,             R,               I
##VAR_TYPE=  INDEPENDENT,   DEPENDENT,       DEPENDENT
##VAR_FORM=  AFFN,          ASDF,            ASDF
##VAR_DIM=   32768,         32768,           32768
##UNITS=     HZ,            ARBITRARY UNITS, ARBITRARY UNITS
##FACTOR=    0.383398360251222, 1,           1
##FIRST=     12562.8140703518, -284019,      179361544
##LAST=      0,             157514,          -145038372
##MIN=       0,             -1590528,        0
##MAX=       12562.8140703518, 57346600,     0
$$ Real data points
##PAGE= N=1
##DATA TABLE= (X++(R..R)), XYDATA
$$ [...]
$$ plain form
2976 -187989 -358378 -514714 -643807 -745225 -793448 -754808 -634865 -480031 -336215 -221622
2966 -221622 -133620 -72789 -45127 -56525 -117671 -219945 -315257 -364904 -381066 -400299 -443724
2955 -443724 -513369 -594311 -672258 -745823 -789184 -751808 -623978 -456831 -311469 -193926 -72560
2944 -72560 61280 196215 310501 380997 417707 455871 511532 583906 671220 755989 810381
2933 810381 826152 824628 821955 801937 717257 542531 338670 199413 164471 203216 251819
2922 251819 260386 214047 149215 109396 88420 59714 6564 -82593 -195245 -291077 -337808 -339206
2910 -339206 -329757 -337489 -346991 -322680 -246561 -135895 -44061 -22157 -65896 -110351 -95319 -30679
2898 -30679 19692 10218 -54672 -128771 -184077 -238582 -300760 -338690 -313586 -227866 -137905 -98873
$$ packed form
2976a87989j70389j56336j29093j01418m8223L8640J19943J54834J43816J14593
2966b21622Q8002O0831K7662j1398o1146j02274r5312m9647j6162j9233m3425
2955d43724o9645q0942p7947p3565m3361L7376J27830J67147J45362J17543J21366
2944g2560J33840J34935J14286P0496L6710L8164N5661P2374Q7314Q4769N4392
2933H10381J5771j524k673k0018q4680j74726k03861j39257l4942L8745M8603
2922B51819Q567m6339o4832l9819k0976k8706n3150q9157j12652r5832m6731j398
2910c39206R449p732r502K4311P6119J10666R1834K1904m3739m4455J5032O4640
2898c0679N0371r474o4890p4099n5306n4505o2178l7930K5104Q5720Q9961L9032
$$ plain form
2886 -98873 -116047 -168863 -234537 -304536 -391147 -504526 -636906 -746480 -775879 -712531 -604230
2875 -604230 -506334 -437906 -396563 -380841 -378564 -379236 -352980 -256549 -100022 58066 172166 233093
2863 233093 247896 238666 251300 330760 460414 579225 654532 659334 580633 470216 390174
2852 390174 344248 295169 218362 131454 57345 8742 18212 106763 242010 366172 444240
2841 444240 465311 431011 363314 289157 215916 134633 50580 -10019 -29079 -26694 -46337 -100404
2829 -100404 -162339 -193831 -198096 -213421 -240872 -250203 -257138 -302865 -387579 -470532 -496346 -446348
2817 -446348 -362538 -299015 -269733 -265393 -280534 -302561 -314971 -309703 -291119 -287752 -312762 -339055
2805 -339055 -319263 -222656 -76638 50791 98146 52957 -53274 -181539 -277693 -288212 -229169
$$ packed form
2886i8873j7174n2816o5674o9999q6611j13379j32380j09574k9399O3348J08301
2875f04230R7896O8428M1343J5722K277o72K6256R6431J56527J58088J14100O0927
2863B33093J4803r230J2634P9460J29654J18811P5307M802p8701j10417q0042
2852C90174m5926m9079p6807q6908p4109m8603R470Q8551J35247J24162P8068
2841D44240K1071l4300o7697p4157p3241q1283q4053o0599j9060K385j9643n4067
2829a00404o1935l1492m265j5325k7451r331o935m5727q4714q2953k5814M9998
2817d46348Q3810O3523K9282M340j5141k2027j2410N268J8584L367k5010k6293
2805c39055J9792R6607J46018J27429M7355m5189j06231j28265r6154j0519N9043
$$ plain form
2794 -229169 -164453 -115688 -55262 44982 168405 259269 259034 151780 3467 -106603 -177750
2783 -177750 -235874 -291193 -381340 -544301 -730549 -835243 -832990 -786102 -758161 -768260 -798756
2772 -798756 -826408 -847424 -873108 -898158 -889992 -828284 -715871 -564802 -408410 -278230 -171164
2761 -171164 -81875 -26034 -16113 -35384 -63219 -84824 -61736 54972 264886 482971 615924
2750 615924 660584 671912 658096 595916 495371 381397 277527 206871 177111 161008 128491
2739 128491 94792 94152 140274 220532 315790 399170 454156 485508 485303 426173 297399 134237
2727 134237 -6917 -77928 -73606 -26534 35276 86947 117137 129557 135098 144521 144418 123463
2715 123463 113992 157377 251687 348348 398810 390977 336203 249556 144101 25214 -100971
$$ packed form
2794b29169O4716M8765O0426J00244J23423R0864k35j07254j48313j10070p1147
2783a77750n8124n5319r0147j62961j86248j04694K253M6888K7941j0099l0496
2772g98756k7652k1016k5684k5050Q166O1708J12413J51069J56392J30180J07066
2761a71164Q9289N5841R921j9271k7835k1605K3088J16708K09914K18085J32953
2750F15924M4660J1328j3816o2180j00545j13974j03870p0656k9760j6103l2517
2739A28491l3699o40M6122Q0258R5258Q3380N4986L1352k05n9130j28774j63162
2727A34237j41154p1011M322M7072O1810N1671L0190J2420N541R423j03k0955
2715A23463r471M3385R4310R6661N0462p833n4774q6647j05455j18887j26185
$$ plain form
2704 -100971 -202617 -263069 -317144 -399387 -494020 -560794 -598363 -633254 -669560 -696010 -699025 -676217
2692 -676217 -634682 -573589 -491293 -392289 -302207 -251391 -243376 -253065 -254533 -230014 -164267 -58350
2680 -58350 80002 228823 325249 311067 183508 -6404 -216785 -426777 -587431 -652428
2670 -652428 -627450 -567764 -537103 -544436 -557634 -557234 -542128 -527890 -526773 -541781 -553330 -541606
2658 -541606 -508748 -456519 -391258 -310342 -216605 -142603 -122477 -163759 -230125 -265098 -226787 -128500
2646 -128500 -33166 11582 13808 35761 118227 208326 224217 166961 95681 26508 -33122 -51659
2634 -51659 -26295 18229 51349 41782 707 -38269 -68335 -105572 -180617 -316285 -490765 -647248
2622 -647248 -739377 -751778 -687644 -570842 -443409 -327908 -215162 -108198 -8947 103058
$$ packed form
2704a00971j01646o0452n4075q2243r4633o6774l7569l4891l6306k6450l015K2808
2692f76217M1535O1093Q2296R9004R0082N0816Q015r689j468K4519O5747J05917
2680e8350J38352J48821R6426j4182j27559j89912k10381k09992j60654o4997
2670f52428K4978N9686L0661p333j3198M00J5106J4238J117j5008j1549J1724
2658e41606L2858N2229O5261Q0916R3737P4002K0126m1282o6366l4973L8311R8287
2646a28500R5334M4748K226K1953Q2466R0099J5891n7256p1280o9173n9630j8537
2634e1659K5364M4524L3120r567m1075l8976l0066l7237p5045j35668j74480j56483
2622f47248r2129j2401O4134J16802J27433J15501J12746J06964R9251J12005
$$ plain form
2612 103058 215747 298879 333190 307542 238345 145414 41194 -40894 -60972 -21963 26431
2601 26431 43082 32146 26987 64352 180660 374907 587720 750076 833449 855895 845683
2590 845683 809052 723769 560088 319170 55542 -162161 -303246 -380627 -423706 -448163 -464433
2579 -464433 -486841 -526166 -584972 -665105 -754720 -804573 -763142 -633151 -480882 -381100 -355705
2568 -355705 -379802 -392451 -333849 -211706 -83255 20059 108329 204972 299885 346618 335523
2557 335523 305531 289406 285135 283528 287332 296676 305413 307519 296049 287022 311133 363787 421576
2544 421576 483730 542836 584639 619307 648759 675261 717003 761374 756125 663624 494950 281847
2532 281847 64443 -111689 -219629 -260884 -253962 -210784 -148390 -101479 -109512 -183118 -290335
$$ packed form
2612A03058J12689Q3132L4311k5648o9197r2931j04220q2088k0078L9009M8394
2601B6431J6651j0936n159L7365J16308J94247K12813J62356Q3373K2446j0212
2590H45683l6631q5283j63681k40918k63628k17703j41085p7381m3079k4457j6270
2579d64433k2408l9325n8806q0133q9615m9853M1431J29991J52269R9782K5395
2568c55705k4097j2649N8602J22143J28451J03314Q8270R6643R4913M6733j1095
2557C35523k9992j6125m271j607L804R344Q737K106j1470r027K4111N2654N7789
2544D21576O2154N9106M1803L4668K9452K6502M1742M4371n249r2501j68674k13103
2532B81847k17404j76132j07940m1255O922M3178O2394M6911q033p3606j07217
$$ plain form
2521 -290335 -389416 -465510 -519280 -537601 -504918 -445660 -404823 -390652 -368570 -297909 -177975
2510 -177975 -47907 61894 150637 205073 190775 110752 5826 -99503 -201297 -305719
2500 -305719 -407068 -487322 -532045 -530453 -485298 -409244 -312461 -204978 -93115 27929 147540
2489 147540 227369 264801 314816 406043 505632 554924 516426 424148 351324 322894 301440 244021
2477 244021 144054 6157 -167582 -360591 -551844 -709179 -794338 -806896 -788503 -771566 -757772
2466 -757772 -721228 -658520 -592665 -525813 -457780 -411753 -411489 -468778 -574152 -679190 -728643 -703527
2454 -703527 -634050 -571173 -530317 -484796 -433435 -383844 -338493 -312495 -281283 -207870 -123588 -74542
2442 -74542 -63834 -65925 -38631 46615 167917 286552 390995 490899 589509 665806 681976
$$ packed form
2521b90335r9081p6094n3770j8321L2683N9258M0837J4171K2082P0661J19934
2510a77975J30068J09801Q8743N4436j4298q0023j04926j05329j01794j04422
2500c05719j01349q0254m4723J592M5155P6054R6783J07483J11863J21044J19611
2489A47540P9829L7432N0015R1227R9589M9292l8498r2278p2824k8430k1454n7419
2477B44021r9967j37897j73739j93009j91253j57335q5159j2558J8393J6937J3794
2466g57772L6544O2708O5855O6852O8033M6027K64n7289j05374j05038m9453K5116
2454g03527O9477O2877M0856M5521N1361M9591M5351K5998L1212P3413Q4282M9046
2442g4542J0708k091K7294Q5246J21302J18635J04443R9904R8610P6297J6170
$$ plain form
2431 681976 626060 508407 333203 123677 -59057 -143757 -108343 3972 142294 281193
2421 281193 411894 519982 572458 554614 492033 413173 331060 266873 255380 305329 376796
2410 376796 420198 419441 396306 371311 359504 365677 354006 297353 196871 49990 -130030 -312160
2398 -312160 -464848 -546953 -529203 -424985 -278357 -136419 -32697 5127 -13479 -34083 265
2387 265 103416 236833 357796 430360 448230 434240 424242 443638 479670 499627 471399 393736
2375 393736 302412 227291 189816 191970 192767 160828 117355 83905 50985 19008 3095 13873
2363 13873 60064 132167 189134 206344 197559 190242 210326 273861 365048 438436 455281 408170
2351 408170 305518 155117 -26711 -200644 -331129 -404495 -409121 -346466 -245748 -152475 -88914
$$ packed form
2431F81976n5916j17653j75204k09526j82734q4700L5414J12315J38322J38899
2421B81193J30701J08088N2476j7844o2581p8860q2113o4187j1493M9949P1467
2410C76796M3402p57k3135k4995j1807O173j1671n6653j00482j46881j80020j82130
2398c12160j52688q2105J7750J04218J46628J41938J03722L7824j8606k0604L4348
2387B65J03151J33417J20963P2564J7870j3990r998J9396L6032J9957k8228p7663
2375C93736r1324p5121l7475K154P97l1939m3473l3450l2920l1977j5913J0778
2363A3873M6191P2103N6967J7210q785p317K0084O3535R1187P3388J6845m7111
2351D08170j02652j50401j81828j73933j30485p3366m626O2655J00718R3273O3561
$$ plain form
2340 -88914 -43280 -12977 -1994 -9541 -32694 -57638 -65282 -58245 -63264 -82573 -96634 -98725 -103190
2327 -103190 -136164 -188746 -226291 -229561 -201442 -155777 -94157 -29294 16325 41529 48621 35855
2315 35855 18123 14333 9531 -29482 -96364 -159449 -199004 -197564 -139694 -48084 23482 53578
2303 53578 54152 23342 -50893 -141336 -173845 -102955 34043 159454 233798 265526 263020 231748
2291 231748 193929 162013 122763 82173 71553 86444 99334 86461 30856 -50736 -115021 -135495
2279 -135495 -109089 -26454 105886 244744 335309 351529 308621 231458 131585 28574 -50087
2268 -50087 -80131 -48812 28018 109556 157216 159611 126941 60291 -54547 -205967 -361839
2257 -361839 -504322 -603815 -619485 -551165 -463774 -416634 -396473 -369283 -328602 -276300 -219163
$$ packed form
2340h8914M5634L0303J0983p547k3153k4944p644P037n019j9309j4061k091m465
2327a03190l2974n2582l7545l270K8119M5665O1620O4863M5619K5204P092j2766
2315C5855j7732l790m802l9013o6882o3085l9555J440N7870R1610P1566L0096
2303E3578N74l0810p4235r0443l2509P0890J36998J25411P4344L1728k506l1272
2291B31748l7819l1916l9250m0590j0620J4891J2890j2873n5605q1592o4285k0474
2279a35495K6406Q2635J32340J38858R0565J6220m2908p7163r9873j03011p8661
2268e0087l0044L1319P6830Q1538M7660K395l2670o6650j14838j51420j55872
2257c61839j42483r9493j5670O8320Q7391M7140K0161K7190M0681N2302N7137
$$ plain form
2246 -219163 -172531 -125372 -61129 -6134 27396 75620 164807 269014 348286 394297 423217
2235 423217 451690 465959 445710 407752 376082 320412 179569 -41325 -251347 -361569 -368874
2224 -368874 -352650 -374554 -407773 -406487 -378832 -365488 -397171 -481770 -610026 -755189 -876552
2213 -876552 -954739 -985404 -959335 -877405 -761977 -636645 -522630 -434781 -386544 -412618 -523789
2202 -523789 -664933 -761327 -767282 -674672 -529985 -419575 -401093 -479680 -612073 -734121 -811987
2191 -811987 -844064 -827716 -757191 -642562 -516808 -407336 -329649 -293283 -300534 -357835 -436996
2180 -436996 -483490 -468702 -397185 -295153 -187593 -80401 12498 69265 96680 135844 200859
2169 200859 249047 246176 201785 142647 85934 14158 -106157 -267339 -418833 -515048 -538244
$$ packed form
2246b19163M6632M7159O4243N4995L3530M8224Q9187J04207P9272M6011K8920
2235D23217K8473J4269k0249l7958l1670n5670j40843k20894k10022j10222p305
2224c68874J6224k1904l3219J286K7655J3344l1683q4599j28256j45163j21363
2213h76552p8187l0665K6069Q1930J15428J25332J14015Q7849M8237k6074j11171
2202e23789j41144r6394n955R2610J44687J10410J8482p8587j32393j22048p7866
2191h11987l2077J6348P0525J14629J25754J09472P7687L6366p251n7301p9161
2180d36996m6494J4788P1517J02032J07560J07192R2899N6767K7415L9164O5015
2169B00859M8188k871m4391n9138n6713p1776j20315j61182j51494r6215k3196
$$ plain form
2158 -538244 -490817 -371326 -198020 -29050 97391 193039 276143 339796 351906 290562 185806
2147 185806 72731 -51111 -183245 -281721 -298908 -225464 -93257 53713 178391 247261
2137 247261 242655 193440 159577 196595 311061 456348 568232 608029 579186 499094 401714
2126 401714 330933 303533 319266 366393 403692 395559 348492 281864 205205 147262 137185 164975
2114 164975 197697 216521 225989 237755 258642 279319 272957 226351 173589 179466 257067 353371
2102 353371 416477 439566 429696 387347 328803 269916 183467 45797 -104629 -207601 -239284
2091 -239284 -211177 -161161 -130960 -113558 -77861 -29894 7911 26945 17250 -15716 -32640 -14909
2079 -14909 3291 -15513 -69149 -128125 -178804 -231502 -289357 -327177 -319718 -277138 -224501 -162662
$$ packed form
2158e38244M7427J19491J73306J68970J26441R5648Q3104O3653J2110o1344j04756
2147A85806j13075j23842j32134r8476j7187P3444J32207J46970J24678O8870
2137B47261m606m9215l3863L7018J14466J45287J11884L9797k8843q0092r7380
2126D01714p0781k7400J5733M7127L7299q133m7067o6628p6659n7943j0077K7790
2114A64975L2722J8824R468J1766K0887K0677o362m6606n2762N877P7601R6304
2102C53371O3106K3089r870m2349n8544n8887q6449j37670j50426j02972l1683
2091b39284K8107N0016L0201J7402L5697M7967L7805J9034r695l2966j6924J7731
2079a4909J8200j8804n3636n8976n0679n2698n7855l7820P459M2580N2637O1839
$$ plain form
2067 -162662 -93699 -20079 69905 170305 244648 267834 239658 161271 56062 -36939 -85080
2056 -85080 -66668 -400 67482 108299 121159 103997 27457 -122301 -302459 -437950 -478086
2045 -478086 -440968 -384077 -332016 -276459 -219107 -177247 -150917 -123208 -97866 -102494 -154433 -240825
2033 -240825 -322192 -354157 -306197 -174353 4572 171494 294472 357698 346384 300494 311606
2022 311606 418049 573249 705076 772969 776585 723217 618239 484868 359752 280516 254377
2011 254377 245884 236323 235104 246490 262544 256877 195801 85298 -34499 -127777 -173496 -185973
1999 -185973 -182595 -149341 -86443 -25434 25494 71993 98097 95168 87260 76522 15058 -115903
1987 -115903 -265082 -380404 -459142 -510790 -509798 -416668 -241480 -68252 33644 80114 108694
$$ packed form
2067a62662O8963P3620Q9984J00400P4343K3186k8176p8387j05209r3001m8141
2056h5080J8412O6268O7882M0817J2860j7162p6540j49758j80158j35491m0136
2045d78086L7118N6891N2061N5557N7352M1860K6330K7709K5342m628n1939q6392
2033b40825q1367l1965M7960J31844J78925J66922J22978O3226j1314m5890J1112
2022C11606J06443J55200J31827O7893L616n3368j04978j33371j25116p9236k6139
2011B54377q493r561j219J1386J6054n667o1076j10503j19797r3278m5719j2477
1999a85973L378L3254O2898O1009N0928M6499K6104k929p908j0738o1464j30961
1987a15903j49179j15322p8738n1648R92R3130J75188J73228J01896M6470K8580
$$ plain form
1976 108694 113593 81804 43069 16295 -28876 -114843 -222045 -325938 -418439 -470842 -451803
1965 -451803 -363054 -222826 -72964 26954 54594 58304 117823 272763 480678 659437 768751
1954 768751 824205 870529 949143 1054117 1127960 1109541 996011 831838 659622 509260 383453
1943 383453 269237 183104 133111 92203 49072 24787 46965 125621 233074 314009 357971
1932 357971 397814 427134 414093 377155 356998 353097 338743 299046 250070 215762 187994 133369
1920 133369 20914 -168114 -414880 -660852 -840066 -923812 -935214 -898569 -812195 -696380
1910 -696380 -603503 -562562 -562523 -593427 -659341 -766455 -899087 -1011811 -1052996 -1000199 -876870
1899 -876870 -726788 -558062 -340971 -78743 146524 259924 257379 155459 -16632 -184036
$$ packed form
1976A08694M899l1789l8735k6774m5171q5967j07202j03893r2501n2403J9039
1965d51803Q8749J40228J49862R9918K7640L710N9519J54940K07915J78759J09314
1954G68751N5454M6324P8614J04974P3843j8419j13530j64173j72216j50362j25807
1943C83453j14216q6133m9993m0908m3131k4285K2178P8656J07453Q0935M3962
1932C57971L9843K9320j3041l6938k0157l901j4354l9697m8976l4308k7768n4625
1920A33369j12455j89028k46766k45972j79214q3746j1402L6645Q6374J15815
1910f96380R2877M0941L9l0904o5914j07114j32632j12724m1185N2797J23329
1899h76870J50082J68726K17091K62228K25267J13400k545j01920j72091j67404
$$ plain form
1889 -184036 -254671 -197593 -46642 139484 292966 380005 408926 425627 477677 556787 601726
1878 601726 563767 471589 382003 306944 227464 141667 69258 20482 -12616 -26611 1365 73443
1866 73443 154703 205956 226673 249374 292144 341008 379547 424909 509902 624152 725586
1855 725586 783918 779139 692569 528739 336986 173860 45100 -89796 -258523 -434789
1845 -434789 -582919 -709473 -812328 -862840 -854313 -812343 -766027 -722083 -662683 -570057 -457378
1834 -457378 -379858 -385488 -464873 -565074 -615486 -594198 -552852 -543549 -567079 -586201 -566832 -493885
1822 -493885 -379102 -277574 -212576 -144586 -68519 -33937 -55098 -83291 -89933 -99489 -130391 -150185
1810 -150185 -131836 -106363 -133079 -212677 -270878 -258986 -194395 -95481 45603 214160 376917
$$ packed form
1889a84036p0635N7078J50951J86126J53482Q7039K8921J6701N2050P9110M4939
1878F01726l7959r2178q9586p5059p9480q5797p2409m8776l3098j3995K7976P2078
1866G3443Q1260N1253K0717K2701M2770M8864L8539M5362Q4993J14250J01434
1855G25586N8332m779q6570j63830j91753j63126j28760j34896j68727j76266
1845d34789j48130j26554j02855n0512Q527M1970M6316M3944N9400R2626J12679
1834d57378P7520n630p9385j00201n0412K1288M1346R303k3530j9122J9369P2947
1822d93885J14783J01528O4998O7990P6067L4582k1161k8193o642r556l0902j9794
1810a50185J8349K5473k6716p9598n8201J1892O4591R8914J41084J68557J62757
$$ plain form
1799 376917 532673 681634 788788 834708 825960 753303 621412 476529 374327 335910 332553
1788 332553 319479 252068 108617 -62024 -174718 -199990 -171003 -134017 -136337 -209460 -335104
1777 -335104 -460237 -541365 -561821 -526221 -461903 -407075 -379663 -371362 -377952 -397532 -407965 -389520
1765 -389520 -328002 -226373 -103939 25095 151713 271903 374450 431436 421501 352850 262255
1754 262255 208594 229529 285447 302778 263589 205429 180174 210629 255992 255201 192971 90802
1742 90802 -23241 -109834 -132303 -107455 -87962 -88046 -64199 12881 99515 126363 69754 -46928
1730 -46928 -189140 -341366 -499846 -642335 -731946 -761507 -752952 -715818 -660708 -613336 -591120
1719 -591120 -590014 -595520 -584652 -546902 -484460 -410237 -333839 -263462 -217342 -200606 -212079 -252218
$$ packed form
1799C76917J55756J48961J07154M5920q748p2657j31891j44883j02202l8417l357
1788C32553j3074o7411j43451j70641j12694k5272K8987L6986k320p3123j25644
1777c35104j25133q1128k0456L5600O4318N4828K7412Q301o590j9580j0433J8445
1765c89520O1518J01629J22434J29034J26618J20190J02547N6986r935o8651r0595
1754B62255n3661K0935N5918J7331l9189n8160k5255L0455M5363p91o2230j02169
1742I0802j14043q6593k2469K4848J9493q4K3847P7080Q6634K6848n6609j16682
1730d6928j42212j52226j58480j42489q9611k9561Q555L7134N5110M7372K2216
1719e91120J106n506J0868L7750O2442P4223P6398P0377M6120J6736j1473m0139
$$ plain form
1707 -252218 -315839 -382000 -433207 -486918 -569045 -687089 -814133 -901958 -920915 -853790 -694912
1696 -694912 -477955 -281278 -179636 -178993 -217798 -247348 -257238 -229235 -163856 -112435 -107985 -137338
1684 -137338 -180902 -230409 -272972 -293859 -289315 -259352 -205167 -125915 -26038 63946 104139 84761
1672 84761 17192 -82861 -185580 -252558 -279582 -291444 -278196 -236682 -193154 -141565 -62785
1661 -62785 16482 43784 -543 -92091 -193673 -292479 -383480 -454555 -510619 -575386 -660007 -764301
1649 -764301 -875825 -982219 -1101084 -1243458 -1374680 -1442549 -1397880 -1210769 -904776 -554263
1639 -554263 -248216 -45356 52653 97526 134074 162401 174036 190646 226099 260108 273645
1628 273645 255905 187707 62214 -86982 -188871 -185962 -74076 112141 314877 487434
$$ packed form
1707b52218o3621o6161n1207n3711q2127j18044j27044q7825j8957O7125J58878
1696f94912K16957J96677J01642O43l8805k9550r890K8003O5379N1421M450k9353
1684a37338m3564m9507m2563k0887M544K9963N4185P9252R9877Q9984M0193j9378
1672H4761o7569j00053j02719o6978k7024j1862J3248M1514M3528N1589P8780
1661f2785P9267K7302m4327r1548j01582r8806r1001p1075n6064o4767q4621j04294
1649g64301j11524j06394j18865j42374j31222o7869M4669J87111L05993L50513
1639e54263L06047K02860R8009M4873L6548K8327J1635J6610L5453L4009J3537
1628B73645j7740o8198j25493j49196j01889K909J11886J86217K02736J72557
$$ plain form
1618 487434 615315 696739 731373 741888 746990 731109 671283 577990 493501 442580 398556 313016
1606 313016 170600 -9584 -179806 -288190 -322035 -314939 -310037 -310647 -308881 -306238 -282389 -216705
1594 -216705 -140242 -107040 -122164 -134015 -95645 -24505 25918 29431 5825 -11442 -18074 -18725
1582 -18725 11387 79330 128134 107110 22200 -99957 -223363 -300288 -309100 -272623 -238997 -241027
1570 -241027 -279691 -314596 -315104 -311273 -331791 -341615 -304468 -244189 -186082 -142688 -125666 -114904
1558 -114904 -97745 -106927 -145446 -162943 -145375 -140580 -178654 -226656 -223512 -138818 -3625 127280
1546 127280 215338 251703 260022 268246 300300 376159 489572 627149 774027 870444 867257 785736
1534 785736 675589 546528 369618 144438 -87632 -288691 -435026 -495490 -470739 -399197
$$ packed form
1618D87434J27881Q1424L4634J0515N102j5881n9826r3293q4489n0921m4024q5540
1606C13016j42416j80184j70222j08384l3845P096M902o10J766K643K3849O5684
1594b16705P6463L3202j5124j1851L8370P1140N0423L513k3606j7267o632o51
1582a8725L0112O7943M8804k1024q4910j22157j23406p6925q812L6477L3626k030
1570b41027l8664l4905n08L831k0518r824L7147O0279N8107M3394J7022J0762
1558a14904J7159r182l8519j7497J7568M795l8074m8002L144Q4694J35193J30905
1546A27280Q8058L6365Q319Q224L2054P5859J13413J37577J46878R6417l187q1521
1534G85736j10147j29061j76910k25180k32070k01059j46335o0464K4751P1542
$$ plain form
1524 -399197 -305876 -207632 -128177 -76614 -32626 29585 94912 132737 140687 115888 47487 -41265
1512 -41265 -99347 -99486 -50554 28557 127347 245551 373218 486563 571086 625102 647059 622044
1500 622044 522074 347735 144127 -56197 -234921 -340361 -336026 -252310 -160986 -117728 -120636
1489 -120636 -146855 -184556 -224536 -239076 -196244 -103229 -8465 46479 67059 90555 136092 171695
1477 171695 153003 83569 -7657 -102648 -187983 -248812 -261509 -206769 -97216 40021 192418
1466 192418 345724 460258 521442 576628 658041 728571 759703 772640 782452 755930 665080
1455 665080 531255 391715 289178 259235 288960 340530 387764 413388 422630 443314 507225
1444 507225 614728 724087 778188 743652 638249 503199 364534 219924 49362 -150230
$$ packed form
1524c99197R3321R8244P9455N1563M3988O2211O5327L7825P950k4799o8401q8752
1512d1265n8082j39M8932P9111R8790J18204J27667J13345Q4523N4016K1957k5015
1500F22044r9970j74339k03608k00324j78724j05440M335Q3716R1324M3258k908
1489a20636k6219l7701l9980j4540M2832R3015R4764N4944K0580K3496M5537L5603
1477A71695j8692o9434r1226r4991q5335o0829j2697N4740J09553J37237J52397
1466A92418J53306J14534O1184N5186Q1413P0530L1132J2937R812k6522r0850
1455F65080j33825j39540j02537k9943K9725N1570M7234K5624R242K0684O3911
1444E07225J07503J09359N4101l4536j05403j35050j38665j44610j70562j99592
$$ plain form
1434 -150230 -333078 -435149 -444620 -403961 -340168 -242516 -114810 -5997 33132 15388 -14159
1423 -14159 -38648 -64020 -99153 -147827 -215385 -295494 -355485 -361459 -301225 -183491 -35532 92505
1411 92505 142774 93217 -34068 -193368 -329866 -405613 -414599 -391760 -360022 -305824 -226522
1400 -226522 -135042 -49134 15285 48110 46352 17076 -7402 21284 119214 246789 323720 293736
1388 293736 193130 94455 26853 -15663 -51255 -101836 -177855 -263344 -320698 -317986 -261287 -193863
1376 -193863 -131222 -62997 -1735 45650 109287 215971 349847 470483 551220 583653 553227
1365 553227 437372 257908 91689 12303 43357 157087 323274 514270 665597 708984
1355 708984 639505 515616 418908 409292 472049 523066 515536 472763 447040 488788 609519 766485
$$ packed form
1434a50230j82848j02071r471M0659O3793R7652J27706J08813L9129j7744k9547
1423a4159k4489k5372l5133m8674o7558q0109n9991n974O0234J17734J47959J28037
1411I2505N0269m9557j27285j59300j36498p5747q986K2839L1738N4198P9302
1400b26522R1480Q5908O4419L2825j758k9276k4478K8686R7930J27575P6931k9984
1388B93736j00606r8675o7602m2516l5592n0581p6019q5489n7354K712N6699O7424
1376a93863O2641O8225O1262M7385O3637J06684J33876J20636Q0737L2433l0426
1365E53227j15855j79464j66219p9386L1054J13730J66187J90996J51327M3387
1355G08984o9479j23889r6708r616O2757N1017p530m2773k5723M1748J20731J56966
$$ plain form
1343 766485 895459 967328 985159 963976 919217 852113 759816 662594 584846 503031 368662
1332 368662 183525 8674 -111680 -190350 -245402 -278888 -298848 -311395 -304601 -265463 -212228
1321 -212228 -172607 -122997 -17877 151214 345841 507602 588347 589967 583600 639716 762947
1310 762947 914051 1035722 1067506 1009537 927092 879567 875103 879582 869334 855241 857338 871231
1298 871231 868549 828472 743103 628847 528526 478200 503529 609336 759239 881832 913671
1287 913671 854266 729380 570483 431910 360689 350906 367405 386415 399110 386385 312420
1276 312420 188851 105761 142037 275588 414367 502581 554373 592620 605673 565222 469674
1265 469674 351895 252453 190522 141306 72942 -10224 -77985 -99672 -77069 -48331 -69010
$$ packed form
1343G66485J28974P1869J7831k1183m4759o7104r2297r7222p7748q1815j34369
1332C68662j85137j74851j20354p8670n5052l3486j9960j2547O794L9138N3235
1321b12228L9621M9610J05120J69091J94627J61761Q0745J620o367N6116J23231
1310G62947J51104J21671L1784n7969q2445m7525m464M479j0248j4093K097J3893
1298H71231k682m0077q5369j14256j00321n0326K5329J05807J49903J22593L1839
1287I13671n9405j24886j58897j38573p1221r783J6499J9010J2695j2725p3965
1276C12420j23569q3090L6276J33551J38779Q8214N1792L8247J3053m0451r5548
1265D69674j17779r9442o1931m9216o8364q3166o7761k1687K2603K8738k0679
$$ plain form
1254 -69010 -170641 -317493 -455990 -555013 -580987 -518732 -394874 -250217 -123893 -31806 30260
1243 30260 59122 49223 3270 -77506 -190304 -318824 -411389 -403385 -292368 -140984 -9051
1232 -9051 70427 90197 75257 61004 79636 141978 214826 239347 173735 42363 -76909 -128415
1220 -128415 -106101 -19320 123798 310046 499012 623479 639119 558030 420240 253899
1210 253899 90173 -34839 -121868 -193110 -252152 -283729 -285587 -258277 -178859 -54361 53851
1199 53851 83800 19671 -85980 -167197 -219170 -259592 -281699 -272150 -216064 -112188 12010
1188 12010 119378 192897 235192 235888 189361 121204 55844 13129 37323 153354 343092 572923
1176 572923 800123 965601 1007936 939001 848255 784556 711770 583453 416346 265959 141099
$$ packed form
1254f9010j01631j46852j38497r9023k5974O2255J23858J44657J26324R2087O2066
1243C0260K8862r899m5953q0776j12798j28520r2565Q004J11017J51384J31933
1232i051P9478J9770j4940j4253J8632O2342P2848K4521o5612j31372j19272n1506
1220a28415K2314Q6781J43118J86248J88966J24467J5640q1089j37790j66341
1210B53899j63726j25012q7029p1242n9042l1577j858K7310P9418J24498J08212
1199E3851K9949o4129j05651q1217n1973m0422k2107R549N6086J03876J24198
1188A2010J07368P3519M2295O96m6527o8157o5360m2715K4194J16031J89738K29831
1176E72923K27200J65478M2335o8935r0746o3699p2786j28317j67107j50387j24860
$$ plain form
1165 141099 17025 -104072 -197217 -235337 -194611 -92363 8410 68428 116114 200136 311295
1154 311295 396701 431131 421520 364298 253672 103335 -37680 -112395 -113638 -84584 -61505
1143 -61505 -41246 -2490 55937 108758 133918 131988 107844 49493 -29255 -87071 -117475 -144306
1131 -144306 -194832 -274299 -360288 -421817 -438169 -391622 -274680 -119493 20426 113279 158890
1120 158890 189227 225230 248109 242689 227858 212715 161379 65674 -16785 -47106 -37359 -5880
1108 -5880 48205 120916 182371 204187 184583 140974 111490 133385 191918 235530 229649 184921
1096 184921 144975 130363 139764 184976 254676 304289 308993 275567 217831 160834 133536 142704
1084 142704 164340 166941 146664 116156 82166 71987 117438 187375 231121 257204 296481 339208
$$ packed form
1165A41099j24074j21097r3145l8120M0726J02248J00773O0018M7686Q4022J11159
1154C11295Q5406L4430r611n7222j10626j50337j41015p4715j243K9054K3079
1143f1505K0259L8756N8427N2821K5160j930k4144n8351p8748n7816l0404k6831
1131a44306n0526p9467q5989o1529j6352M6547J16942J55187J39919R2853M5611
1120A58890L0337L6003K2879n420j4831j5143n1336r5705q2459l0321R747L1479
1108e880N4085P2711O1455K1816j9604m3609k9484K1895N8533M3612n881m4728
1096A84921l9946j4612R401M5212O9700M9613M704l3426n7736n6997k7298R168
1084A42704K1636K601k0277l0508l3990j0179M5451O9937M3746K6083L9277M2727
$$ plain form
1072 339208 354591 364544 411548 479689 525397 532012 512411 485689 465540 464903 479978 489161 486373
1059 486373 498691 539828 589999 625696 625952 573768 467644 344983 235767 123957 -1681
1048 -1681 -125758 -221446 -280368 -313730 -339488 -369786 -387335 -349368 -236550 -83900 51301
1037 51301 149971 238673 341918 433832 448460 350996 172588 -9016 -144890 -256853 -371392
1026 -371392 -457423 -458164 -368098 -246403 -146319 -85958 -78684 -122325 -193524 -294139 -441085
1015 -441085 -595110 -691711 -731949 -773572 -852193 -941491 -988550 -962272 -882216 -777889 -643999
1004 -643999 -484602 -346319 -258221 -183547 -75130 61439 186038 275571 330143 365755 423114
993 423114 528069 658136 769496 828089 839681 805400 711302 601615 533195 490963 421627
$$ packed form
1072C39208J5383R953M7004O8141M5708O615j9601k6722k0149o37J5075R183k788
1059D86373J2318M1137N0171L5697K56n2184j06124j22661j09216j11810j25638
1048a681j24077r5688n8922l3362k5758l0298j7549L7967J12818J52650J35201
1037E1301R8670Q8702J03245R1914J4628r7464j78408j81604j35874j11963j14539
1026c71392q6031p41R0066J21695J00084O0361P274m3641p1199j00615j46946
1015d41085j54025r6601m0238m1623p8621q9298m7059K6278Q0056J04327J33890
1004f43999J59397J38283Q8098P4674J08417J36569J24599Q9533N4572L5612N7359
993D23114J04955J30067J11360N8593J1592l4281r4098j09687o8420m2232o9336
$$ plain form
982 421627 327308 252137 203966 176999 177488 191458 217417 284457 383278 487121 592010 666281
970 666281 677691 647655 601387 528498 435303 354064 290415 229842 173935 139722 145014 178189
958 178189 208155 233376 284746 371345 456808 495151 456086 347051 205373 46416 -119916
947 -119916 -254848 -314665 -291586 -226787 -170520 -158862 -186532 -226462 -276629 -342004 -413274 -489969
935 -489969 -589153 -708894 -806149 -841725 -825920 -810060 -829896 -867117 -894381 -886199 -808566 -677090
923 -677090 -554384 -474459 -427935 -388046 -344260 -317343 -308842 -295281 -271294 -268486 -333031 -450669
911 -450669 -557955 -628023 -665721 -678767 -672094 -640196 -568729 -443210 -286976 -167003 -136124
900 -136124 -196188 -310405 -437187 -557892 -655745 -704922 -694601 -649535 -609452 -584361 -558879
$$ packed form
982D21627r4319p5171m8171k6967M89J3970K5959O7040R8821J03843J04889P4271
970F66281J1410l0036m6268p2889r3195q1239o3649o0573n5907l4213N292L3175
958A78189K9966K5221N1370Q6599Q5463L8343l9065j09035j41678j58957j66332
947a19916j34932n9817K3079O4799N6267J1658k7670l9930n0167o5375p1270p6695
935d89969r9184j19741r7255l5576J5805J5860j9836l7221k7264Q182P7633J31476
923f77090J22706P9925M6524L9889M3786K6917Q501J3561K3987K808o4545j17638
911d50669j07286p0068l7698j3046O673L1898P1467J25519J56234J19973L0879
900a36124o0064j14217j26782j20705r7853m9177J0321M5066M0083K5091K5482
$$ plain form
889 -558879 -519310 -458646 -368988 -252378 -127030 -20241 42809 65154 55887 10517 -51811
878 -51811 -107649 -161414 -220602 -284633 -352610 -432749 -518822 -547850 -463955 -309010 -194390 -198334
866 -198334 -308376 -451141 -558187 -587050 -512923 -357412 -180208 -39801 28180 25633 -29140
855 -29140 -117986 -225124 -343146 -469097 -593566 -713200 -843698 -958022 -982820 -878415
845 -878415 -651616 -353283 -58131 189149 365119 451454 435986 321610 142610 -37396
835 -37396 -168062 -244113 -278614 -286790 -298801 -346169 -437027 -553012 -651493 -678375 -613317 -499727
823 -499727 -398156 -324594 -267413 -230944 -229794 -254260 -277982 -272808 -236990 -194335 -170272 -171318
811 -171318 -160827 -87433 41551 159851 213279 214647 225464 275524 333263 365352 404404 488149
$$ packed form
889e58879L9569O0664Q9658J16610J25348J06789O3050K2345r267m5370o2328
878e1811n5838n3765n9188o4031o7977q0139q6073k9028Q3895J54945J14620l944
866a98334j10042j42765j07046k8863P4127J55511J77204J40407O7981k547n4773
855b9140q8846j07138j18022j25951j24469j19634j30498j14324k4798J04405
845h78415K26799K98333K95152K47280J75970Q6335j5468j14376j79000j80006
835c7396j30666p6051l4501q176j2011m7368r0858j15985r8481k6882O5058J13590
823d99727J01571P3562N7181L6469J150k4466k3722N174L5818M2655K4063j046
811a71318J0491P3394J28984J18300N3428J368J0817N0060N7739L2089L9052Q3745
$$ plain form
799 488149 581076 629240 607526 506740 345807 200884 135175 110959 68688 14171 -19948
788 -19948 464 90260 197619 263980 286632 285757 282561 286882 287858 279894 275456 267679 226522 134852
774 134852 13140 -78794 -116241 -152629 -234801 -325125 -361137 -346783 -334064 -317509 -229609 -35807
762 -35807 234735 513833 720960 800387 785876 769271 791440 818930 802841 713051 550053
751 550053 352825 171011 27635 -83459 -174745 -235290 -250352 -229633 -182192 -107023 -34771
740 -34771 -13102 -22262 -17039 1360 6117 -29369 -101791 -192706 -300033 -395250 -426660 -375802
728 -375802 -254061 -83884 92531 239843 334801 369381 360716 312380 218285 105718 26221
717 26221 -14150 -70838 -171995 -292255 -406987 -506821 -583195 -629791 -635126 -571619 -445985
$$ packed form
799D88149R2927M8164k1714j00786j60933j44923o5709k4216m2271n4517l4119
788a9948K0412Q9796J07359O6361K2652q75l196M321R76p964m438p777m1157r1670
774A34852j21712r1934l7447l6388q2172r0324l6012J4354J2719J6555Q7900J93802
762c5807K70542K79098K07127P9427j4511j6605K2169K7490j6089q9790j62998
751E50053j97228j81814j43376j11094r1286o0545j5062K0719M7441P5169P2252
740c4771K1669r160N223J8399M757l5486p2422r0915j07327r5217l1410N0858
728c75802J21741J70177J76415J47312R4958L4580q665m8336r4095j12567p9497
717B6221m0371n6688j01157j20260j14732r9834p6374m6596n335O3507J25634
$$ plain form
706 -445985 -321050 -248674 -211092 -150017 -38255 84503 139206 97176 6085 -64899 -80220
695 -80220 -59826 -68329 -145974 -240918 -279298 -252728 -191562 -143189 -155737 -233903 -317585 -331292
683 -331292 -266721 -180947 -123910 -93441 -69108 -44259 -6177 56258 126214 191859 249988 278784
671 278784 279184 277043 282799 289553 300992 339189 396536 443105 463238 447073 403215 368712 370151
658 370151 403921 461024 523152 555662 533012 455231 320661 122544 -107367 -315431 -457594
647 -457594 -492470 -394693 -186917 67126 284822 412148 443501 415150 381092 367656 365357
636 365357 368957 379678 386378 384245 387433 402100 419781 437388 459265 505848 566941 586868 537848
623 537848 437589 323035 235611 187095 166152 159437 155595 166715 207762 261593 290719 267350
$$ packed form
706d45985J24935P2376L7582O1075J11762J22758N4703m2030r1091p0984j5321
695h0220K0394q503p7645r4944l8380K6570O1166M8373j2548p8166q3682j3707
683c31292O4571Q5774N7037L0469K4333K4849L8082O2435O9956O5645N8129K8796
671B78784M00k141N756O754J1439L8197N7347M6569K0133j6165m3858l4503J439
658C70151L3770N7103O2128L2510k2650p7781j34570j98117k29911k08064j42163
647d57594l4876R7777K07776K54043K17696J27326L1353k8351l4058j3436k299
636C65357L600J0721O700k133L188J4667J7681J7607K1877M6583O1093J9927m9020
623E37848j00259j14554q7424m8516k0943o715l842J1120M1047N3831K9126k3369
$$ plain form
611 267350 187470 73194 -39260 -130353 -207912 -298423 -413211 -519867 -571788 -551663 -475841
600 -475841 -378489 -271960 -138318 15755 146737 202984 147527 -13293 -218412 -388189
590 -388189 -479940 -505179 -494876 -452536 -367140 -247041 -120420 -8803 87928 174961 244922
579 244922 292194 321874 329779 303803 241399 160451 81761 25965 -1604 -13421 -37270 -108575
567 -108575 -224383 -344586 -442382 -503188 -508286 -459679 -376264 -273578 -184887 -143271 -140828 -142752
555 -142752 -122147 -83000 -47036 -26226 -26960 -33339 18539 169654 380349 570079 668581 664872
543 664872 611323 539052 442511 357679 337319 376156 426405 458464 480012 500645 488939 393597
531 393597 215519 17298 -138912 -243501 -322045 -366960 -348404 -271328 -165492 -78166 -44462
$$ packed form
611B67350p9880j14276j12454r1093p7559r0511j14788j06656n1921K0125P5822
600d75841R7352J06529J33642J54073J30982N6247n5457j60820k05119j69777
590c88189r1751k5239J0303M2340Q5396J20099J26621J11617R6731Q7033O9961
579B44922M7272K9680P905k5976o2404q0948p8690n5796k7569j1817k3849p1305
567a08575j15808j20203r7796o0806n098M8607Q3415J02686Q8691M1616K443j924
555a42752K0605L9147L5964K0810p34o379N1878J51115K10695J89730R8502l709
543F64872n3549p2271r6541q4832k0360L8837N0249L2059K1548K0633j1706r5342
531C93597j78078j98221j56210j04589p8544m4915J8556P7076J05836Q7326L3704
$$ plain form
520 -44462 -35827 18221 142899 274306 332361 290002 178110 43451 -69582 -113919 -53978
509 -53978 82464 204769 240538 189709 114400 71996 45898 -17003 -115784 -220717 -313179
498 -313179 -368218 -368980 -318427 -218143 -79080 67489 174141 215776 214033 207135 186416 115684
486 115684 27922 -36538 -115896 -239618 -363856 -416221 -367693 -244907 -110302 -42039 -75512
475 -75512 -169399 -251225 -285664 -283767 -259885 -213228 -169248 -161331 -193824 -253679 -316382 -362361
463 -362361 -382044 -362040 -287917 -185672 -114924 -81946 -30990 65033 172189 229180 192030
452 192030 66883 -113674 -320751 -530125 -710729 -823215 -854655 -827162 -769038 -691717 -607300
441 -607300 -533230 -458640 -361099 -256883 -178888 -137678 -118783 -104824 -97725 -94802 -79634 -63720
$$ packed form
520d4462Q635N4048J24678J31407N8055m2359j11892j34659j13033m4337N9941
509e3978J36442J22305L5769n0829p5309m2404k6098o2901r8781j04933r2462
498c13179n5039p62N0553J00284J39063J46569J06652M1635j743o898k0719p0732
486A15684q7762o4460p9358j23722j24238n2365M8528J22786J34605O8263l3473
475g5512r3887q1826l4439J897K3882M6657M3980P917l2493n9855o2703m5979
463c62361j9683K0004P4123J02245P0748L2978N0956R6023J07156N6991l7150
452A92030j25147j80557k07077k09374j80604j12486l1440K7493N8124P7321Q4417
441f07300P4070P4590R7541J04216P7995M1210J8895J3959P099K923J5168J5914
$$ plain form
429 -63720 -65114 -68303 -48390 6304 93103 200820 301815 360472 375332 383158 413625 470835
417 470835 550988 641666 710652 738664 730951 685182 586953 453508 338587 275079 246029 229996
405 229996 217451 193627 147577 84618 27458 -10093 -42084 -91318 -133300 -110807 -28167 51342
393 51342 72663 32097 -40372 -142499 -288249 -449395 -572314 -637043 -669104 -689411 -678832
382 -678832 -612056 -505931 -410652 -349834 -306746 -241320 -122643 38855 199386 312452 368667
371 368667 389946 389905 364747 306075 224516 150443 106433 81430 45833 16118 41111 120085
359 120085 207103 260635 254101 185625 82386 -16732 -94278 -161612 -224811 -295282 -381296 -464976
347 -464976 -529948 -554849 -518769 -435995 -348921 -308646 -317577 -330986 -322975 -296265 -272476 -269384
$$ packed form
429f3720j394l189J9913N4694Q6799J07717J00995N8657J4860P826L0467N7210
417D70835Q0153R0678O8986K8012p713m5769r8229j33445j14921o3508k9050j6033
405B29996j2545k3824m6050o2959n7160l7551l1991m9234m1982K2493Q2640P9509
393E1342K1321m0566p2469j02127j45750j61146j22919o4729l2061k0307J0579
382f78832O6776J06125R5279O0818M3088O5426J18677J61498J60531J13066N6215
371C68667K1279m1k5158n8672q1559p4073m4010k5003l5597k9715K4993P8974
359A20085Q7018N3532o534o8476j03239r9118p7546o7334o3199p0471q6014q3680
347d64976o4972k4901L6080Q2774Q7074M0275q931j3409Q011K6710K3789L092
$$ plain form
335 -269384 -289877 -319973 -331379 -305822 -254091 -198098 -129146 -41603 18649 -2536 -101316 -208168
323 -208168 -245510 -209696 -150218 -88891 -7450 115125 275091 451594 611285 733975 827208
312 827208 890047 909858 888635 841737 792765 754895 703990 620818 523317 431250 363742 340168
300 340168 367979 448489 559264 646226 660745 588482 444291 274556 147610 99998 110658
289 110658 124338 89569 12579 -46693 -65012 -80931 -109813 -126900 -131681 -153030 -202027 -268726
277 -268726 -350934 -428754 -476679 -494680 -479410 -450300 -445867 -460959 -482308 -526679 -581955 -592113
265 -592113 -545195 -493543 -469963 -461785 -453831 -450997 -447978 -417873 -344573 -237249 -131575 -80130
253 -80130 -102655 -181230 -291989 -409579 -500038 -538964 -527771 -486250 -439535 -408557 -394245 -379528
$$ packed form
335b69384k0493l0096j1406K5557N1731N5993O8952Q7543O0252k1185r8780j06852
323b08168l7342L5814N9478O1327Q1441J22575J59966J76503J59691J22690R3233
312H27208O2839J9811k1223m6898m8972l7870n0905q3172r7501r2067o7508k3574
300C40168K7811Q0510J10775Q6962J4519p2263j44191j69735j26946m7612J0660
289A10658J3680l4769p6990n9272j8319j5919k8882j7087m781k1349m8997o6699
277b68726q2208p7820m7925j8001J5270K9110M433j5092k1349m4371n5276j0158
265e92113M6918N1652K3580Q178P954K834L019L0105P3300J07324J05674N1445
253h0130k2525p8575j10759j17590r0459l8926J1193M1521M6715L0978J4312J4717
$$ plain form
241 -379528 -363798 -352429 -342190 -334492 -338663 -335824 -296470 -227919 -174567 -168116 -198386 -240871 -285581
228 -285581 -326451 -350530 -350396 -327922 -287325 -225901 -136313 -28660 58095 101433 139009 226759
216 226759 348250 423116 396798 287810 157752 58619 2433 -18697 -24524 -46399 -99451
205 -99451 -171099 -228811 -232667 -174917 -84282 13908 99176 148013 164895 186401 223764 242408
193 242408 200296 78662 -92066 -236772 -294779 -270416 -217639 -175075 -158494 -190371 -271776
182 -271776 -353925 -387879 -367945 -311495 -241041 -194808 -187695 -198124 -219415 -262786 -315510 -347576
170 -347576 -349532 -315728 -236101 -127170 -32881 9061 8563 19406 76878 160518 217292 212127
158 212127 158256 79977 -22048 -150733 -275451 -324290 -240366 -59691 115726 225148 270645
$$ packed form
241c79528J5730J1369J0239P698m171K839L9354O8551N3352O451l0270m2485m4710
228b85581m0870k4079J34K2474M0597O1424Q9588J07653Q6755M3338L7576Q7750
216B26759J21491P4866k6318j08988j30058r9133n6186k1130n827k1875n3052
205i9451p1648n7712l856N7750R0635R8190Q5268M8837J6882K1506L7363J8644
193B42408m2112j21634j70728j44706n8007K4363N2777M2564J6581l1877q1405
182b71776q2149l3954J9934N6450P0454M6233P113j0429k1291m3371n2724l2066
170c47576j956L3804P9627J08931R4289M1942m98J0843N7472Q3640N6774n165
158B12127n3871p8279j02025j28685j24718m8839Q3924J80675J75417J09422M5497
$$ plain form
147 270645 261303 201876 125487 94141 142377 230419 289638 294047 247446 160557 54350 -42593
135 -42593 -98995 -95307 -47183 19475 97129 171933 229022 267070 289949 297041 266622 181278
123 181278 73155 -4520 -22674 -36 7013 -20711 -50743 -59952 -62253 -74573 -95111 -106762
111 -106762 -95839 -68894 -35572 -1967 17677 9872 -7018 -3647 12383 10200 -24041 -90390
99 -90390 -174745 -247414 -275633 -248320 -199860 -160165 -137290 -144012 -174159 -222432 -294218 -375651
87 -375651 -448418 -509843 -564180 -615842 -658797 -675504 -671482 -658667 -618460 -538504 -442837 -366385
75 -366385 -321195 -300063 -293092 -285643 -272002 -272383 -305514 -346066 -365373 -375448 -395409 -414312 -409441
62 -409441 -378666 -335667 -305076 -316463 -366844 -413266 -426636 -410292 -381399 -349899 -306498 -247203
$$ packed form
147B70645r342n9427p6389l1346M8236Q8042N9219M409m6601q6889j06207r6943
135d2593n6402L688M8124O6658P7654P4804N7089L8048K2879P092l0419q5344
123A81278j08123p7675j8154K2638P049k7724l0032r209k301j2320k0538j1651
111a06762J0923K6945L3322L3605J9644p805j6890L371J6030k183l4241o6349
99i0390q4355p2669k8219K7313M8460L9695K2875o722l0147m8273p1786q1433
87c75651p2767o1425n4337n1662m2955j6707M022J2815M0207P9956R5667P6452
75c66385M5190K1132O971P449J3641l81l3131m0552j9307j0075j9961j8903M871
62d09441L0775M2999L0591j1387n0381m6422j3370J6344K8893L1500M3401N9295
$$ plain form
50 -247203 -176446 -96675 -27430 1955 -3177 -15883 -41582 -93577 -150563 -186019 -185414 -149667 -103000
37 -103000 -57962 -10088 15885 -14358 -87400 -160367 -212790 -252193 -288895 -311060 -294124 -240469
25 -240469 -187414 -173783 -201895 -252266 -309716 -366128 -412357 -442107 -451718 -416518 -310660 -159564
13 -159564 -32215 39805 81751 120311 156131 177246 183616 184223 173423 143078 119635 127849 157514
0 157514
$$ packed form
50b47203P0757P9771O9245K9385n132j2706k5699n1995n6986l5456O05L5747M6667
37a03000M5038M7874K5973l0243p3042p2967n2423l9403l6702k2165J6936N3655
25b40469N3055J3631k8112n0371n7450n6412m6229k9750r611L5200J05858J51096
13a59564J27349P2020M1946L8560L5820K1115O370O07j0800l0345k3443Q214K9665
0A57514
$$ Imaginary data points
##PAGE= N=2
##DATA TABLE= (X++(I..I)), XYDATA
$$ plain form
32767 179361544 179334595 179298218 179258975 179226643 179219543 179247307 179307390 179384302 179443898 179458081 179433459
32756 179433459 179397260 179377813 179392526 179424230 179428436 179393287 179341256 179274481 179179955 179047462 178879056
32745 178879056 178696975 178534960 178425957 178384385 178395867 178430505 178460173 178464108 178434893 178380159
32735 178380159 178322607 178273281 178204879 178094442 177963350 177859266 177800376 177752307 177682199 177603531
32725 177603531 177548363 177510899 177458274 177387823 177324275 177279178 177249308 177220670 177177059 177120979 177059328
32714 177059328 176992113 176924036 176868393 176836423 176818377 176795652 176762315 176720758 176674175 176619478 176560592
32703 176560592 176520429 176509483 176518908 176533457 176534954 176519230 176506531 176506267 176495247 176456499 176399479 176329072
32691 176329072 176239114 176142022 176062085 175997915 175915250 175794979 175661307 175545370 175457898 175414326
$$ packed form
32767A79361544k6949l6377l9243l2332p100K7764O0083P6912N9596J4183k4622
32756A79433459l6199j9447J4713L1704M206l5149n2031o6775r4526j32493j68406
32745A78879056j82081j62015j09003m1572J1482L4638K9668L935k9215n4734
32735A78380159n7552m9326o8402j10437j31092j04084n8890m8069p0108p8668
32725A77603531n5168l7464n2625p0451o3548m5097k9870k8638m3611n6080o1651
32714A77059328o7215o8077n5643l1970j8046k2725l3337m1557m6583n4697n8886
32703A76560592m0163j0946R425J4549J497j5724j2699k64j1020l8748n7020p0407
32691A76329072q9958r7092p9937o4170q2665j20271j33672j15937q7472m3572
$$ plain form
32681 175414326 175433253 175484934 175518352 175521753 175510923 175488274 175443197 175380717 175314728 175255357 175219050
32670 175219050 175222689 175252474 175272847 175273006 175264077 175244591 175195691 175105734 175003848 174935891 174914369
32659 174914369 174918483 174932664 174953147 174976184 174999142 175023725 175050438 175067795 175063897 175033307 174977098
32648 174977098 174917122 174880428 174851291 174781944 174667849 174532782 174380046 174208126 174022611 173839197
32638 173839197 173693018 173605291 173545626 173484076 173449345 173475382 173541294 173603004 173634616 173632283 173606188
32627 173606188 173564735 173517279 173471926 173433340 173411080 173402767 173393834 173374988 173346572 173299188 173225763
32616 173225763 173149079 173100399 173076242 173052014 173020868 172982967 172947280 172936452 172947736 172948687 172916300
32605 172916300 172840878 172729140 172618841 172546408 172503867 172467578 172427171 172379097 172340044 172322850
$$ packed form
32681A75414326J8927N1681L3418L401j0830k2649m5077o2480o5989n9371l6307
32670A75219050L639K9785K0373J59q929j9486m8900q9957j01886o7957k1522
32659A74914369M114J4181K0483K3037K2958K4583K6713J7357l898l0590n6209
32648A74977098n9976l6694k9137o9347j14095j35067j52736j71920j85515j83414
32638A73839197j46179q7727n9665o1550l4731K6037O5912O1710L1612k333k6095
32627A73606188m1453m7456m5353l8586k2260q313q933j8846k8416m7384p3425
32616A73225763p6684m8680k4157k4228l1146l7901l5687j0828J1284R51l2387
32605A72916300p5422j11738j10299p2433m2541l6289m0407m8074l9053j7194
$$ plain form
32595 172322850 172317317 172301581 172247384 172147248 172031714 171927366 171841195 171787513 171772673 171761329
32585 171761329 171713189 171640721 171574233 171528516 171518253 171537710 171542626 171493339 171402101 171323550 171285756
32574 171285756 171276860 171284994 171295898 171286537 171249454 171193599 171142323 171117907 171120365 171127296 171119189 171091382
32562 171091382 171033384 170955263 170896455 170886646 170937781 171032080 171121527 171155753 171104441 170986030 170852685
32551 170852685 170731717 170614583 170508151 170449590 170445881 170459132 170467523 170476628 170483072 170485398 170482992
32540 170482992 170447859 170366036 170266472 170177358 170087675 169980028 169866544 169772838 169712876 169685621
32530 169685621 169681052 169677964 169643623 169574371 169500920 169423325 169319937 169199710 169086366 168996720 168956777
32519 168956777 168983775 169041464 169075327 169074069 169074201 169117613 169198518 169288722 169367862 169411414 169417324 169417873
$$ packed form
32595A72322850n533j5736n4197j00136j15534j04348q6171n3682j4840j1344
32585A71761329m8140p2468o6488m5717j0263J9457M916m9287r1238p8551l7794
32574A71285756q896Q134J0904r361l7083n5855n1276k4416K458O931q107k7807
32562A71091382n7998p8121n8808r809N1135R4299Q9447L4226n1312j18411j33345
32551A70852685j20968j17134j06432n8561l709J3251Q391R105O444K326k406
32540A70482992l5133q1823r9564q9114q9683j07647j13484r3706n9962k7255
32530A69685621m569l088l4341o9252p3451p7595j03388j20227j13344q9646l9943
32519A68956777K6998N7689L3863j258J32M3412Q0905R0204P9140M3552N910N49
$$ plain form
32507 169417873 169425069 169425192 169413907 169385275 169320713 169207836 169066934 168949706 168887003 168858120 168842685
32496 168842685 168859188 168902067 168929619 168945290 168987114 169063496 169146883 169195292 169167616 169055567 168895048
32485 168895048 168724175 168569531 168469072 168436224 168425765 168379982 168292566 168211015 168172832 168155212
32475 168155212 168117460 168062164 168026849 168045069 168101502 168140903 168122041 168047222 167946977 167858973 167814849
32464 167814849 167827977 167894738 167970005 167984327 167909651 167772182 167631295 167540326 167517332 167558369
32454 167558369 167646411 167755177 167847887 167894664 167891802 167863518 167839876 167822903 167800173 167748605 167641439
32443 167641439 167496837 167365629 167270614 167197140 167128449 167066240 167021546 167010920 167060698 167172090
32433 167172090 167301813 167388778 167408728 167389427 167360071 167321736 167256558 167147869 166993172 166830599
$$ packed form
32507A69417873P196J23j1285k8632o4562j12877j40902j17228o2703k8883j5435
32496A68842685J6503M2879K7552J5671M1824P6382Q3387M8409k7676j12049j60519
32485A68895048j70873j54644j00459l2848j0459m5783q7416q1551l8183j7620
32475A68155212l7752n5296l5315J8220N6433L9401j8862p4819j00245q8004m4124
32464A67814849J3128O6761P5267J4322p4676j37469j40887r0969k2994M1037
32454A67558369Q8042J08766R2710M6777k862k8284k3642j6973k2730n1568j07166
32443A67641439j44602j31208r5015p3474o8691o2209m4694j0626M9778J11392
32433A67172090J29723Q6965J9950j9301k9356l8335o5178j08689j54697j62573
$$ plain form
32423 166830599 166717253 166676523 166704241 166772587 166847219 166905125 166922001 166899327 166887948 166938224 167028657
32412 167028657 167089752 167075083 166981082 166841573 166704666 166589974 166490389 166416917 166387225 166389375
32402 166389375 166392919 166378428 166347802 166312661 166284290 166271640 166268030 166260555 166229765 166155097 166054229
32391 166054229 165988997 166000346 166071103 166159209 166240069 166314201 166372690 166401138 166396598 166364787 166317349
32380 166317349 166262647 166205473 166162147 166152112 166186382 166272204 166405600 166563138 166718080 166844191
32370 166844191 166924534 166963637 166959407 166894312 166766417 166611149 166487969 166432543 166439930 166478115 166502813
32359 166502813 166480918 166430345 166399795 166382086 166318483 166178322 165999727 165843201 165732062 165674863
32349 165674863 165664770 165658708 165625576 165588737 165599989 165685485 165832218 166008860 166172043 166285882
$$ packed form
32423A66830599j13346m0730K7718O8346P4632N7906J6876k2674j1379N0276R0433
32412A67028657O1095j4669r4001j39509j36907j14692r9585p3472k9692K150
32402A66389375L544j4491l0626l5141k8371j2650l610p475l0790p4668j00868
32391A66054229o5232J1349P0757Q8106Q0860P4132N8489K8448m540l1811m7438
32380A66317349n4702n7174m3326j0035L4270Q5822J33396J57538J54942J26111
32370A66844191Q0343L9103m230o5095j27895j55268j23180n5426P387L8185K4698
32359A66502813k1895n0573l0550j7709o3603j40161j78595j56526j11139n7199
32349A65674863j0093o062l3132l6839J1252Q5496J46733J76642J63183J13839
$$ plain form
32339 166285882 166327329 166276341 166144997 165990211 165877733 165826461 165789410 165719554 165631629 165583623
32329 165583623 165618123 165709948 165798550 165842779 165837843 165803898 165758728 165719405 165695724 165686309 165688103
32318 165688103 165694953 165699141 165701680 165695050 165659324 165579187 165459938 165334675 165236558 165164710 165093969
32307 165093969 165019076 164977561 165016129 165114519 165205590 165268463 165306731 165312567 165295042 165282216 165273540
32296 165273540 165257943 165262506 165301532 165352740 165381203 165364973 165312004 165261444 165261475 165321897 165398377 165448036
32284 165448036 165469960 165478483 165471559 165440615 165410258 165425123 165495236 165595792 165682057 165724452 165751249
32273 165751249 165798738 165867781 165931704 165972509 166001309 166001467 165920197 165735389 165495703 165278296 165119587
32262 165119587 165008390 164904627 164783631 164666207 164609511 164687070 164899162 165158423 165369005
$$ packed form
32339A66285882M1447n0988j31344j54786j12478n1272l7051o9856q7925m8006
32329A65583623L4500R1825Q8602M4229m936l3945m5170l9323k3681r415J794
32318A65688103O850M188K539o630l5726q0137j19249j25263r8117p1848p0741
32307A65093969p4893m1515L8568R8390R1071O2873L8268N836j7525j2826q676
32296A65273540j5597M563L9026N1208K8463j6230n2969n0560L1O0422P6480M9659
32284A65448036K1924Q523o924l0944l0357J4865P0113J00556Q6265M2395K6797
32273A65751249M7489O9043O3923M0805K8800J58q1270j84808k39686k17407j58709
32262A65119587j11197j03763j20996j17424n6696P7559K12092K59261K10582
$$ plain form
32253 165369005 165470905 165461676 165382400 165282817 165203701 165169751 165182742 165217287 165254756 165302008 165335583
32242 165335583 165312724 165244997 165176202 165135939 165132890 165156348 165177517 165172254 165147628 165118589 165083856
32231 165083856 165051437 165040254 165051315 165055356 165000565 164883560 164747174 164592184 164411006 164244975
32221 164244975 164141965 164096817 164062613 164030241 164066472 164226111 164450571 164621547 164692384 164700432
32211 164700432 164684090 164660388 164656069 164703345 164807681 164939816 165068718 165192172 165317613 165438770
32201 165438770 165519331 165514630 165427517 165316988 165242299 165206176 165175727 165145060 165120488 165097714 165080342
32190 165080342 165062131 165020968 164956524 164906601 164919853 165008602 165114304 165162078 165129075 165039413 164933200
32179 164933200 164839764 164760220 164678909 164593963 164516748 164464674 164450636 164468323 164498651 164540224 164602400
$$ packed form
32253A65369005J01900r229p9276r9583p9116l3950J2991L4545L7469M7252L3575
32242A65335583k2859o7727o8795m0263l049K3458K1169n263k4626k9039l4733
32231A65083856l2419j1183J1061M041n4791j17005j36386j54990j81178j66031
32221A64244975j03010m5148l4204l2372L6231J59639K24460J70976P0837Q048
32211A64700432j6342k3702m319M7276J04336J32135J28902J23454J25441J21157
32201A65438770Q0561m701q7113j10529p4689l6123l0449l0667k4572k2774j7372
32190A65080342j8211m1163o4444m9923J3252Q8749J05702M7774l3003q9662j06213
32179A64933200r3436p9544q1311q4946p7215n2074j4038J7687L0328M1573O2176
$$ plain form
32168 164602400 164688078 164778718 164827379 164811245 164768503 164755961 164765838 164740722 164652082 164515147 164360773
32157 164360773 164213445 164110779 164103161 164190329 164313487 164408613 164452314 164451284 164420851 164407303 164454457
32146 164454457 164545108 164610307 164603030 164539607 164456709 164365604 164259164 164142434 164043899 163983080 163947005
32135 163947005 163940133 163987437 164071841 164160214 164247511 164322435 164355474 164328150 164267735 164241291 164280893
32124 164280893 164379420 164522018 164670050 164776230 164817529 164811284 164791730 164771579 164747784 164693091
32114 164693091 164591037 164478682 164397236 164339184 164283525 164234611 164191703 164147809 164110476 164097868
32104 164097868 164115344 164140881 164151956 164144001 164131297 164146400 164210188 164301718 164383854 164441840 164485703
32093 164485703 164521215 164540642 164553315 164590565 164653118 164705506 164744558 164784292 164804052 164762069 164648333
$$ packed form
32168A64602400Q5678R0640M8661j6134m2742j2542R877k5116q8640j36935j54374
32157A64360773j47328j02666p618Q7168J23158R5126M3701j030l0433j3548M7154
32146A64454457R0651O5199p277o3423q2898r1105j06440j16730r8535o0819l6075
32135A63947005o872M7304Q4404Q8373Q7297P4924L3039k7324o0415k6444L9602
32124A64280893R8527J42598J48032J06180M1299o245j9554k0151k3795n4693
32114A64693091j02054j12355q1446n8052n5659m8914m2908m3894l7333j2608
32104A64097868J7476K5537J1075p955j2704J5103O3788R1530Q2136N7986M3863
32093A64485703L5512J9427J2673L7250O2553N2388L9052L9734J9760m1983j13736
$$ plain form
32082 164648333 164505419 164393762 164335947 164322149 164330950 164328220 164298886 164251934 164200564 164150354 164099687
32071 164099687 164053521 164021669 163970931 163863642 163737074 163659298 163655347 163713045 163806955 163904165 163995147
32060 163995147 164091014 164187236 164258047 164285279 164271417 164226371 164140523 164009477 163852362 163687558
32050 163687558 163539441 163455582 163470098 163565399 163677007 163742844 163762897 163774787 163805605 163847115
32040 163847115 163848426 163769385 163631699 163484869 163373028 163315796 163307293 163329373 163345090 163304166 163180264
32029 163180264 162999707 162826760 162735425 162764457 162887951 163041941 163171890 163265940 163336956 163389531
32019 163389531 163411557 163382541 163305588 163209791 163140154 163130799 163176544 163243208 163298357 163336118 163389175
32008 163389175 163497609 163660083 163847076 164025068 164158853 164222606 164215410 164156261 164075508 164010780
$$ packed form
32082A64648333j42914j11657n7815j3798Q801k730k9334m6952n1370n0210n0667
32071A64099687m6166l1852n0738j07289j26568p7776l951N7698R3910R7210R0982
32060A63995147R5867R6222P0811K7232j3862m5046q5848j31046j57115j64804
32050A63687558j48117q3859J4516R5301J11608O5837K0053J1890L0818M1510
32040A63847115J311p9041j37686j46830j11841n7232q503K2080J5717m0924j23902
32029A63180264j80557j72947r1335K9032J23494J53990J29949R4050P1016N2575
32019A63389531K2026k9016p6953r5797o9637r355M5745O6664N5149L7761N3057
32008A63389175J08434J62474J86993J77992J33785O3753p196n9149q0753o4728
$$ plain form
31998 164010780 163966468 163901179 163777788 163612811 163480337 163447214 163508380 163601588 163679799 163743702
31988 163743702 163795899 163811601 163760762 163626085 163410709 163150939 162911739 162745913 162646415 162566948
31978 162566948 162467825 162357443 162286637 162282447 162313461 162339453 162374993 162438537 162519101 162613979 162716969
31967 162716969 162800373 162858752 162921144 162981152 162993658 162964151 162957852 163006914 163069711 163091786 163049713
31956 163049713 162955439 162856667 162799634 162795911 162839224 162920254 163018443 163107766 163173422 163202161 163179438
31945 163179438 163109464 163006509 162883035 162751940 162641520 162580061 162564985 162562794 162565266 162607379
31935 162607379 162704407 162808410 162847755 162804782 162740794 162704977 162660887 162550630 162392626 162258613
31925 162258613 162190846 162187972 162226967 162284576 162355913 162462663 162602621 162739234 162850222 162924031
$$ packed form
31998A64010780m4312o5289j23391j64977j32474l3123O1166R3208P8211O3903
31988A63743702N2197J5702n0839j34677k15376k59770k39200j65826r9498p9467
31978A62566948r9123j10382p0806m190L1014K5992L5540O3544Q0564R4878J02990
31967A62716969Q3404N8379O2392O0008J2506k9507o299M9062O2797K2075m2073
31956A63049713r4274r8772n7033l723M3313Q1030R8189Q9323O5656K8739k2723
31945A63179438o9974j02955j23474j31095j10420o1459j5076k191K472M2113
31935A62607379R7028J04003L9345m2973o3988l5817m4090j10257j58004j34013
31925A62258613o7767k874L8995N7609P1337J06750J39958J36613J10988P3809
$$ plain form
31915 162924031 162957347 162982348 163034834 163093539 163102095 163037107 162935743 162864747 162866283 162916390 162955852
31904 162955852 162965774 162963122 162961786 162947630 162876403 162729683 162558033 162438170 162394906 162368374 162298585
31893 162298585 162201305 162123972 162093475 162128010 162235643 162400562 162595317 162808164 163032334 163235480
31883 163235480 163364955 163390884 163321155 163182592 163018552 162892686 162847137 162875997 162939101 162983512
31873 162983512 162967617 162877434 162748506 162625417 162515481 162423484 162368502 162357249 162368768 162367623
31863 162367623 162356461 162369668 162419699 162493290 162570241 162631078 162668912 162688788 162699888 162714036 162745600
31852 162745600 162789545 162798925 162743773 162661669 162595989 162552435 162517657 162475144 162405133 162306278 162186039
31841 162186039 162038435 161882759 161766620 161718303 161743660 161841466 161979408 162105079 162197232 162283284
$$ packed form
31915A62924031L3316K5001N2486N8705Q556o4988j01364p0996J536N0107L9462
31904A62955852R922k652j336j4156p1227j46720j71650j19863m3264k6532o9789
31893A62298585r7280p7333l0497L4535J07633J64919J94755K12847K24170K03146
31883A63235480J29475K5929o9729j38563j64040j25866m5549K8860O3104M4411
31873A62983512j5895r0183j28928j23089j09936r1997n4982j1253J1519j145
31863A62367623j1162J3207N0031P3591P6951O0837L7834J9876J1100J4148L1564
31852A62745600M3945R380n5152q2104o5680m3554l4778m2513p0011r8855j20239
31841A62186039j47604j55676j16139m8317K5357R7806J37942J25671R2153Q6052
$$ plain form
31831 162283284 162378901 162457235 162490848 162469095 162404022 162339232 162303769 162270934 162193696 162070376 161938230
31820 161938230 161818709 161706358 161599922 161525644 161507955 161522371 161522120 161497599 161468740 161459447 161481864
31809 161481864 161529374 161591318 161661190 161742703 161836656 161924478 161995346 162060540 162131843 162206622 162254712
31798 162254712 162259505 162252728 162256182 162257207 162244691 162210969 162157363 162105973 162058957 161993301 161916209 161853311
31786 161853311 161805151 161792108 161857964 161980322 162091222 162147251 162131219 162050567 161943420 161849960
31776 161849960 161786323 161752824 161749567 161767668 161784639 161796657 161818358 161842684 161843615 161810226 161740807
31765 161740807 161639888 161524563 161435296 161420369 161496300 161642664 161822049 161983452 162077194 162082611
31755 162082611 162013678 161897284 161755869 161629969 161559903 161545654 161552905 161539094 161489466 161438476
$$ packed form
31831A62283284R5617P8334L3613k1753o5073o4790l5463l2835p7238j23320j32146
31820A61938230j19521j12351j06436p4278j7689J4416k51k4521k8859r293K2417
31809A61481864M7510O1944O9872Q1513R3953Q7822P0868O5194P1303P4779M8090
31798A62254712M793o777L454J025j2516l3722n3606n1390m7016o5656p7092o2898
31786A61853311m8160j3043O5856J22358J10900N6029j6032q0652j07147r3460
31776A61849960o3637l3499l257J8101J6971J2018K1701K4326R31l3389o9419
31765A61740807j00919j15325q9267j4927P5931J46364J79385J61403R3742N417
31755A62082611o8933j16394j41415j25900p0066j4249P251j3811m9628n0990
$$ plain form
31745 161438476 161425309 161450169 161485547 161517544 161563658 161645166 161756626 161861309 161930699 161963626
31735 161963626 161959733 161906316 161813365 161724490 161667080 161626946 161567997 161467033 161344667 161241063
31725 161241063 161183017 161165910 161165263 161157994 161139491 161141505 161185667 161246286 161284434 161303956 161326151 161343766
31713 161343766 161367108 161399588 161394365 161324186 161211420 161077129 160926294 160778302 160668057 160621052
31703 160621052 160639208 160695022 160742563 160754909 160726984 160667170 160595894 160537063 160529979 160614111 160782742
31692 160782742 160967861 161086611 161114626 161101344 161100375 161126457 161186765 161301341 161461491 161630109
31682 161630109 161792952 161942542 162033002 162036804 161972302 161862398 161719975 161571881 161460817 161395216
31672 161395216 161344961 161300036 161279345 161293452 161338232 161396191 161444308 161475177 161500816 161527661 161549895
$$ packed form
31745A61438476j3167K4860L5378L1997M6114Q1508J11460J04683O9390L2927
31735A61963626l893n3417r2951q8875n7410m0134n8949j00964j22366j03604
31725A61241063n8046j7107o47p269j8503K014M4162O0619L8148J9522K2195J7615
31713A61343766K3342L2480n223p0179j12766j34291j50835j47992j10245m7005
31703A60621052J8156N5814M7541J2346k7925n9814p1276n8831p084Q4132J68631
31692A60782742J85119J18750K8015j3282r69K6082O0308J14576J60150J68618
31682A61630109J62843J49590R0460L802o4502j09904j42423j48094j11064o5601
31672A61395216n0255m4925k0691J4107M4780N7959M8117L0869K5639K6845K2234
$$ plain form
31661 161549895 161558890 161549328 161525208 161494841 161455727 161393893 161317209 161265152 161277014 161351085 161448618
31650 161448618 161539715 161625506 161726424 161847491 161962667 162037998 162043778 161969567 161830430 161645538
31640 161645538 161451496 161300693 161222077 161204558 161201905 161159709 161067034 160970565 160917933 160920841 160966317
31629 160966317 161026279 161069113 161073226 161039606 160994835 160954934 160922953 160913359 160938364 161015734 161148687
31618 161148687 161301683 161447945 161578569 161665293 161684546 161653528 161613489 161586060 161556992 161525587
31608 161525587 161522000 161552645 161574241 161541702 161483753 161463835 161509479 161614405 161740723 161834978 161866041
31597 161866041 161843852 161801845 161738619 161630547 161510731 161432494 161394180 161350186 161268762 161176479
31587 161176479 161127679 161163159 161288774 161471642 161663026 161822288 161935205 162017593 162085140 162119366
$$ packed form
31661A61549895Q995r562k4120l0367l9114o1834p6684n2057J1862P4071R7533
31650A61448618R1097Q5791J00918J21067J15176P5331N780p4211j39137j84892
31640A61645538j94042j50803p8616j7519k653m2196r2675r6469n2632K908M5476
31629A60966317N9962M2834M113l3620m4771l9901l1981r594K5005P7370J32953
31618A61148687J52996J46262J30624Q6724J9253l1018m0039k7429k9068l1405
31608A61525587l587L0645K1596l2539n7949j9918M5644J04926J26318R4255L1063
31597A61866041k2189m2007o3226j08072j19816p8237l8314m3994q1424r2283
31587A61176479m8800L5480J25615J82868J91384J59262J12917Q2388O7547L4226
$$ plain form
31577 162119366 162108751 162080837 162063851 162066035 162085642 162121078 162154681 162160795 162144997 162121687 162087176
31566 162087176 162017147 161885827 161692075 161466734 161267047 161134894 161058181 160992025 160906465 160804466
31556 160804466 160702209 160628516 160610213 160639535 160689271 160734340 160768542 160806354 160861086 160922308 160964682
31545 160964682 160987126 160997281 160984149 160937653 160871762 160804095 160737689 160665975 160588256 160526488 160486277
31534 160486277 160454661 160446490 160492533 160599791 160758819 160933199 161079588 161183582 161236893 161215626
31524 161215626 161109701 160955685 160817256 160720591 160645410 160594767 160590522 160629209 160711094 160836359
31514 160836359 160977821 161084922 161123789 161091467 160988144 160844319 160748174 160769592 160880469 161000176
31504 161000176 161078968 161119465 161151597 161206906 161297694 161402976 161487978 161529970 161517858 161453182 161355791
$$ packed form
31577A62119366j0615k7914j6986K184J9607L5436L3603O114j5798k3310l4511
31566A62087176p0029j31320j93752k25341j99687j32153p6713o6156q5560j01999
31556A60804466j02257p3693j8303K9322M9736M5069L4202L7812N4732O1222M2374
31545A60964682K2444J0155j3132m6496o5891o7667o6406p1714p7719o1768m0211
31534A60486277l1616q171M6043J07258J59028J74380J46389J03994N3311k1267
31524A61215626j05925j54016j38429r6665p5181n0643m245L8687Q1885J25265
31514A60836359J41462J07101L8867l2322j03323j43825r6145K1418J10877J19707
31504A61000176P8792M0497L2132N5309R0788J05282Q5002M1992j2112o4676r7391
$$ plain form
31493 161355791 161225556 161046298 160836510 160654526 160566691 160582576 160652810 160724181 160775747 160811815
31483 160811815 160832609 160836628 160823650 160793368 160756075 160724383 160700578 160684103 160682904 160680648 160634603
31472 160634603 160544648 160460828 160429989 160458706 160492103 160483930 160458131 160446153 160450211 160475022 160526122
31461 160526122 160608880 160733115 160883889 161011645 161055409 160984314 160831085 160667535 160545634 160475000
31451 160475000 160449192 160458051 160455208 160397384 160310843 160249455 160223169 160211647 160223113 160293105 160404767
31440 160404767 160475271 160453580 160380077 160330202 160333795 160375027 160418045 160429459 160389766 160284332 160131478
31429 160131478 160004198 159958432 159975694 160021710 160082252 160143291 160203384 160250924 160228221 160112348
31419 160112348 159959295 159827744 159741480 159704826 159718472 159782720 159876190 159959213 159990253 159952344
$$ packed form
31493A61355791j30235j79258k09788j81984q7835J5885P0234P1371N1566L6068
31483A60811815K0794M019j2978l0282l7293l1692k3805j6475j199k256m6045
31472A60634603q9955q3820l0839K8717L3397q173k5799j1978M058K4811N1100
31461A60526122Q2758J24235J50774J27756M3764p1095j53229j63550j21901p0634
31451A60475000k5808Q859k843n7824q6541o1388k6286j1522J1466O9992J11662
31440A60404767P0504k1691p3503m9875L593M1232M3018J1414l9693j05434j52854
31429A60131478j27280m5766J7262M6016O0542O1039O0093M7540k2703j15873
31419A60112348j53053j31551q6264l6654J3646O4248R3470Q3023L1040l7909
$$ plain form
31409 159952344 159886346 159851146 159862333 159892081 159896151 159863774 159816247 159731517 159561259 159336316 159165953
31398 159165953 159138116 159236108 159359422 159413180 159379568 159304081 159213000 159108700 159009928 158944282
31388 158944282 158938209 159009389 159157261 159362127 159580795 159764098 159894153 160008080 160143174 160290015
31378 160290015 160423357 160517810 160564600 160589228 160629288 160704451 160792159 160846323 160826529 160739567 160640003
31367 160640003 160574496 160547180 160522416 160458455 160354449 160236563 160114995 159990625 159872498 159776086
31357 159776086 159703491 159653601 159653913 159730076 159865258 160004224 160084019 160085067 160022878 159934991 159882274
31346 159882274 159875995 159866512 159805625 159670627 159467253 159229095 159008794 158868544 158843782 158922106
31336 158922106 159063593 159214207 159323565 159383198 159441798 159540336 159637651 159672851 159642273 159547291
$$ packed form
31409A59952344o5998l5200J1187K9748M070l2377m7527q4730j70258k24943j70363
31398A59165953k7837R7992J23314N3758l3612p5487r1081j04300r8772o5646
31388A58944282o073P1180J47872K04866K18668J83303J30055J13927J35094J46841
31378A60290015J33342R4453M6790K4628M0060P5163Q7708N4164j9794q6962r9564
31367A60640003o5507k7316k4764o3961j04006j17886j21568j24370j18127r6412
31357A59776086p2595m9890L12P6163J35182J38966P9795J048o2189q7887n2717
31346A59882274o279r483o0887j34998k03374k38158k20301j40250k4762P8324
31336A58922106J41487J50614J09358N9633N8600R8538R7315L5200l0578r4982
$$ plain form
31326 159547291 159371475 159150456 158980998 158950743 159062387 159236135 159401914 159523548 159589960
31317 159589960 159620865 159633707 159633095 159616906 159572459 159487824 159382826 159296244 159237936 159190348 159149231
31306 159149231 159139174 159204090 159362869 159575656 159762137 159850643 159827104 159731968 159613946 159519955
31296 159519955 159489991 159531224 159621278 159712773 159756141 159736473 159673675 159592482 159497131 159381676 159245552
31285 159245552 159104473 158980611 158901662 158917205 159035745 159183258 159287615 159342095 159366492 159377520
31275 159377520 159385104 159354191 159258180 159143145 159065661 159022789 158957852 158837195 158689098 158553956
31265 158553956 158467929 158465968 158542957 158661379 158788030 158905876 158992005 159007237 158927599 158787414
31255 158787414 158658045 158574191 158532725 158550716 158649355 158807477 158953693 159027765 159037846 159018223
$$ packed form
31326A59547291j75816k21019j69458l0255J11644J73748J65779J21634O6412
31317A59589960L0905J2842o12j6189m4447q4635j04998q6582n8308m7588m1117
31306A59149231j0057O4916J58779K12787J86481Q8506k3539r5136j18022r3991
31296A59519955k9964M1233R0054R1495M3368j9668o2798q1193r5351j15455j36124
31285A59245552j41079j23862p8949J5543J18540J47513J04357N4480K4397J1028
31275A59377520P584l0913r6011j15035p7484m2872o4937j20657j48097j35142
31265A58553956q6027j961P6989J18422J26651J17846Q6129J5232p9638j40185
31255A58787414j29369q3854m1466J7991R8639J58122J46216P4072J0081j9623
$$ plain form
31245 159018223 158989330 158956168 158920592 158886648 158860729 158871757 158951514 159099552 159274628 159434867
31235 159434867 159557621 159632932 159677881 159716062 159744301 159746983 159710552 159625300 159497765 159357615
31225 159357615 159246454 159195136 159192928 159201298 159185307 159115363 159001422 158890491 158814094 158795924 158865901
31214 158865901 159011361 159155024 159226981 159226489 159184685 159103775 158983924 158872760 158822396 158840098
31204 158840098 158898335 158956226 158985319 158966794 158904371 158833338 158780334 158756409 158769870 158812904 158862163
31193 158862163 158906962 158947351 158982980 159025498 159087972 159153071 159173251 159115160 159006838 158910198 158848090
31182 158848090 158782590 158677400 158565041 158497470 158484879 158496546 158483396 158412457 158289530 158150858
31172 158150858 158033241 157943555 157877652 157866277 157922098 158000707 158060922 158106769 158145453 158166375 158170325
$$ packed form
31245A59018223k8893l3162l5576l3944k5919J1028P9757J48038J75076J60239
31235A59434867J22754P5311M4949L8181K8239K682l6431q5252j27535j40150
31225A59357615j11161n1318k208Q370j5991o9944j13941j10931p6397j8170O9977
31214A58865901J45460J43663P1957m92m1804q0910j19851j11164n0364J7702
31204A58840098N8237N7891K9093j8525o2423p1033n3004k3925J3461M3034M9259
31193A58862163M4799M0389L5629M2518O2474O5099K0180n8091j08322r6640o2108
31182A58848090o5500j05190j12359o7571j2591J1667j3150p0939j22927j38672
31172A58150858j17617q9686o5903j1375N5821P8609O0215M5847L8684K0922L950
$$ plain form
31161 158170325 158172959 158178823 158173580 158140699 158077447 158004038 157950238 157934865 157969954 158047485 158147242
31150 158147242 158263675 158416416 158598972 158743218 158794773 158771075 158725439 158687050 158655939 158633635
31140 158633635 158633652 158653917 158661593 158641873 158603466 158534949 158427200 158303462 158189123 158086408 157986704
31129 157986704 157896976 157836374 157820548 157869877 157985695 158137065 158300239 158453614 158552904 158571918
31119 158571918 158524540 158436589 158338481 158256097 158194788 158154679 158130035 158098770 158045330 157993224 157989197
31108 157989197 158036279 158081329 158090350 158082402 158084827 158106787 158156483 158258022 158413351 158559362 158621973
31097 158621973 158593742 158529752 158488446 158474329 158451666 158402219 158331089 158244447 158162254 158118070 158112911
31086 158112911 158117946 158121371 158142804 158191313 158235461 158248096 158235002 158210372 158182556 158165599 158182849
$$ packed form
31161A58170325K634N864n243l2881o3252p3409n3800j5373L5089P7531R9757
31150A58147242J16433J52741J82556J44246N1555k3698m5636l8389l1111k2304
31140A58633635J7K0265P676j9720l8407o8517j07749j23738j14339j02715r9704
31129A57986704q9728o0602j5826M9329J15818J51370J63174J53375R9290J9014
31119A58571918m7378q7951r8108q2384o1309m0109k4644l1265n3440n2106m027
31108A57989197M7082M5050R021p948K425K1960M9696J01539J55329J46011O2611
31097A58621973k8231o3990m1306j4117k2663m9447p1130q6642q2193m4184n159
31086A58112911N035L425K1433M8509M4148J2635j3094k4630k7816j6957J7250
$$ plain form
31075 158182849 158232264 158288921 158326726 158321873 158279406 158236854 158238579 158297707 158386309 158478997 158579801
31064 158579801 158682693 158753727 158761814 158698634 158586590 158479329 158426295 158421062 158396696 158306083 158200896
31053 158200896 158155643 158166417 158190152 158220179 158254316 158248460 158184038 158097830 158027501 157992534 157986764
31042 157986764 157992695 158005594 158030752 158060046 158072661 158064914 158017049 157911025 157779257 157652280 157536241
31031 157536241 157438688 157374605 157361429 157387015 157417289 157450855 157524475 157665018 157863946 158082918
31021 158082918 158271480 158394408 158453320 158497837 158591380 158736754 158859242 158892776 158838573 158717378
31011 158717378 158526996 158296000 158095801 157981239 157958032 158000454 158049357 158029919 157940835 157851476
31001 157851476 157808068 157792402 157767635 157723751 157666826 157603681 157547319 157512797 157503671 157515916 157538212
$$ packed form
31075A58182849M9415N6657L7805m853m2467m2552J725N9128Q8602R2688J00804
31064A58579801J02892P1034Q087o3180j12044j07261n3034n233k4366r0613j05187
31053A58200896m5253J0774K3735L0027L4137n856o4422q6208p0329l4967n770
31042A57986764N931J2899K5158K9294J2615p747m7865j06024j31768j26977j16039
31031A57536241r7553o4083j3176K5586L0274L3566P3620J40543J98928K18972
31021A58082918J88562J22928N8912M4517R3543J45374J22488L3534n4203j21195
31011A58717378j90382k30996k00199j14562k3207M2422M8903j9438q9084q9359
31001A57851476m3408j5666k4767m3884n6925o3145n6362l4522r126J2245K2296
$$ plain form
30990 157538212 157554605 157568303 157590467 157617967 157641822 157647142 157596419 157447464 157225801 157025995
30980 157025995 156925871 156945112 157054289 157212499 157391837 157557574 157675588 157740011 157778220 157817379
30970 157817379 157862743 157907206 157943062 157947422 157899001 157828489 157792463 157809693 157858317 157912773 157955535
30959 157955535 157975442 157979927 157971331 157934917 157883109 157850251 157841275 157844063 157851605 157864063 157901023 158002319
30947 158002319 158173953 158360393 158514297 158630917 158701062 158714635 158701723 158708196 158748584 158791760
30937 158791760 158785603 158704414 158568555 158408905 158234233 158045896 157872121 157749954 157680022 157646168
30927 157646168 157618948 157562174 157482353 157428515 157441316 157520606 157640404 157763108 157857914 157927871
30917 157927871 157992125 158034645 158033032 158011009 157994018 157969143 157935568 157905760 157866443 157811194 157762927
$$ packed form
30990A57538212J6393J3698K2164K7500K3855N320n0723j48955k21663j99806
30980A57025995j00124J9241J09177J58210J79338J65737J18014O4423L8209L9159
30970A57817379M5364M4463L5856M360m8421p0512l6026J7230M8624N4456M2762
30959A57955535J9907M485q596l6414n1808l2858q976K788P542J2458L6960J01296
30947A58002319J71634J86440J53904J16620P0145J3573j2912O473M0388M3176
30937A58791760o157q1189j35859j59650j74672j88337j73775j22167o9932l3854
30927A57646168k7220n6774p9821n3838J2801P9290J19798J22704R4806O9957
30917A57927871O4254M2520j613k2023j6991k4875l3575k9808l9317n5249m8267
$$ plain form
30906 157762927 157741414 157744864 157759307 157772321 157787496 157809241 157831927 157859648 157887925 157889626 157833632
30895 157833632 157713558 157567287 157452679 157398108 157388563 157402721 157428912 157452769 157465376 157468328 157457669
30884 157457669 157430310 157387713 157328745 157247749 157159822 157098997 157087178 157115087 157132119 157094833 157010028
30873 157010028 156911224 156811099 156713909 156631697 156566283 156524177 156525142 156581985 156687575 156804191 156880063
30862 156880063 156890086 156856258 156807890 156740676 156645143 156552242 156518074 156565998 156686948 156850373
30852 156850373 157005662 157129777 157233489 157310769 157335166 157311627 157297315 157330309 157402125 157495761
30842 157495761 157593666 157690151 157778984 157842062 157875233 157888346 157889846 157899925 157927751 157939301 157870307
30831 157870307 157687281 157423303 157147802 156920498 156748426 156624406 156568398 156581970 156644155 156741483
$$ packed form
30906A57762927k1513L450J4443J3014J5175K1745K2686K7721K8277J701n5994
30895A57833632j20074j46271j14608n4571r545J4158K6191K3857J2607K952j0659
30884A57457669k7359m2597n8968q0996q7927o0825j1819K7909J7032l7286q4805
30873A57010028r8804j00125r7190q2212o5414m2106R65N6843J05590J16616P5872
30862A56880063J0023l3828m8368o7214r5533r2901l4168M7924J20950J63425
30852A56850373J55289J24115J03712P7280K4397k3539j4312L2994P1816R3636
30842A57495761R7905R6485Q8833O3078L3171J3113J500J0079K7826J1550o8994
30831A57870307j83026k63978k75501k27304j72072j24020n6008J3572O2185R7328
$$ plain form
30821 156741483 156856516 156941724 156969530 156961754 156949971 156923663 156851542 156758337 156701738 156705946 156755542
30810 156755542 156812170 156857287 156885424 156874854 156834756 156809627 156806559 156787162 156747389 156731389 156779861
30799 156779861 156898203 157047914 157184636 157288190 157344503 157329532 157233277 157086277 156931811 156816789
30789 156816789 156767603 156759809 156772702 156816829 156899219 156986699 157036987 157049885 157033747 156994657 156949781
30778 156949781 156930889 156966257 157043746 157128649 157209542 157271268 157261457 157146776 156946289 156686975
30768 156686975 156407462 156179787 156077152 156105433 156204587 156334746 156479613 156607476 156700979 156770911
30758 156770911 156828161 156890517 156987252 157118479 157246914 157346380 157416348 157450079 157426314 157348400
30748 157348400 157250082 157163657 157102729 157051430 156977096 156874892 156775891 156708855 156675686 156659383 156638907
$$ packed form
30821A56741483J15033Q5208K7806p776j1783k6308p2121r3205n6599M208M9596
30810A56755542N6628M5117K8137j0570m0098k5129l068j9397l9773j6000M8472
30799A56779861J18342J49711J36722J03554N6313j4971r6255j47000j54466j15022
30789A56816789m9186p794J2893M4127Q2390Q7480N0288J2898j6138l9090m4876
30778A56949781j8892L5368P7489Q4903Q0893O1726r811j14681k00487k59314
30768A56686975k79513k27675j02635K8281R9154J30159J44867J27863R3503O9932
30758A56770911N7250O2356R6735J31227J28435R9466O9968L3731k3765p7914
30748A57348400r8318q6425o0928n1299p4334j02204r9001o7036l3169j6303k0476
$$ plain form
30737 156638907 156610348 156603515 156646183 156723721 156790903 156806895 156763406 156692591 156638606 156611863 156591525
30726 156591525 156571807 156555546 156517435 156437781 156326225 156212649 156128499 156084068 156052566 156003608
30716 156003608 155957271 155936054 155925993 155923495 155942965 155967833 155967120 155935453 155904744 155887346 155848457
30705 155848457 155778767 155715996 155696980 155720472 155761777 155804591 155830088 155843798 155879035 155928340 155953386
30694 155953386 155944085 155921437 155918666 155960979 156038001 156118606 156186545 156238253 156266470 156275468 156259964
30683 156259964 156207462 156149414 156124882 156122721 156110654 156075637 156026734 155987108 155967962 155961656 155974187
30672 155974187 156002910 156004575 155942843 155834077 155733555 155691203 155719019 155778942 155809503 155783009 155729538
30661 155729538 155698172 155723982 155812639 155937585 156063421 156161791 156206877 156190774 156123060 156009714
$$ packed form
30737A56638907k8559o833M2668P7538O7182J5992m3489p0815n3985k6743k0338
30726A56591525j9718j6261l8111p9654j11556j13576q4150m4431l1502m8958
30716A56003608m6337k1217j0061k498J9470K4868p13l1667l0709j7398l8889
30705A55848457o9690o2771j9016K3492M1305M2814K5497J3710L5237M9305K5046
30694A55953386r301k2648k771M2313P7022Q0605O7939N1708K8217Q998j5504
30683A56259964n2502n8048k4532k161j2067l5017m8903l9626j9146o306J2531
30672A55974187K8723J665o1732j08766j00522m2352K7816N9923L0561k6494n3471
30661A55729538l1366K5810Q8657J24946J25836R8370M5086j6103o7714j13346
$$ plain form
30651 156009714 155883800 155803603 155783794 155776532 155732961 155649174 155546561 155452542 155401589 155421932 155509031
30640 155509031 155612345 155686514 155722899 155713549 155654643 155592800 155586601 155644245 155733544 155825715 155908549
30629 155908549 155976883 156019198 156030359 156006641 155941997 155868388 155822429 155805767 155802956 155790242 155742764
30618 155742764 155645361 155504520 155348020 155213431 155132537 155121162 155177531 155272434 155363100 155430256
30608 155430256 155471433 155466548 155408975 155334850 155276526 155240796 155217384 155193581 155170377 155167364 155214721
30597 155214721 155326498 155460543 155542565 155532964 155460888 155402683 155395593 155432239 155498362 155565214 155605669
30586 155605669 155613102 155590026 155534463 155435375 155313626 155222575 155188118 155174032 155149225 155134195 155158778
30575 155158778 155233420 155344698 155449233 155506513 155516927 155511828 155517748 155532839 155553003 155598107 155673084
$$ packed form
30651A56009714j25914q0197j9809p262m3571q3787j02613r4019n0953K0343Q7099
30640A55509031J03314P4169L6385r350n8906o1843o199N7644Q9299R2171Q2834
30629A55908549O8334M2315J1161k3718o4644p3609m5959j6662k811j2714m7478
30618A55742764r7403j40841j56500j34589q0894j1375N6369R4903R0666O7156
30608A55430256M1177m885n7573p4125n8324l5730k3412k3803k3204l013M7357
30597A55214721J11777J34045Q2022r601p2076n8205p090L6646O6123O6852M0455
30586A55605669P433k3076n5563r9088j21749r1051l4457j4086k4807j5030K4583
30575A55158778P4642J11278J04535N7280J0414n099N920J5091K0164M5104P4977
$$ plain form
30564 155673084 155744169 155784574 155807233 155844716 155906620 155989487 156097421 156203233 156256657 156213845
30554 156213845 156040339 155781086 155561485 155462190 155461900 155495295 155517112 155523671 155511498 155463049 155377745
30543 155377745 155275991 155194087 155148313 155136903 155176505 155281551 155428982 155579496 155707734 155787003
30533 155787003 155792515 155749173 155711160 155708496 155730745 155750999 155747911 155709846 155636363 155549441 155492386
30522 155492386 155491053 155519132 155527596 155494614 155447686 155416762 155386217 155335371 155250580 155124225 154977345
30511 154977345 154869964 154862059 154952137 155072211 155141614 155137819 155099355 155088843 155140230 155243558 155358439
30500 155358439 155419518 155383096 155264221 155104337 154922145 154738201 154612841 154606846 154711543 154864067
30490 154864067 155020764 155179228 155331026 155438905 155496429 155543276 155587170 155591521 155563557 155561809
$$ packed form
30564A55673084P1085M0405K2659L7483O1904Q2867J07934J05812N3424m2812
30554A56213845j73506k59253k19601r9295k90L3395K1817O559j2173m8449q5304
30543A55377745j01754q1904m5774j1410L9602J05046J47431J50514J28238P9269
30533A55787003N512m3342l8013k664K2249K0254l088l8065p3483q6922n7055
30522A55492386j333K8079Q464l2982m6928l0924l0545n0846q4791j26355j46880
30511A54977345j07381p905R0078J20074O9403l795l8464j0512N1387J03328J14881
30500A55358439O1079l6422j18875j59884j82192j83944j25360n995J04697J52524
30490A54864067J56697J58464J51798J07879N7524M6847M3894M351k7964j748
$$ plain form
30480 155561809 155596806 155595303 155499693 155320204 155095626 154897764 154784829 154742006 154726276 154704960
30470 154704960 154651587 154570575 154494667 154446438 154415549 154371233 154315836 154290782 154322838 154404551 154511683
30459 154511683 154623084 154718741 154794773 154885312 155015448 155166078 155305486 155401031 155433050 155394110
30449 155394110 155295588 155180755 155090444 155049178 155052867 155055419 155021032 154956461 154885555 154820776 154767488
30438 154767488 154714747 154650634 154601691 154605399 154641632 154648673 154628504 154633983 154651373 154611062 154503753
30427 154503753 154390748 154311599 154260976 154230082 154223352 154246047 154289941 154327180 154346537 154372660 154415542
30416 154415542 154446960 154465365 154505922 154571859 154632079 154679058 154734299 154799408 154857586 154889947 154886993
30405 154886993 154871621 154880871 154916272 154935531 154903951 154834065 154769051 154742088 154749534 154763786 154767079
$$ packed form
30480A55561809L4997j503r5610j79489k24578j97862j12935m2823j5730k1316
30470A54704960n3373q1012p5908m8229l0889m4316n5397k5054L2056Q1713J07132
30459A54511683J11401R5657P6032R0539J30136J50630J39408R5545L2019l8940
30449A55394110r8522j14833r0311m1266L689K552l4387o4571p0906o4779n3288
30438A54767488n2741o4113m8943L708L6233P041k0169N479J7390m0311j07309
30427A54503753j13005p9149n0623l0894o730K2695M3894L7239J9357K6123M2882
30416A54415542L1418J8405M0557O5937O0220M6979N5241O5109N8178L2361k954
30405A54886993j5372R250L5401J9259l1580o9886o5014k6963P446J4252L293
$$ plain form
30394 154767079 154761298 154747548 154717465 154664744 154594227 154508331 154424810 154400558 154454284 154515518 154512899
30383 154512899 154458897 154409681 154386849 154378408 154361460 154318131 154243811 154150949 154065537 154001994 153959310
30372 153959310 153928389 153905815 153901848 153934852 154012963 154137316 154312756 154521620 154708110 154811890
30362 154811890 154806592 154712662 154586905 154482694 154415038 154375659 154350009 154311677 154244048 154164012 154105207
30351 154105207 154076066 154035859 153950982 153835514 153721919 153641592 153610323 153623371 153673367 153742163
30341 153742163 153803281 153861747 153922573 153946068 153894694 153796074 153715233 153687765 153730074 153853068 154022111
30330 154022111 154176268 154298603 154397975 154457963 154453391 154386753 154301204 154235845 154192215 154156552 154109779
30319 154109779 154022521 153890969 153765264 153698037 153687847 153692248 153681699 153660392 153642103 153639978 153656520
$$ packed form
30394A54767079n781j3750l0083n2721p0517q5896q3521k4252N3726O1234k619
30383A54512899n4002m9216k2832q441j6948m3329p4320r2862q5412o3543m2684
30372A53959310l0921k2574l967L3004P8111J24353J75440K08864J86490J03780
30362A54811890n298r3930j25757j04211o7656l9379k5650l8332o7629q0036n8805
30351A54105207k9141m0207q4877j15468j13595q0327l1269J3048M9996O8796
30341A53742163O1118N8466O0826K3495n1374r8620q0841k7468M2309J22994J69043
30330A54022111J54157J22335R9372N9988m572o6638q5549o5359m3630l5663m6773
30319A54109779q7258j31552j25705o7227j0190M401j0549k1307j8289k125J6542
$$ plain form
30308 153656520 153676982 153698952 153716502 153701848 153639950 153553931 153488077 153460068 153465133 153504506 153551041
30297 153551041 153557182 153514917 153442403 153364003 153317909 153322460 153353339 153379125 153375691 153337595 153295492
30286 153295492 153265488 153238208 153232478 153275292 153342391 153402319 153467138 153552528 153644800 153710955 153730547
30275 153730547 153727185 153721319 153696008 153642252 153574837 153527047 153513239 153529293 153578622 153644489 153688799
30264 153688799 153690974 153655788 153599961 153548348 153522421 153524296 153548172 153582292 153616636 153643710 153659637
30253 153659637 153653540 153593928 153478899 153330452 153172233 153039936 152969243 152949529 152927814 152872250
30243 152872250 152794126 152719944 152671934 152669597 152709721 152766122 152812675 152834871 152830902 152829528 152876262
30232 152876262 152976160 153086953 153156852 153170995 153157367 153136016 153113401 153104929 153132512 153174515 153195351
$$ packed form
30308A53656520K0462K1970J7550j4654o1898q6019o5854k8009N065L9373M6535
30297A53551041O141m2265p2514p8400m6094M551L0879K5786l434l8096m2103
30286A53295492l0004k7280n730M2814O7099N9928O4819Q5390R2272O6155J9592
30275A53730547l362n866k5311n3756o7415m7790j3808J6054M9329O5867M4310
30264A53688799K175l5186n5827n1613k5927J875K3876L4120L4344K7074J5927
30253A53659637o097n9612j15029j48447j58219j32297p0693j9714k1715n5564
30243A52872250p8124p4182m8010k337M0124N6401M6553K2196l969j374M6734
30232A52876262R9898J10793O9899J4143j3628k1351k2615q472K7583M2003K0836
$$ plain form
30221 153195351 153213306 153242680 153269791 153285078 153289630 153290488 153291592 153288191 153267003 153216783 153150154 153101847
30209 153101847 153091811 153095583 153078685 153037398 152978305 152897430 152795480 152698145 152632966 152600388 152603463
30198 152603463 152663369 152792997 152977880 153172075 153326941 153422345 153477960 153517677 153531225 153506938
30188 153506938 153481633 153518521 153627406 153756599 153851539 153882276 153841280 153742388 153618335 153485249
30178 153485249 153321983 153142412 153028875 153032062 153117816 153226090 153311993 153363643 153388802 153382899
30168 153382899 153329150 153251339 153220932 153272398 153369983 153448468 153470952 153444025 153367214 153233699 153078662
30157 153078662 152978653 152980811 153061914 153175519 153283975 153341638 153331196 153286834 153233308 153180269
30147 153180269 153139131 153095846 153015000 152914579 152857174 152859614 152879458 152867579 152818146 152773025 152761984
$$ packed form
30221A53195351J7955K9374K7111J5287M552Q58J104l401k1188n0220o6629m8307
30209A53101847j0036L772j6898m1287n9093q0875j01950r7335o5179l2578L075
30198A52603463N9906J29628J84883J94195J54866R5404N5615L9717J3548k4287
30188A53506938k5305L6888J08885J29193R4940L0737m0996r8892j24053j33086
30178A53485249j63266j79571j13537L187Q5754J08274Q5903N1650K5159n903
30168A53382899n3749p7811l0407N1466R7585P8485K2484k6927p6811j33515j55037
30157A53078662j00009K158Q1103J13605J08456N7663j0442m4362n3526n3039
30147A53180269m1138m3285q0846j00421n7405K440J9844j1879m9433m5121j1041
$$ plain form
30136 152761984 152741623 152635161 152438403 152231532 152097152 152063938 152111063 152188680 152257051 152309544
30126 152309544 152353863 152384331 152389217 152385527 152411640 152468038 152517742 152549511 152581161 152619761 152682083
30115 152682083 152777446 152862163 152901157 152900171 152869851 152832433 152812228 152819132 152857592 152933179 153031421
30104 153031421 153121824 153178400 153194023 153187929 153189457 153207660 153217606 153203694 153176570 153139062 153070594
30093 153070594 152960845 152823090 152687220 152596371 152553045 152518599 152493732 152517983 152609340 152729796
30083 152729796 152815040 152827746 152760158 152626587 152459697 152292456 152159902 152097833 152108663 152146398
30073 152146398 152174433 152199229 152223226 152203888 152126028 152056916 152068429 152149260 152218410 152229065 152204781
30062 152204781 152191560 152219050 152288332 152374945 152450468 152496892 152516717 152524109 152536305 152574920 152644824
$$ packed form
30136A52761984k0361j06462j96758k06871j34380l3214M7125P7617O8371N2493
30126A52309544M4319L0468M886l690K6113N6398M9704L1769L1650L8600O2322
30115A52682083R5363Q4717L8994r86l0320l7418k0205O904L8460P5587R8242
30104A53031421R0403N6576J5623o094J528J8203R946j3912k7124l7508o8468
30093A53070594j09749j37755j35870r0849m3326l4446k4867K4251R1357J20456
30083A52729796Q5244J2706o7588j33571j66890j67241j32554o2069J0830L7735
30073A52146398K8035K4796K3997j9338p7860o9112J1513Q0831O9150J0655k4284
30062A52204781j3221K7490O9282Q6613P5523M6424J9825P392J2196L8615O9904
$$ plain form
30051 152644824 152736918 152855217 152998410 153130914 153210835 153209641 153113428 152952166 152800075 152708809
30041 152708809 152674562 152678286 152697463 152719610 152752076 152798159 152839576 152852566 152860969 152899595 152953161
30030 152953161 152993761 153043255 153126237 153212079 153252937 153230107 153146088 153002537 152812841 152607078
30020 152607078 152423979 152315656 152302308 152340129 152381343 152426223 152483490 152535300 152576828 152623655
30010 152623655 152672792 152701145 152672412 152547473 152341308 152130870 151990855 151931616 151884379 151794371
30000 151794371 151687100 151611815 151594539 151615172 151633287 151650878 151710834 151807957 151885705 151921377 151924240
29989 151924240 151882222 151797798 151719144 151698359 151754531 151858225 151965102 152051286 152115024 152179881
29979 152179881 152261354 152339486 152388235 152381734 152305042 152189345 152097791 152053252 151992134 151857806 151703268
$$ packed form
30051A52644824R2094J18299J43193J32504P9921j194r6213j61262j52091r1266
30041A52708809l4247L724J9177K2147L2466M6083M1417J2990Q403L8626N3566
30030A52953161M0600M9494Q2982Q5842M0858k2830q4019j43551j89696k05763
30020A52607078j83099j08323j3348L7821M1214M4880N7267N1810M1528M6827
30010A52623655M9137K8353k8733j24939k06165k10438j40015n9239m7237r0008
30000A51794371j07271p5285j7276K0633J8115J7591N9956R7123P7748L5672K863
29989A51924240m2018q4424p8654k0785N6172J03694J06877Q6184O3738O4857
29979A52179881Q1473P8132M8749o501p6692j15697r1554m4539o1118j34328j54538
$$ plain form
29968 151703268 151613569 151620792 151718221 151863232 151993940 152073984 152106497 152123696 152150420 152177163 152182252
29957 152182252 152150186 152091510 152045358 152031778 152060016 152127998 152204418 152268697 152329637 152401023 152495083
29946 152495083 152594029 152657811 152684681 152681398 152616605 152464388 152248817 152028825 151851057 151731509
$$ packed form
29968A51703268q9699P223R7429J45011J30708Q0044L2513J7199K6724K6743N089
29957A52182252l2066n8676m6152j3580K8238O7982P6420O4279O0940P1386R4060
29946A52495083R8946O3782K6870l283o4793j52217k15571k19992j77768j19548
$$ [...]
##END NTUPLES=NMR SPECTRUM
##END=
