##TITLE=c13 ikalashn
5237-H
17.9.2024
##JCAMPDX= 6.0         $$ Bruker NMR JCAMP-DX V2.0
##DATA TYPE= NMR SPECTRUM
##DATA CLASS= NTUPLES
##ORIGIN= UXNMR, Bruker Analytische Messtechnik GmbH
##OWNER= root
$$ TOPSPIN		Version 1.3
$$ 2024-09-17 10:12:14.296 +0400  Irina@DPX200
$$ Compression mode = diff/dup
##.OBSERVE FREQUENCY= 50.3277412709
##.OBSERVE NUCLEUS= ^13C
##.ACQUISITION MODE= SIMULTANEOUS
##.ACQUISITION SCHEME= undefined
##.AVERAGES= 18800
##.DIGITISER RES= 17
##SPECTROMETER/DATA SYSTEM= spect
##.PULSE SEQUENCE= zgpg
##.SOLVENT NAME= CDCl3
##.SHIFT REFERENCE= INTERNAL, CDCl3, 1, 219.1352
##AUDIT TRAIL= $$ (NUMBER, WHEN, WHO, WHERE, WHAT)
$$ ##TITLE= Audit trail, TOPSPIN		Version 1.3
$$ ##JCAMPDX= 5.01
$$ ##ORIGIN= Bruker BioSpin GmbH
$$ ##OWNER= Irina
$$ $$ F:/spectra/data/iren/nmr/c13zvl/1/pdata/1/auditp.txt
$$ ##AUDIT TRAIL=  $$ (NUMBER, WHEN, WHO, WHERE, VERSION, WHAT)
(   1,<2024-09-17 10:11:38.609 +0400>,<Irina>,<DPX200>,<TOPSPIN 1.3>,
      <created by zg
	started at 2024-09-16 16:16:53.031 +0400,
	POWCHK disabled, PULCHK disabled
       terminated by command 'halt'
       configuration hash MD5:
       BE 6D 3F 07 2A EA 11 49 91 17 2B D3 AF B3 58 0D
       data hash MD5: 32K
       0D CF 3D AD 52 01 E9 11 F7 2E 46 D0 36 95 B0 8C>)
(   2,<2024-09-17 10:11:39.609 +0400>,<Irina>,<DPX200>,<TOPSPIN 1.3>,
      <Start of raw data processing
       efp BC_mod = 2 LB = 2.5 FT_mod = 6 PKNL = 1 PHC0 = 205.9534 PHC1 = -5.431315 SI = 32K 
       data hash MD5: 32K
       15 71 48 EA 21 7D 59 BE F9 64 6A C7 D3 D1 B4 8F>)
(   3,<2024-09-17 10:11:42.078 +0400>,<Irina>,<DPX200>,<TOPSPIN 1.3>,
      <apk 
       data hash MD5: 32K
       4F 16 E3 74 4A 33 45 07 BC 9D 91 FE D8 1A BC 04>)
(   4,<2024-09-17 10:11:44.359 +0400>,<Irina>,<DPX200>,<TOPSPIN 1.3>,
      <abs n ABSG = 5 
       data hash MD5: 32K
       14 69 F4 D3 35 81 42 0C 70 D7 E6 43 A4 84 0D 7A>)
(   5,<2024-09-17 10:11:56.578 +0400>,<Irina>,<DPX200>,<TOPSPIN 1.3>,
      <abs n ABSG = 5 
       data hash MD5: 32K
       E0 D0 81 5A 7E 51 8E ED 52 6D E6 66 73 EE 59 46>)
$$ ##END=
$$ 
$$ $$ hash MD5
$$ $$ 1C 85 57 BC 8F 7C 1D 82 3B 75 26 5C D5 81 DE C2
##$RELAX= 
##$RELAX= 
##$RELAX= 
##$RELAX= 
##$RELAX= 
##$RELAX= 
##$RELAX= 
##$RELAX= 
##$RELAX= 
$$ Bruker specific parameters
$$ --------------------------
##$DU= <F:/spectra>
##$EXPNO= 1
##$NAME= <c13zvl>
##$PROCNO= 1
##$TYPE= <nmr>
##$USER= <iren>
##$AMP= (0..31)
100 100 100 100 100 100 100 100 100 100 100 100 100 100 100 100 100 100 
100 100 100 100 100 100 100 100 100 100 100 100 100 100 
##$ANAVPT= -1
##$AQSEQ= 0
##$AQ_mod= 1
##$AUNM= <au_zg>
##$AUTOPOS= <>
##$BF1= 50.322709
##$BF2= 200.13
##$BF3= 200.13
##$BF4= 200.13
##$BF5= 200.13
##$BF6= 200.13
##$BF7= 200.13
##$BF8= 200.13
##$BYTORDA= 1
##$CFDGTYP= 0
##$CFRGTYP= 5
##$CHEMSTR= <none>
##$CNST= (0..63)
1 1 145 1 1 1 1 1 1 1 1 1 1 1 1 1 1 1 1 1 1 1 1 1 1 1 1 1 1 1 1 1 1 1 
1 1 1 1 1 1 1 1 1 1 1 1 1 1 1 1 1 1 1 1 1 1 1 1 1 1 1 1 1 1 
##$CPDPRG= <waltz16>
##$CPDPRG1= <>
$$ [...]
##$SW= 238.246489333188
##$SWIBOX= (0..15)
0 1 3 0 0 0 0 0 0 0 0 0 0 0 0 0 
##$SW_h= 11990.4076738609
##$TD= 32768
##$TD0= 1
##$TE= 300
##$TE2= 300
##$TE3= 300
##$TEG= 300
##$TL= (0..7)
120 120 120 120 120 120 120 120 
##$TP= (0..7)
150 150 150 150 150 150 150 150 
##$TP07= 0
##$TPNAME0= <>
##$TPNAME1= <>
##$TPNAME2= <>
##$TPNAME3= <>
##$TPNAME4= <>
##$TPNAME5= <>
##$TPNAME6= <>
##$TPNAME7= <>
##$TPOAL= (0..7)
0.5 0.5 0.5 0.5 0.5 0.5 0.5 0.5 
##$TPOFFS= (0..7)
0 0 0 0 0 0 0 0 
##$TUNHIN= 0
##$TUNHOUT= 0
##$TUNXOUT= 0
##$USERA1= <user>
##$USERA2= <user>
##$USERA3= <user>
##$USERA4= <user>
##$USERA5= <user>
##$V9= 5
##$VALIST= <valist>
##$VCLIST= <CCCCCCCCCCCCCCC>
##$VD= 0
##$VDLIST= <DDDDDDDDDDDDDDD>
##$VPLIST= <PPPPPPPPPPPPPPP>
##$VTLIST= <TTTTTTTTTTTTTTT>
##$WBST= 1024
##$WBSW= 4
##$XGAIN= (0..3)
0 0 0 0 
##$XL= 0
##$YL= 0
##$YMAX_a= 16109196
##$YMIN_a= -25621375
##$ZGOPTNS= <>
##$ZL1= 120
##$ZL2= 120
##$ZL3= 120
##$ZL4= 120
##$ABSF1= 219.1352
##$ABSF2= -19.13512
##$ABSG= 5
##$ABSL= 3
##$ALPHA= 0
##$AQORDER= 0
##$ASSFAC= 0
##$ASSFACI= 0
##$ASSFACX= 0
##$ASSWID= 0
##$AUNMP= <proc_1d>
##$AXLEFT= 0
##$AXRIGHT= 0
##$AXTYPE= 0
##$AXUNIT= <>
##$AZFE= 0.1
##$AZFW= 0.5
##$BCFW= 0
##$BC_mod= 2
##$BYTORDP= 0
##$COROFFS= 0
##$CY= -3
##$DATMOD= 1
##$DC= 0
##$DFILT= <>
##$DTYPP= 0
##$F1P= 0
##$F2P= 0
##$FCOR= 0.5
##$FTSIZE= 32768
##$FT_mod= 6
##$GAMMA= 0
##$GB= 0
##$INTBC= 1
##$INTSCL= 1.406111e-010
##$ISEN= 30
##$LB= 2.5
##$LEV0= 0
##$LPBIN= 0
##$MAXI= 7.640843
##$MC2= 0
##$MEAN= 0
##$ME_mod= 0
##$MI= 1.154659
##$NCOEF= 0
##$NC_proc= -4
##$NLEV= 6
##$NOISF1= 0
##$NOISF2= 0
##$NSP= 0
##$NTH_PI= 0
##$NZP= 0
##$OFFSET= 219.1352
##$PC= 1.4
##$PHC0= 196.8808
##$PHC1= 1.824199
##$PH_mod= 1
##$PKNL= yes
##$PPARMOD= 0
##$PPDIAG= 0
##$PPIPTYP= 0
##$PPMPNUM= 100
##$PPRESOL= 1
##$PSCAL= 0
##$PSIGN= 0
##$REVERSE= no
##$SF= 50.322709
##$SI= 32768
##$SIGF1= 0
##$SIGF2= 0
##$SINO= 80
##$SIOLD= 32768
##$SREGLST= <13C.CDCl3>
##$SSB= 0
##$STSI= 32768
##$STSR= 0
##$SW_p= 11990.4076738609
##$SYMM= 0
##$S_DEV= 0
##$TDeff= 32768
##$TDoff= 0
##$TI= <>
##$TILT= no
##$TM1= 0
##$TM2= 0
##$TOPLEV= 0
##$USERP1= <user>
##$USERP2= <user>
##$USERP3= <user>
##$USERP4= <user>
##$USERP5= <user>
##$WDW= 1
##$XDIM= 32768
##$YMAX_p= 74527416
##$YMIN_p= -2925639
$$ End of Bruker specific parameters
$$ ---------------------------------
##NTUPLES= NMR SPECTRUM
##VAR_NAME=  FREQUENCY,     SPECTRUM/REAL,   SPECTRUM/IMAG
##SYMBOL=    X,             R,               I
##VAR_TYPE=  INDEPENDENT,   DEPENDENT,       DEPENDENT
##VAR_FORM=  AFFN,          ASDF,            ASDF
##VAR_DIM=   32768,         32768,           32768
##UNITS=     HZ,            ARBITRARY UNITS, ARBITRARY UNITS
##FACTOR=    0.365929370215793, 1,           1
##FIRST=     11990.4076738609, -224615,      71152765
##LAST=      0,             -1263,           -38804056
##MIN=       0,             -2925639,        0
##MAX=       11990.4076738609, 74527416,     0
$$ Real data points
##PAGE= N=1
##DATA TABLE= (X++(R..R)), XYDATA
$$ [...]
##PAGE= N=2
##DATA TABLE= (X++(I..I)), XYDATA
7484 -276904711 -277239956 -277506439 -277673792 -277770196 -277835858 -277904977 -278016066 -278184956 -278375444 -278539148
7474 -278539148 -278674466 -278817381 -278972987 -279074708 -279051641 -278904222 -278684021 -278432524 -278161539
7465 -278161539 -277900794 -277723792 -277673478 -277723982 -277844068 -278014174 -278156161 -278182508 -278125933 -278093101
7455 -278093101 -278103830 -278085352 -278007457 -277932589 -277923630 -277944685 -277921772 -277861727 -277842472 -277878000 -277889665
7444 -277889665 -277828714 -277715392 -277601195 -277532824 -277540017 -277629843 -277744053 -277786263 -277748116 -277696235 -277640893
7433 -277640893 -277548696 -277425470 -277322603 -277288868 -277299200 -277269052 -277143462 -276923520 -276661789 -276408118
7423 -276408118 -276188867 -276047154 -276021343 -276104289 -276280094 -276565073 -276956036 -277376963 -277730886 -277988531
7413 -277988531 -278202085 -278428869 -278648093 -278794393 -278855405 -278834799 -278715293 -278534857 -278358219 -278201613
7403 -278201613 -278084139 -278013870 -277951195 -277875231 -277832564 -277882584 -278046926 -278289527 -278525318 -278677816
7393 -278677816 -278745271 -278769312 -278769600 -278750672 -278721174 -278681123 -278624725 -278533327 -278396531 -278263272 -278190437
7382 -278190437 -278176243 -278174843 -278151246 -278115944 -278066309 -277959117 -277799849 -277647742 -277510798 -277374397
7372 -277374397 -277252404 -277139013 -277005807 -276838302 -276668051 -276582543 -276664838 -276924176 -277311862 -277759405
7362 -277759405 -278216830 -278670259 -279120238 -279556591 -279945266 -280226936 -280328869 -280250681 -280115573
7353 -280115573 -280075922 -280187920 -280394076 -280583511 -280665504 -280609035 -280461814 -280303031 -280157680 -280018430
7343 -280018430 -279892932 -279771899 -279627344 -279461833 -279304198 -279192158 -279168021 -279259407 -279471545 -279771112
7333 -279771112 -280069475 -280281271 -280367617 -280326289 -280182541 -279973983 -279745738 -279549865 -279419932 -279349739
7323 -279349739 -279322549 -279340127 -279424484 -279579333 -279774349 -279948596 -280038198 -280079072 -280175328 -280322831
7313 -280322831 -280388816 -280300553 -280118737 -279953490 -279871858 -279851343 -279835879 -279814267 -279802886 -279804862 -279824414
7302 -279824414 -279872424 -279908519 -279859592 -279695582 -279482784 -279316280 -279193808 -279081080 -279014843 -279024538
7292 -279024538 -279035362 -278950408 -278778141 -278573488 -278366063 -278202114 -278140196 -278181924 -278317079 -278534169
7282 -278534169 -278747166 -278881415 -278972320 -279070283 -279159018 -279205532 -279222333 -279250835 -279304357 -279349520 -279347625
7271 -279347625 -279305683 -279280828 -279327733 -279488399 -279761264 -280040316 -280205293 -280260046 -280283892 -280307557
7261 -280307557 -280324661 -280343106 -280339467 -280265032 -280155398 -280089051 -280060406 -280040624 -280038995 -280029723 -279938365
7250 -279938365 -279731966 -279520734 -279483499 -279648146 -279846403 -279929739 -279919228 -279878355 -279816227 -279715436
7240 -279715436 -279561531 -279357124 -279124204 -278889687 -278672369 -278487163 -278335878 -278195670 -278040375
7231 -278040375 -277894402 -277814414 -277821732 -277892931 -278014486 -278211628 -278513520 -278880653 -279202432 -279374818
7221 -279374818 -279369377 -279220178 -278988478 -278754084 -278623915 -278646289 -278737739 -278769300 -278690191 -278532460
7211 -278532460 -278382051 -278316013 -278312301 -278290171 -278219836 -278150150 -278146159 -278226910 -278373740 -278581233 -278838558
7200 -278838558 -279105078 -279335652 -279508375 -279604309 -279625072 -279625836 -279661920 -279747212 -279863121 -279989011
7190 -279989011 -280122254 -280296320 -280545613 -280831562 -281042137 -281077813 -280943064 -280731262 -280529202
7181 -280529202 -280360405 -280230348 -280155520 -280135267 -280127517 -280078309 -279969378 -279806828 -279615496 -279432272
7171 -279432272 -279253668 -279063834 -278884455 -278716019 -278562294 -278485666 -278514341 -278583433 -278614651 -278609554
7161 -278609554 -278612989 -278644579 -278711300 -278830691 -279017732 -279232409 -279402926 -279492813 -279525686 -279556427
7151 -279556427 -279615150 -279665798 -279668985 -279683667 -279806060 -280037232 -280279489 -280448495 -280526128 -280538488
7141 -280538488 -280512558 -280434345 -280302837 -280157437 -280013678 -279866319 -279693289 -279483442 -279294098 -279196244
7131 -279196244 -279185899 -279200542 -279181914 -279106604 -279005898 -278953130 -279010584 -279186756 -279421377 -279630197
7121 -279630197 -279769812 -279824467 -279811068 -279784014 -279773361 -279777305 -279800791 -279843611 -279868301 -279833891 -279751236
7110 -279751236 -279670261 -279638565 -279670995 -279731759 -279774764 -279787033 -279785612 -279778571 -279738640 -279661955 -279617319
7099 -279617319 -279694189 -279893219 -280081554 -280123538 -280026744 -279917484 -279883280 -279880313 -279810415 -279647532
7089 -279647532 -279463723 -279332911 -279272680 -279260493 -279265043 -279274103 -279290919 -279314647 -279329362 -279314080 -279237300
7078 -279237300 -279079127 -278887993 -278726336 -278610186 -278544160 -278526973 -278526160 -278510334 -278479374 -278435738 -278345997
7067 -278345997 -278174875 -277966495 -277843838 -277889450 -278065238 -278283908 -278492435 -278690503 -278915427
7058 -278915427 -279161375 -279365528 -279529978 -279726979 -279963877 -280180156 -280332928 -280400679 -280372088 -280266842
7048 -280266842 -280128870 -279979621 -279835777 -279758094 -279782167 -279852971 -279897683 -279893060 -279839501 -279756267 -279672714
7037 -279672714 -279587943 -279479698 -279332470 -279159237 -279002802 -278906851 -278891152 -278946317 -279036641 -279146312
7027 -279146312 -279303173 -279526508 -279793626 -280016969 -280099425 -280049956 -279960116 -279879294 -279813663 -279767052
7017 -279767052 -279711201 -279641302 -279603463 -279650942 -279820413 -280096228 -280385980 -280547966 -280523980 -280371617
7007 -280371617 -280163285 -279923144 -279657680 -279436917 -279345124 -279368411 -279418155 -279455776 -279500197 -279571389
6997 -279571389 -279693766 -279878861 -280083831 -280263950 -280410212 -280496711 -280488183 -280380229 -280202164 -280002701
6987 -280002701 -279834240 -279691495 -279511711 -279294528 -279124428 -279058359 -279071462 -279093659 -279074439 -279022331
6977 -279022331 -278975952 -278950451 -278951721 -278987700 -279035767 -279084916 -279193839 -279408097 -279668050 -279876182
6967 -279876182 -279965884 -279933628 -279844266 -279756041 -279652024 -279486574 -279278319 -279107210 -279008914 -278959617
6957 -278959617 -278931159 -278909220 -278890703 -278860139 -278835713 -278882796 -279063101 -279383889 -279771032 -280111521
6947 -280111521 -280359268 -280547238 -280685425 -280741121 -280697432 -280588597 -280481679 -280428578 -280449837 -280539528
6937 -280539528 -280661827 -280753621 -280765039 -280717356 -280718522 -280859445 -281093330 -281271991 -281295470 -281178608
6927 -281178608 -280980443 -280750075 -280528065 -280364350 -280280917 -280244414 -280232665 -280235137 -280224984 -280183124
6917 -280183124 -280130940 -280129926 -280179525 -280237975 -280289549 -280343875 -280417872 -280493360 -280532573 -280517528 -280435888
6906 -280435888 -280294492 -280139273 -280040781 -280054993 -280173591 -280345335 -280514380 -280632466 -280645310 -280494347
6896 -280494347 -280178598 -279758588 -279285606 -278830167 -278501817 -278348369 -278334275 -278378159 -278420896 -278479715
6886 -278479715 -278582798 -278749265 -278972297 -279206022 -279423304 -279619899 -279757063 -279800038 -279781579 -279768589
6876 -279768589 -279814052 -279932394 -280121255 -280355260 -280598446 -280837728 -281033267 -281108265 -281027426 -280841049
6866 -280841049 -280639579 -280506951 -280493520 -280580591 -280696565 -280735056 -280626900 -280453152 -280345226 -280274631
6856 -280274631 -280134964 -279917631 -279662275 -279418034 -279253680 -279201952 -279269595 -279493496 -279928328 -280537214
6846 -280537214 -281172175 -281686078 -282021096 -282246806 -282464354 -282700870 -282925922 -283102393 -283203334
6837 -283203334 -283224550 -283200144 -283177675 -283172969 -283174379 -283182868 -283219014 -283281051 -283321650 -283286370 -283173889
6826 -283173889 -283022965 -282850149 -282657378 -282452802 -282254933 -282123729 -282081755 -282065877 -282009582 -281897334
6816 -281897334 -281726229 -281458095 -281091835 -280715834 -280442549 -280326754 -280374696 -280538942 -280719736
6807 -280719736 -280875106 -281051194 -281265040 -281456367 -281555223 -281552241 -281523572 -281531312 -281558796 -281583892 -281594511
6796 -281594511 -281622982 -281732621 -281903807 -282051223 -282103648 -282049823 -281962210 -281912619 -281912082 -281955195 -281994942
6785 -281994942 -281970388 -281876128 -281717441 -281496157 -281253938 -281069600 -281023099 -281141077 -281362632 -281579915
6775 -281579915 -281730392 -281814325 -281869791 -281923879 -281931565 -281799563 -281502459 -281154889 -280932953 -280926647
6765 -280926647 -281097648 -281326967 -281487206 -281558148 -281612035 -281686037 -281746214 -281771730 -281771847 -281737631 -281644912
6754 -281644912 -281471566 -281241189 -281054191 -280959697 -280886931 -280789227 -280695616 -280670595 -280782843 -281038591
6744 -281038591 -281355312 -281632363 -281825874 -281934938 -281949138 -281835704 -281601474 -281319914 -281051542
6735 -281051542 -280798045 -280568153 -280422432 -280399842 -280460443 -280542333 -280643944 -280776019 -280919111 -281090971
6725 -281090971 -281323722 -281554893 -281677071 -281668249 -281584723 -281493927 -281405873 -281282857 -281124391 -280981798
6715 -280981798 -280934138 -281038376 -281283974 -281605892 -281928606 -282168604 -282255309 -282212510 -282152052 -282150621
6705 -282150621 -282182464 -282165044 -282054351 -281924090 -281886702 -281979371 -282140244 -282263960 -282278273 -282163764
6695 -282163764 -281964611 -281770897 -281664633 -281699744 -281882672 -282132155 -282300714 -282283132 -282125298 -281978130
6685 -281978130 -281947006 -282028168 -282162240 -282295879 -282406333 -282510721 -282630979 -282762396 -282885390 -282972072
6675 -282972072 -282989075 -282939418 -282891120 -282880521 -282834615 -282653976 -282312645 -281888849 -281502169 -281225224
6665 -281225224 -281076054 -281036038 -281040526 -281017775 -280929914 -280783833 -280658971 -280664703 -280873037 -281277930
6655 -281277930 -281762939 -282192421 -282516793 -282729099 -282815446 -282794540 -282687189 -282463521 -282121675 -281723008
6645 -281723008 -281336172 -281022547 -280843807 -280830197 -280951387 -281126743 -281275484 -281394525 -281551067
6636 -281551067 -281779873 -282029299 -282214585 -282303724 -282304664 -282242615 -282169116 -282133114 -282139635 -282167379 -282212992
6625 -282212992 -282278382 -282328679 -282322049 -282246859 -282096629 -281884867 -281679627 -281555221 -281511678 -281508895 -281516136
6614 -281516136 -281504517 -281477903 -281484797 -281534849 -281573900 -281569034 -281522564 -281437454 -281300655 -281110580 -280919062
6603 -280919062 -280812212 -280864740 -281077531 -281353757 -281577507 -281651554 -281508439 -281189337 -280845224 -280629379
6593 -280629379 -280622838 -280823160 -281134818 -281401998 -281499605 -281409926 -281223409 -281031799 -280881054 -280806788
6583 -280806788 -280821558 -280903329 -281003109 -281047103 -281022064 -281028007 -281146470 -281351517 -281577628 -281766696
6573 -281766696 -281865482 -281853867 -281777531 -281719443 -281716070 -281764914 -281856684 -281973606 -282091555 -282142976 -282081852
6562 -282081852 -281960528 -281834972 -281701021 -281574961 -281505765 -281514874 -281595400 -281695558 -281742240 -281703903
6552 -281703903 -281590910 -281394679 -281106165 -280770204 -280446085 -280212461 -280163942 -280309529 -280569699
6543 -280569699 -280853581 -281072992 -281144386 -281030496 -280782337 -280519567 -280319542 -280175172 -280089460 -280123149
6533 -280123149 -280344051 -280744832 -281230281 -281698194 -282066093 -282264393 -282253655 -282082116 -281842286
6524 -281842286 -281562100 -281242149 -280910082 -280630854 -280483971 -280478700 -280568186 -280715016 -280926636 -281205858
6514 -281205858 -281465842 -281612795 -281654969 -281672513 -281736924 -281857117 -281981577 -282031195 -281935000 -281701797
6504 -281701797 -281434173 -281225765 -281084626 -280953930 -280820313 -280754671 -280825188 -281039502 -281373785 -281765655
6494 -281765655 -282095952 -282286585 -282374878 -282434742 -282497940 -282563087 -282606209 -282581991 -282451876 -282258802
6484 -282258802 -282118969 -282104816 -282193438 -282302140 -282361178 -282358856 -282300988 -282179981 -282000723 -281804205
6474 -281804205 -281644155 -281532573 -281422880 -281286503 -281151659 -281044150 -280957857 -280899795 -280884448 -280923899
6464 -280923899 -281003568 -281076889 -281133098 -281205455 -281305658 -281393509 -281424204 -281418892 -281482600 -281703166 -282057937
6453 -282057937 -282431694 -282707969 -282853284 -282904674 -282913453 -282890444 -282811533 -282667850 -282454104 -282161218
6443 -282161218 -281818652 -281473730 -281171712 -280945414 -280777705 -280630660 -280501582 -280424346 -280390095 -280328468
6433 -280328468 -280226933 -280178120 -280248518 -280415744 -280628094 -280844235 -281029469 -281162971 -281279733 -281437165
6423 -281437165 -281636939 -281785398 -281793337 -281713093 -281668514 -281715772 -281846061 -282031974 -282193679 -282251237
6413 -282251237 -282212134 -282105419 -281922172 -281693840 -281523271 -281447643 -281428990 -281485248 -281670566 -281930340
6403 -281930340 -282114698 -282122073 -281964846 -281722516 -281452188 -281191826 -280985906 -280850514 -280744749 -280630306
6393 -280630306 -280508758 -280405331 -280386944 -280528860 -280830073 -281194616 -281496085 -281690698 -281819696
6384 -281819696 -281967290 -282228923 -282590456 -282918925 -283137081 -283266386 -283339255 -283385199 -283405861 -283356565
6374 -283356565 -283171633 -282818672 -282354487 -281897885 -281550457 -281362926 -281329909 -281424052 -281593644 -281740628
6364 -281740628 -281797673 -281800706 -281825587 -281930745 -282127481 -282323490 -282401487 -282335621 -282157908 -281906170
6354 -281906170 -281633351 -281393354 -281251350 -281271520 -281433920 -281639026 -281818224 -281968255 -282067965 -282051060
6344 -282051060 -281908705 -281702532 -281481582 -281296255 -281173166 -281079547 -281007660 -280979462 -280991371 -281024531
6334 -281024531 -281075662 -281135256 -281164491 -281152859 -281164671 -281277849 -281473626 -281654732 -281748063 -281727711
6324 -281727711 -281626129 -281528867 -281484953 -281496164 -281557480 -281632602 -281682662 -281723302 -281799657 -281917787 -282012870
6313 -282012870 -281968693 -281695166 -281207815 -280651434 -280192568 -279925027 -279885973 -280034188 -280260002 -280476369
6303 -280476369 -280663203 -280824175 -280953604 -281067398 -281168172 -281231177 -281252816 -281239021 -281199462 -281145600
6293 -281145600 -281105574 -281124405 -281189032 -281239737 -281306597 -281492399 -281802101 -282102628 -282277411 -282280201
6283 -282280201 -282120140 -281862907 -281562039 -281238593 -280906911 -280604616 -280370458 -280211459 -280113335
6274 -280113335 -280046229 -279966797 -279855651 -279739672 -279648494 -279603116 -279602758 -279619156 -279619348 -279547086 -279370015
6263 -279370015 -279122981 -278873624 -278682710 -278543389 -278374054 -278129905 -277876144 -277708547 -277651498
6254 -277651498 -277670122 -277703961 -277685416 -277591421 -277468405 -277369527 -277279400 -277160121 -277005837 -276845675
6244 -276845675 -276737597 -276747751 -276933794 -277301190 -277829821 -278541193 -279402257 -280230132 -280837096
6235 -280837096 -281183825 -281335138 -281349672 -281232248 -280999619 -280719693 -280439388 -280155915 -279856490
6226 -279856490 -279534932 -279237707 -279039793 -278952464 -278915349 -278850603 -278693556 -278410148 -278022936 -277600601
6216 -277600601 -277197979 -276803869 -276353311 -275823046 -275298414 -274853676 -274446410 -274033620 -273657918
6207 -273657918 -273369782 -273148445 -272917502 -272601732 -272156777 -271598080 -270990628 -270355020 -269645592
6198 -269645592 -268865300 -268137825 -267604426 -267303192 -267172762 -267134534 -267102579 -266981752 -266726714 -266321371
6188 -266321371 -265717258 -264884172 -263866248 -262774319 -261762567 -260941259 -260314959 -259938251 -260052667
6179 -260052667 -261034224 -263365718 -267567266 -273967905 -282311786 -291527682 -300092939 -306830694
6171 -306830694 -311389227 -314048690 -315293598 -315585527 -315260245 -314515238 -313505811 -312382180
6163 -312382180 -311254834 -310201371 -309219319 -308222105 -307155063 -306053968 -305012714 -304156765
6155 -304156765 -303545676 -303069126 -302548654 -301888672 -301108318 -300270664 -299475286 -298864256 -298508078
6146 -298508078 -298320242 -298172232 -298040416 -297915874 -297746525 -297533602 -297306610 -297035274 -296669436
6137 -296669436 -296220232 -295770266 -295398785 -295142981 -295002702 -294915619 -294792562 -294616186 -294464400
6128 -294464400 -294386015 -294323896 -294191645 -293978787 -293760740 -293606472 -293529405 -293535897 -293613664 -293673725
6118 -293673725 -293637283 -293523466 -293395252 -293332579 -293403608 -293578309 -293761895 -293870630 -293862261 -293759142
6108 -293759142 -293620644 -293488061 -293372134 -293246420 -293081907 -292869686 -292584222 -292252549 -291992939
6099 -291992939 -291878817 -291883756 -291952632 -292029449 -292055723 -291995416 -291863314 -291714205 -291607854 -291571856
6089 -291571856 -291559922 -291462719 -291238518 -290967148 -290754870 -290648590 -290630849 -290674743 -290782973 -290934622
6079 -290934622 -291057720 -291083304 -290973567 -290746900 -290519770 -290422817 -290476761 -290596263 -290667516 -290650740
6069 -290650740 -290591678 -290551383 -290537629 -290506430 -290438613 -290350430 -290263090 -290227650 -290287273 -290410843 -290502407
6058 -290502407 -290468378 -290290470 -290040706 -289819025 -289669970 -289586724 -289576678 -289659946 -289813010 -289990532
6048 -289990532 -290183353 -290358025 -290431819 -290374773 -290220947 -289991969 -289684189 -289339173 -289050924 -288894767
6038 -288894767 -288878882 -288934397 -288986895 -289015781 -289021448 -289012117 -289011314 -289045744 -289118405 -289184303 -289180982 -289080182
6026 -289080182 -288920510 -288791322 -288759343 -288834343 -288992015 -289220987 -289505263 -289776403 -289937409 -289925496
6016 -289925496 -289766904 -289563415 -289389883 -289246229 -289121384 -289047507 -289096549 -289290376 -289550479 -289800386
6006 -289800386 -290018534 -290179107 -290282619 -290350226 -290355387 -290274077 -290148468 -290031742 -289923578 -289812186
5996 -289812186 -289709738 -289643091 -289623141 -289624768 -289642894 -289715930 -289852119 -290007530 -290138380 -290194928
5986 -290194928 -290142252 -290012347 -289852441 -289707557 -289630515 -289607544 -289561302 -289457028 -289324951 -289234879
5976 -289234879 -289259842 -289381657 -289506477 -289620749 -289786113 -290008495 -290234838 -290407519 -290508031
5967 -290508031 -290566956 -290590561 -290554651 -290464634 -290344117 -290183823 -289958649 -289710906 -289548861 -289532552
5957 -289532552 -289619861 -289736709 -289859866 -290001751 -290160483 -290320477 -290473023 -290601961 -290669396 -290614606
5947 -290614606 -290408953 -290109196 -289799984 -289530530 -289356217 -289339808 -289435693 -289517750 -289519321 -289446641
5937 -289446641 -289330827 -289200154 -289063668 -288931871 -288812189 -288709326 -288659567 -288672138 -288679666 -288624174
5927 -288624174 -288511595 -288362675 -288190324 -288047706 -287982333 -287956226 -287908786 -287807265 -287645611 -287446949
5917 -287446949 -287230622 -287018153 -286830943 -286709454 -286710498 -286815465 -286951286 -287095336 -287280489 -287537521
5907 -287537521 -287875216 -288251411 -288600414 -288907901 -289201380 -289482514 -289735035 -289953475 -290121989
5898 -290121989 -290218443 -290248518 -290271230 -290327928 -290397635 -290443769 -290423199 -290321314 -290196460 -290113944 -290061793
5887 -290061793 -289951391 -289727812 -289455199 -289217147 -289033630 -288893355 -288782718 -288680705 -288564369
5878 -288564369 -288452901 -288419792 -288528861 -288770853 -289095957 -289438318 -289695896 -289780331 -289699318 -289533885
5868 -289533885 -289342764 -289163057 -289018163 -288889219 -288797400 -288780881 -288765101 -288648977 -288447891 -288241440
5858 -288241440 -288064085 -287928207 -287877167 -287938873 -288096741 -288312053 -288543241 -288730840 -288793574 -288719855
5848 -288719855 -288618747 -288608515 -288712911 -288880629 -289037604 -289135792 -289176783 -289178199 -289179105 -289224533 -289314350
5837 -289314350 -289430000 -289553910 -289656117 -289692452 -289653145 -289604874 -289626599 -289715219 -289806423 -289827052
5827 -289827052 -289730472 -289533554 -289324709 -289186599 -289090051 -288947423 -288724647 -288489452 -288340007 -288308150
5817 -288308150 -288350880 -288401818 -288448698 -288517440 -288606581 -288684212 -288717848 -288703695 -288701869 -288788247 -288953064
5806 -288953064 -289105229 -289195344 -289258852 -289329238 -289384043 -289390327 -289353460 -289288961 -289189633 -289059740 -288945073
5795 -288945073 -288897285 -288912811 -288937961 -288959618 -289010099 -289103459 -289242533 -289393922 -289457383 -289371109 -289186759
5784 -289186759 -288990506 -288806605 -288605178 -288387614 -288201184 -288059968 -287947214 -287886180 -287925138 -288076137
5774 -288076137 -288342161 -288732187 -289169959 -289510939 -289699059 -289770461 -289737079 -289624479 -289506520 -289442026
5764 -289442026 -289455083 -289496815 -289484489 -289400797 -289286144 -289144006 -288982919 -288879852 -288887367 -288988748
5754 -288988748 -289112818 -289180141 -289147965 -289027541 -288869162 -288719337 -288593175 -288483144 -288406317 -288400393
5744 -288400393 -288474124 -288617680 -288816846 -289003965 -289107829 -289142884 -289166637 -289199355 -289217142 -289187956
5734 -289187956 -289104091 -288996505 -288902680 -288833314 -288762157 -288621672 -288363580 -288048480 -287840243 -287851804
5724 -287851804 -288026962 -288210312 -288278827 -288210992 -288090713 -288017547 -288012961 -288082430 -288254231 -288495269
5714 -288495269 -288747521 -289021026 -289315080 -289574476 -289773632 -289939405 -290121633 -290348190 -290558450
5705 -290558450 -290640846 -290530239 -290228105 -289814356 -289443469 -289208783 -289032119 -288803584 -288507460
5696 -288507460 -288215018 -288022210 -287978710 -288090325 -288315039 -288545470 -288713577 -288865845 -289049564
5687 -289049564 -289205132 -289248258 -289176542 -289054672 -288950238 -288912948 -288964870 -289074465 -289169276 -289193096
5677 -289193096 -289153103 -289095620 -289039079 -288948442 -288817196 -288733413 -288776584 -288930855 -289144923 -289372696
5667 -289372696 -289565315 -289670191 -289676035 -289661155 -289708479 -289783520 -289804266 -289741593 -289633377 -289557886 -289535675
5656 -289535675 -289526653 -289528882 -289564885 -289602428 -289585821 -289525984 -289468498 -289432864 -289400209 -289349130 -289295241
5645 -289295241 -289271573 -289292158 -289331609 -289350378 -289353029 -289377125 -289427415 -289455622 -289420551 -289376425 -289399427
5634 -289399427 -289467106 -289534595 -289606614 -289636860 -289509116 -289196577 -288822114 -288529242 -288378454 -288347787
5624 -288347787 -288359243 -288363581 -288375228 -288398682 -288401853 -288403234 -288445614 -288514587 -288588955 -288645795 -288644193 -288608727
5612 -288608727 -288628177 -288732551 -288878900 -289023281 -289158199 -289285233 -289380285 -289411471 -289367603 -289267419
5602 -289267419 -289160202 -289124491 -289202678 -289311580 -289327476 -289210273 -289004611 -288802177 -288678676 -288671664
5592 -288671664 -288762355 -288875070 -288954396 -289011736 -289085327 -289169998 -289234479 -289281132 -289299686 -289255331 -289143614
5581 -289143614 -289011206 -288909456 -288848311 -288782022 -288675506 -288563885 -288517811 -288582234 -288754328 -289008787
5571 -289008787 -289263704 -289392291 -289341171 -289158318 -288922781 -288703337 -288539820 -288440193 -288387397 -288360873
5561 -288360873 -288357096 -288383223 -288413811 -288393448 -288325285 -288294792 -288392888 -288618578 -288877172 -289074188 -289184782
5550 -289184782 -289253943 -289344007 -289476688 -289623710 -289731838 -289772567 -289740453 -289658704 -289619125 -289667341
5540 -289667341 -289731338 -289756580 -289777744 -289844233 -289943245 -290012736 -290021578 -290000042 -290000589 -290063216 -290211246
5529 -290211246 -290429639 -290674201 -290891525 -291004732 -290953108 -290804484 -290718955 -290819911 -291144244 -291602499
5519 -291602499 -292010285 -292226711 -292203935 -291958734 -291580495 -291194314 -290880746 -290610277 -290296543
5510 -290296543 -289944331 -289652951 -289501015 -289503119 -289594386 -289662491 -289676550 -289716186 -289834264 -289972891
5500 -289972891 -290069389 -290118681 -290120707 -290091133 -290073758 -290083225 -290107800 -290136882 -290135328 -290072930 -289970312
5489 -289970312 -289850992 -289692087 -289490155 -289314380 -289221000 -289188826 -289179715 -289195971 -289244025 -289295283
5479 -289295283 -289326936 -289329382 -289260525 -289071188 -288780605 -288502871 -288321257 -288209188 -288133778 -288125111
5469 -288125111 -288259533 -288570064 -288954383 -289252557 -289367844 -289294256 -289110521 -288916105 -288740929
5460 -288740929 -288553354 -288371270 -288267946 -288238546 -288212964 -288189102 -288230624 -288350297 -288522205 -288739251
5450 -288739251 -288958358 -289117248 -289187005 -289154939 -289053932 -288954956 -288887200 -288837716 -288804405 -288807511 -288867854
5439 -288867854 -288968183 -289027531 -288983284 -288910764 -288942821 -289085928 -289254898 -289390367 -289465593 -289463631
5429 -289463631 -289390380 -289282948 -289187122 -289110677 -289019173 -288879333 -288711911 -288610186 -288617881 -288663829
5419 -288663829 -288635684 -288474961 -288207965 -287919536 -287718738 -287650931 -287660348 -287685803 -287751064 -287913424
5409 -287913424 -288150135 -288368720 -288511707 -288602283 -288714291 -288882568 -289075425 -289254447 -289385533
5400 -289385533 -289453956 -289474712 -289479622 -289509537 -289601650 -289753360 -289894842 -289945112 -289878438 -289708341 -289471606
5389 -289471606 -289236219 -289073959 -289008182 -289018203 -289108142 -289293254 -289571025 -289907502 -290222591 -290469577
5379 -290469577 -290660218 -290826497 -291010822 -291199241 -291315567 -291319248 -291217970 -291070353 -290971579 -290963645
5369 -290963645 -290994972 -290989761 -290925520 -290824187 -290686673 -290524646 -290436622 -290483231 -290585478 -290642178
5359 -290642178 -290648330 -290672923 -290732957 -290745904 -290648083 -290477948 -290300708 -290154496 -290083328 -290114914 -290203807
5348 -290203807 -290279582 -290336748 -290428941 -290604912 -290808932 -290897096 -290791501 -290549634 -290245369 -289918700
5338 -289918700 -289640849 -289468509 -289351673 -289190683 -288941375 -288626734 -288289695 -287976819 -287740917
5329 -287740917 -287628054 -287678256 -287893634 -288211868 -288562354 -288898923 -289139528 -289213615 -289168813 -289131642
5319 -289131642 -289194762 -289364187 -289574128 -289737038 -289771685 -289609099 -289257998 -288834688 -288436173 -288080356
5309 -288080356 -287796161 -287670714 -287834773 -288421672 -289525818 -291084211 -292759184 -294131875 -295004932
5300 -295004932 -295408306 -295462041 -295319895 -295157689 -295118956 -295232774 -295392698 -295449051 -295305469 -294954619
5290 -294954619 -294467921 -293966883 -293541349 -293208067 -292987402 -292925918 -293015775 -293162701 -293292284 -293411082
5280 -293411082 -293532699 -293636476 -293707202 -293760579 -293825423 -293899827 -293943888 -293955154 -293977696 -293996351 -293963068
5269 -293963068 -293881304 -293784425 -293709208 -293648615 -293573436 -293496965 -293434585 -293365016 -293269113 -293172904 -293097030
5258 -293097030 -292989114 -292803731 -292582284 -292399181 -292288469 -292230934 -292179971 -292119948 -292100181 -292162331
5248 -292162331 -292280249 -292378971 -292402744 -292384465 -292408155 -292500730 -292620576 -292753087 -292902353 -293019836
5238 -293019836 -293026398 -292910494 -292751203 -292586453 -292390275 -292149463 -291902936 -291722688 -291639039 -291611008
5228 -291611008 -291573528 -291492750 -291347964 -291116782 -290817187 -290534518 -290381333 -290385052 -290465665 -290542624
5218 -290542624 -290622816 -290746205 -290903324 -291026850 -291060868 -291041048 -291078308 -291227793 -291439995 -291640266
5208 -291640266 -291744964 -291680210 -291448365 -291112857 -290751068 -290438935 -290248260 -290222516 -290319083 -290447364
5198 -290447364 -290578551 -290708872 -290803245 -290857292 -290893264 -290902117 -290847930 -290721942 -290592319 -290580594
5188 -290580594 -290753864 -291073885 -291399326 -291574072 -291588007 -291551719 -291523049 -291475039 -291393720 -291310368
5178 -291310368 -291267276 -291279058 -291312051 -291303724 -291228083 -291109525 -290968938 -290838456 -290771311 -290799382 -290911600
5167 -290911600 -291068840 -291204106 -291237451 -291148395 -290992262 -290845619 -290765995 -290770429 -290830044 -290911753
5157 -290911753 -291025891 -291183808 -291351828 -291486980 -291584835 -291680423 -291796301 -291887312 -291896857 -291833528
5147 -291833528 -291738161 -291640595 -291553654 -291485817 -291428917 -291362042 -291284398 -291205995 -291141621 -291103954 -291088991
5136 -291088991 -291072364 -291057667 -291081322 -291154908 -291264625 -291374637 -291451506 -291521196 -291656860 -291872813
5126 -291872813 -292106399 -292306765 -292435901 -292462847 -292411512 -292334013 -292276120 -292275096 -292368661 -292569322
5116 -292569322 -292811122 -292998789 -293076716 -293060564 -293040581 -293088656 -293221454 -293414756 -293606399 -293744332
5106 -293744332 -293816295 -293841769 -293819530 -293739903 -293625738 -293505469 -293411601 -293361667 -293311305 -293189911
5096 -293189911 -292994475 -292830038 -292830184 -293025980 -293323991 -293587163 -293745966 -293856706 -294024835 -294271395
5086 -294271395 -294496192 -294574243 -294474824 -294270693 -294038568 -293802471 -293575031 -293381658 -293215075 -293058858
5076 -293058858 -292931574 -292846082 -292803217 -292819658 -292907399 -293026972 -293102418 -293093743 -293032141 -292972819 -292928515
5065 -292928515 -292884034 -292858927 -292868876 -292850173 -292717799 -292476792 -292196093 -291940446 -291742103 -291587561
5055 -291587561 -291447323 -291313297 -291244082 -291349560 -291674389 -292140596 -292642819 -293115980 -293494284
5046 -293494284 -293693610 -293674814 -293496102 -293251472 -293032546 -292905406 -292846814 -292797817 -292717071 -292571520
5036 -292571520 -292395016 -292279238 -292241857 -292194356 -292049511 -291837271 -291664465 -291607900 -291675132 -291819998
5026 -291819998 -291972330 -292087204 -292186424 -292301787 -292434199 -292573327 -292706570 -292792744 -292787299 -292712651
5016 -292712651 -292636339 -292614581 -292652886 -292703286 -292710946 -292655029 -292541044 -292383631 -292230780 -292166772 -292239706
5005 -292239706 -292401271 -292566658 -292701163 -292812871 -292886529 -292875549 -292783683 -292674972 -292625277 -292677011
4995 -292677011 -292806865 -292963670 -293113247 -293262742 -293412901 -293517883 -293491895 -293282549 -292932827
4986 -292932827 -292526541 -292144382 -291861366 -291750412 -291840975 -292088964 -292415969 -292742686 -292980163
4977 -292980163 -293093089 -293152716 -293238466 -293350304 -293429820 -293429779 -293360413 -293222175 -292953871 -292541088 -292078646
4966 -292078646 -291673001 -291403072 -291334161 -291482300 -291792847 -292149207 -292433253 -292596855 -292656676 -292660725
4956 -292660725 -292670043 -292712272 -292755217 -292759394 -292710793 -292601149 -292433513 -292236348 -292048209 -291906550
4946 -291906550 -291837200 -291832771 -291851376 -291838527 -291772758 -291675127 -291583300 -291548687 -291611459 -291739020 -291869303
4935 -291869303 -292003517 -292173659 -292335263 -292398213 -292338481 -292178174 -291957694 -291773580 -291727089 -291828539
4925 -291828539 -291994252 -292113433 -292153665 -292200737 -292344593 -292616037 -293022896 -293553569 -294134824 -294643293
4915 -294643293 -295013942 -295282837 -295485068 -295585699 -295568450 -295501145 -295467888 -295472260 -295468652 -295475350 -295565898
4904 -295565898 -295767971 -296024197 -296264219 -296461963 -296627440 -296769091 -296869464 -296937624 -297013545 -297088487
4894 -297088487 -297089068 -296979845 -296821656 -296684966 -296603318 -296594005 -296647540 -296730879 -296801827 -296790561 -296635805
4883 -296635805 -296349860 -295989649 -295606493 -295261420 -295010561 -294859478 -294806822 -294831638 -294859795 -294845729
4873 -294845729 -294784223 -294654495 -294458996 -294246167 -294050574 -293905565 -293876396 -294000087 -294237902 -294518206
4863 -294518206 -294791229 -294998997 -295093071 -295095646 -295048308 -294945177 -294776875 -294613299 -294532560 -294527366
4853 -294527366 -294549920 -294569960 -294578263 -294578752 -294597773 -294652460 -294721412 -294801456 -294903879 -295005912 -295105280
4842 -295105280 -295236271 -295379822 -295469173 -295464178 -295358867 -295203270 -295067637 -294978351 -294980084 -295154691
4832 -295154691 -295520133 -295967987 -296326658 -296506217 -296533528 -296475973 -296382430 -296263665 -296107677 -295917038
4822 -295917038 -295729444 -295561907 -295423675 -295357686 -295377907 -295441073 -295499767 -295542612 -295575836 -295560186
4812 -295560186 -295440010 -295236279 -295014425 -294836348 -294747940 -294718747 -294662799 -294529859 -294320818 -294054110
4802 -294054110 -293779837 -293581920 -293513761 -293555340 -293641250 -293740467 -293840060 -293882319 -293819375 -293671706
4792 -293671706 -293493457 -293330446 -293232738 -293241973 -293325375 -293432117 -293578732 -293809004 -294140007 -294522451
4782 -294522451 -294882571 -295214587 -295541462 -295864248 -296138096 -296269277 -296229424 -296085242 -295911232
4773 -295911232 -295752521 -295633171 -295592087 -295647026 -295728251 -295742443 -295673017 -295559310 -295432099 -295297140
4763 -295297140 -295127473 -294899491 -294635507 -294361488 -294085469 -293839393 -293675922 -293618729 -293661611 -293790959
4753 -293790959 -293974635 -294156587 -294289300 -294364694 -294391641 -294381039 -294352337 -294348536 -294414933 -294537808
4743 -294537808 -294659788 -294743557 -294772387 -294766341 -294806223 -294950254 -295158082 -295346077 -295466309 -295481939
4733 -295481939 -295331972 -295014659 -294630551 -294287400 -294021523 -293848467 -293773366 -293737304 -293687335 -293650363
4723 -293650363 -293673701 -293771718 -293927037 -294079158 -294153332 -294114868 -294009543 -293917609 -293890606 -293969443
4713 -293969443 -294141192 -294288514 -294324135 -294267719 -294176979 -294132139 -294220085 -294434849 -294667140 -294824288
4703 -294824288 -294891134 -294913764 -294941662 -294966361 -294956418 -294930535 -294933409 -294971359 -295016936 -295068231 -295126570
4692 -295126570 -295149568 -295113755 -295066739 -295061849 -295122642 -295241687 -295371771 -295477086 -295544478 -295553120 -295489665
4681 -295489665 -295362865 -295202808 -295074945 -295018154 -294974065 -294850701 -294633275 -294390016 -294212471 -294160363
4671 -294160363 -294208374 -294267546 -294292998 -294325294 -294385828 -294454475 -294558906 -294744634 -294973148 -295149488
4661 -295149488 -295213950 -295187512 -295145471 -295173580 -295345891 -295669187 -296048307 -296396414 -296683117 -296857934
4651 -296857934 -296890376 -296809795 -296671883 -296538539 -296452945 -296399579 -296323963 -296180506 -295949586 -295637393
4641 -295637393 -295289314 -294962480 -294719076 -294594576 -294528307 -294429031 -294291939 -294174676 -294136104 -294202639
4631 -294202639 -294346823 -294530032 -294705092 -294831452 -294898502 -294898987 -294843222 -294787306 -294775085 -294759876 -294691972
4620 -294691972 -294582845 -294457129 -294372046 -294408901 -294591705 -294881236 -295222743 -295546114 -295769987 -295855565
4610 -295855565 -295830130 -295772037 -295752886 -295763981 -295756385 -295716086 -295655647 -295581241 -295493192 -295400522 -295340241
4599 -295340241 -295347211 -295414318 -295510552 -295612548 -295688447 -295708638 -295680175 -295609429 -295511735 -295416391 -295335537
4588 -295335537 -295283845 -295262929 -295251846 -295229863 -295182099 -295102319 -295002569 -294889996 -294754476 -294591519
4578 -294591519 -294420850 -294309502 -294328314 -294467084 -294653845 -294803347 -294848051 -294794826 -294720961 -294697329
4568 -294697329 -294742713 -294845015 -295013692 -295257066 -295514653 -295706611 -295827316 -295898137 -295926700 -295924930
4558 -295924930 -295901310 -295841953 -295736486 -295605744 -295490892 -295402337 -295298311 -295154216 -294997174 -294877474
4548 -294877474 -294846573 -294917965 -295067113 -295279844 -295518658 -295725153 -295880307 -296001507 -296111085 -296183290
4538 -296183290 -296156793 -296034161 -295877439 -295715468 -295549530 -295398041 -295297957 -295301600 -295420923 -295587501
4528 -295587501 -295718059 -295816127 -295970100 -296209071 -296438594 -296577716 -296628104 -296609524 -296528731 -296373829
4518 -296373829 -296152562 -295921438 -295707979 -295503320 -295316005 -295150980 -295000593 -294887315 -294841159
4509 -294841159 -294862855 -294916247 -294932844 -294902013 -294896278 -294968989 -295107494 -295262163 -295398079 -295517837
4499 -295517837 -295594287 -295590559 -295548597 -295536715 -295563462 -295609553 -295685432 -295819663 -296001264 -296162059 -296250129
4488 -296250129 -296257684 -296198281 -296105844 -295977988 -295772755 -295487412 -295192755 -294987508 -294901355 -294883608
4478 -294883608 -294880474 -294875975 -294870806 -294847354 -294791977 -294759542 -294834916 -295031658 -295297045 -295591605 -295897953
4467 -295897953 -296179628 -296360623 -296356483 -296192469 -295994053 -295858750 -295855432 -296051002 -296416948 -296805592
4457 -296805592 -297089474 -297237200 -297278243 -297274960 -297277215 -297319327 -297413675 -297491577 -297463020 -297301568 -297049976
4446 -297049976 -296771790 -296486551 -296169121 -295807211 -295452929 -295188867 -295043742 -294963636 -294903141 -294926758
4436 -294926758 -295122685 -295443324 -295735984 -295904671 -295966195 -295983420 -295988709 -295964277 -295902407 -295861972
4426 -295861972 -295899964 -295999606 -296119695 -296234132 -296317177 -296329331 -296243773 -296100414 -295958232 -295840288
4416 -295840288 -295757842 -295738695 -295783045 -295819372 -295790162 -295740437 -295704737 -295633535 -295539967 -295536240 -295663442
4405 -295663442 -295840945 -295966551 -296019365 -296053894 -296122862 -296240708 -296378894 -296504178 -296619399 -296731932
4395 -296731932 -296816215 -296870944 -296919240 -296938420 -296888904 -296767073 -296601621 -296426419 -296255973 -296106305
4385 -296106305 -295993866 -295895681 -295801490 -295779687 -295899276 -296135592 -296386784 -296558027 -296626229 -296623508
4375 -296623508 -296620683 -296681715 -296792734 -296891501 -296922849 -296873654 -296772905 -296649362 -296533853 -296451339
4365 -296451339 -296387864 -296298411 -296153917 -295971516 -295811721 -295735330 -295745100 -295797269 -295847874 -295886982 -295941571
4354 -295941571 -296025149 -296129721 -296252490 -296388330 -296498606 -296521749 -296431555 -296276980 -296160921 -296155131
4344 -296155131 -296227791 -296293760 -296313197 -296290025 -296228811 -296122802 -295964071 -295782345 -295647809 -295589092
4334 -295589092 -295601531 -295715672 -295970529 -296331002 -296693300 -296968931 -297119165 -297163985 -297205910 -297331656
4324 -297331656 -297523925 -297731009 -297909495 -298040746 -298130164 -298187016 -298231816 -298277869 -298333076 -298395191
4314 -298395191 -298434265 -298449411 -298493953 -298584865 -298678681 -298715086 -298643952 -298486863 -298319370 -298144202
4304 -298144202 -297893869 -297560704 -297178985 -296756183 -296369557 -296160274 -296150389 -296191142 -296141936 -296013229
4294 -296013229 -295896173 -295852464 -295895893 -296041508 -296299795 -296621579 -296950540 -297249703 -297459349 -297540276
4284 -297540276 -297513601 -297422777 -297312344 -297211263 -297104660 -296959297 -296780235 -296601862 -296476948 -296484279
4274 -296484279 -296650346 -296894170 -297092443 -297135143 -296988506 -296753180 -296578218 -296514173 -296514219 -296542745
4264 -296542745 -296604805 -296703112 -296803538 -296863456 -296889550 -296931530 -297011097 -297102346 -297188171 -297258898 -297294491
4253 -297294491 -297299812 -297298955 -297321294 -297362922 -297370197 -297317281 -297251465 -297244804 -297309613 -297380203 -297375377 -297261462
4241 -297261462 -297070173 -296905101 -296872457 -296964140 -297068724 -297099493 -297058454 -297023327 -297063110 -297195107
4231 -297195107 -297410627 -297635777 -297757839 -297732957 -297608520 -297484446 -297444930 -297484388 -297541659 -297576098
4221 -297576098 -297570915 -297491296 -297307113 -297066742 -296859972 -296683193 -296480404 -296278356 -296154227 -296147224
4211 -296147224 -296263777 -296490597 -296772513 -297042126 -297263968 -297434939 -297543331 -297580974 -297578222 -297565555
4201 -297565555 -297550281 -297543747 -297537802 -297491823 -297393115 -297296753 -297274953 -297334518 -297427733 -297511902 -297587740
4190 -297587740 -297669200 -297729016 -297713829 -297623576 -297538698 -297535999 -297574606 -297563223 -297500517 -297465296 -297512862
4179 -297512862 -297612071 -297683162 -297682500 -297636745 -297612028 -297670005 -297800786 -297928067 -298016354 -298062705 -298077216
4168 -298077216 -298123187 -298231610 -298324239 -298305333 -298181919 -298020229 -297842153 -297631102 -297394681 -297178420
4158 -297178420 -297026595 -296955203 -296979560 -297097905 -297256393 -297410810 -297539980 -297597505 -297555156 -297454298
4148 -297454298 -297343281 -297228649 -297120298 -297035668 -296983722 -296962064 -296934488 -296848625 -296675014 -296414442
4138 -296414442 -296103402 -295789813 -295490686 -295254079 -295165855 -295245790 -295438135 -295667702 -295865671 -296029080
4128 -296029080 -296204421 -296408629 -296646801 -296907598 -297133432 -297297026 -297441045 -297600068 -297752088
4119 -297752088 -297843071 -297836340 -297782792 -297801145 -297955234 -298233754 -298585280 -298913252 -299141503 -299256256
4109 -299256256 -299283881 -299287940 -299306327 -299312772 -299279866 -299191437 -299063907 -298914102 -298723147 -298505483 -298294303
4098 -298294303 -298096096 -297906659 -297735872 -297592127 -297449365 -297270353 -297093649 -297004802 -297016873 -297071605
4088 -297071605 -297127208 -297184627 -297238396 -297291081 -297401851 -297609670 -297869773 -298136759 -298382041 -298577856
4078 -298577856 -298729447 -298842903 -298897397 -298888083 -298862985 -298847966 -298794355 -298660256 -298451858 -298192989
4068 -298192989 -297908633 -297620638 -297356509 -297134045 -296924520 -296677373 -296397278 -296179939 -296150212
4059 -296150212 -296354595 -296704887 -297051394 -297319087 -297535026 -297733794 -297889058 -297942328 -297866725 -297689991
4049 -297689991 -297497243 -297376938 -297332460 -297285228 -297164335 -296971211 -296772012 -296641555 -296619907 -296693315
4039 -296693315 -296809895 -296918911 -296982178 -297007452 -297037766 -297078742 -297099040 -297112137 -297154559 -297222714 -297315779
4028 -297315779 -297437431 -297544008 -297591991 -297593932 -297580318 -297570050 -297569889 -297577179 -297618705 -297722524 -297854896
4017 -297854896 -297970668 -298062251 -298119830 -298146424 -298168651 -298180620 -298170292 -298173978 -298209873 -298229297 -298190186
4006 -298190186 -298111567 -298018014 -297918012 -297822679 -297742980 -297682937 -297623887 -297538764 -297445643 -297372466 -297316406
3995 -297316406 -297320495 -297478194 -297844880 -298365884 -298873887 -299199450 -299297604 -299272526 -299291006 -299444235
3985 -299444235 -299675239 -299858190 -299906546 -299821973 -299680151 -299547362 -299434400 -299299600 -299114282 -298928119
3975 -298928119 -298819581 -298827835 -298924366 -299031485 -299089627 -299084354 -299045754 -299031576 -299041632 -299028564 -298983888
3964 -298983888 -298945575 -298940816 -298947855 -298956858 -298977350 -298980250 -298918847 -298798568 -298677714 -298616513 -298638026
3953 -298638026 -298706836 -298736567 -298651778 -298460796 -298250050 -298135516 -298134329 -298149557 -298138637 -298157977 -298253814
3942 -298253814 -298380638 -298400765 -298212746 -297891712 -297629648 -297560411 -297692269 -297942435 -298197489 -298381052
3932 -298381052 -298489451 -298546986 -298540948 -298468959 -298377394 -298304162 -298228963 -298105217 -297929140 -297756859
3922 -297756859 -297646709 -297583804 -297551726 -297635845 -297913181 -298335502 -298756677 -299053016 -299229863 -299366209
3912 -299366209 -299496356 -299607197 -299704318 -299818332 -299928650 -299954948 -299863140 -299693438 -299465494 -299144285
3902 -299144285 -298716987 -298252801 -297875495 -297679724 -297682996 -297856827 -298128473 -298397298 -298612327 -298764253
3892 -298764253 -298848694 -298896910 -298942425 -298973033 -298978450 -298959843 -298890534 -298728178 -298480834 -298228156 -298063010
3881 -298063010 -298042690 -298171189 -298404379 -298660856 -298847281 -298916369 -298909971 -298898424 -298905193 -298932800 -299012040
3870 -299012040 -299134673 -299242237 -299287756 -299232279 -299076417 -298923989 -298875729 -298893906 -298872155 -298750453
3860 -298750453 -298537447 -298308617 -298186347 -298232465 -298377913 -298517312 -298603953 -298637086 -298635556 -298628301
3850 -298628301 -298668338 -298786903 -298907979 -298932090 -298867811 -298757717 -298589821 -298373292 -298191379 -298136620
3840 -298136620 -298218725 -298353390 -298463471 -298546957 -298627196 -298697153 -298731851 -298722057 -298709642 -298744165 -298801091
3829 -298801091 -298828704 -298842746 -298907316 -299035011 -299165328 -299241096 -299242459 -299173282 -299057256 -298939361
3819 -298939361 -298826872 -298669123 -298451656 -298255850 -298185567 -298247165 -298339249 -298370683 -298341071 -298324901
3809 -298324901 -298385085 -298524156 -298701486 -298883448 -299056942 -299187048 -299254439 -299299046 -299338365 -299335198
3799 -299335198 -299276462 -299156361 -298957487 -298698254 -298412469 -298173477 -298091510 -298208129 -298466859 -298765646
3789 -298765646 -298990915 -299060268 -298978523 -298815888 -298640522 -298512751 -298486472 -298576605 -298743705 -298950757
3779 -298950757 -299198047 -299486374 -299775080 -299986949 -300050150 -299941860 -299734367 -299546506 -299436059
3770 -299436059 -299375817 -299348670 -299383745 -299467672 -299530502 -299548131 -299557067 -299585511 -299644928 -299775149 -300007477
3759 -300007477 -300280117 -300487437 -300577817 -300552060 -300427751 -300211949 -299930452 -299639518 -299379252 -299169540
3749 -299169540 -299040399 -299008074 -299037298 -299066959 -299054077 -298980356 -298855511 -298714400 -298588047 -298506213
3739 -298506213 -298479732 -298489371 -298539032 -298663922 -298848103 -299035005 -299213395 -299398284 -299584457 -299790659
3729 -299790659 -300047927 -300303874 -300441261 -300411291 -300303352 -300237685 -300259490 -300320913 -300342652 -300283259
3719 -300283259 -300149147 -300001040 -299933597 -299986907 -300136985 -300355080 -300592388 -300768347 -300795331 -300647441
3709 -300647441 -300407786 -300200426 -300096455 -300104804 -300201515 -300341040 -300470621 -300559615 -300579224 -300492504
3699 -300492504 -300302349 -300061971 -299814805 -299557719 -299312048 -299142377 -299076180 -299084741 -299140558 -299234587
3689 -299234587 -299354126 -299480780 -299579113 -299599540 -299528628 -299413943 -299313286 -299220934 -299099946 -298975980
3679 -298975980 -298919956 -298971542 -299111809 -299276049 -299431710 -299620575 -299875598 -300158343 -300393922 -300532382
3669 -300532382 -300570582 -300523323 -300389328 -300143740 -299759603 -299273822 -298800140 -298433838 -298207393 -298129925
3659 -298129925 -298173442 -298264299 -298346914 -298384911 -298342441 -298232789 -298134602 -298141442 -298303915 -298576767 -298847226
3648 -298847226 -299039852 -299141674 -299171823 -299137504 -299045658 -298931095 -298811598 -298691696 -298590137 -298504910
3638 -298504910 -298420173 -298358036 -298384313 -298542656 -298776650 -298968215 -299060335 -299079828 -299077825 -299118704 -299241839
3627 -299241839 -299381691 -299443215 -299418282 -299357539 -299311919 -299298058 -299307749 -299342289 -299384532 -299393253 -299390736
3616 -299390736 -299461413 -299653786 -299926568 -300179816 -300313727 -300270167 -300063295 -299761097 -299444035 -299198618
3606 -299198618 -299086081 -299086857 -299094683 -299021090 -298892569 -298788349 -298738898 -298722695 -298753330 -298891857 -299126434
3595 -299126434 -299325045 -299362461 -299276241 -299228608 -299294671 -299407384 -299492163 -299554941 -299630486 -299703881 -299739726
3584 -299739726 -299728600 -299662392 -299553776 -299459547 -299428774 -299437639 -299415871 -299356409 -299325283 -299395681 -299570750
3573 -299570750 -299775195 -299933650 -300021541 -300070387 -300159056 -300358232 -300633239 -300860909 -300963244 -300962516
3563 -300962516 -300922699 -300888100 -300841390 -300730616 -300542586 -300299363 -300055896 -299891033 -299857244 -299956363
3553 -299956363 -300159025 -300394405 -300556992 -300565342 -300424276 -300220313 -300014596 -299827785 -299714753 -299700280
3543 -299700280 -299726885 -299764393 -299816873 -299878746 -299946362 -300027447 -300142839 -300307866 -300491862 -300639872
3533 -300639872 -300716784 -300698744 -300586233 -300426881 -300257358 -300070063 -299849821 -299626339 -299480371 -299481577
3523 -299481577 -299594276 -299727915 -299867529 -300055363 -300285436 -300487560 -300578851 -300529156 -300394872 -300264465
3513 -300264465 -300186159 -300177076 -300240372 -300344375 -300442732 -300516640 -300565121 -300591490 -300620502 -300640985 -300598652
3502 -300598652 -300509096 -300499280 -300672649 -300978347 -301271836 -301455568 -301534015 -301600523 -301691341 -301728049
3492 -301728049 -301667114 -301538724 -301362366 -301135093 -300880043 -300687451 -300660221 -300782510 -300927990 -301003929
3482 -301003929 -300999601 -300954599 -300924430 -300938793 -301002069 -301128567 -301303097 -301454018 -301520565 -301480288 -301335577
3471 -301335577 -301122733 -300912978 -300777312 -300738359 -300785694 -300893563 -301000590 -301045175 -300999199 -300862411
3461 -300862411 -300681284 -300550127 -300539225 -300649475 -300824610 -300994752 -301092066 -301058424 -300907238 -300744507
3451 -300744507 -300665400 -300654804 -300639390 -300590600 -300552695 -300592195 -300706193 -300796087 -300795421 -300773464 -300805323
3440 -300805323 -300862404 -300871854 -300802932 -300702618 -300610898 -300536936 -300494238 -300453029 -300359433 -300257405 -300237547
3429 -300237547 -300304227 -300407475 -300517988 -300591917 -300581460 -300511100 -300428586 -300363819 -300356953 -300409450 -300450651
3418 -300450651 -300422628 -300322787 -300197033 -300124127 -300167019 -300329998 -300554498 -300761584 -300908998 -300967738
3408 -300967738 -300932325 -300863995 -300814479 -300799122 -300823266 -300870383 -300911484 -300938785 -300960501 -300972267 -300959116
3397 -300959116 -300896351 -300775000 -300636179 -300532909 -300441339 -300270799 -300015432 -299807114 -299753687 -299850181
3387 -299850181 -300034845 -300248352 -300468857 -300669134 -300817842 -300929578 -301037447 -301123072 -301113589 -300992398
3377 -300992398 -300837895 -300726472 -300697105 -300756745 -300865306 -300995455 -301164697 -301380885 -301606398 -301767011
3367 -301767011 -301815210 -301803360 -301836342 -301961469 -302147563 -302341164 -302496256 -302569063 -302548500 -302455997
3357 -302455997 -302339315 -302274643 -302291855 -302342941 -302363008 -302294784 -302134790 -301967275 -301870880 -301836182
3347 -301836182 -301799366 -301712648 -301573494 -301414409 -301299107 -301290643 -301415639 -301642558 -301890856 -302071370
3337 -302071370 -302132537 -302080554 -301976962 -301905715 -301936967 -302109278 -302375649 -302622201 -302759034 -302749286
3327 -302749286 -302604875 -302403116 -302257623 -302229811 -302266871 -302256755 -302138803 -301949830 -301776753 -301695088
3317 -301695088 -301701947 -301733887 -301755566 -301744345 -301647926 -301418237 -301068617 -300717046 -300534065 -300589622
3307 -300589622 -300808258 -301090955 -301380524 -301643782 -301844106 -301980203 -302081336 -302154017 -302185219 -302166653
3297 -302166653 -302134376 -302127272 -302146816 -302174882 -302203218 -302221736 -302198487 -302137078 -302071549 -302008321 -301938960
3286 -301938960 -301853935 -301761548 -301707847 -301699094 -301668675 -301567383 -301424994 -301304239 -301213889 -301127043 -301055472
3275 -301055472 -301053844 -301175000 -301404060 -301648891 -301814417 -301847781 -301705245 -301363759 -300907524 -300506848
3265 -300506848 -300263139 -300146235 -300084102 -300042000 -300046492 -300160232 -300418295 -300772566 -301119651 -301357338
3255 -301357338 -301444610 -301427517 -301368638 -301299382 -301241369 -301203230 -301161529 -301127677 -301164003 -301296616 -301490187
3244 -301490187 -301677742 -301815343 -301927390 -302046264 -302151901 -302201109 -302170693 -302105518 -302060710 -302035161
3234 -302035161 -302019603 -302013885 -302034633 -302151606 -302397664 -302676189 -302860944 -302893897 -302805435 -302723361
3224 -302723361 -302778121 -302969079 -303194522 -303365370 -303474077 -303556290 -303603838 -303555030 -303368319 -303094436
3214 -303094436 -302840082 -302662139 -302557588 -302502621 -302470745 -302480664 -302571100 -302728353 -302899321 -303061417
3204 -303061417 -303241258 -303441086 -303611580 -303680697 -303593745 -303409755 -303272125 -303234291 -303242541 -303251535
3194 -303251535 -303267130 -303316830 -303398707 -303468857 -303515513 -303600901 -303755978 -303889791 -303851902 -303550410
3184 -303550410 -303035392 -302481390 -302052393 -301808473 -301719707 -301734991 -301802456 -301855865 -301842655 -301761069
3174 -301761069 -301663052 -301590351 -301527036 -301458205 -301425710 -301507370 -301760983 -302146829 -302520999 -302756126
3164 -302756126 -302857137 -302919104 -302995939 -303045238 -302993223 -302837092 -302650427 -302468171 -302239206 -301943513
3154 -301943513 -301652936 -301444570 -301340826 -301334900 -301406493 -301502329 -301567206 -301605928 -301664472 -301757302 -301873913
3143 -301873913 -302004861 -302139209 -302250602 -302283209 -302234748 -302196560 -302243461 -302360586 -302488161 -302575380
3133 -302575380 -302599482 -302577195 -302560673 -302574168 -302587374 -302578531 -302541415 -302464144 -302349869 -302246294 -302229951
3122 -302229951 -302305350 -302383539 -302419574 -302490645 -302674950 -302938077 -303194630 -303396045 -303540241 -303630005
3112 -303630005 -303639110 -303526239 -303293830 -303025759 -302831434 -302754577 -302778833 -302868468 -302975221 -303077661
3102 -303077661 -303181972 -303281905 -303346668 -303345913 -303283951 -303191604 -303103562 -303048035 -303013467 -302937447 -302766074
3091 -302766074 -302487514 -302132748 -301779443 -301537664 -301473120 -301573500 -301813422 -302113891 -302344040
3082 -302344040 -302445762 -302443884 -302373309 -302260087 -302145864 -302075209 -302040783 -301996879 -301952988 -301924939 -301862876
3071 -301862876 -301753111 -301674718 -301723747 -301943425 -302304839 -302720501 -303101192 -303408676 -303655795 -303862333
3061 -303862333 -304048164 -304258488 -304508026 -304738930 -304899255 -304984475 -305001002 -304953314 -304840901 -304643603
3051 -304643603 -304367184 -304081944 -303867562 -303759073 -303741630 -303766612 -303779154 -303739340 -303653759 -303572191
3041 -303572191 -303491434 -303348655 -303145915 -302957716 -302826165 -302743095 -302688751 -302638911 -302607881 -302604940
3031 -302604940 -302556256 -302398500 -302165474 -301925982 -301763420 -301748272 -301852931 -301996074 -302142043 -302295225
3021 -302295225 -302462825 -302664384 -302914839 -303188751 -303463045 -303709138 -303861220 -303900381 -303866045 -303811345
3011 -303811345 -303803762 -303894167 -304071431 -304248392 -304324392 -304315127 -304363085 -304524252 -304678206 -304694104 -304547067
3000 -304547067 -304279564 -303970003 -303703718 -303504763 -303332728 -303164077 -303035074 -302982560 -302975670 -302958921
2990 -302958921 -302906361 -302823908 -302756228 -302748446 -302819137 -302947076 -303103384 -303291314 -303526393 -303792560
2980 -303792560 -304026311 -304162988 -304192077 -304139143 -304022564 -303863943 -303668764 -303407136 -303086995 -302774827
2970 -302774827 -302500916 -302230088 -301956411 -301783912 -301833608 -302121818 -302574269 -303059012 -303429146
2961 -303429146 -303621094 -303656406 -303567720 -303389135 -303178292 -302996464 -302902007 -302932703 -303068344 -303254771
2951 -303254771 -303439964 -303580402 -303656093 -303672864 -303637144 -303564132 -303472829 -303381202 -303309129 -303262346 -303242335
2940 -303242335 -303251923 -303249260 -303188080 -303080302 -302998947 -303024614 -303169876 -303368643 -303523117 -303567609 -303527051
2929 -303527051 -303492874 -303525792 -303613387 -303692265 -303710276 -303664662 -303572144 -303445508 -303297747 -303133308
2919 -303133308 -302942591 -302730698 -302553036 -302477214 -302523767 -302667081 -302870682 -303131561 -303451532 -303785238
2909 -303785238 -304048954 -304147045 -304013332 -303696755 -303339034 -303065520 -302916167 -302861782 -302858383 -302890104
2899 -302890104 -302976549 -303110005 -303228082 -303264597 -303198576 -303083395 -303001855 -302957146 -302900304 -302862350
2889 -302862350 -302942767 -303191070 -303562767 -303932546 -304144683 -304098366 -303810969 -303470843 -303274778 -303246594
2879 -303246594 -303297961 -303344718 -303342709 -303298485 -303240954 -303161826 -303013893 -302790454 -302579996 -302450578
2869 -302450578 -302397436 -302410100 -302493075 -302623649 -302731714 -302761125 -302697045 -302571480 -302460636 -302421746
2859 -302421746 -302455366 -302527311 -302609722 -302689342 -302753867 -302793168 -302807470 -302820120 -302860953 -302923732 -302962465
2848 -302962465 -302965311 -302961732 -302950946 -302907737 -302820101 -302730073 -302704247 -302733967 -302737072 -302656007 -302511473
2837 -302511473 -302372846 -302298141 -302301447 -302352336 -302425556 -302522600 -302639845 -302766851 -302908886 -303057940
2827 -303057940 -303146331 -303101378 -302921524 -302656156 -302389648 -302224495 -302214343 -302361829 -302608392 -302848193
2817 -302848193 -303005302 -303096362 -303233618 -303505986 -303854799 -304160817 -304375163 -304494399 -304539173 -304537417
2807 -304537417 -304497369 -304446279 -304410862 -304347232 -304222120 -304108623 -304112237 -304259498 -304467572 -304616241
2797 -304616241 -304632341 -304495657 -304232425 -303919635 -303639875 -303438476 -303299808 -303169374 -303055372
2788 -303055372 -303034982 -303135513 -303286575 -303418713 -303532930 -303658314 -303790861 -303909817 -303976356 -303939816
2778 -303939816 -303806173 -303648991 -303546708 -303512592 -303474320 -303351860 -303138716 -302914351 -302811567 -302915698
2768 -302915698 -303189354 -303530417 -303855237 -304129711 -304351756 -304546690 -304754412 -304984745 -305229303
2759 -305229303 -305479313 -305706644 -305906118 -306118648 -306342703 -306491364 -306511998 -306464522 -306411976 -306345947
2749 -306345947 -306234086 -306061654 -305856614 -305666474 -305508409 -305382400 -305288900 -305216003 -305113489 -304917388
2739 -304917388 -304625384 -304301138 -304020496 -303828174 -303721224 -303650430 -303554921 -303410146 -303240312 -303070092
2729 -303070092 -302894168 -302737500 -302673621 -302727535 -302834548 -302937391 -303033662 -303124672 -303228833 -303375723
2719 -303375723 -303566692 -303801542 -304078837 -304366894 -304615876 -304792139 -304879672 -304886880 -304861035 -304821223
2709 -304821223 -304744946 -304617571 -304453248 -304279687 -304092787 -303910864 -303767918 -303664736 -303622536 -303680239
2699 -303680239 -303849003 -304116446 -304422884 -304682603 -304863012 -304983502 -305066579 -305127099 -305178935 -305213316
2689 -305213316 -305216993 -305205678 -305189504 -305156573 -305106150 -305056893 -305022595 -304994095 -304975538 -305003036 -305092052
2678 -305092052 -305182736 -305201199 -305157520 -305117245 -305129093 -305199405 -305266747 -305218221 -304989748 -304665887 -304415049
2667 -304415049 -304326185 -304371320 -304478367 -304566470 -304563381 -304444314 -304235804 -303995192 -303827617 -303801311
2657 -303801311 -303875215 -303997294 -304157386 -304357950 -304577011 -304773247 -304916784 -304999121 -305027725 -304999087
2647 -304999087 -304901781 -304759773 -304623038 -304530832 -304511006 -304565145 -304665685 -304765831 -304779488 -304606699
2637 -304606699 -304254189 -303859999 -303576932 -303476176 -303534583 -303696531 -303888155 -304050252 -304203740
2628 -304203740 -304392669 -304618393 -304837835 -305005129 -305113864 -305154202 -305125128 -305069807 -305010452 -304944616
2618 -304944616 -304909998 -304954844 -305073995 -305204373 -305273485 -305268207 -305249731 -305255798 -305265818 -305284357 -305344517
2607 -305344517 -305451722 -305609474 -305829493 -306120992 -306463158 -306790287 -307063978 -307273716 -307402319
2598 -307402319 -307447519 -307406294 -307268301 -307062487 -306869409 -306741617 -306665971 -306615352 -306597579 -306644224
2588 -306644224 -306763991 -306924491 -307038655 -306997378 -306757530 -306373924 -305951945 -305567124 -305252385
2579 -305252385 -305041191 -304938226 -304912972 -304942969 -304999419 -305049308 -305080971 -305088656 -305080833 -305092426 -305163224
2568 -305163224 -305325937 -305576831 -305856107 -306084682 -306187819 -306117848 -305890869 -305601504 -305382515
2559 -305382515 -305314272 -305374689 -305512690 -305702656 -305901939 -306063569 -306180924 -306277015 -306368336 -306440217
2549 -306440217 -306444879 -306362961 -306250663 -306163341 -306077096 -305922043 -305669364 -305372685 -305091593 -304862479
2539 -304862479 -304734820 -304752708 -304922788 -305189353 -305467184 -305686234 -305803609 -305825832 -305811017 -305805491
2529 -305805491 -305796726 -305755334 -305680191 -305576650 -305452180 -305359357 -305394856 -305606488 -305957341 -306364470
2519 -306364470 -306715886 -306934241 -307018366 -306996843 -306889166 -306737884 -306605970 -306492805 -306336671 -306121729
2509 -306121729 -305899639 -305725619 -305615800 -305546456 -305489778 -305451019 -305437501 -305435222 -305432891 -305422931 -305441663
2498 -305441663 -305573651 -305814806 -306024966 -306093839 -306062821 -306061994 -306175114 -306405785 -306682093 -306864846
2488 -306864846 -306857055 -306678709 -306417954 -306166125 -306010675 -305988930 -306036087 -306021810 -305866344 -305594863
2478 -305594863 -305291694 -305053563 -304960295 -305025219 -305146861 -305199911 -305164846 -305114042 -305098309 -305087909
2468 -305087909 -305046823 -304990481 -304913289 -304769508 -304574780 -304399463 -304313534 -304360437 -304520247 -304749153
2458 -304749153 -305005939 -305239616 -305412028 -305480945 -305419737 -305236606 -304959965 -304672997 -304481713 -304422068
2448 -304422068 -304454818 -304520503 -304581883 -304632611 -304691287 -304795410 -304974008 -305211594 -305425577 -305526140
2438 -305526140 -305514078 -305463802 -305439295 -305453624 -305476913 -305476609 -305463430 -305490757 -305599511 -305775200 -305962576
2427 -305962576 -306121786 -306258604 -306405336 -306564662 -306712391 -306832307 -306888615 -306831368 -306671271 -306474373
2417 -306474373 -306277264 -306067627 -305855484 -305709515 -305697406 -305824469 -306021239 -306180461 -306253261 -306277218
2407 -306277218 -306265253 -306214569 -306205193 -306317826 -306503634 -306641487 -306677856 -306655987 -306634893 -306623645 -306578095
2396 -306578095 -306459858 -306271197 -306049157 -305874399 -305815872 -305869587 -305979781 -306085020 -306132537 -306100137
2386 -306100137 -306019342 -305934737 -305889550 -305903679 -305942745 -305992022 -306092834 -306270787 -306492942 -306687576
2376 -306687576 -306787170 -306786107 -306760586 -306774776 -306810643 -306813726 -306778721 -306749948 -306752091 -306800180 -306897378 -307008701
2364 -307008701 -307053368 -306921500 -306573648 -306098642 -305659882 -305401001 -305363987 -305489713 -305691791 -305900078
2354 -305900078 -306024219 -306024170 -305987344 -306003613 -306086940 -306222490 -306375275 -306497079 -306553931 -306529729 -306453369
2343 -306453369 -306389407 -306380993 -306422183 -306493903 -306575791 -306642244 -306696750 -306757031 -306836817 -306918717 -306946684
2332 -306946684 -306884197 -306767240 -306658302 -306556133 -306403798 -306201436 -306038717 -306013206 -306144451 -306379282
2322 -306379282 -306653123 -306875231 -306971271 -306953963 -306866253 -306691067 -306378108 -305961425 -305557968 -305283287
2312 -305283287 -305216698 -305349432 -305561724 -305744119 -305891205 -306020305 -306099474 -306090304 -305977937 -305774767
2302 -305774767 -305534171 -305346378 -305264163 -305262588 -305315693 -305449756 -305682355 -305969439 -306255966 -306505933
2292 -306505933 -306646642 -306612941 -306436100 -306213972 -306049766 -305991166 -306005434 -306040652 -306060113 -306030985
2282 -306030985 -305946768 -305858341 -305819285 -305843693 -305926815 -306045794 -306161396 -306241243 -306271313 -306240892 -306145751
2271 -306145751 -306039315 -306016572 -306096514 -306177236 -306161357 -306061577 -305943969 -305850207 -305824769 -305894028 -306022512
2260 -306022512 -306135713 -306127100 -305927577 -305616745 -305376318 -305320355 -305439294 -305674338 -305931538 -306065581
2250 -306065581 -305992958 -305777105 -305550780 -305396108 -305332129 -305355265 -305465839 -305660750 -305913642 -306177781
2240 -306177781 -306395625 -306530432 -306596805 -306643951 -306702280 -306758855 -306782192 -306757716 -306693793 -306621636 -306595069
2229 -306595069 -306624438 -306654370 -306639304 -306581842 -306503070 -306408185 -306289224 -306163564 -306056729 -305978095
2219 -305978095 -305958343 -306030387 -306186514 -306399721 -306625830 -306782203 -306813280 -306742518 -306636800 -306565614
2209 -306565614 -306566978 -306624999 -306680041 -306663855 -306563396 -306441769 -306361702 -306319440 -306285781 -306269546 -306287923
2198 -306287923 -306320230 -306318094 -306279531 -306270275 -306288727 -306267251 -306208868 -306159551 -306122186 -306081387 -306025527
2187 -306025527 -305942831 -305829315 -305685420 -305524767 -305385483 -305299295 -305257767 -305256828 -305322127 -305488454
2177 -305488454 -305765244 -306088574 -306359460 -306507599 -306513434 -306397178 -306178022 -305886192 -305596870 -305401905
2167 -305401905 -305357830 -305464499 -305673852 -305911727 -306085054 -306121584 -306030072 -305909505 -305876043 -305970823
2157 -305970823 -306136980 -306271446 -306290727 -306210025 -306125894 -306076356 -306050963 -306062806 -306125869 -306234497
2147 -306234497 -306369000 -306494690 -306562534 -306542181 -306446934 -306330164 -306237328 -306189713 -306208285 -306267157
2137 -306267157 -306302048 -306299141 -306323400 -306486149 -306804312 -307135643 -307328265 -307359548 -307279874 -307125531
2127 -307125531 -306955252 -306842622 -306825842 -306880034 -306942179 -306960261 -306895074 -306732614 -306517154 -306322123
2117 -306322123 -306199637 -306180592 -306255181 -306359736 -306427774 -306436753 -306443340 -306532278 -306723570 -306954057 -307115184
2106 -307115184 -307128972 -307000930 -306828837 -306719965 -306708137 -306767772 -306818726 -306782400 -306680254 -306581830
2096 -306581830 -306552215 -306639056 -306843423 -307138600 -307473164 -307762502 -307939354 -307992671 -307935603 -307789811
2086 -307789811 -307602622 -307433348 -307338733 -307294185 -307177283 -306945332 -306727535 -306646595 -306701484 -306821197
2076 -306821197 -306911448 -306904265 -306821771 -306767943 -306821088 -306987188 -307221470 -307455656 -307604403 -307594315
2066 -307594315 -307460915 -307321271 -307258012 -307295576 -307419038 -307563508 -307640813 -307604361 -307470466 -307302502
2056 -307302502 -307185731 -307173995 -307242422 -307326598 -307402457 -307475894 -307530026 -307532782 -307476977 -307388943 -307307092
2045 -307307092 -307247493 -307199674 -307146922 -307093456 -307054449 -307016659 -306943725 -306797642 -306607610 -306471492
2035 -306471492 -306457555 -306568333 -306776725 -307018781 -307186125 -307209356 -307160210 -307169535 -307274999 -307431358
2025 -307431358 -307576383 -307665924 -307681255 -307617951 -307481628 -307309358 -307181026 -307159853 -307240787 -307368683
2015 -307368683 -307484088 -307510307 -307374343 -307104238 -306818042 -306621568 -306552353 -306587140 -306666171 -306715285
2005 -306715285 -306679938 -306580003 -306509420 -306538225 -306658082 -306822330 -306981030 -307074562 -307075386 -306983063 -306798791
1994 -306798791 -306573770 -306390919 -306311009 -306332114 -306434592 -306657002 -307058748 -307605583 -308143350 -308537175
1984 -308537175 -308743325 -308751520 -308602121 -308409212 -308304652 -308368315 -308557192 -308721842 -308738142 -308596565
1974 -308596565 -308350879 -308074752 -307870510 -307830983 -307988891 -308278686 -308586602 -308844427 -309013499
1965 -309013499 -309030085 -308847861 -308513808 -308176292 -307988028 -307978800 -308042175 -308053949 -307981895 -307871362
1955 -307871362 -307794661 -307822214 -307924821 -307978271 -307930416 -307851584 -307839717 -307940886 -308135300 -308364846
1945 -308364846 -308572882 -308719573 -308794431 -308798636 -308708402 -308510589 -308245520 -307960756 -307697890 -307509631
1935 -307509631 -307442337 -307509654 -307688126 -307945328 -308241679 -308520286 -308710175 -308756630 -308669724 -308486690
1925 -308486690 -308231265 -307966472 -307795809 -307781718 -307884613 -307978850 -307954432 -307816892 -307676100 -307617042
1915 -307617042 -307651945 -307797081 -308031838 -308266631 -308427259 -308514679 -308562985 -308593534 -308630245 -308712593
1905 -308712593 -308867257 -309068034 -309264349 -309446421 -309637371 -309815932 -309927347 -309938777 -309849482 -309723888
1895 -309723888 -309669472 -309714739 -309781027 -309772912 -309676374 -309553530 -309437876 -309296997 -309117393 -308957704
1885 -308957704 -308867982 -308785338 -308641079 -308488742 -308406370 -308392056 -308388214 -308345855 -308236009 -308035945
1875 -308035945 -307780263 -307577702 -307519355 -307576300 -307610200 -307525462 -307375407 -307277333 -307287554 -307393576
1865 -307393576 -307576593 -307820191 -308073175 -308283235 -308426135 -308499928 -308506137 -308427406 -308278278 -308118566
1855 -308118566 -307991117 -307923340 -307973143 -308180931 -308485990 -308757862 -308894493 -308921654 -308961661 -309064105
1845 -309064105 -309165157 -309217557 -309231407 -309202204 -309144806 -309106089 -309101405 -309105653 -309076460 -309003688 -308916727
1834 -308916727 -308860077 -308873233 -308962916 -309107777 -309282710 -309436973 -309485499 -309389359 -309173490 -308919689
1824 -308919689 -308744881 -308684770 -308682654 -308666059 -308574501 -308407476 -308258333 -308247821 -308428946 -308755448
1814 -308755448 -309130746 -309454415 -309632459 -309616203 -309480425 -309379650 -309404158 -309518680 -309616120 -309616964
1804 -309616964 -309517437 -309332704 -309061915 -308750125 -308501314 -308425830 -308566089 -308876652 -309279429 -309698412
1794 -309698412 -310073105 -310381788 -310621144 -310737209 -310672525 -310429497 -310041412 -309572815 -309137234
1785 -309137234 -308832537 -308686665 -308684271 -308784040 -308906965 -308963132 -308954107 -308950791 -308985749 -309050993 -309116431
1774 -309116431 -309141739 -309121934 -309060851 -308931011 -308699701 -308378047 -308030149 -307739943 -307557045 -307485321
1764 -307485321 -307512421 -307609839 -307743687 -307891000 -308031270 -308134021 -308168248 -308147415 -308121368 -308102780
1754 -308102780 -308026862 -307818527 -307529120 -307314074 -307265558 -307345351 -307453900 -307502652 -307447410 -307344192
1744 -307344192 -307324101 -307461357 -307752834 -308147171 -308514520 -308736252 -308824057 -308859989 -308869402 -308817769
1734 -308817769 -308683317 -308500298 -308330855 -308228684 -308232469 -308336229 -308461205 -308514479 -308473807 -308382560
1724 -308382560 -308293640 -308216525 -308143316 -308110581 -308165336 -308302009 -308481741 -308677540 -308905591 -309208846
1714 -309208846 -309557045 -309838635 -309974271 -310018833 -310085447 -310167731 -310141748 -309954280 -309704027 -309486979
1704 -309486979 -309342140 -309310644 -309423985 -309653066 -309868713 -309958717 -309947300 -309913733 -309906891 -309914774 -309872676
1693 -309872676 -309747065 -309578249 -309423103 -309309912 -309228838 -309147629 -309052282 -308950327 -308836089 -308706015
1683 -308706015 -308591606 -308578008 -308729055 -308978417 -309216713 -309403724 -309510920 -309506572 -309371041 -309077398
1673 -309077398 -308671365 -308306890 -308118288 -308114291 -308217245 -308324486 -308364123 -308372022 -308436508 -308563447
1663 -308563447 -308655768 -308648597 -308575698 -308475728 -308354449 -308252419 -308228877 -308299549 -308424061 -308529567
1653 -308529567 -308587448 -308656548 -308803733 -309010640 -309173163 -309221909 -309217659 -309275616 -309423197 -309569448
1643 -309569448 -309618698 -309527586 -309279423 -308912934 -308555975 -308355993 -308360614 -308471024 -308584659 -308716415
1633 -308716415 -308899801 -309082630 -309156125 -309085852 -308957541 -308878912 -308881915 -308926112 -308990848 -309105481
1623 -309105481 -309274781 -309443662 -309543400 -309524341 -309388307 -309196574 -309025221 -308907969 -308836902 -308801654
1613 -308801654 -308777260 -308724583 -308631358 -308527597 -308454738 -308425723 -308433166 -308459222 -308481595 -308480475 -308451024
1602 -308451024 -308408265 -308346629 -308241931 -308097665 -307957265 -307878843 -307891316 -307961969 -308008627 -307990276
1592 -307990276 -307938002 -307872586 -307803207 -307745293 -307710242 -307703165 -307690949 -307622527 -307513996 -307432999 -307414483
1581 -307414483 -307459176 -307545820 -307627730 -307648066 -307596931 -307563070 -307636503 -307791604 -307953523 -308085445
1571 -308085445 -308184831 -308312043 -308531892 -308799045 -309017082 -309147578 -309184863 -309126630 -308987352 -308815782
1561 -308815782 -308698649 -308697321 -308800185 -308952204 -309086668 -309145416 -309100175 -308976323 -308862083 -308844154
1551 -308844154 -308933087 -309081945 -309251637 -309401506 -309479331 -309462480 -309348283 -309155320 -308949317 -308822378
1541 -308822378 -308842399 -308971923 -309109829 -309215878 -309294555 -309315054 -309265705 -309242568 -309373109 -309648807
1531 -309648807 -309931498 -310090803 -310054354 -309812224 -309418642 -308931829 -308407395 -307950476 -307662916
1522 -307662916 -307585246 -307716579 -308023856 -308428372 -308817468 -309116417 -309307539 -309396358 -309430512 -309511227
1512 -309511227 -309676340 -309814959 -309807769 -309654314 -309431345 -309193845 -308953021 -308721674 -308534332 -308423686
1502 -308423686 -308402547 -308471024 -308599512 -308733257 -308822979 -308847411 -308835631 -308848229 -308910683 -308967597 -308916229
1491 -308916229 -308732984 -308506418 -308318838 -308177697 -308056524 -307938939 -307856417 -307857834 -307924900 -307979019
1481 -307979019 -307996270 -308072076 -308251771 -308421302 -308489989 -308479402 -308429958 -308344329 -308207135 -308074930
1471 -308074930 -308030933 -308045262 -308047157 -308045364 -308090143 -308206213 -308365099 -308498604 -308557851 -308570860 -308588646
1460 -308588646 -308627324 -308697508 -308797035 -308862963 -308821488 -308677627 -308492297 -308339719 -308302751 -308413418
1450 -308413418 -308600434 -308767618 -308886228 -308968107 -309008921 -308999130 -308949054 -308875829 -308782795 -308655886
1440 -308655886 -308505255 -308408232 -308440585 -308598853 -308792790 -308920221 -308959265 -308934884 -308860304 -308739735
1430 -308739735 -308573077 -308381146 -308243203 -308237360 -308339653 -308471676 -308580887 -308622372 -308571446 -308446747
1420 -308446747 -308265333 -308004932 -307701569 -307507083 -307528047 -307734142 -308014464 -308264377 -308464590
1411 -308464590 -308642677 -308769227 -308795721 -308733191 -308619978 -308490826 -308389971 -308389808 -308553531 -308837884
1401 -308837884 -309098267 -309240742 -309318213 -309444089 -309658498 -309916935 -310163645 -310357325 -310455000 -310448299
1391 -310448299 -310392036 -310349170 -310345825 -310391439 -310469070 -310515225 -310491611 -310435898 -310395638 -310390671 -310415829
1380 -310415829 -310444620 -310443523 -310365978 -310177525 -309914437 -309676128 -309574512 -309630518 -309757218 -309864907
1370 -309864907 -309907466 -309900230 -309895025 -309898728 -309888664 -309886999 -309936841 -310027560 -310119037 -310192382 -310268725 -310376971
1358 -310376971 -310515022 -310653171 -310742257 -310767569 -310764749 -310722943 -310572013 -310308512 -310035473 -309836407
1348 -309836407 -309688551 -309520647 -309331050 -309167979 -309013641 -308825239 -308615567 -308436748 -308321124
1339 -308321124 -308253850 -308187588 -308086321 -307988385 -307979141 -308110234 -308367245 -308689098 -309032837 -309374190
1329 -309374190 -309671144 -309901696 -310086011 -310240698 -310361095 -310455073 -310549692 -310676789 -310834843 -310945740
1319 -310945740 -310939846 -310855556 -310766896 -310711465 -310707025 -310758736 -310836308 -310890411 -310903053 -310914982 -310991400
1308 -310991400 -311095201 -311102781 -310976663 -310802237 -310664157 -310572785 -310526874 -310538418 -310583693 -310624170
1298 -310624170 -310624457 -310554181 -310457532 -310414108 -310430754 -310500900 -310674282 -310972147 -311308127 -311574949 -311749105
1287 -311749105 -311878379 -311993857 -312068762 -312058414 -311955410 -311788018 -311587742 -311396663 -311271650 -311206782
1277 -311206782 -311143625 -311060092 -310929053 -310675811 -310250434 -309702987 -309176059 -308802097 -308614287 -308552527
1267 -308552527 -308526317 -308492416 -308496130 -308605086 -308817108 -309066843 -309267327 -309335661 -309246038 -309061005
1257 -309061005 -308872268 -308751504 -308755662 -308921784 -309242534 -309643822 -310017737 -310303971 -310498813 -310627108
1247 -310627108 -310719506 -310779477 -310831820 -310914992 -311016141 -311102929 -311189993 -311303663 -311424871 -311514835
1237 -311514835 -311557009 -311558045 -311503217 -311373787 -311202770 -311027075 -310841604 -310646289 -310449841 -310257685
1227 -310257685 -310098911 -310018041 -310030299 -310107841 -310229866 -310377521 -310481568 -310476672 -310398990 -310356721
1217 -310356721 -310416427 -310573252 -310815827 -311128455 -311452713 -311736623 -311975659 -312180888 -312335756
1208 -312335756 -312411007 -312395032 -312294313 -312115960 -311860601 -311569661 -311327387 -311193486 -311202365 -311338368
1198 -311338368 -311501271 -311554031 -311443500 -311271757 -311169672 -311162888 -311196061 -311236920 -311285146 -311365657
1188 -311365657 -311517670 -311735017 -311963309 -312128072 -312174060 -312096255 -311945539 -311771850 -311570922 -311300984
1178 -311300984 -310961799 -310625965 -310372764 -310239526 -310233879 -310317184 -310380108 -310354837 -310278424 -310196832
1168 -310196832 -310102673 -309962112 -309749562 -309486195 -309238165 -309094566 -309146191 -309394843 -309691413 -309864124
1158 -309864124 -309897572 -309898246 -309937603 -310014931 -310114860 -310239809 -310420819 -310646112 -310850797 -311032596
1148 -311032596 -311237347 -311438994 -311576958 -311652579 -311687976 -311690023 -311701169 -311789004 -311936497 -312025530
1138 -312025530 -311956031 -311723805 -311427210 -311195564 -311062241 -310958708 -310847285 -310740752 -310646956 -310598573
1128 -310598573 -310621394 -310682191 -310724748 -310741253 -310741588 -310707784 -310666004 -310694060 -310839324 -311057842 -311251378
1117 -311251378 -311375090 -311477629 -311621963 -311796708 -311925105 -311936380 -311829862 -311682872 -311570275
1108 -311570275 -311489234 -311377574 -311151329 -310786924 -310351309 -309918789 -309571995 -309408246 -309467528 -309723212
1098 -309723212 -310085529 -310418194 -310636917 -310741286 -310749106 -310682789 -310575163 -310456200 -310376157 -310388714
1088 -310388714 -310509965 -310713618 -310928932 -311088722 -311173212 -311198885 -311218630 -311242094 -311192166 -311034381
1078 -311034381 -310831997 -310629918 -310430889 -310261934 -310160448 -310130750 -310162861 -310265703 -310446153 -310670942
1068 -310670942 -310878289 -311002623 -310997594 -310898855 -310778527 -310656986 -310557143 -310538560 -310618531 -310743835
1058 -310743835 -310869612 -311015971 -311225323 -311478088 -311678435 -311729371 -311601350 -311358224 -311127792
1049 -311127792 -310986822 -310914414 -310885689 -310903982 -310920328 -310851095 -310669935 -310429963 -310227643 -310148789
1039 -310148789 -310222212 -310424562 -310716501 -311036410 -311332195 -311589641 -311794301 -311926641 -312002320 -312074471
1029 -312074471 -312171068 -312250937 -312228232 -312082755 -311910038 -311804432 -311762453 -311766496 -311846598 -312017365
1019 -312017365 -312255271 -312526781 -312807299 -313052041 -313196796 -313208110 -313100234 -312920568 -312717847
1010 -312717847 -312540154 -312422748 -312359809 -312323527 -312292918 -312260276 -312213433 -312126316 -311992045 -311838432
1000 -311838432 -311714036 -311659215 -311645715 -311604087 -311515972 -311402934 -311281095 -311167822 -311081312 -311027970
990 -311027970 -311037391 -311110801 -311182926 -311224292 -311260040 -311290679 -311291877 -311274090 -311281724 -311323671 -311349596 -311328082
978 -311328082 -311265279 -311198244 -311190202 -311292202 -311507998 -311767410 -311957026 -312008709 -311939281 -311814778
968 -311814778 -311680193 -311529335 -311360688 -311221865 -311200899 -311350526 -311610260 -311840172 -311905554 -311771720
958 -311771720 -311524224 -311289404 -311177123 -311238294 -311421492 -311590510 -311628852 -311522097 -311307628 -311013146
948 -311013146 -310684395 -310421540 -310313285 -310346947 -310417379 -310437706 -310392603 -310300828 -310203956 -310172936 -310252110
937 -310252110 -310434135 -310698285 -311010005 -311327004 -311600535 -311764236 -311753129 -311538154 -311168954 -310770255
927 -310770255 -310455123 -310284621 -310300702 -310487948 -310733435 -310931439 -311070902 -311214743 -311414731 -311625085
917 -311625085 -311760534 -311803548 -311803693 -311822848 -311887782 -311946063 -311921414 -311836265 -311785720 -311820252 -311932718
906 -311932718 -312122084 -312392872 -312713842 -312987379 -313105382 -313049144 -312861032 -312583615 -312290276 -312083178
896 -312083178 -312011987 -312058648 -312199291 -312405964 -312598149 -312681690 -312648135 -312581460 -312564745 -312623557 -312732347
885 -312732347 -312833207 -312864263 -312809495 -312683896 -312499653 -312286301 -312082182 -311902747 -311741996 -311594585
875 -311594585 -311447435 -311285014 -311107012 -310918145 -310743758 -310632699 -310642883 -310791476 -311005432 -311170269
865 -311170269 -311229493 -311216606 -311240543 -311368071 -311537567 -311663027 -311735351 -311791012 -311841487 -311904864 -312011700
854 -312011700 -312135070 -312212612 -312242764 -312273660 -312311162 -312324445 -312327321 -312359145 -312432967 -312535134 -312615594
843 -312615594 -312592053 -312425373 -312180340 -311999174 -312013066 -312227862 -312513398 -312721331 -312801752 -312800032
833 -312800032 -312735416 -312606918 -312458671 -312361773 -312371491 -312458778 -312533464 -312528922 -312435058 -312291363 -312126999
822 -312126999 -311942611 -311758711 -311636538 -311638828 -311747905 -311900946 -312090499 -312331190 -312604522 -312893753
812 -312893753 -313190609 -313442449 -313565624 -313491577 -313229722 -312902525 -312648147 -312515786 -312478470 -312458474
802 -312458474 -312381219 -312230863 -312033776 -311826409 -311641579 -311505602 -311425138 -311379258 -311319858 -311235294
792 -311235294 -311177766 -311180723 -311228093 -311303652 -311416112 -311582861 -311800149 -311986759 -312003386 -311812547
782 -311812547 -311515356 -311233860 -311047907 -310977411 -311005793 -311121798 -311309493 -311492250 -311552656 -311437099
772 -311437099 -311190850 -310911821 -310691076 -310566968 -310503591 -310429584 -310354584 -310401758 -310626461 -310919666
762 -310919666 -311160993 -311322857 -311409232 -311413998 -311386355 -311435012 -311602272 -311834601 -312069857 -312253558
752 -312253558 -312332697 -312307793 -312233664 -312174070 -312160462 -312160304 -312126700 -312081565 -312083115 -312115241 -312143449 -312190331
740 -312190331 -312243337 -312236942 -312148368 -312011072 -311871251 -311761376 -311669885 -311608319 -311646120 -311797441 -311983079
729 -311983079 -312108658 -312151868 -312188267 -312284122 -312416588 -312541125 -312649832 -312746284 -312807712 -312819534
719 -312819534 -312782669 -312694639 -312576039 -312450608 -312356427 -312360582 -312471624 -312584000 -312557603 -312351332
709 -312351332 -312026503 -311664050 -311355817 -311207141 -311272197 -311491204 -311739877 -311935699 -312078007 -312182974
699 -312182974 -312238220 -312239059 -312222804 -312251317 -312348614 -312501147 -312693623 -312891312 -313041295 -313074979 -312949647
688 -312949647 -312728416 -312550415 -312477283 -312459348 -312479336 -312570292 -312656384 -312598580 -312411004 -312231167
678 -312231167 -312142314 -312149673 -312266811 -312494414 -312778056 -313069331 -313356562 -313604678 -313761680 -313820837
668 -313820837 -313783373 -313654215 -313480948 -313313189 -313158994 -313006114 -312852305 -312718221 -312621555 -312526290
658 -312526290 -312371005 -312150867 -311940702 -311802269 -311718302 -311654672 -311601121 -311536626 -311453334 -311366158
648 -311366158 -311265558 -311135659 -311001756 -310914327 -310865288 -310798413 -310704275 -310602896 -310483688 -310319523
638 -310319523 -310094500 -309865140 -309748330 -309786106 -309889931 -309929152 -309828705 -309611943 -309364530 -309151461
628 -309151461 -309008010 -308940009 -308941049 -309043997 -309262220 -309535640 -309773595 -309901618 -309895546 -309788317
618 -309788317 -309658455 -309585715 -309593979 -309635192 -309631386 -309534289 -309373618 -309228412 -309132463 -309041001 -308908217
607 -308908217 -308757061 -308625740 -308526636 -308476204 -308498994 -308594048 -308700824 -308731636 -308681765 -308655116 -308730772
596 -308730772 -308898860 -309127713 -309371860 -309553711 -309596042 -309476088 -309254044 -309015446 -308818694 -308681743
586 -308681743 -308572566 -308492518 -308493488 -308562244 -308596042 -308535881 -308412784 -308279188 -308163392 -308075101 -308001913
575 -308001913 -307884359 -307680432 -307433550 -307235457 -307100385 -306945341 -306728483 -306520859 -306398469
566 -306398469 -306367967 -306406882 -306489728 -306579011 -306646745 -306710867 -306773897 -306777636 -306670761 -306456733 -306187793
555 -306187793 -305902050 -305623785 -305394073 -305231265 -305123080 -305050174 -305000962 -304967680 -304929675 -304864837
545 -304864837 -304772509 -304667623 -304573909 -304514054 -304458285 -304355078 -304217033 -304095228 -304028154 -304010016
535 -304010016 -303998155 -303951858 -303853799 -303733185 -303635326 -303563077 -303494691 -303434099 -303419124 -303470504 -303553929
524 -303553929 -303613998 -303606106 -303508242 -303326915 -303088858 -302807998 -302453211 -302040224 -301676596 -301436555
514 -301436555 -301320633 -301313944 -301384512 -301440400 -301403264 -301297573 -301170118 -301023502 -300825893 -300558472
504 -300558472 -300250606 -299971833 -299800839 -299765626 -299809679 -299852063 -299844197 -299761866 -299594923 -299331066
494 -299331066 -298980310 -298601149 -298273738 -298052826 -297904972 -297721188 -297435516 -297077933 -296747304
485 -296747304 -296537744 -296477750 -296525420 -296606725 -296678490 -296750243 -296811352 -296787748 -296644009 -296444718 -296265064
474 -296265064 -296126212 -296025880 -295940135 -295823844 -295662760 -295473819 -295279627 -295106046 -294930519 -294698938
464 -294698938 -294422539 -294169164 -293941176 -293650059 -293256507 -292820483 -292411878 -292047954 -291711433
455 -291711433 -291414734 -291203334 -291096803 -291081926 -291142028 -291242644 -291323361 -291323578 -291197465 -290952476
445 -290952476 -290668258 -290444251 -290336470 -290306792 -290243076 -290020142 -289579873 -289026044 -288545623 -288241869
435 -288241869 -288103615 -288052765 -288002554 -287893120 -287687291 -287391763 -287046633 -286684008 -286316556 -285942226
425 -285942226 -285606510 -285383065 -285265181 -285189068 -285120241 -285033653 -284894285 -284698606 -284447413 -284169605
415 -284169605 -283940417 -283804523 -283740375 -283679712 -283544886 -283288442 -282929182 -282519023 -282093699 -281690320
405 -281690320 -281328432 -280964878 -280550648 -280100560 -279664806 -279275492 -278922100 -278555911 -278116564
396 -278116564 -277591726 -277044727 -276578502 -276258680 -276073913 -275980912 -275941093 -275909663 -275848344 -275764042
386 -275764042 -275674514 -275548289 -275318584 -274939809 -274408403 -273777666 -273159196 -272654130 -272290416 -272035265
376 -272035265 -271823244 -271576949 -271281166 -271000865 -270786542 -270609712 -270419001 -270198871 -269947354
367 -269947354 -269666667 -269358213 -269001674 -268556878 -268019391 -267436842 -266854142 -266286598 -265722751
358 -265722751 -265160443 -264629228 -264161551 -263786900 -263508066 -263290783 -263094746 -262901031 -262686328
349 -262686328 -262394699 -261988544 -261513178 -261076376 -260729315 -260437409 -260169116 -259916381 -259667187
340 -259667187 -259409428 -259121842 -258771206 -258374271 -257994079 -257640738 -257282476 -256882890 -256386819
331 -256386819 -255769501 -255090883 -254434771 -253817661 -253216060 -252633121 -252101770 -251653131 -251290811
322 -251290811 -251005452 -250791088 -250622738 -250428748 -250138955 -249741968 -249261935 -248724846 -248187931
313 -248187931 -247724500 -247346575 -247002150 -246636156 -246255308 -245951406 -245810706 -245810620 -245834193 -245732109
303 -245732109 -245401023 -244849488 -244182649 -243540421 -243016588 -242595371 -242208051 -241810399 -241385461
294 -241385461 -240951085 -240535563 -240113735 -239628504 -239034496 -238321639 -237515194 -236666481 -235849458
285 -235849458 -235104321 -234420196 -233795330 -233270133 -232872271 -232561672 -232247231 -231865128 -231426664
276 -231426664 -230979047 -230565721 -230180386 -229767621 -229290537 -228741035 -228117748 -227443898 -226741139
267 -226741139 -226034917 -225357863 -224703092 -224063185 -223466950 -222918997 -222398855 -221904619 -221419992
258 -221419992 -220919537 -220403311 -219878276 -219355647 -218854109 -218378390 -217910972 -217442864 -216986901
249 -216986901 -216558821 -216126860 -215636264 -215067736 -214429335 -213765391 -213129474 -212547369 -212005362
240 -212005362 -211471952 -210956639 -210490930 -210068064 -209641727 -209154340 -208564877 -207907962 -207271661
231 -207271661 -206693153 -206160597 -205667243 -205216166 -204786024 -204295938 -203672042 -202952103 -202224817
222 -202224817 -201533846 -200894114 -200295973 -199696019 -199039596 -198325808 -197616455 -196934146 -196254808
213 -196254808 -195578491 -194931159 -194339584 -193809089 -193315715 -192790563 -192165417 -191459070 -190748410
204 -190748410 -190096962 -189490155 -188837261 -188079169 -187281936 -186561035 -185950976 -185417072 -184917549
195 -184917549 -184414510 -183869482 -183266868 -182626198 -181974929 -181320988 -180638366 -179920232 -179204946
186 -179204946 -178506859 -177803188 -177068235 -176302735 -175555836 -174887596 -174324355 -173831352 -173326202
177 -173326202 -172774481 -172190707 -171554488 -170834506 -170059634 -169272117 -168474305 -167664909 -166869127
168 -166869127 -166139151 -165498640 -164895358 -164272011 -163613588 -162945088 -162309535 -161689324 -161029450
159 -161029450 -160318049 -159565141 -158783581 -158019267 -157302045 -156608152 -155884135 -155080059 -154178378
150 -154178378 -153221675 -152292896 -151453185 -150711688 -150035577 -149380948 -148718409 -148053144 -147400248
141 -147400248 -146746433 -146066335 -145370549 -144716923 -144111944 -143492402 -142830178 -142134670 -141405710
132 -141405710 -140660666 -139932431 -139205858 -138429070 -137586801 -136726258 -135909301 -135152414 -134448220
123 -134448220 -133798693 -133194676 -132618053 -132044601 -131436151 -130758424 -130013837 -129245663 -128482622
114 -128482622 -127712033 -126922834 -126136354 -125390146 -124698194 -124042627 -123410420 -122810468 -122231098
105 -122231098 -121609014 -120878019 -120011621 -119025994 -118001423 -117054823 -116245254 -115520732 -114784862
96 -114784862 -113993275 -113166953 -112363723 -111613035 -110877539 -110122987 -109362688 -108600017 -107810750 -106999227
86 -106999227 -106206831 -105464099 -104764135 -104073314 -103351435 -102584589 -101788291 -100971667 -100122548 -99242188
76 -99242188 -98363125 -97503768 -96661194 -95843657 -95054329 -94281405 -93519708 -92769647 -92011852 -91218609
66 -91218609 -90397724 -89587057 -88799681 -88026309 -87272263 -86532717 -85781724 -84979239 -84106228 -83204643
56 -83204643 -82342344 -81562765 -80866332 -80215072 -79557274 -78852286 -78079382 -77240234 -76359584 -75483229
46 -75483229 -74649368 -73854740 -73071993 -72280855 -71456910 -70587088 -69666180 -68680403 -67634206 -66554854
36 -66554854 -65477844 -64436428 -63481730 -62655431 -61928496 -61231651 -60532811 -59849793 -59214557
27 -59214557 -58627838 -58075269 -57569871 -57109782 -56630742 -56068739 -55435881 -54763419 -54047592 -53265376
17 -53265376 -52431106 -51596326 -50764896 -49887958 -48952166 -48009178 -47077726 -46140539 -45227727 -44400617
7 -44400617 -43683063 -43007821 -42269706 -41441550 -40578166 -39710281 -38804056
0 -38804056
##END NTUPLES=NMR SPECTRUM
##END=
