##TITLE=1H ikalashn
Am-S-NH2
27.9.2024
##JCAMPDX= 6.0         $$ Bruker NMR JCAMP-DX V2.0
##DATA TYPE= NMR FID
##DATA CLASS= NTUPLES
##ORIGIN= UXNMR, Bruker Analytische Messtechnik GmbH
##OWNER= root
$$ TOPSPIN		Version 1.3
$$ 2024-09-27 08:51:12.734 +0400  Irina@DPX200
$$ Compression mode = diff/dup
##.OBSERVE FREQUENCY= 200.131392401
##.OBSERVE NUCLEUS= ^1H
##.DELAY= (6, 6)
##.ACQUISITION MODE= SIMULTANEOUS
##.ACQUISITION SCHEME= undefined
##.AVERAGES= 16
##.DIGITISER RES= 18
##SPECTROMETER/DATA SYSTEM= spect
##.PULSE SEQUENCE= zg
##.SOLVENT NAME= DMSO
##.SHIFT REFERENCE= INTERNAL, DMSO, 1, 17.95386
##AUDIT TRAIL= $$ (NUMBER, WHEN, WHO, WHERE, WHAT)
$$ ##TITLE= Audit trail, TOPSPIN		Version 1.3
$$ ##JCAMPDX= 5.01
$$ ##ORIGIN= Bruker BioSpin GmbH
$$ ##OWNER= Irina
$$ $$ F:/spectra/data/iren/nmr/1H/4/audita.txt
$$ ##AUDIT TRAIL=  $$ (NUMBER, WHEN, WHO, WHERE, VERSION, WHAT)
(   1,<2024-09-27 08:50:58.156 +0400>,<Irina>,<DPX200>,<TOPSPIN 1.3>,
      <created by zg
	started at 2024-09-27 08:49:50.218 +0400,
	POWCHK disabled, PULCHK disabled
       terminated by command 'halt'
       configuration hash MD5:
       BE 6D 3F 07 2A EA 11 49 91 17 2B D3 AF B3 58 0D
       data hash MD5: 16K
       C5 F9 1D 4A BF C5 A7 0A 4D 55 3A 1B 46 F0 44 A0>)
$$ ##END=
$$ 
$$ $$ hash MD5
$$ $$ 41 83 D1 8B 55 4D 8C 66 97 5E A6 0B 6D 37 A7 7E
##$RELAX= 
##$RELAX= 
##$RELAX= 
##$RELAX= 
##$RELAX= 
##$RELAX= 
##$RELAX= 
##$RELAX= 
##$RELAX= 
$$ Bruker specific parameters
$$ --------------------------
##$DU= <F:/spectra>
##$EXPNO= 4
##$NAME= <1H>
##$PROCNO= 1
##$TYPE= <nmr>
##$USER= <iren>
##$AMP= (0..31)
100 100 100 100 100 100 100 100 100 100 100 100 100 100 100 100 100 100 
100 100 100 100 100 100 100 100 100 100 100 100 100 100 
##$ANAVPT= -1
##$AQSEQ= 0
##$AQ_mod= 1
##$AUNM= <au_zg>
##$AUTOPOS= <>
##$BF1= 200.13
##$BF2= 200.13
##$BF3= 200.13
##$BF4= 200.13
##$BF5= 200.13
##$BF6= 200.13
##$BF7= 200.13
##$BF8= 200.13
##$BYTORDA= 1
##$CFDGTYP= 0
##$CFRGTYP= 5
##$CHEMSTR= <none>
##$CNST= (0..63)
1 1 145 1 1 1 1 1 1 1 1 1 1 1 1 1 1 1 1 1 1 1 1 1 1 1 1 1 1 1 1 1 1 1 
1 1 1 1 1 1 1 1 1 1 1 1 1 1 1 1 1 1 1 1 1 1 1 1 1 1 1 1 1 1 
##$CPDPRG= <>
##$CPDPRG1= <>
##$CPDPRG2= <>
##$CPDPRG3= <>
##$CPDPRG4= <mlev>
##$CPDPRG5= <mlev>
##$CPDPRG6= <mlev>
##$CPDPRG7= <mlev>
##$CPDPRG8= <mlev>
##$CPDPRGB= <>
##$CPDPRGT= <>
##$D= (0..63)
0 2 0 0 0 0 0 0 0 0.06 0 0.03 0 0 0 0 0.0002 0 0 0 0 0 0 0 0 0 0 0 0 0 
0 0 0 0 0 0 0 0 0 0 0 0 0 0 0 0 0 0 0 0 0 0 0 0 0 0 0 0 0 0 0 0 0 0 
##$DATE= 1727412655
##$DBL= (0..7)
120 120 120 120 120 120 120 120 
##$DBP= (0..7)
150 150 150 150 150 150 150 150 
##$DBP07= 0
##$DBPNAM0= <>
##$DBPNAM1= <>
##$DBPNAM2= <>
##$DBPNAM3= <>
##$DBPNAM4= <>
##$DBPNAM5= <>
##$DBPNAM6= <>
##$DBPNAM7= <>
##$DBPOAL= (0..7)
0.5 0.5 0.5 0.5 0.5 0.5 0.5 0.5 
##$DBPOFFS= (0..7)
0 0 0 0 0 0 0 0 
##$DE= 6
##$DECBNUC= <off>
##$DECIM= 32
##$DECNUC= <off>
##$DECSTAT= 4
##$DIGMOD= 1
##$DIGTYP= 9
##$DL= (0..7)
0 120 120 120 120 120 120 120 
##$DP= (0..7)
$$ [...]
##$SW= 21.9925939549014
##$SWIBOX= (0..15)
0 0 2 0 0 0 0 0 0 0 0 0 0 0 0 0 
##$SW_h= 4401.40845070422
##$TD= 16384
##$TD0= 1
##$TE= 300
##$TE2= 300
##$TE3= 300
##$TEG= 300
##$TL= (0..7)
0 120 120 120 120 120 120 120 
##$TP= (0..7)
150 150 150 150 150 150 150 150 
##$TP07= 0
##$TPNAME0= <>
##$TPNAME1= <>
##$TPNAME2= <>
##$TPNAME3= <>
##$TPNAME4= <>
##$TPNAME5= <>
##$TPNAME6= <>
##$TPNAME7= <>
##$TPOAL= (0..7)
0.5 0.5 0.5 0.5 0.5 0.5 0.5 0.5 
##$TPOFFS= (0..7)
0 0 0 0 0 0 0 0 
##$TUNHIN= 0
##$TUNHOUT= 0
##$TUNXOUT= 0
##$USERA1= <user>
##$USERA2= <user>
##$USERA3= <user>
##$USERA4= <user>
##$USERA5= <user>
##$V9= 5
##$VALIST= <valist>
##$VCLIST= <CCCCCCCCCCCCCCC>
##$VD= 0
##$VDLIST= <DDDDDDDDDDDDDDD>
##$VPLIST= <PPPPPPPPPPPPPPP>
##$VTLIST= <TTTTTTTTTTTTTTT>
##$WBST= 1024
##$WBSW= 25
##$XGAIN= (0..3)
0 0 0 0 
##$XL= 0
##$YL= 0
##$YMAX_a= 593384
##$YMIN_a= -824802
##$ZGOPTNS= <>
##$ZL1= 120
##$ZL2= 120
##$ZL3= 120
##$ZL4= 120
##$ABSF1= 10
##$ABSF2= 0
##$ABSG= 5
##$ABSL= 3
##$ALPHA= 0
##$AQORDER= 0
##$ASSFAC= 0
##$ASSFACI= 0
##$ASSFACX= 0
##$ASSWID= 0
##$AUNMP= <proc_1d>
##$AXLEFT= 0
##$AXRIGHT= 0
##$AXTYPE= 0
##$AXUNIT= <>
##$AZFE= 0.1
##$AZFW= 0.1
##$BCFW= 1
##$BC_mod= 2
##$BYTORDP= 1
##$COROFFS= 0
##$CY= 7568.61572265625
##$DATMOD= 1
##$DC= 2
##$DFILT= <>
##$DTYPP= 0
##$F1P= 17.9538593292236
##$F2P= -4.03888763876832
##$FCOR= 0.5
##$FTSIZE= 32768
##$FT_mod= 4
##$GAMMA= 1
##$GB= 1
##$INTBC= 1
##$INTSCL= 1
##$ISEN= 128
##$LB= 0.02
##$LEV0= 0
##$LPBIN= 0
##$MAXI= 945.577
##$MC2= 0
##$MEAN= 0
##$ME_mod= 0
##$MI= -402.1523
##$NCOEF= 0
##$NC_proc= 0
##$NLEV= 6
##$NOISF1= 8.587773
##$NOISF2= 6.764455
##$NSP= 1
##$NTH_PI= 0
##$NZP= 0
##$OFFSET= 17.95386
##$PC= 1
##$PHC0= 292.0821
##$PHC1= 28.00898
##$PH_mod= 0
##$PKNL= yes
##$PPARMOD= 0
##$PPDIAG= 0
##$PPIPTYP= 0
##$PPMPNUM= 100
##$PPRESOL= 1
##$PSCAL= 0
##$PSIGN= 0
##$REVERSE= no
##$SF= 200.13
##$SI= 32768
##$SIGF1= 18.5376
##$SIGF2= -6.396296
##$SINO= 400
##$SIOLD= 32768
##$SREGLST= <1H.CDCl3>
##$SSB= 3
##$STSI= 0
##$STSR= 0
##$SW_p= 4401.40845070423
##$SYMM= 0
##$S_DEV= 0
##$TDeff= 0
##$TDoff= 0
##$TI= <>
##$TILT= no
##$TM1= 0
##$TM2= 0
##$TOPLEV= 0
##$USERP1= <user>
##$USERP2= <user>
##$USERP3= <user>
##$USERP4= <user>
##$USERP5= <user>
##$WDW= 1
##$XDIM= 8192
##$YMAX_p= 0
##$YMIN_p= 0
$$ End of Bruker specific parameters
$$ ---------------------------------
##NTUPLES= NMR FID
##VAR_NAME=  TIME,          FID/REAL,        FID/IMAG
##SYMBOL=    X,             R,               I
##VAR_TYPE=  INDEPENDENT,   DEPENDENT,       DEPENDENT
##VAR_FORM=  AFFN,          ASDF,            ASDF
##VAR_DIM=   8192,          8192,            8192
##UNITS=     SECONDS,       ARBITRARY UNITS, ARBITRARY UNITS
##FACTOR=    0.0002272,     1,               1
##FIRST=     0,             0,               0
##LAST=      1.8609952,     77,              -89
##MIN=       0,             -824802,         -824802
##MAX=       1.8609952,     593384,          593384
$$ Real data points
##PAGE= N=1
##DATA TABLE= (X++(R..R)), XYDATA
$$ [...]
1927H17k140K86K128J253j403k332m8J970R83j333k164j30K217J571j632k376
1943b333k86K411K061o23k517j115K199K414j07k161j245J138K110K49j926j363
1959a094R49J588K94j877j762Q46K375L74k154k212O35K345J436j463k570mK165
1976a29J784n33k149n25J714J718o18j632m75J448J440m35k381q90J814K011n98
1993A564k497j680J413K777J59k504j924P69K344J145j464k023J52K243J153j145
2009D82j607M8K070J280j290k107J4K185J584j021k690q44J992K127o75k412j455
2026b319J241K073K81k110j551R93K052M52j621j555Q87K467O05j876j869P24
2042a126K570J406j743k531l6K410J631r53k398r37J500J799n57k007r46J143
$$ y = [817, -1323, -1037, 1091, 2344, 941, -1391, -1439, 531, 1514, 181, -1983, -2113, 104, 1675, 43, -2333, -2619, -208, 1853, 1230, -1287, -2402, -203, 2211, 2104, -57, -1302, -164, 1946, 2195, 269, -1094, -145, 1443, 1737, -140, -1902, -1056, 1319, 1693, -461, -2673, -2038, 307, 1743, 280, -2290, -2294, -129, 1655, 1122, -1027, -1552, 162, 1880, 1262, -370, -845, 603, 2043, 1608, -773, -1663, 151, 2162, 1564, -933, -2613, -1200, 1577, 1736, -768, -2692, -1923, 421, 1566, 102, -1921, -1769, 474, 1627, 482, -1125, -1077, 993, 2273, 983, -1124, -1110, 1075, 2659, 1638, -1052, -1896, 96, 2223, 1548, -864, -2319, -1078, 995, 1276, -834, -2385, -1392, 660, 1112, -509, -2064, -1177, 1290, 1895, 19, -1850, -1126, 1444, 2850, 1107, -1424, -1460, 950, 2581, 1628, -770, -1707, -207, 1592, 1035, -972, -1918, -775]
2058g75J633j55j905j080J526J951j74j965j233J271K725M33k203j635Q01K286
2074A501J003j348k108P6J719J066r04j835m61J529J228j195k003j31J857J326
2090A320r18k122p05J860K179l22k160j196J186K277N45j729j385P68J746M17
2106A761j158j531M45J684M34j774j456N32J959N85j673k237L57K223J307j123
2122C35k053n33J758K003l67j966o61J265J671J64j778q16J354J473j99j827j098
2139a275J035J997J1k087j674Q04K060P23j580k027J24K066R78r89j679M6J519
2156E2J412p84j724n5J727J270p05j993n51J816J809n64k184j254J139J978L97
2173A786k094j620O63J728N13j267j398K23J711N64j199j189O12J726Q34j304
$$ y = [-775, 858, 703, -1202, -2282, -756, 1195, 1021, -944, -2177, -906, 1819, 2252, 49, -1586, -785, 1501, 2504, 1156, -952, -876, 843, 1909, 1005, -830, -1291, 238, 1466, 271, -1732, -1863, -6, 1320, 402, -1720, -2425, -565, 1614, 1292, -868, -2064, -878, 1399, 1944, 215, -1170, -402, 1344, 1761, 603, -928, -483, 1201, 1635, -139, -1595, -1063, 896, 1481, -192, -2429, -2072, 151, 1458, 335, -1718, -2251, -493, 1510, 1143, -823, -1484, -219, 1452, 1616, -162, -978, 376, 1849, 1650, -177, -1275, -240, 1757, 1768, -319, -1993, -1189, 871, 1594, 14, -2013, -1889, 177, 1155, 166, -1513, -1467, 52, 1464, 680, -1044, -1099, 628, 1898, 1193, -800, -1351, 465, 2274, 1710, -474, -1728, -589, 1389, 1786, -308, -1928, -1265, 463, 976, -291, -1689, -1466, 245, 809, -390, -1579, -967, 759, 1593, 289]
2189B89j744M03K152J274j058k015n63J631J900n90k042r72J045J462l3j559j036
2206a456Q31J381j69j482q85Q55J757J64j704j253J109J870P32j344j684J98J922
2223H42J169r53j581l78J329J017n31j489l58J045R20p31j584l26J378J410r15
2240B64j745o06J449J723J2j706j157J149J785L95j191j303L61J747N60j179j253
2257f95M07J275N28j220j581K36J742O74j241j689l05J749J367p54j961l10J354
2274d24J383q8j531p26J340J361j60j415n19R89J422Rj866j040J022J746J86j668
2292B1j672K60J918Q85j270j784j31J417J242n66j669KJ362J012n07j373j57J461
2310D51J279o01j702n18J352J691j08j959j415J030J787L00j452j655J38J677
$$ y = [289, -1455, -1052, 1100, 2374, 1316, -699, -1262, 369, 2269, 1679, -363, -1335, -290, 1172, 1139, -420, -1456, -625, 756, 587, -895, -1780, -925, 832, 996, -708, -1961, -852, 1018, 1750, 406, -1278, -1080, 842, 2011, 1058, -523, -901, 428, 1445, 914, -575, -933, 112, 1032, 301, -1283, -1609, -231, 1179, 264, -1481, -2087, -638, 1085, 1097, -609, -1766, -617, 1168, 1563, 372, -931, -570, 1177, 1737, 558, -695, -288, 987, 1515, 295, -1286, -1050, 692, 1366, 125, -1564, -1869, -120, 1247, 493, -1468, -1778, -424, 959, 871, -660, -1386, -46, 1315, 1155, -260, -779, 210, 1632, 1641, -225, -1265, -243, 1503, 1689, 21, -1651, -1391, 527, 1412, 142, -1642, -1773, -356, 886, 320, -1349, -1347, 15, 1027, 520, -853, -1010, 451, 1730, 1129, -573, -1091, 261, 1952, 1844, -115, -1530, -500, 1287, 1587, 135, -1520, -1382, 295]
2326B95P45j183j379K88J316P44r37j430L51J698Q71j088j378j02J644J542p08
2343A289j829p41J403J421J07j612j160O42J337M0j137r98N73J074J94j400q87
2360a684Q47J431L67j381j249M85J880R36j072j524L1J413J300n53j573l86J177
2377D45Q37l10j362m22Q26J066n05j529m66J058J213j53j646r54R57J704L09j346
2395b78j015L70J664N96r52j096L62J240M31p36j253K16J402M76j009j489p8J408
2413B59J103q12j826m53J258J249j2j516r67Q99J453J14j085p01O43J286K87j249
2431g0o48P97J175J58j110j341M43J744M33j257j501m9J324J001n75j635m32J150
2449c93R62k19j112n66J041J170l22j258l86J159J317j70j544p84J132J432M5
$$ y = [295, 1040, -143, -1522, -1234, 82, 826, -111, -1541, -1190, 508, 1379, 291, -1087, -1189, 455, 1997, 1289, -540, -1281, 122, 1543, 1650, 38, -1122, -480, 857, 897, -240, -1238, -665, 409, 603, -797, -1684, -837, 594, 961, -420, -1669, -1184, 696, 1632, 560, -964, -933, 480, 1780, 1227, -346, -732, 445, 1282, 972, -390, -812, 14, 1080, 575, -954, -1420, -362, 851, 698, -948, -1902, -945, 759, 1068, -278, -1293, -923, 741, 1337, 385, -711, -349, 891, 1322, 586, -667, -451, 951, 1427, 418, -1071, -1149, 259, 1362, 550, -1276, -1729, -471, 778, 766, -750, -1717, -818, 635, 749, -336, -1037, -394, 892, 1179, -70, -718, 79, 1254, 1412, 302, -1039, -596, 1148, 1581, 324, -1177, -1226, 98, 1099, 524, -1111, -1543, -393, 569, 350, -762, -1328, -287, 883, 561, -697, -1083, 76, 1393, 1223, -321, -1105, 27, 1459, 1504]
2466A504j264j283L47J504O53j245j193K1R80O68p07j154L6J139O22q71j002J11
2484a134J317J072p29j414k14J459J316l82j399r08R14J360K00j375r79M69J156
2501G29J22j131q57N65J012J11r22j031L29J525M54j102j065J44J354J063n87
2518G13j356k61J243R44k37j215n14R64R38l70j283m25R06R24l28j361p80R39
2536e59J339Mj419r45K73J627P31j035j168J97J219Q54n32j024K0J043O04o55
2554E74r23jR28Q05q34j385k39J167J016m07j518q00R21J380L3j186q08M76J215
2573D14L83r20p95N48J114J23p24p00K61J222M56j113j123L59J107P02o93j474
2591h53k77J111Q60m01j166n58P16J033k03j038k46O95Q46j11r50m43R18J245
$$ y = [1504, 240, -1043, -696, 808, 1461, 216, -977, -956, 24, 692, -15, -1169, -1133, 6, 628, -243, -1245, -1134, 183, 1255, 526, -888, -1102, 357, 1673, 1291, -108, -1016, -102, 1258, 1458, 83, -896, -427, 729, 851, -280, -1137, -572, 440, 551, -371, -1402, -1073, 452, 906, -196, -1261, -1117, 237, 1300, 713, -643, -904, 339, 1283, 1046, -169, -683, 281, 1219, 849, -434, -859, 47, 971, 643, -718, -1498, -559, 780, 784, -635, -1580, -1307, 320, 1051, 16, -1152, -955, 264, 1118, 586, -438, -418, 625, 1229, 574, -349, -350, 578, 1383, 549, -836, -1075, 92, 1108, 701, -817, -1617, -696, 684, 717, -469, -1277, -801, 414, 797, -123, -918, -370, 744, 867, 143, -557, -296, 926, 1382, 269, -854, -495, 612, 1314, 621, -853, -1130, -19, 841, 440, -726, -1284, -568, 465, 262, -776, -1022, -327, 519, 408, -542, -985, -67, 1178]
2609A178j33j131q09P41J278L60j049j296K85J051O60o73j195k48J043N09n40
2626C1j018m8R61O96n80j167N7J068R20l54j043o13R44J378Qj210p00N92R78K82
2646A182r69r48M13J071o1q02q18K44J121K08r88j116N05J012P94o01j429j27
2664a309J343R91l44j003n63R74J012o4j029l88O62O85j27r41o57P30Q95j54j175
2683d62q18M95J266L99j241j148M98J201O28o34j048m4R92R63n02q47j04P40P61
2702A095l96j067j38J062O36m17j134o90R42J074k59j293o56N75J005K60q24j032
2720a257L39J191K81n64p74K65J057M92q31p34K56J045M71o26j090k26J198P48
2738A241o08j197m61Q19Q63j89j058n10N52P61P8p95n41O36Q58L9q34m80N16J093
$$ y = [1178, 1045, -86, -895, -154, 1124, 1484, 435, -861, -576, 475, 1135, 462, -733, -981, 62, 571, 31, -987, -1035, -74, 622, 42, -1125, -1068, 0, 920, 566, -477, -1090, -146, 1232, 1240, 30, -670, -78, 900, 1182, 213, -735, -322, 749, 688, -114, -932, -688, 433, 641, -347, -1463, -958, 54, 848, 247, -1182, -1309, 34, 1025, 681, -322, -885, 89, 1101, 1037, 8, -380, 282, 967, 840, -101, -758, -28, 867, 713, -462, -1280, -785, 481, 880, -361, -1509, -1011, 190, 818, 184, -864, -908, 84, 1047, 545, -302, -406, 334, 1095, 699, -368, -506, 556, 1192, 775, -359, -1049, -107, 967, 708, -585, -1241, -666, 339, 599, -225, -1257, -918, 273, 554, -10, -784, -519, 538, 1030, 199, -535, -279, 766, 1237, 611, -479, -705, 493, 1241, 633, -564, -1025, -206, 657, 468, -590, -1100, -548, 213, 291, -504, -1045, -409, 449, 488, -346, -826, -310, 783]
2758G83K95q79r09L91J077N50p29j140l4R10O79o72q40n6M72P04m79r55j90Q62
2778a60O69l52r38l62Q55J118m9j307m75O94J161L49r02q22K22R91K60n87p94
2797d29P6Q65K62q25p34J32R13K77o92r87m6J307N71n59r20k47Q72J036j00j111
2817c39l49O69Q19J16p92n34M62Q61p8r41m90L74R07J87j063r28L49J110L05o82
2837c7j071L5Q96P99m49q98r6Q08P15k19q29j41Q05O97l22q43l84Q75O93j97j189
2858c52m77N45R79Q1r89r35L48J038K83o84q37J06Q38O34n93o52K05P45O44n41
2878C86q74O2R79P07n95j026j89P45Q74l65j010n23N39P46n6p13o63L52Q57Mo95
2899d58n44N37Q04K95q64o87N10J053L92o84r46j0J209O07n74j013j98P79N94
$$ y = [783, 1078, 199, -710, -319, 758, 1308, 579, -561, -595, 315, 994, 322, -518, -574, -102, 602, 123, -832, -1022, -160, 509, 157, -781, -1143, -288, 830, 781, -526, -1001, -307, 854, 1203, 301, -521, -299, 692, 952, 365, -429, -353, 512, 774, -51, -785, -653, 260, 537, -155, -1142, -1188, 119, 690, 131, -789, -1036, -164, 872, 772, -339, -688, -19, 800, 916, 124, -410, 52, 913, 835, -106, -596, -222, 685, 872, -191, -1119, -770, 340, 645, -37, -1108, -1073, -177, 622, 173, -725, -821, -13, 702, 483, -346, -487, 318, 1015, 693, -150, -534, 341, 1034, 837, -352, -829, -284, 695, 776, -213, -1148, -800, 238, 521, -163, -1000, -894, -56, 578, -15, -667, -462, 283, 927, 386, -488, -426, 553, 1260, 665, -361, -550, 195, 1069, 704, -306, -829, -290, 456, 400, -313, -976, -624, 233, 237, -458, -1002, -465, 339, 634, -230, -917, -407, 646, 1038, 354, -592, -602, 607, 1214, 640, -373, -571, 208, 802]
2918H02l11q99k72N16O61l60q08k45O42P56k02r68l94P69R03R8r17o76N57J066
2938G18L71o71p57L8P29N92o26p34J2O92K94n12p70j01P88N90o30r27j14P10R23
2959F15j95j020m82P79Q54J26o65n93K73R39K48p56m98L71O88K08q18o15K27Q94
2979E80J71o63r35k7Q80O30o47q86o7O55Q43k40o83m56P17P24q8o49k94N15O72
3000G52Q3q40k96L20Q12O4q23q09L14Q60K48q37o75J4Q01M52m18p51%O18N10k86
3022A13o97J8P42O06m12p02j08P06O42j18q30n39O65P29l9p15p78L44P51J07o26
3043a41n57J87M70K66m79m98K34P80Q8l22p38K33Q75M96n14q12J6O97P41l06q66
3064a50l18N12O48j57o70n37M77M94Op79m58O09N71Q8o85o11M56Q48K50o36n88
$$ y = [802, 491, -408, -680, -164, 497, 137, -671, -916, -274, 482, 280, -688, -1082, -313, 590, 688, -229, -905, -348, 718, 1089, 418, -339, -301, 428, 1020, 394, -340, -328, 364, 658, 146, -624, -725, 63, 653, 23, -904, -1018, -308, 615, 420, -600, -1082, -303, 551, 677, 12, -581, -308, 631, 879, 123, -375, -4, 684, 892, 74, -541, -314, 580, 751, 88, -847, -874, 6, 636, -11, -897, -964, -309, 534, 294, -389, -845, -128, 596, 508, -141, -435, 80, 752, 835, -5, -301, 19, 831, 895, 72, -737, -423, 437, 685, -152, -827, -813, -12, 440, 22, -729, -729, -111, 399, 113, -584, -566, 176, 782, 370, -332, -440, 266, 908, 790, -40, -579, 86, 815, 776, 61, -717, -373, 378, 485, -141, -698, -511, -41, 225, -254, -752, -518, 262, 350, 28, -710, -477, 398, 894, 380, -432, -416, 281, 1022, 716, -150, -468, 44, 692, 535, -135, -672, -195, 299, 305, -474, -932, -323, 248, 336, -349, -960, -504, 344, 594, -42, -630]
3085f30J73Q85N35n43p63N4P21M30l66o16k28N48M71m52o14k15N85N86k92r86
3105g17k45O24P51r9o66m61L98Q51J97o76m27K91O37K54l86o94L41O21J96m87
3125C03o79J20N57L53m87q17l4N63O39k84q16m26O87P47j14o34k50K79P06J07
3145E20o51l43N74O53p3o20m97M48P07J54p46o36J06P45L85o44p26j31P06M22
3165C53l14n69j96O14M50k84m80o1N11N59j90o84k42O96O23j80o59m11M40O95
3185F71J24p68n49Q2O75K26n48o20R3O86J56l91n98J73O03M11l85o70J19P16N49
3206G55k78p64k41P26N45o0o76m33K80O37J13p15l87L07M71j11m75l95K10P61
3226B70Q2o32m98K79O27M25m37o35k0P69N18k74m91l19N57M24j94n59j40L87M50
$$ y = [-630, -457, 428, 963, 420, -343, -289, 432, 862, 496, -120, -348, 200, 671, 219, -395, -610, -25, 561, 269, -717, -962, -338, 413, 314, -352, -813, -415, 436, 633, -43, -470, -179, 458, 712, 326, -368, -27, 594, 790, 303, -376, -256, 301, 654, 167, -650, -684, -121, 518, 234, -582, -1008, -321, 426, 312, -322, -572, -293, 413, 520, -131, -474, 100, 753, 680, 60, -437, 11, 718, 872, 126, -510, -404, 341, 726, 82, -644, -775, -69, 353, 39, -530, -726, -112, 338, 54, -426, -487, 24, 583, 393, -291, -533, 163, 786, 606, -53, -464, -24, 671, 795, 27, -522, -440, 235, 461, -87, -707, -614, 72, 228, -163, -761, -588, 15, 426, 41, -629, -510, 206, 755, 477, -287, -528, 198, 743, 683, 7, -426, -146, 491, 604, -111, -498, -191, 280, 169, -306, -701, -491, 270, 352, -280, -778, -499, 128, 553, 116, -519, -539, 230, 748, 474, -17, -336, 221, 645, 451, -108, -248, 139, 589]
3247E89k55p03k11N70L92j64o53l67L63O48J53n32o60L35O40M22m25n81J48O85
3267C94J99m64k97l1N63L24l44p16M9O34K67m28o60k08O40M86k58n25k68K48O23
3288B28R9n17l89K97O21L1l97l54L05O64pn27m73M13N79J69n52p41J97M95M10
3309E51l65o44j22L83M74j63o04j32M45M90j69n15j62N11N63j56n29k14L31O08
3329E81J67n62n30J04O50K31m32o39O3N41K81m72n15RM66L45m19m66J16M56M96
3350D71l99n36n5N63N84j62o06l38N34N11R3n73m10K70M61P8m98k88R3M59J08
3371C60n66m08K06M93K25m69n49J26O63L32k52n11j36M82O24j14n89l5K78M12
3391E72q3n54j36K54M18r2o36k58L33N56p1o21m22K36O85J22m26m07kN84K75k58
$$ y = [589, 334, -369, -580, -10, 382, 218, -435, -802, -439, 209, 362, -170, -830, -495, 145, 567, 142, -439, -291, 394, 593, 129, -168, -199, 364, 688, 344, -372, -323, 311, 578, 150, -510, -718, -78, 408, 150, -375, -643, -395, 228, 327, -190, -579, -282, 339, 370, -27, -381, -76, 588, 581, 54, -419, -6, 573, 742, 190, -551, -354, 141, 551, 186, -458, -580, -197, 277, 114, -490, -622, -177, 313, 144, -371, -533, -22, 541, 385, -144, -358, -27, 581, 748, 186, -344, -240, 410, 641, 209, -430, -367, 174, 455, -17, -532, -523, -57, 288, -131, -597, -481, -25, 471, 72, -464, -519, 44, 628, 466, -140, -478, 56, 567, 660, 87, -323, -53, 408, 486, -12, -300, -207, 252, 360, -206, -614, -408, 85, 310, -159, -708, -582, 81, 413, 161, -350, -486, -4, 620, 506, -83, -118, 160, 572, 489, -65, -201, 53, 471, 379, -257, -515, -182, 374, 303, -318, -740, -504, 181, 303, -123, -530, -532, 52, 327, 69]
3413F9l84L1M46M38l50l96L0M52K12k58n46j09M45M62l35n85k90M42M81N9n33
3434b19n21K61N93K7k94k56M8N56K36m41k88K55M07K38l19n72K03N54J97l47n66
3455b48r8M21L70j83n79j25K45M08j5m85k69L29M62j80k53k13K37N71P7n60l86
3476d74L45O69J17m41m74L0N41K64l35m95m7L79J80j19n03r9L70K66j25m17k06
3497e74M93M28k24m40j39L78O08o6m35l10L52M25M5k97m35K4M92O4l17l19j5M06
3519A44J47l07n62R6N41K28l36m89r1O00M47j43n31j32L54M77k3l94j90J93M14
3540D43n8k78k68J15N23j17l52l50Q3M30J36l63n18R7N88K00l87l65r7M59L92
3561C13r7m16n4M08K65n8l22j81L69L28j19m83k95L97L28K6n39l83J57N01J01
$$ y = [69, -315, -284, 162, 600, 250, -146, -116, 336, 548, 290, -256, -365, 80, 542, 207, -378, -668, -226, 255, 314, -219, -740, -479, 114, 141, -153, -409, -361, 195, 431, -10, -298, -43, 364, 602, 283, -289, -86, 468, 665, 318, -248, -346, 75, 445, 262, -317, -442, -197, 211, 196, -289, -558, -229, 233, 53, -200, -413, -176, 395, 472, -88, -474, -129, 540, 657, 216, -258, -228, 313, 577, 242, -253, -300, 79, 259, 140, -363, -462, -92, 174, 49, -368, -574, -81, 347, 123, -317, -456, -78, 530, 464, 29, -281, 71, 496, 541, 244, -191, -167, 325, 389, 72, -247, -262, 144, 291, -16, -578, -482, 59, 287, -49, -538, -629, -29, 418, 275, -256, -388, -34, 443, 420, 26, -164, 29, 443, 385, 107, -161, -46, 477, 360, 8, -342, -259, 171, 307, -56, -574, -477, 111, 311, -76, -441, -538, -79, 313, 216, -200, -254, 154, 419, 361, 39, -142, 227, 555, 436, -47, -342, 55, 383, 409, -130, -513, -356, 145, 246]
3582B46m27l48J29M00J86k70k54J24K90K81l30k87J43L82K94l36m26p9L82N18
3602F18k51m64k32L21L64j6n05j35P1L26Km19n2J31K75J65m19l39M28M69K2l36
3624B4k44M3O52J04k90m35m9L66K71j48m92K7K02K00k25k33k35K68L97l21l18
3645d36k9K56M11k5l00m22L54N51J15k24m63R6M72J39k53l19O1J99K00k58l01
3666a76j31M13J94k53m92L4L02M30j84n89p8M38L80j8l77j78K38L93qk64j88J02
3688a2L70L4k75l18J86K43J27m27k63pM41J57l10l83k5L27K86r5m51j9L33J89
3710A08N2k92qK07L12j5m47n7K31L22nm15l02K82M00Nl79m07N0M70J27k97k93
3733c51k3L49J41o2l09pL10K47j68k78J4K51L82j96m02o5L05K81j8l80m09K97
$$ y = [246, -181, -529, -400, 0, 186, -84, -338, -214, 76, 357, 27, -260, -117, 265, 559, 223, -203, -282, 100, 618, 367, -97, -329, -8, 356, 340, -165, -300, -229, 97, 99, -320, -372, -241, 34, 199, -220, -559, -131, 338, 360, 24, -220, -177, 475, 579, 289, -146, -195, 171, 442, 294, -198, -171, 31, 231, 6, -227, -462, -194, 203, -118, -436, -465, -209, 202, 177, -123, -545, -191, 360, 475, 251, -212, -116, 356, 495, 242, -77, -16, 183, 383, 125, -176, -307, 106, 300, 47, -445, -411, -109, 321, 137, -452, -530, -92, 288, 270, -107, -285, -47, 346, 338, 74, -114, -12, 358, 392, 117, -201, -15, 228, 355, -72, -335, -342, 99, 256, -54, -437, -462, -135, 151, 56, -395, -414, -81, 108, 160, -132, -140, 67, 379, 364, -83, -140, 91, 413, 408, -7, -309, -27, 373, 378, -1, -408, -358, 112, 239, -58, -351, -374, -25, 116, 54, -255, -262, 48, 295, 127, -151, -137, 114, 496, 300, -102, -167, 138, 419, 401, 21, -388, -91]
3755i1L27J07m55k41O1K90O6l03j82J62K95J22k73l12K64K78L14m11j29j09L83
3776A63L25n7n01k29M18L14j45k34k11L6L17q0k92j72L2M87o9l82j76J06N66M5
3798B61l35l44J92L46K91j79l50O1K29J67J8l83o2K95J10j11l56r8K03K49p4m93
3820c63j10L04K70ol46k24J90L82J83l84j71K02K86O3j34k32L1L36l0j97k21Q7
3842h4L42J55l56l05l4K56K77j85m18j07J37M42n4k38k48K32L87m4j85j45K53
3863G8K52l0k03l10L12L08K7l17k31K5K13K52k13m51j7K40K22o5m33n1K95K42
3885A45q9k68m4K47K17l8l16o5K22L52K5l81j10R2L40K3k62k78n6L08J58j65m24
3908c67J16L14K6j13k20j07L69J16n2l24J9K88K30l2m26K1J66L87j04k48r5J61
$$ y = [-91, 236, 343, -112, -353, -292, -2, 64, -239, -421, -259, 36, 158, -115, -427, -163, 115, 429, 18, -111, -220, 163, 488, 431, -70, -299, 119, 433, 288, 54, -157, -121, 196, 116, -176, -348, -316, 171, 102, -280, -456, -350, 216, 261, -74, -418, -226, 120, 411, 232, -118, -57, 172, 339, 357, -26, -88, 207, 317, 206, -150, -248, -45, 204, 130, -363, -473, -169, 101, 95, -251, -475, -285, 97, 280, -104, -275, -73, 213, 276, 142, -90, -59, 277, 247, 50, -171, -84, 258, 413, 57, -248, -282, -26, 251, 66, -352, -459, -322, 120, 66, -172, -420, -188, 199, 155, -30, -175, 78, 330, 300, 97, -213, 99, 407, 434, 117, -114, -89, 124, 376, 163, -288, -305, -65, 157, 92, -341, -392, -97, 145, 56, -212, -256, -9, 208, 170, -146, -211, 11, 363, 388, 7, -103, -11, 329, 352, 90, -188, -244, 64, 222, 57, -367, -251, 63, 89, -24, -244, -351, 18, 134, 82, -242, -223, 65, 295, 263, -163, -142, 24, 411, 307, 59, -36, 125]
3930A25J59o2k26j35O2K37L3k84k83J77K30R8k99j93O6L59Q3j77j76N0K63J51
3952B58o0k60q0J55L27m0l07l6J60J25J7l54j10J64L47k77k15k17J04M20J12l94
3974a61k55R4L61K30j59k39M3K73R1j22j98P7K06J35j59l53j7L52J10k64j88k28
3996c71K82L40j78l02j69K17J67J34j81k25J58J83J38j74k09J93L00pk00j81J59
4017G4J35J99k75l14N0K20K21j86l25o8J99K83j66j96j00J46J62M6k63o1J34J58
4039G3J77l36j23J55L80N8l40j97R4K95J22k14k83k2J82J27m7k96L8P2J28m5k54
4062b56l1K30K00j49k08n1K15L49m3k94j37Q3M32J32l43k29J43J11J11k28k20
4083a83M6K18J88k94l31K06J04K83k95l02O8L58J00q5k21j24K29L01J7k82o3K5
$$ y = [125, 284, 222, -4, -139, -77, 160, 193, -91, -374, -197, 33, 131, -168, -361, -295, 64, 147, -30, -206, -156, 107, 258, 198, -62, -142, 13, 340, 300, -7, -43, 117, 242, 259, -95, -205, -41, 306, 29, -186, -403, -299, 121, 233, -161, -416, -322, 39, 269, 110, -129, -86, 187, 278, 156, -42, 35, 241, 376, 217, -136, -153, 199, 309, 45, -143, -371, -89, 251, 73, -229, -398, -181, -14, 120, -61, -286, -128, 55, 193, 19, -190, 3, 303, 296, 96, -85, 74, 209, 408, 133, -181, -131, 89, 310, 124, -201, -269, -70, 213, 47, -149, -249, -103, 59, 105, -158, -219, -85, 73, 250, -86, -209, -54, 326, 384, 44, -153, -59, 236, 358, 144, -139, -161, 21, 148, 101, -195, -157, -85, 43, -2, -256, -287, -57, 143, -6, -214, -265, -50, 299, 256, -38, -175, -92, 340, 472, 129, -100, 43, 154, 265, 37, -183, -137, 81, 269, -25, -356, -150, -46, 237, -58, -360, -292, 66, 166, 81, -140, -264, -35, 266, 283, 1, -62, -37]
4105c7K64R2k72j20J73J36K5k72k93R8K83O9j94l36J30K76J11k55j85N8K09K52
4127B12k04j66L4J68K55q7l04L8K25J71j48k19q6J62J55n6k33j56J70J88M1k59
4149i9k09Q4K03J29k63j18J1K28J93j70j27J03K44J46j35k34J7J83M8n9j37j97
4171a59J65K91j54k42j10K2K20K4k02j26J22J60R5k26j20J76K32Q8k38j86N1L63
4193B46M9j96j49J5J93J33j03k76r0J01L07j69k12o6O7K36j11j53j62K43J68l5
4215C6j31j83K15K30J22k93r7K4K48J49j21l02k8K07K23j42k65M9R5J19j96k60
4237c01M0L02J15j65j41r8J35L47o8l05j40J47K30K43k81q8L8K00Q3k51r5Q7J58
4260A92j5j80j60M4J74R8j32l30n2K99J84j43j78j03K16K10k6j91j06K30J15R0
$$ y = [-37, 227, 319, 47, -73, 100, 236, 261, -11, -304, -206, 77, 146, -48, -384, -254, 22, 133, -122, -307, -249, -40, 212, 8, -158, -124, 44, 299, 212, -92, -54, 171, 342, 194, -25, -111, 51, 206, 150, -83, -239, -69, 119, 160, -99, -308, -224, -21, 108, -155, -273, -262, -34, 159, -11, -138, -35, 209, 355, 220, -14, 3, 186, 234, 175, 38, -159, 6, 297, 143, -99, -209, -187, 33, 57, -145, -271, -149, 11, 106, -120, -240, -64, 168, 256, 18, -168, -117, 246, 295, 99, -50, -35, 158, 291, 188, -88, -178, -77, 230, 61, -151, -217, -150, 86, -25, -178, -340, -97, 71, 36, -95, -278, -63, 167, 289, -4, -101, -77, 171, 320, 199, -103, -131, 76, 299, 157, -108, -59, 36, 155, -41, -301, -261, 41, 156, -9, -150, -248, -113, 234, 166, -139, -279, -132, 98, 341, 60, -28, 10, 210, 293, 42, -53, 34, 192, 177, -3, -163, -119, 55, 153, 21, -309, -361, -62, 122, -21, -199, -302, -86, 124, 98, -93, -199, 31, 146, 236]
4282B36k69k0J74J77q6k29n5O8J78O1l05p8j28K66R4j26j11p9K68P4j86j01q7
4305b64K38J88j27j57P2K14N8l3k50j3J15K19K0l17m4M9J88J2k15j82K8K58k2
4328C5j72o7P0J63Q3j10j96N6L08qj31j04n4K58K43k04j81q5J56K68k2l13k27
4351b34J14K38q5j17j60K6L11l7k70j30K57J54lj05k35J93K49O3j29j43j4J53
4373I6K41j62k47K7J37J65j40j43j93J29K27o3k38m4J07J72j2k42k03K44K33J33
4395B24k79j05J34K14m7j12j07Q7J78M3j03k07N4J69Q3j95k27L3J95K05k89j81
4417b33r9J85K95q5k65q9J23K88M4j62j75R8K23J04k08n9N5K08O7k89j35Q5J57
4440A33M6j67k52J03M8K13j17j84r0J77J83l3j80o9J42K42j50j38M1J06J17L2
$$ y = [236, -33, -53, 121, 298, 212, -17, -72, -4, 174, 235, -70, -148, -276, -10, 84, -42, -153, -232, 36, 110, -76, -177, -264, -26, 162, 35, -122, -50, 164, 222, 189, -61, -74, 41, 260, 280, -37, -81, -32, 156, 168, -47, -229, -201, 57, 35, -137, -204, -134, 29, 112, 2, -194, -138, 170, 162, 31, -73, -127, 131, 374, 170, -11, -96, 60, 328, 306, -7, -234, -120, 118, 33, -84, -244, -218, 93, 56, -214, -344, -87, 67, 64, -41, -276, -83, 166, 229, 100, -43, -57, 96, 337, 175, -72, -45, 92, 257, 117, -26, -219, -90, 137, 74, -164, -208, -101, 71, 59, -183, -386, -142, 91, 224, -55, -160, -26, 188, 141, 29, -78, 9, 187, 230, 127, -80, -26, 143, 226, 31, -196, -163, 32, 237, -52, -233, -332, -147, 148, 63, -202, -291, -168, 120, 164, 2, -173, -75, 148, 252, 44, -15, 40, 248, 315, 26, -109, -24, 133, 179, 12, -240, -137, -89, 124, 7, -177, -267, -90, 93, 60, -120, -189, -47, 195, 45, -93, -52, 54, 171, 203]
4462B03j67j49Q6K17O5j95j84M2Q5J50j99p1k3O6K36k10q3j4Q1J17n4j17l9K40
4486H3K04j26j88j47J98K21Rk70j21J28K11K6j33k33M1K26j2k46m9N5K01M2j91
4509g1k09J03K40nj37j24k6K96J85j63p7q7K09P8K5k13p6J71J44j90j26OJ1J31
4533I5qk50q1J09J45P0k19j70O7L16J18j92o1oJ40J83j05j02o3J64J06J5k52p8
4557e9J72M6n8j84J6O1J34q3j82j05K1L07k8p2k13P3J63J89k73p1J15J53R5j2
4581B05k16n4K86k2j24j58j0K12J07j62k48J2J12Q7qj49j47J09K97k8j61j07J15
4604e2J78M1j27r6R1K34P8l00p3O2N5J30k04p1p7J63J77j46k63l0J75J06o7j66
4628a82j07J98K57j50o0j38J32K46K8k70l1J23J09R0j40j70PK50Q4j78j78l3J60
$$ y = [203, 36, -113, -27, 190, 255, 60, -124, -82, 3, 153, -46, -117, -140, -74, 162, -48, -131, -145, -64, 53, -1, -118, -157, 83, 287, 161, -27, -174, 24, 245, 254, -16, -137, -9, 202, 228, 95, -138, -97, 129, 117, -129, -178, -123, 78, 120, -71, -280, -177, 63, 58, -79, -203, -229, 67, 252, 89, 12, -75, 134, 212, 237, 24, -52, 119, 263, 73, -53, -47, -36, 95, 87, -163, -244, -135, 10, 80, -139, -309, -242, 74, 192, 0, -61, -67, 73, 256, 151, 49, -14, 150, 256, 271, 19, -59, 113, 159, 101, -83, -67, -6, 128, 45, -137, -242, -221, 86, 58, -14, -227, -154, 9, 198, -75, -146, -31, 122, 217, 205, -11, -65, 221, 199, 75, -83, -93, 119, 226, 64, -184, -172, -60, 27, 19, -130, -277, -168, 129, 101, -60, -167, -52, 126, 167, 40, -56, 35, 269, 347, 47, -26, 36, 91, 221, 17, -54, -131, 32, 209, 63, -200, -230, -55, 51, -16, -182, -289, -91, 166, 16, -44, -182, -50, 196, 224, -46, -77, 46, 155, 245, 105, -65, -58, 192, 276, 98, -80, -113, 47]
4651D7Rn5j89R2R0L6j02j27P3O7K06j11k20M1R7K10N1k25o9M5K11m8j29r0J05
4676A5J18k9p6k42O1J68P0j96j42L6K88L3j76j61n7L57Pj3j52KJ00J44M4k45J3
4701c3J65M9J7j80l6M0J44l5r8k21P3K13Jj96j67N4J72J66k14j15L6K00Qk9j06
4726i2J9J83K4j18Jn5J19J18j16j29q8J75J71j19j69r7nJ67J06j89j44R0J51J7
4750B0n1r2NK49k3p7j28J03J44J49k10j24l4J75J20o1j83r9M9J43o0q1j19J81
4774dL4l6q3j39J03J45M3j88r1K00P8P2r6j38%K44J30j41k00M0Q3J41p9j29j20
4799a31J25J06j73p8L4P0J18l4k21O9K0J75K3j84J4R1R8O3j25j22K2K13ro8o3
4824C3o5Q6J06j12j70r4K88j0j23j45PJ77J72j80j72j00K11J51O5n8j09l9K83
$$ y = [47, 56, 1, -188, -96, -6, 30, -72, -199, -126, -59, 147, 36, -184, -143, -46, 164, 215, -10, -79, -34, 177, 129, 0, -90, 15, 133, 104, 28, -214, -153, 15, 85, -111, -253, -217, 71, 104, -72, -233, -290, 67, 74, 61, -91, -89, 11, 155, 199, -46, -33, 132, 181, 198, 18, -18, 22, 166, 131, 33, -188, -115, 98, 99, -97, -264, -210, -38, 128, -86, -201, -165, 35, 43, 14, -92, -73, 110, 134, 16, 17, -38, 81, 199, 83, -46, -134, 41, 212, 93, -76, -173, -178, -11, 95, -94, -238, -148, 3, 20, -31, -123, -118, 131, 108, 31, -97, 6, 150, 299, 89, -35, -69, 106, 226, 165, -18, -117, -68, 75, 15, -66, -185, -4, 30, -6, -89, -228, -125, 20, 63, -125, -216, -16, 62, 134, 38, -100, -100, 144, 274, 133, -67, -27, 56, 197, 118, -11, -131, -6, 100, -73, -151, -117, -47, 71, 37, -184, -115, -95, 80, 103, -81, -67, 24, 122, 185, 60, -62, -40, 173, 164, 96, 33, -32, 54, 160, 48, -122, -216, 72, 62, -61, -206, -199, -22, 150, -30, -202, -302, -91, 60, 125, 67, -42, -81, 202]
4847B02n1j70M3%J75m9j54q5L7K38j18j04j38r9K80P1r9j57n7J47J04J6j87N6
4871i9R1K10j26j72L4K32P2n7k38k6R5K16k7k29o5PJ09J21k69nP8R8J4p1j81O2
4897a26J26L2j03l4M7J49O8j24j04rJ61Q0K6j68j32K96Q5r0j32j75R4J28j8j18
4921d1j26M6J19l0j41j02J28K10l2j36m9O5K53j2p6k39L0J85J11M9j81j06J56
4944H1O6J8k51n5J31R5Q5k73m2M7J27n5m1j78J08K41Q4l01k6J51J11J05k31p9
4968h2L2J85J38k03j59J8J13J14p5j10j72J89J45j12k51j0J56J86q0j65kM8J76
4991G9K9j66o0K8K00K5k9j78N2J89J6j92j46J51J30O9j91j99Q8J36O2m4j99nJ52
5016cQ6j31j13O9J08K5J8j45j8J76J95j84p7j04J21J77N0k47l4n2J84J70k59k23
$$ y = [202, 151, -19, 24, 24, 199, 150, -4, -89, -52, 186, 68, -36, -174, -273, 7, 78, -21, -178, -235, -88, 16, 32, -155, -99, -8, 202, 76, -96, -62, 170, 242, 185, -53, -79, 16, 232, 205, -24, -89, -82, 27, 148, -121, -126, -48, 50, 64, -7, -188, -126, 0, 32, -71, -105, -58, 91, 159, 35, -69, -78, 83, 163, 189, 21, -111, 185, 270, 180, 48, -127, -33, 95, 77, -41, -167, -121, -2, -32, -173, -275, -147, 63, 31, -105, -154, -89, 164, 152, 76, -163, -133, 52, 163, 212, 31, -75, 81, 147, 165, -86, -141, -10, 85, 170, -103, -145, -98, 29, -26, -67, -245, -137, 104, 188, -113, -139, 12, 123, 228, -3, -82, -50, 135, 273, 70, -89, -71, 42, 156, 81, -29, -201, -12, 133, 21, -230, -240, -84, 102, 22, -143, -145, -97, 79, 108, -58, -118, -90, 110, 135, 106, -72, -20, 169, 185, -7, -153, -2, 128, 197, 6, -193, -105, 31, 93, 49, -150, -155, -3, 83, -48, -161, -92, 16, 41, 59, -86, -104, 72, 267, 83, 6, -98, 23, 200, 250, 3, -31, -83, 101, 271, 12, -211]
5040b11P3J77k5j20o5j6J37J05m3j48O6J80P4p3j59l7J76N2kJ7k06R9J79J7j30
5065A17k39J05J18p8j05o4j0Q5P8j29M9K7J17N2j66q1N4J80J7Nk14J5J27J67K4
5090B51k38p1R3J08Rj34k34J17K13m7j19j47j7K61j6j92p6J25J26O9q6j56Q5J68
5114I2K3M9j86j00K58O0q5j49OK15j06J0j66r9J84J16j64n7j71M1K89m2q5j01
5138a68P3J46P8j83p2J32J07O7o7j53J31N5P6j18k03N2J20J26j53j64p9J71J82
5161A56j36j43k8N2J28j9j2j89O9K55J9j62Q5m8P0J38j79j77J90Q5O2j31k31L3
5185a13O2K33j16k12p5J47J93j51j56PJ86L7n2r4n2R3J93j1j90m9K27R2K3j87
5209C5o9O9K00k7j59j49lJ26J57j36j73k5J30J00j67q3j15K58J02j12m9l3J78
$$ y = [-211, -138, 39, 14, -106, -171, -187, -50, 55, 12, -136, -70, 110, 184, 111, -48, -85, 91, 143, 141, 158, -48, 51, 230, 247, 117, -122, -17, 101, 23, -82, -146, -156, -71, 7, -122, -73, -46, 71, 123, -43, -124, -70, 110, 127, 132, -82, -67, 60, 227, 251, 13, -58, 35, 143, 152, 18, -216, -99, 114, 67, -52, -199, -216, 45, 29, -163, -239, -114, 12, 81, -5, -161, -76, 92, 115, 164, -22, -122, 136, 196, 111, -38, -32, 183, 77, 87, -79, -178, 6, 122, -42, -99, -270, -229, 60, 18, -67, -168, -95, 51, 129, -54, -126, 6, 113, 180, 113, -40, 91, 146, 222, 104, -99, -47, 73, 199, 46, -118, -197, -26, 156, 20, -123, -151, -99, 29, 10, -2, -191, -122, 133, 152, -10, 75, 27, 97, 235, 56, -121, 69, 154, 216, 85, -146, -113, -51, 182, 66, -146, -221, -74, 119, -32, -188, -181, 5, 42, -10, -104, -156, -63, 130, 119, -71, -120, 107, 199, 222, 35, -34, 35, 235, 208, 49, -100, -103, 23, 180, 44, -129, -154, -24, 76, -91, -174, -289, -31, 71, -41, -90, -123, 55]
5232E5P7j0k19L0R4J52N1j57j05QR4L1j38j15L5J98k5j52j29n8K35K12j93k34
5256b63N1K79P1r5j67j0K08M8j5j03n2J56O4r6l8j52J17K32j22j88l4M7J53j4
5280G7j58j55M2K10L2l1j51p4K35J64j14r6q7J89N6n4j96O8K14J1o6j62q4J77
5304D7J38j48j91r4J08J61J4p6j51Q8J28o1K1j26J61J00Rj55j46J94J76Kj52j18
5328g1R1J51Q6j51j09j68K37N5j13j09q3M2J99j13J8j17J23R5o6r4j2N6J60Jj72
5353f4L9l0K55J02k19j66o1K79J2m4j92n8J60O9j4l11P8J10L6Pk14O1R2J21P3
5378A21j83o6P9K22j3j24j55J13K71k08Kj24J54P8m9j04j15O3P4J7r9o4J9K7J83
5403A19k10on1J15J45m7j29J2O0J79j03n6l7J5J59n5j21m4O0P8N7j99j01J7J84
$$ y = [55, 132, 122, -97, -67, 27, 179, 230, 73, -32, -24, 70, 101, -37, -152, -117, 81, 56, -96, -225, -283, -48, 164, -29, -263, -212, 67, 138, 43, -124, -134, 74, 122, 107, 4, -48, 108, 172, 76, 38, -114, 3, 235, 113, -75, -109, -62, 91, 77, -81, -236, -194, 16, 48, 17, -134, -208, 27, 191, 77, -19, -106, 83, 139, 85, -111, -43, 171, 182, 116, -46, -130, 47, 185, 37, -154, -248, -140, 21, 35, -41, -192, -104, 24, -37, -16, -142, 19, 119, 128, -27, -173, 21, 197, 199, 47, -71, 20, 171, 257, 106, -3, -171, 66, 121, 8, -101, -184, -142, 57, -56, -38, -155, -32, 63, -3, -97, -109, -53, 107, 108, -64, -25, -55, 200, 302, 83, -83, -144, 135, 147, 103, -89, -147, 13, 82, 68, -243, -165, -55, -19, -12, -226, -165, -73, 48, 121, -62, -128, -49, 173, 160, 36, -119, -6, 265, 57, 59, -65, 89, 167, 118, 14, -101, -38, 36, 53, -46, -110, -91, -64, 119, -91, -97, -148, -33, 112, 65, -64, -52, 8, 187, 84, 28, -9, 6, 165, 110, -11, -55, 5, 83, 140, -59, -160, -143, 41]
5428D1L4n5j89k9J83O1p2j61P8J22P8ok51J35J44J20j58oj01J16J15nj64Nk7J67
5454A75o0j50k26J68J26l5Kj51l0K25R0k44r0J18J54ljp5l9J45J14j17n7r8J48
5479H9J21j05j30o3J32R6o2j73j2O4Q0m2l7k1L2RP5k13RQ1J16Qj2j90J45J76M2
5506B15j49k18J79K9P3n0k13%J19J11l0j67ON3J33j03j57k4Q9J91j7j34j00J42
5530b2J56J01k08n3J12K1J43j55j09l8J64p2J8k11M7J57j0k7j59o8J88L3k0r1
5554a03r2J72J31j32jj39P3K00N9j99PL4R7O1j07j48J00J16R0j12k58J6J48J48
5578A61k37p6OJ55J80k12o1n5J44Q0J1j42l7J27J08l4j59J6N5J86j12j26n8K3
5602e7K20q0j87n5J48N6O3j32j43q2K61M3j10o1l3J54J31j44o0K4J07J01lr1l3
$$ y = [41, 75, 20, -169, -198, -15, 46, -26, -187, -109, 13, 91, 85, -166, -31, 113, 233, 75, 69, -32, 84, 199, 194, 30, 35, 8, 175, 115, -35, -261, -93, 33, -2, 0, -151, -181, 44, 134, -110, -200, -82, 72, 69, 68, -7, -46, 99, 213, 96, 39, -59, 89, 210, 105, -25, -88, 44, 140, 78, -95, -107, -43, 37, -5, -42, -63, -31, -22, 53, -160, -151, -70, 46, 54, 42, -148, -3, 173, 215, 66, -152, 27, 56, 129, 79, -134, -134, -15, 96, 66, -101, -95, -42, 91, -12, -169, -193, -104, 87, 70, -64, -164, -22, 134, 235, 27, -26, 86, 107, 250, 95, -14, -52, 112, 40, 58, -153, -106, 51, 41, 14, -145, -213, -25, 8, -12, -103, -195, -23, 108, -24, -25, -164, -91, 109, 168, -31, -24, 10, 107, 168, 61, -87, 13, 129, 219, 107, -151, -135, 13, 161, -76, -152, -146, 9, 189, -23, -84, -139, 5, 85, 96, -46, -83, 44, 152, 118, -41, -25, 30, 216, 104, -22, -80, -57, 163, 83, -104, -159, -11, 45, 108, -24, -167, -249, 12, 55, -55, -116, -149, 5, 136, -8, -68, -44, 63, 164, 161, 70, 37]
5627C7K4P9L6j80m7R9J4m6j28lL6J11Qj82r7N6J93N8j30j23R7J80J10j37j54O6
5653b3J43J43j78j34l1J87N7n8j25n9J19P6j31r5J4oN7j1j64r6K65R4J6m8j61
5678a49J12J69Kj18j22M1K19m9M9j54mJ19JL6k25lJ12O3j66j08M0J25P6r6j98
5703b28JJ99L0Q8k65qJ65J47j0Rk49P6K21m2q0j15oJ67m4j11j06NJ92j7Q7k45
5729a39k6R3J14o9p8L9KK03pj76m6K23nP9k03K1L8J26Lj74j27O1J40j3J9k14k4
5756a40J26N6q1j16r5K28L4j9j11l2K02n2P3j84R1Q4J80m4k32j3M4K53j50pj79
5781h4J02P2J0q2k00K8J65L6j51p8Q1Q6L8Kk72J69J52ql1l3j02K12Q0j1j45p3
5807c7KJ55M4j57m3L3J10k8j10j80K1K18p5r1p2M4J64N9j31r3M9J68P1K4j53l5
$$ y = [37, 61, 140, 176, -4, -51, 48, 62, 16, -112, -115, -79, 32, 40, -142, -239, -183, 10, 68, -62, -185, -88, 92, 202, 65, -89, -23, 120, 263, 85, -49, -80, 107, 164, 106, -19, -78, 41, 117, -14, -109, -95, -101, -44, -55, -219, -315, -50, 44, 60, 12, -149, -37, 132, 134, 16, -106, -65, 154, 105, 154, 0, -4, 115, 116, 152, -73, -76, 36, 99, -67, -175, -135, -10, 66, -30, -228, -227, -28, 2, 90, -175, -183, -18, 129, 119, 128, -121, -45, 176, 134, 54, -61, -67, 100, 56, -55, -161, -156, 36, 19, 106, -139, -165, -72, 42, -27, -105, -66, -64, 139, 132, -44, -90, 133, 128, 207, 4, 25, 63, 189, 192, 18, -109, -48, 92, 79, 98, -116, -140, -14, 42, -39, -155, -250, -22, 12, -7, -118, -150, 52, 0, 73, -111, -20, 64, 244, 200, -32, -45, -1, 252, 102, 95, -84, 18, 90, 100, 18, -182, -154, 11, 47, -104, -182, -101, -15, 23, 25, -247, -78, 74, 66, 35, 2, -100, 112, 192, 181, 36, -37, -35, 120, 164, 7, -36, -3, 107, 79, -31, -211, -190, 28, -47, -138, -210, -166, -2, 57, -74, -167, -118, 50, 121, 145, -8, -43]
5833d3J49K9j9j19K6P9L6m9j66l0J27P6j06j11p5J50Q9rj90K3N9R3N5j53n7J28
5859hJ61L2j09r7J04K8j8Oj65Q7J74o9j6j82j03K28J30j1l39q0J95J20o9j29M4
5884h6O7J05l3r7l9Q9K8O2p8o6J31RO3l8j53lQ9P3r1m5n5L9Q8j22r4o1K47r5P9
5913A3j09n7J63Q8n4p7N1J9J09O6j76r5J40k7J53j11j39n9K30lj28n2j2k3J45
5938E5j80n6L1J81nm9j9q4J95J33j93k1n2J60O8oj77KJ43ON7j61j10k3J59n7l2
5965c5j55K1J63N5p6j34P4R5O2j00j28r0J84J81np4j47J87J66j22j67J7J20Om8
5990E0q3k3K6J98j02j79q4J69L8j1r4j09J31J48q3J0j04J05L1J94j45j14J18P9
6014A66r8M3j67j0J25J22j81l9o3J05K9R9k99K4lJ41M0j10n4J9K25j39%q0J33
$$ y = [-43, 106, 135, 116, -3, 23, 102, 138, 89, -77, -107, 20, 96, -10, -121, -196, -46, 43, 34, -156, -133, -74, 19, 74, -79, -136, -8, 153, 185, 76, -21, 83, 111, 93, 99, -66, 21, 195, 126, 110, -72, -175, 53, 183, 172, -167, -247, -52, 68, -1, -130, -86, -19, 86, 53, -44, -83, 6, 34, 96, 18, -48, 83, 92, 155, 117, -36, -39, 50, 123, 32, -13, -68, -29, 59, -63, -157, -218, 29, -66, 13, -96, -153, 10, 98, 44, -33, 18, 37, 146, 212, 36, -59, 81, 54, 207, 96, -43, -102, 128, 125, -3, -55, -67, -90, 55, -125, -181, -150, 31, 26, -23, -42, -126, 69, 202, 9, -12, -64, 96, 164, 158, -19, -17, 126, 132, 189, 28, -82, -105, 54, -3, -35, -190, -169, -6, 49, -27, -161, -87, 8, 70, -30, -158, -248, -64, 117, 112, 38, -109, 78, 244, 122, -45, -28, 92, 98, 50, -33, -56, -30, 168, 66, -113, -197, -28, 10, -1, -95, -204, -73, 75, -8, 2, -102, 3, 34, 228, 83, -31, 87, 166, 68, 111, -56, -66, 59, 181, 0, -39, -102, 3, 32, 131, -168, -144, -147, -6, 34, -76, -130, -111, 114, -25, -25, -105, 28]
6039B8J43m2j38l2J28N7K9j02r3j8R4N7L0j87PL0J31r2j99J20n0J20n7p0l1P6
6065f1P8R5j71m9K3L06pj93j40J21K17n6j70j2k5P3O2q2j51p4K49l0o2q3k7J89
6091B0K8q7j39J8J29J45L3j45k8J0J94N1j89n7J03J13Jj91K7j07M9J02o8j58P7
6116f9J02P3k13r2j4Q9K50j47r5jJ26O1L2r3P1J7N0o1n1j4l9J84j5k52j6J34M2
6143E9o1l1q0j07K45Q8j70k2n0R7Q0K9k10J45J02J8m5q8J4O1J08r7j75o4K53K8
6169A27k0j52q7P9J51m0k02l8J09P2O5j54k5j5J55J28j30n8J3J57R1k54k0M4N2
6194D8J76r4j56o3J91m7R1j53r8O9J46q8j51n6P0J20J9j08j2j3J84L1j17o7O6
6219a2J29J02j08j29R6J53k3j57j04N4R3K0j84q2L0P9O0J0k88J10R6J75r8j21
$$ y = [28, 171, 129, -9, -41, 87, 144, 173, 71, -22, -40, 54, 111, 141, -46, -39, -9, 122, 30, -169, -49, -99, 21, -36, -106, -137, -61, 17, 112, -59, -108, -85, 221, 214, 21, -119, 2, 219, 163, -7, -19, -44, 29, 91, 9, -142, -216, 33, 3, -59, -142, -169, 20, 48, -39, -178, -160, -31, 114, 147, 2, -26, -16, 178, 229, 40, -17, 86, 199, 200, 9, 36, -71, -22, 80, 12, -146, -69, 33, 106, -107, -199, -213, -124, 126, -21, -116, -117, 9, 70, 102, 9, 80, 97, 147, 86, 35, 21, -18, 166, 151, -101, -117, 17, 59, -2, -33, -113, -220, 25, 113, -57, -79, -129, -32, 48, 77, -133, 12, 114, 132, 87, -1, 13, 74, 182, 85, -90, -154, 99, 127, 107, -45, -132, -53, 98, 58, -144, -182, -73, -1, 64, -90, -115, -130, 25, 153, 23, -35, -22, 135, 226, -28, -48, -4, 48, 224, 130, -26, -89, 102, 55, 146, -7, -105, -36, 110, 22, -129, -185, -115, 5, 24, -84, -96, -109, 75, 106, -11, -78, -12, 117, 219, 111, -18, 78, 231, 208, 51, -53, 1, 94, 114, -70, -152, -122, -43, 17, 27, -261, -151, -55, 120, 22, -99]
6243i9O7L4J50n1q8k25K05J23L6p5p2M4J56j07Ok28J41J61j68l2k04J72L9m3K6
6268c2j76j2J63J60j15o0j2M5J13O3j42m1O8J17n2jj6M6L1l8r5q1k5J81J7j83
6294g7j61N0J39J42j93o6l7J39L4K6p3m2R0J43o0q5J7P3J72j42r0l8J17J26j11
6319I3j18j22J43R5r2l2r0M5M3lq7mL3J08J9Q1j00l9J71p9N1j26l4J67M0O2k65
6346d0p9J44J08j5r3k01J22J22j23m6l4L6J20K4j48l4M3K22k8r0j56J38J50N7
6370A99j18j18L5J20R2j29q7j28J33J46k08r9o3K22J25k19p9l3Q8Q5Rk2j12J32
6394b9Q0Q8k33L5PL06r0j9k19R6M3Q2J6k04OM1P3j03k11N3J21L6P9j95k7J87K2
6421D1K2j76j3K00rP2j57R1J8J30p1q7j30J09O3N0j45j31K0J26K7r0j84N1J20
$$ y = [-99, -32, 2, 152, 101, 13, -212, -7, 116, 152, 77, 5, 49, 205, 98, 104, -124, 17, 178, 10, -22, -226, -54, -15, -58, -32, -208, -220, -57, 103, -12, -72, -84, -39, 74, 137, -5, -46, 22, 139, 87, 86, 70, 116, 147, 109, 14, -67, -92, 89, 106, -77, -238, -188, -49, 93, -100, -166, -203, -64, -30, -4, -77, -119, -29, 114, 54, -31, -14, 59, 231, 89, -1, -39, 78, 204, 93, -25, -147, -4, 91, -1, -33, -123, -78, -35, -38, -125, -129, -96, 12, 31, 112, 12, -27, 144, 65, 116, -10, -44, 123, 163, 225, -40, -119, 25, 133, 118, 25, -176, -54, 68, -55, -101, -135, -99, 21, 45, -103, -137, -94, 128, 100, 10, -146, -8, 142, 199, 81, -37, -2, 118, 210, 81, -6, -134, -1, 145, -63, -162, -225, -3, 122, -97, -176, -209, -121, -36, -27, -49, -161, -29, 51, 139, -94, -59, -52, 254, 164, 145, -74, 22, 65, 147, 163, -41, -35, 6, 79, -24, -235, -182, -61, -25, 54, -141, -168, 19, 41, 63, -113, -126, 74, 65, 137, -20, 71, 89, 219, 148, 61, -69, 40, 103, 153, 8, -123, -103, 23, 50, -40, -224, -173, -53]
6446e3R0k3j45m1P7J88j58L6p3K14R7j71p6M5M3J72j02q7k0P3J34l9j43j03l2
6471i7Q4R3j16j82O8K10j9j09j42J13lK38j38q7K0J72J18j78n1k6J23J49j56j19
6495c5JLJ50mp4q3j50K32n2o9k9J9M1Koj21J66L4J05m2k22O3J77P5j22j19QK31
6523A79N7o7k17l5P8J47j22j06p5Q5O6j11m3MM4J55J8q5q1M0J77Q2j44j16M5R3
6549F8J61j69j4j02J22J95j70j16l5J40k3j0j25n0N4Q4K6k28j3J16J57l7n0n8
6573g7O3P6O6j11j9J17l2O2L7k03lJ18Q0j30j21M0L5J13n4k24M1N0J55r4j64N5
6599a24R3J2Q0p6p7J21P8J9o0p1P4J13nj20j39P6M6N6j10p0J9L5O3m8j81P3O1
6626f2K8j0r4O2O8J68j72r3J17J1J30o0l1j04R4J51l9r4r0k2J79m2j48n3O9J7
$$ y = [-53, 37, 14, -131, -172, -95, 93, -65, -29, -102, 112, 209, 38, -38, 7, 50, 222, 120, 33, 13, 86, 220, 181, 38, -65, -97, -13, 80, -36, -218, -150, 60, 41, -68, -210, -97, -100, 138, 0, -87, -67, 105, 223, 45, -6, -32, 91, 240, 84, -35, -34, -31, 119, 115, 41, -42, -192, 40, -12, -81, -110, -91, -50, -48, -54, -175, -9, 25, 130, 88, -134, -71, 106, 181, 59, -60, -52, 179, 236, 169, -48, -83, -5, 142, 20, -86, -161, -76, -10, -121, -164, -160, -116, 39, 57, -28, -109, -69, 108, 190, 46, -70, -25, 68, 229, 60, 46, -56, 66, 261, 91, -25, -60, 80, 57, 47, -78, -128, -74, 10, 36, -192, -205, -89, 68, 31, -19, -77, -14, 62, 128, 17, -2, 115, 83, 145, 182, -21, -24, 94, 174, 44, -77, -37, -2, 111, 57, -167, -126, -76, 79, -15, -179, -124, -31, -19, 61, -15, -92, 29, 107, 126, 66, -5, 69, 182, 177, 57, -82, -6, 40, 96, -14, -84, -65, -30, 33, -15, -196, -123, -62, -34, -44, -138, -76, -8, 160, -12, -105, 12, 23, 153, 93, 62, -42, 52, 203, 164, 70, -20, -42, 137, 95, -53, -106, -37, -20]
6652b0M9j25m5rJ48m1p8M0j38K73J19k07j8kk5J81N7j06o2N7J17q4n4q5Q0J04
6678A26m0j59j54J33J48q4j57j20J17J86p1j6rp4K42N8n8j64M5J11R9m7m6j52
6702h6J51J45j02r7m5M1J62o9k69L7M0L1l1K7j70J40O5L4r7r5J13J38J25j39o6
6727a7pJ23P2n0j65M1J07N6p8r7m1R4L5Lj64m1J70K9j11j08j8nJ29J12j28j2L0
6754d1M9J14n5k17J66K4J54o7k18N5J03Q1j54p4L9q9J81l9j70j03K26J39q9j05
6778i0N4K8R1n9l9k3L3J92qr7j70%L14n0r0j76L4K39r0j09j50L7J18N3m8j43M2
6805a07J74j54np3J0K48klr4n7J27P9l3r9J7P3J6L7j80J23j8J9K6r8p7q5J76l6
6833Dj41NO6O3K7j03q5M4J48M0q8l9j0J89pL5n7r4J23k1k1j43J7J8N5jj14p7M1
$$ y = [-20, 29, -96, -141, -150, -2, -43, -121, -81, -219, 54, 173, -34, -52, -54, -79, 102, 159, 53, -9, 48, 165, 81, 27, -58, 22, 126, 86, -73, -227, -94, 54, -30, -187, -307, -190, -4, -75, -91, -100, -174, 68, 126, 68, -96, -51, 60, 159, 112, 66, -86, 65, 210, 108, 11, -34, 7, 169, 100, -169, -132, -92, -61, -92, -65, -235, -95, -30, 4, -93, -188, -75, 63, 188, 49, -17, -24, 99, 171, 121, -44, -3, 104, 160, 82, -15, -56, 38, 73, 76, -88, -129, 41, 70, -41, -149, -167, -172, -43, 69, -59, -71, -41, 8, 122, 67, -150, 16, 40, 194, 127, -91, -36, 67, 148, -6, -80, -41, -130, 51, 12, -158, -261, -35, 104, 15, -90, -36, -8, 83, 24, -15, -38, -5, 187, 179, 82, -88, -88, 226, 176, 86, -90, -56, 183, 93, -16, -166, -129, -11, 42, -6, -149, -107, 67, -87, -92, -165, -155, 93, 91, 88, -6, -63, 64, 143, 110, 11, 28, 101, 117, 154, -26, 97, 79, 98, 124, 26, -51, -136, 40, 4, -137, -132, -66, -3, 24, -79, -164, -120, 28, 68, -20, -59, -69, 120, 113, 148, 91, -3, 120, 99, 78, -65, -48, -30, 25, 24, -90, -167, -126]
6862a26J97n4j76p1Q8J08K4k3p2M6Q8P7j33k1J5J57J00j54p2M7J41lj22j34q1
6887a54J12J38p4n9j06R1M4K5j62j02P3J27O5r3j14J68J77l7j95M6L4J02N2r1
6911F7j6j65K14J8j09n5k3pJ31j6k10L5J9J96j15j10o3J59O9O9n9k11J13J44M0
6936A15j74j0R9J36K7m1j59K8P0o1O1j54LM1J09j15j21l1J89J5r7j17m1K07M5
6961B4N4j41L8J3J43p2j4p4J23K6M1q8j12K2J09j1j16r4M2J62J1j68j76J01J00
6986e7Q3J7j47j27K48Q3j33k3m0J61j1Q8k6j21K14q1M9j45p5l1K31o4j73p3L1
7011a22J11J2q4j17n0J50J94q8m9Q6n5J73q3j14j4J09J07k5j41qJ47M7p9j85K8
7036e0j2J26O7k35m9M0R0ljj09J08R9r1Mp6L3J04R0k3j90J25P7J11o1k29j4R5
$$ y = [-126, 71, 17, -159, -230, -142, -34, -10, -33, -105, -59, 29, 106, -27, -48, -33, 124, 224, 70, -2, 45, 186, 183, 61, -73, -154, -42, 96, 22, -37, -143, -52, -8, 17, -145, -247, -174, -47, 18, -75, -189, -21, 156, 119, -76, -30, 4, 106, 158, 67, 51, -114, 100, 118, 9, -46, -69, -76, 55, 39, -171, -136, -117, 79, -36, -146, -209, -50, 19, 88, 29, -182, -69, 75, 115, -59, -69, 30, 166, 193, 152, -7, 21, 91, 30, 91, -63, -60, -19, 90, -25, -146, -177, 12, 27, -70, -187, -228, -21, 24, 78, -63, -25, -12, 131, 59, 45, -29, 94, 120, 161, 73, -39, -17, 92, 81, -35, -129, -87, 75, 86, -82, -258, -157, -57, 26, 43, -104, -231, 17, 100, -33, -56, -96, 65, 54, 142, 116, -5, 209, 128, 177, 32, -43, -74, 157, 93, -80, -153, -122, -11, 1, -83, -200, -250, -100, 94, 6, -43, 43, -12, 161, 78, -36, -50, 59, 166, 141, 0, -8, 139, 186, 107, -78, -50, -62, 64, 131, -104, -153, -113, -23, -26, -27, -136, -28, 71, -20, -16, -92, -59, 45, 135, 112, -78, 47, 124, 235, 174, -55, -69, 26]
7063B6J51r7j67j6J95j09J50j56r1RO9N0j00q2R4P5J45j33j25N5Q0J39r1j70J16
7088A7J21j3j3j64j5J58pk8j29l5J29Lq7p8k2J51N0p4o6r9J13J41M8j14p5R3J57
7115A62j45Q4j83R9J15K3q2j40M7K8N0k2k14R8R5l6Lj88j5R9K08n4r2j46J56J19
7141F9K6j60j1J60K7no2J4N7qn3L1j62NJ41j4q7j26J0K24k7j15j94J13J79l3j2
7168a3j46RJ18P0N5j71l5J98R2m1r0M1j45J92l1q2n8m1J09l1l4j08O6K3K3j8j23
7195a71O4K7N6m7j09J36P2J1M6q5j6J22J27r1n0r4K4J52r7o7j44J64O0p1j14o6
7221a61N2J27j51J2q0R4P7nK7r8M3J44M9r1l4M7n2J86l9k13J21J6N5q8r3p0J05
7248b0P2j30m2J2K4M1J04k00m7J06J08L8j53L8L5Q2Q0j06o4R7P4L6p2j79O7Q2
$$ y = [26, 177, 80, -87, -103, 92, -17, 133, -23, -114, -105, -36, 14, -86, -168, -74, 1, 146, 13, -112, -57, 23, 162, 71, -99, 17, 138, 125, 112, -52, -67, 91, 84, 56, -73, -108, 21, 24, -63, -141, -163, -12, 38, -36, -102, -201, -88, 53, 101, -13, -88, 5, 162, 17, 101, -82, 17, 132, 155, 73, -67, -20, 8, 58, 36, -178, -80, 15, -21, -18, -206, -221, -122, 86, 32, -60, -206, -50, 69, 95, -65, -76, 84, 111, 106, 44, 58, 115, 107, 54, 85, -77, -72, 69, 55, -32, -158, -148, 76, 49, -66, -260, -147, 32, -1, -13, -159, -150, -32, 38, 93, -78, -113, 85, 177, 136, 46, 87, -58, 134, 103, 21, -37, -78, 31, 0, -34, -142, -76, -53, -30, -48, -171, -107, -80, -24, -71, -180, -44, 28, 39, 85, 0, -16, 106, 233, 142, 92, -2, 22, 174, 77, 10, -134, 30, 90, 19, -95, -161, -109, 18, -133, -121, -201, -107, -30, -35, -8, -106, -63, 81, 130, 39, 5, 52, 0, 186, 147, -66, 55, 71, 126, 38, -55, -125, -20, 52, -78, -120, -108, -84, -43, 61, -139, -186, -80, 28, 66, -87, -49, -14, 68, 148, 42, -22, 75, 149, 185, 113, -66, 1, 83]
7274H3K9p1j00L8j18J80j68MLL6J41m4n4r4j9K88m2j51R4p1N2J29j16o1M8K6P2
7301A14n4j13l3J37ro8j41Q2M3J28l3j70j36K37M4p9l0l5J20J10r7p8J07l7J62
7326A71q6M0j28J37j0L8l7j63jP8L9o5j43J5J13%jj77P4O2J23p5j22J48m1J12
7352A01Lj11p3R4J75j16p3o0P5J48p5k7q6p5K28j14j26N9l7NJ18j20n9j6K37k1
7378E4j00j14R9O9J0K2r3LJ04J21p6k4q6M2O8m8j19N3OP3j3j62m7pJ45O0j59K4
7406i5n6J80R7j15Qj02J14J30j11q4M3J84M9m6o7p1o3K01j05j25j9O8Ok7l9j22
7432a67j2J78j8K5j68Q5J43j8K3j66R6J7Q9L5o1m8J82%j26q9o1J72K1j02j04l8
7458a12J98M5j71o5k3O7J05j01M2r0N1Q7n6M6o0N7J33p5m3l2K9J61k5o6j04m9
$$ y = [83, 112, 41, -59, -21, -139, 41, -127, -123, -120, -84, 57, 13, -41, -135, -154, 134, 92, -59, 35, -36, 16, 145, 29, -32, 16, 42, 114, 60, -53, -86, 51, 42, -26, -167, -85, -42, 86, 53, -117, -253, -16, 28, -51, -81, -116, 4, 114, 17, -61, 46, 9, 171, 85, 125, -3, 134, 124, 162, 125, -38, -39, 39, 78, 13, -130, -115, -2, -2, -3, -180, -106, -44, 79, 4, -118, 30, -11, 101, 104, -7, -80, 14, 189, 73, 0, -60, 15, 163, 88, 61, -25, -100, 128, 14, -112, -53, -90, -85, 33, -87, -146, -162, 75, 54, -46, -160, -61, 8, 18, 40, -53, -50, 54, 175, 99, 75, -11, 31, 99, 51, -68, -15, -9, 64, 51, -111, -158, -165, -20, 40, -119, -95, -151, 29, 126, 11, 19, -83, 31, 161, 50, -34, 9, 193, 242, 196, 129, 58, -5, 196, 91, -34, -53, 15, 21, -6, -45, -167, -179, -1, -19, 6, -162, -77, 66, 48, 71, -95, 1, 18, 107, 142, 81, 33, 215, 215, 89, 0, -61, 111, 132, 30, -74, -112, 86, 131, -40, -105, -128, -61, 44, -57, -15, -105, -54, 33, -23, 23, -37, 20, 153, 78, 35, 3, 32, 193, 168, 102, -2, -51]
7484e1J19J1q2k6j79J16Q5pq9j5R3qM1j09O4N0J40j7j64K6n3K21n4lp9l5J45O1
7512B01j33j24J06M4j25m6l1j2K8J00k8j56k1J94J08p4j42q4K23Q7k7j32J06M0
7536A02L0j4o2j02R6N5l1o3o4l3M1J63j42r7K7K8km1o2R1L1M0l3p5J6J67R2l4
7564A24l6l0J06o0Rj00M8M3J5k6r0o1k0k4Q6q4p9J33oQ1j35m2j1J85j1%j0L7O9
7593A11Jr1n7J12J2l2P9j88MJ20j1l1j81k2R7K2M8J2j30lO4K6r0J22o4J06J7j1
7621D2p2P4L5Q1q7o4K2N3N5P9k18o4J60n4j15N4p0K8J16j32q8J7O1J66p7Ln6M9
7649bR5K6j69J3O7P6J17j64j33O2P0L5L4j74%R1J1r2j32R3L0O0m2o5j09K42L9
7676G9p6j12r6J50J50O5j26k1M5P3Q2j80j9J7M7L8r3m8Rk2R4j07n0OL8N5r4J0
$$ y = [-51, 68, 79, -3, -29, -208, -92, -7, -14, -103, -118, -25, -33, 8, -101, -37, 13, 153, 136, -28, -2, -55, 166, 112, 109, 30, -5, 140, 201, 68, -56, 50, 94, -31, -77, -108, -120, -92, 8, -20, -176, -197, -3, 105, 31, -111, -195, 28, 115, 88, -44, 62, 102, 132, 118, 56, -46, 50, 105, 74, 11, -53, -86, -45, 118, -24, -121, -94, -66, -68, -109, -171, -80, -49, -9, -42, -117, -101, 66, 158, 124, 88, 58, 164, 104, 113, 13, 61, 104, 119, 93, 3, -58, -78, -102, -16, -100, -179, -46, -52, 29, -106, -148, -159, 26, 15, 15, 5, 42, 111, 112, 21, -36, 76, 88, 56, 135, -53, -49, 71, 60, 29, -152, -174, -77, -55, -7, 5, -125, -128, -64, -38, -128, -6, -70, 36, 53, 42, -30, 44, 79, 160, 73, 9, 31, 84, 139, 218, 0, -64, 96, 42, -73, -19, -89, -61, 55, -77, -165, -148, -87, 79, 2, 5, -51, -2, 93, 119, -50, -37, 30, 106, 223, 59, -74, -12, 58, 93, 127, -47, -47, 44, 55, -37, -169, -76, -46, 14, -28, -93, -202, 40, 79, 3, -109, -205, -55, 95, 160, 34, 13, 58, 131, 213, 33, 14, 31, 78, 116, 23, -25, -16, -38, 56, -51, -101, -95, -57, -2, -96, -86]
7704h6j36K73J3k5j55P0JJ50N8k16L5J47K0kl3r9J12k9J4j83j46K49k8M7j43o6
7730a58M9N1lm3l5Q4L1M0m6K2m4O5L8NJ3j21J94mq8k4L3n3P9m2q0j29M4J68o7
7759b1l2j59J76M3J5j65P3lM8J88k27P1M6N8N0p0kq2J17J7p8p2n5rJ12M8j73n0
7787a36K0L2K5Qr2R2J21q0j20QO5R9Pj4n3P3J27n4m7%q2Q8P6j69l9Q8M4j02K6
7816A1j04j11J14J62j24j10l8J69m2qJ23j22R2J03J0p8j44J36Q0J8k3j35L4N3
7840F6K0j01rl7J49m7p6q4q5J14Q3j31M6r9J66O6l4p1m0J47J01Kq1j01J48N2j5
7867A49j34m5O2P8k0j45L6l8Q3n1j7l0m6J39J0J3k20J14Q3l3J20p4q0R3J31n5
7893A23o8m0L6j5K7l4l4JN5K9j99n1J74lj4k8j32M7R2Jl1l6k4P0J38j20Q4k5l1
$$ y = [-86, -222, 51, 64, 39, -116, -46, -45, 105, 163, -53, -18, 129, 149, 147, 114, 15, 127, 98, 112, -71, -217, 32, 4, 51, -92, -158, -109, -58, -61, -104, -139, -55, -24, 16, -30, -8, -52, 13, 51, 56, 69, -52, 142, 138, 50, 26, 59, 6, 85, 43, -37, -166, -122, 46, -21, -53, -212, -36, 7, 22, -143, -70, -73, -25, 163, -64, 7, 53, 111, 161, 91, 89, 7, 124, 141, 63, -9, -64, -73, 39, 87, -86, -136, -116, -84, -59, -51, -143, -51, 70, -10, -130, -122, -57, 42, 49, 35, -18, 55, 182, 128, 81, 81, -1, 87, 163, -6, -45, 43, 87, -15, 11, -93, -204, -90, 72, -52, -162, -200, -31, -73, -81, 42, -80, 12, 115, 125, 47, -97, 39, 119, 137, 114, -21, 13, 66, 86, -15, -24, -61, 88, 41, -35, -119, -204, -90, -7, -138, -92, -191, -25, 41, 7, -64, -104, 43, 144, 146, 65, -36, 112, 164, 149, 15, -30, 32, 110, 90, -55, -19, -57, 26, -25, -42, -72, -118, 21, 31, 44, -176, -62, 21, -12, 108, 34, -46, 47, 178, 123, 55, 15, 51, 36, 63, 29, -5, -4, 51, 80, -119, -170, 4, 1, -13, -41, -173, -126, -34, -33, -64, -100, -124, -54, 84, -36, 48, 23, -8]
7922hN9O3p1k9J06k0O6j54m2N4P1L7k03l2N1K9N1j22m0O4Q9n0l1r3J66M7L6K9
7950A23j44N8J24Qq2j19O1J43j83O9mj38J45L7j10q7ql5J21J43k28j19J04K54
7974A33j30n6K2KJ77n0l5o8oR4P8m0j05jJ34n5l5p7k8J3J09q7r2J05j00Q7O7k27
8002a71K5J35P0o7m6n9J51R3n0j4o3O7L5N1p7Pj54J22O6r1r5k8J70k3q7q9o4J54
8030c2kj3p3K9Q1Q2p8j0J3mJ92n8q0R0k1j0O5j36J6j14J85p4o4m4oK7K6j3j04
8059a30M1O5k0L2q2o9J82J9L3q8k4J10L8N2j18n9oJ85O2j17j00L6j2rk1r6N5Q0
8087C9n4q9J4o0K25o4n6p2K8P2J12j51L7QJ21L4n0Ln8n6J39o0n3pk4M6o6n0K3
8116f9K8Q5j66K0k2J5J08nl1l6j9J36O8o9o0M8R6l8j6o2J01kM4j10o1j3O7j0K8
$$ y = [-8, 51, 114, 43, 14, 120, 100, 166, 12, -30, 24, 95, 132, -71, -103, -52, -23, 28, -94, -134, -70, 19, -31, -62, -155, 11, 58, 94, 123, -21, 37, 161, 169, 87, -32, 29, 172, -11, 58, 54, -84, 61, 98, -12, -99, -107, -142, -21, 122, -106, -225, -121, 133, 3, -53, -31, -29, 148, 98, 63, -5, -11, 83, 161, 121, 16, 15, 149, 94, 59, -18, -46, -33, 76, -11, -103, 2, -98, -11, 56, -171, -146, -11, 59, -8, -54, -113, 38, 131, 81, 67, 4, 71, 106, 157, 80, 87, -67, 55, 121, 30, -65, -93, 77, 54, -33, -122, -186, -32, -34, -47, -120, -91, -10, 72, -6, -16, -3, -7, 185, 127, 47, 137, 116, 106, 171, 35, 51, -63, 122, 48, -16, -60, -66, -39, -13, -26, -130, -89, -24, -44, -12, -94, -163, 19, 38, 71, -17, -41, 69, 107, 159, 41, -18, -24, 161, 223, 106, 6, 42, 30, 21, 0, -96, -41, 39, -15, -104, -90, -150, 75, 11, -45, -117, -89, -17, 95, -56, -19, -11, 110, 144, 94, 97, 39, -17, 122, 62, 9, 2, -22, 24, -42, -92, -69, -41, 44, -122, -102, -124, -109, -1, -6, -37, -73, -92, 44, 112, 43, -17, 31, 127, 89, 73, 11, 112, 110, 154, 44, -17, -30, 37, 27, 55]
8145E5k14RRK08j34j14k0R7P7l1K7m9M9N0K3L2j30J43K3N3p4r2QKO6J8j41o8J42
8174B4J8m0m4j07M1N9Q6j79K2R5J34j13J3p2O3R5j8
$$ y = [55, -159, -150, -141, 67, -67, -181, -201, -104, -27, -58, -31, -80, -31, 19, 42, 74, -56, 87, 110, 163, 89, -3, 5, 7, 73, 91, -50, -118, 24, 42, 2, -42, -149, -108, -49, 37, -142, -120, -25, 109, -4, 9, -63, 0, 95, 77]
8191G7
$$ Imaginary data points
##PAGE= N=2
##DATA TABLE= (X++(I..I)), XYDATA
0@%%%%%%%%%%%j6L2l2L2m8O4o5Q1r9J15j44J76k08K41k79L27l84M47n13N78o58
32c53P55q52R56j076J212j357J517j693J883k094K324k573K847l149L473l828
48b008M222m651N121n643O221o864P582q392R313j0369J1594j3031J4755j6865
62i015J9510k2948K7618l4357M4986o4331J10711m22668m74308Q65762N52424
73E93384k19752o12799j03156K77904K37638n0139q3201o1782j0375M0792J11425
84A19939m2688j95477p0212K67216K46544j77098m41120p2960M22148L41728k13411
95A84609m29050p6338L03598K35516o1582j99181j00591M1291J26321J08404k9140
106A03857j68861q6463J38545J69757n7768j89100l1257J59581R6301r6720j25311
$$ y = [0, 0, 0, 0, 0, 0, 0, 0, 0, 0, 0, 0, -16, 16, -16, 16, -32, 32, -33, 48, -51, 64, -80, 96, -112, 129, -150, 177, -207, 240, -273, 305, -353, 402, -450, 506, -570, 642, -715, 802, -891, 992, -1102, 1222, -1351, 1496, -1653, 1820, -2008, 2214, -2437, 2684, -2959, 3262, -3602, 3980, -4412, 4901, -5468, 6126, -6905, 7850, -9015, 10495, -12453, 15165, -19192, 25794, -38537, 72174, -350494, -824802, 40960, 593384, 373632, -239167, -342323, -64419, 173219, 123080, 39879, -21903, -32278, 8514, 119939, 77251, -118226, -188438, 78778, 325322, 148224, -292896, -365856, 56292, 398020, 184609, -244441, -320779, -17181, 218335, 156753, -42428, -143019, -101728, 24593, 132997, 103857, -65004, -151467, -12922, 156835, 99067, -90033, -121290, 38291, 134592, 37872, -87439]
117h7439J4064Q7143L5567j2043k7153o1460m9692O4706J36365J4442j63139j24900
129a73539J03556J88417K382j59776o7033Q9098O7649l2476j9301M1081p873q4959
141e2774j1932J17584O0140j16273j08500Q3131J36632l8277j52321k1971J39811
152C5250P7681r9208j13580L0531R7082K5036l5325k4953j8461k3449K2341Q0952
164E3897L4559q9777j02723M5236J36822K7074j13850p8457O0594R4328p722q3992
176b4011l4808M9419N1342q469m5673l5436O152M9492M4829k1244p5306l9004
188h2717N5497Q8175N914q4043n8744L8943P4282K1231l8467m5145p137L1918
200b93L5186M73l6744l1002K0644M8565l92n8006k8628M7027N3648j8976o8090
$$ y = [-87439, -73375, 13768, 49335, 37292, 10139, -51321, -101013, -36307, 100058, 114500, -48639, -173539, -69983, 118434, 120816, -38960, -105993, -16895, 50754, 18278, -1023, 40058, 32185, -52774, -64706, 52878, 113018, -3255, -111755, -28624, 108008, 69731, -82590, -104561, 35250, 112931, 13723, -99857, -69326, 27756, 52792, 17467, -7486, -25947, -49396, -27055, 53897, 88456, -1321, -104044, -58808, 78014, 105088, -8762, -87219, -26625, 67703, 59981, -24011, -58819, -9400, 41942, 33473, -12200, -47636, -41484, 8008, 52837, 31593, -43713, -82717, -27220, 60955, 66869, -17174, -75918, -36975, 37307, 58538, 20071, -25074, -32211, -293, 34893, 35366, -1378, -32380, -11736, 36829, 36437, -21569, -50197, -3170, 50478, 31502, -36588]
213c6588k6080M8720N5844o022m9214k9840J3002L6599K7799p082l6523k7000
225c6385J6490M7128J9913l8592m4700J7753N3608O784m8895l1689K8269M4882
237C4566k671m5693k7815J9971L7399J4159k1810l8286j2865L1866M0555j1m0337
250a0972l1151J9207M7914J3433l7223l2016J7827L9682O258l4457k6786J8571
262i713L7563M880l2341k9103N845L5175K4784k0739m5757j3029L6246L8519q677
275B3653m4058k0091K9850L5919n618l1908j2904J9937K6030r87k5926j4650J6983
288c770K6689M732k3367k6011M260L2425J8115k1499l3869m333K8291K2389j4053
301I999k8824k204K2002R642j3277j3443M486J6344O413j2969j4379L858J8934
$$ y = [-36588, -62668, -13948, 41896, 35874, -13340, -43180, -30178, 6421, 34220, 27138, -9385, -36385, -19895, 27233, 47146, 8554, -36146, -18393, 35215, 41999, -6896, -38585, -10316, 34566, 31895, -13798, -41613, -21642, 15757, 29916, 8106, -30180, -43045, -11179, 29376, 29365, -10972, -42123, -22916, 24998, 38431, 1208, -30808, -12981, 26701, 32959, -1498, -28284, -9713, 27850, 32730, 389, -28714, -22869, 12306, 37090, 16351, -29406, -42435, -6189, 32330, 23653, -20405, -40496, -10646, 25273, 19655, -12253, -25157, -5220, 20810, 19823, -6103, -20753, -3770, 22919, 27651, 4284, -21727, -17467, 14958, 33073, 11574, -22295, -26628, 1663, 24052, 9999, -18825, -21029, 973, 10615, -2662, -16105, -11619, 4725, 11138, -1831, -16210, -12352, 6582]
314F582J4534o785k3976j1104K0283K6471k215k6752j6581J3841K4195j19k3081
327d707j0607J3398J2773o735j5868m057J3815J3592o333j8525o895J3409K0198
340A3458L780k0216j9708R707K7795R749j9305k2097N197K6743J0295k1122k0762
353a6486P936K2059N625j8131j9975L530K2128J1451j3487k2822o763J9103K3775
366A7943l959k7831j3591J8497K5673J069k2736j4629J4689K2806o71k0185j0752
379a3677J2000J9405J238k0433j5577J0026K1640N887j7979k2827o7K4913J6999
392B1548j4644k6709m537K2247K0032q171k4011n630J9318J6435n732j7624o915
405a4393J4304J8774k060k0700j1661J2266K1384L624k1161k0303P304K3932Q306
$$ y = [6582, 21116, 14331, -9645, -20749, -466, 26005, 23790, -2962, -19543, -5702, 18493, 18374, -4707, -15314, -1916, 10857, 4122, -11746, -15803, -1988, 11604, 5271, -13254, -20149, -6740, 13458, 17238, -2978, -22686, -12979, 14816, 24565, 5260, -16837, -11640, 15103, 25398, 4276, -16486, -8550, 13509, 19134, 1003, -18972, -15442, 6686, 18137, 4650, -18172, -24935, -5832, 17943, 13984, -13847, -27438, -8941, 16732, 17801, -4935, -19564, -4875, 17931, 17260, -2925, -13677, -1677, 17728, 18966, -1467, -17044, -7018, 14622, 20509, 2530, -20297, -20364, 4549, 21548, 6904, -19805, -24342, -2095, 17937, 9766, -14245, -19875, -557, 15878, 10146, -7478, -14393, -89, 18685, 16625, -4075, -15736, -3470, 17914, 21538, 377, -19926, -12622, 11310, 19616]
418A9616j6760k0397P4J9591J1941j1751j7600M18J5254R466p610j4663n47J6880
432C912J2260q156j7757m698J6474J9447l431k3254j2176J3501K0763K893j7675
445B103j7018M176J7255O324j1295j3177j33J2001P401q795j1839L510J3794N099
459I406r944j2495K418J6791R883r935j5132q61J3716J2120m451j5162n417J0207
473A144R641l155j0945n480O823J0241k637j4356o350J0720J3896j250j7272j0901
487a9881J1791J9277J896j5352j1990N698J6824P005j1133j2368L715J2890M288
500A2660r451j0682L107J3378M168j2450j3568J405J4962J1451q875k1111o326
513b1332J7169J8684k453k0464j3251J1672K1725L545j7194j3222P687J8624M805
$$ y = [19616, 2856, -17541, -17467, 2124, 14065, 2314, -15286, -14868, 386, 9852, 2242, -12421, -12968, 3912, 16172, 8016, -9741, -14439, 2035, 21482, 18051, -5203, -17379, -3878, 16885, 19778, 2103, -14915, -10739, 6516, 12840, 1545, -11632, -11765, 236, 7637, -1158, -12997, -9487, 4307, 9406, -538, -13033, -10615, 6176, 16059, 6124, -9008, -9869, 3847, 15967, 11516, -3646, -9063, 1144, 10785, 7630, -3315, -8795, -1972, 8269, 5632, -8724, -15074, -4354, 9542, 8292, -8980, -19881, -8090, 11187, 13083, -2269, -14259, -8561, 8263, 15268, 4135, -8233, -4518, 8372, 12660, 3209, -7473, -4366, 9012, 13180, 730, -12838, -11433, 3529, 14980, 6105, -15006, -21332, -4163, 14521, 12068, -8396, -21647, -9975, 11750, 15295, -1899, -15121, -7434, 11190, 15995]
526A5995j4992j2990Q525J6991J963j4330j2768L580J5877Q173j0580j6901m326
539a5783J2863J5340j182j8364j1907R821J7235K605j3628j1334O806J6185K279
552A0936j4007p997R720J4207k83j4672r610R485J5615J111j3678j1396K873J2743
566E047O801q299j2169j839P754P199j149q387n034N542Q095l92p942m507P126
581b154J1730q00j4486o382J3394J5610l896j8577q060J4552J6743n540j8870
594f736n239J2493J0441m437j2663m854P429Q494k22p446q224k44J2001J1513
608A2306o018j8096n490J7337J9898m757k4920r552K0187K0930o830k2670p341
621a5016J5950J5962o247j8516n291J1887J1520k443j3576r954O493J5788N214
$$ y = [15995, 1003, -11987, -3462, 13529, 15492, 1162, -11606, -8026, 7851, 16024, 5444, -11457, -15783, -2920, 12420, 11238, -7126, -19033, -9212, 8023, 10628, -3000, -14334, -7528, 8657, 10936, -3071, -11068, -1348, 12859, 12576, -2096, -11706, -2221, 13394, 14505, 827, -10569, -7696, 5047, 11848, 3549, -8620, -10459, -2705, 4494, 3345, -5042, -10076, -4534, 3561, 3169, -4773, -9280, -2154, 9576, 8776, -5710, -12092, 1302, 16912, 13016, -5561, -13621, 931, 17674, 12134, -6736, -11975, 518, 10959, 6522, -6141, -10995, -3566, 4928, 4706, -2740, -10964, -11208, 793, 12306, 6288, -11808, -17298, 39, 19937, 15180, -9740, -19292, 895, 21825, 14995, -7675, -15016, 934, 16896, 10649, -7867, -13158, -1271, 10249, 7806, -5770, -15724, -9231, 6557, 11771]
634A1771j2206j5710R9J7728J4957p655k0348o094J5792J8213j214j8542j1325
647a4534J1562J7970k34j6636j0288R320J5702n68j7638r824J1198J4920j752
660I198j4939q951P348J2606J908q050o397k45N296P597J628p342o463M200R913
675G307J830r573o674Q744J1395n789j5518j499J5229R735j0758j7475K00J6502
689C656P443j0345j1280J418Q377M184l342m829k56L440L534P41l687m626L878
704a694J0171J714j1151r002O499J5329L466j5119j4105O192J7406M917j3463
717A160j4406K085J5490P407j0454j3904P92J3480R186o996j4891k311J4682J2644
731A3964n225j5307o123J0821J5283Q67j3845j0748L812J3438P499q599j4906
$$ y = [11771, -435, -16145, -16046, 1682, 16639, 8984, -11364, -17458, -1666, 16547, 15333, -3209, -14534, -2972, 14998, 14764, -1872, -12160, -2840, 12862, 12294, -5344, -15168, -3970, 10950, 9198, -5741, -14692, -7344, 5262, 7170, -880, -7277, -7522, -2226, 5371, 6999, -343, -6806, -2606, 7307, 9137, -436, -7110, 1634, 13029, 7240, -8278, -9777, 5452, 15187, 4429, -13046, -12846, 3656, 11099, 754, -10526, -9108, -731, 3453, 111, -4718, -4974, -1534, 2000, 2741, -946, -5572, -1694, 8477, 10191, -960, -9962, -3463, 11866, 15332, 213, -13892, -7700, 9706, 14623, 1160, -13246, -11161, 4329, 11736, 1282, -12622, -11830, 1650, 10836, 3840, -11051, -13362, 1320, 13964, 8739, -6568, -12691, -1870, 13413, 14280, 435, -10313, -6501, 6937, 14436, 5837, -9069]
744i069j607J3253Q899p679j4203j424J3504Q984r773j4335J476J4756Q050p797
758C035j3130j309J1871R860k467r289n761L350R843N136o232r501p07Q474N815
773H988n053r728J44R315K971q311p534L167R373L062q048q241K938R176M190
788F409m444o522j186O294N721j843n506j184M309M019k233o120n63O855L775
803G781n794p927r31P696O787l748j0755m216P097R408O53r344p612M581J0976
818D652K541p959o924L442R957L182q135p823M530J0329K503q332r356J448J0888
833D943O194p004j1622k670R041J0195k372j3073o469Q607J1476l40j1234p411
847a1739O971J2554J286j1210q246N669J2953M538r996j2116J984J3345P581o825
$$ y = [-9069, -10676, 2577, 11476, 3797, -10406, -11830, 1674, 10658, 885, -13450, -11974, 2782, 10832, 3035, -10095, -11404, 467, 10327, 7860, -1429, -7190, -3840, 6003, 11139, 4907, -4594, -5301, 3173, 8988, 3935, -5793, -5649, 3666, 6637, -1674, -9208, -6041, 3332, 6394, -1654, -9895, -6957, 2219, 6409, 1965, -4557, -5743, 551, 6272, 4429, -1077, -2261, 2048, 6067, 3834, -2286, -2849, 4006, 7781, 1987, -5940, -6871, 825, 7612, 3864, -6891, -11107, -4010, 5398, 6051, -3293, -10905, -6324, 4652, 7193, -766, -7690, -4248, 5709, 8891, 756, -7067, -2537, 7792, 10295, 1963, -7393, -5945, 4943, 11137, 4133, -7489, -10159, -1118, 9077, 6705, -6368, -12837, -4230, 7246, 6906, -4328, -11739, -4768, 7786, 9072, -2138, -10384, -4715, 8238, 12776, 2780, -9336, -7352, 5993, 13574, 6749]
861F749j3156l959J0025J0938l191j2442n636O995R676m93j0170n743O716R155
875E464n66r002n879N625J1610K419j0392r067L982J2487N987p600j1770j039
889g741J0749P820m075j0137m017O272P666k090q492l020N431N682j627p652l399
904h630O367Q162j245q537m855N175R684K616p866p374K753Q130L614m208o585
919b799l13N822K722m022m676P46M746J916n207o082J914P494K773n497p289k54
935h006P724O601l058p906k140N640O553n7n960l103M200N004j339m881j933L889
951A228M890j841p436l125N382O684r10p893n973L989Q881J706p083o217J944
966e774P785M002n101o822J639P851L621m810p027K86Q445N603n233r331j623
$$ y = [6749, -6407, -10366, -341, 10597, 7406, -5036, -10672, -3677, 5999, 5506, -4664, -10407, -3691, 5464, 4898, -4104, -9983, -4358, 7252, 9671, -721, -9788, -5806, 6681, 12668, 5068, -6702, -7741, 3008, 10828, 6753, -3384, -7401, -1129, 6537, 4447, -4045, -7065, -1634, 4048, 2421, -5231, -8630, -2263, 5899, 4654, -3883, -8738, -3563, 6121, 8737, 871, -6503, -3750, 4380, 7994, 3786, -2799, -3112, 2710, 5432, 1410, -3266, -2520, 2226, 4142, -1065, -7147, -5233, 2261, 5034, -463, -7752, -8006, -282, 6319, 3261, -4645, -6785, -1145, 5408, 5351, -609, -3712, 488, 5492, 4153, -728, -2661, 1228, 6118, 4277, -3159, -6284, -902, 5782, 4872, -3021, -8994, -5005, 3876, 5582, -1501, -7718, -5774, 2011, 6013, 912, -5910, -4271, 3580, 7201, 2391, -4636, -4350, 4095, 9698, 4465, -4866, -6489]
981f489P733P548k313j0326n177O017Q426k8p807n924L088Q081J584o687m970
996g244L432P529J995o472o485L416R651L287o942q423N31R589O741m930j0118
1011d443k668P080P291j323q519n022M756O835n00o661l749L785O674J11p064
1026c417m183M881P828J257o838o328K779R327L501n810p378kO795N248l497p403
1042c240j326N585L773k968n989j206N622M357l851o865p90O102N942j651p748
1057d253l875N778P982Q43o590n683K717P883K644n689n453J590N775K241m774
1072A136n731J541O552J699n743n896Q74O835M424m524p580r87O605O007j532
1087C680p068l245N294O888n90o089l110L904O175P4o507m161L970O642N78o659
$$ y = [-6489, 1244, 8792, 6479, -3847, -9024, -3007, 5419, 5391, -2416, -8340, -5252, 2829, 4413, -2274, -7244, -3812, 3717, 5712, -760, -7245, -3829, 5822, 9109, 2167, -6256, -5725, 3864, 10605, 5675, -4443, -7111, -31, 7260, 5937, -2582, -7604, -2848, 3987, 3487, -3174, -6923, -3138, 3536, 3647, -3417, -7600, -2719, 5109, 6366, -472, -6800, -4021, 5306, 8807, 2997, -4381, -4383, 2412, 7660, 4163, -3240, -4566, 1019, 4792, 1824, -4165, -5371, 251, 4608, 757, -6108, -6898, -796, 5146, 3495, -4253, -8128, -2350, 5632, 6475, -115, -5798, -3081, 4802, 7446, 1757, -3696, -2106, 3669, 5910, 1136, -4595, -3054, 3498, 5197, -546, -6442, -5568, 1267, 5691, 1167, -6413, -7400, -795, 5212, 3680, -3388, -6633, -1339, 5549, 4959, -1130, -4240, -336, 5839, 5913, -594, -4755, -785, 5857, 6435, -224]
1103b24o247K067Q045K914o071p138N7O507M851l008o630q94N204L958j695m428
1119b732r09M551L955k281n111p24M782M800j208o743m002M516P136K53o859n931
1135f507K136P226K229n641n326J535N008J859l347l825J464N216J349l889l494
1150d007J502N464L323l688o098l07N783M875j678o811l521M441N946j002o067
1165a845l223L176M936o12n558k747M414N106j156n800l417M193P341Q05o563
1180i50n032K638P072L455m102o542n83N760M242j968n687k529M154M696j944
1195B680o226j692M552M804j747p101k892N874O785j169p105l803M084P299J367
1210E710n663m451K225N194K421k978m656l3M769K668l143m967o66M943M102l278
$$ y = [-224, -6471, -4404, 3641, 6555, 484, -6654, -6597, -90, 4761, 1753, -4877, -5771, -567, 3391, 1696, -2732, -3641, 910, 4865, 2584, -2527, -3251, 1531, 6331, 5123, -1620, -5622, -1106, 6030, 6283, -576, -6507, -4371, 2855, 5084, -557, -5883, -4348, 660, 2519, -828, -4653, -3189, 2027, 3376, -513, -4007, -2505, 2959, 6282, 2594, -3504, -3811, 1972, 6847, 5169, -1642, -5163, -722, 5224, 4222, -1845, -5068, -1892, 3044, 2432, -3126, -5873, -1459, 3647, 2491, -3309, -6726, -2533, 4808, 5613, -950, -5982, -3344, 3728, 7183, 3081, -3461, -4044, 1716, 5958, 3990, -1697, -4226, -72, 4624, 2680, -3546, -5238, -686, 4118, 2371, -4730, -7622, -1748, 5037, 3868, -3237, -7040, -2956, 4343, 5710, 47, -4404, -2179, 3015, 5436, 2458, -2198, -2231, 2538, 5206, 2063, -2904, -3570, 1373, 5475, 2197]
1226B197p051j535N869N297j783o931l350M649O375k78n121k776K657M451P85
1241C455l554k274K544L484k83l519k540K048M864O61n058m455J344N426K764
1256D907l763o343n92N265M097k016n059j677L859M378j344m512n87M221L400
1271D234j697m752j110M998M344k159n536k220L473N039K15n298l928J717M378
1286A698J644l203m433K48M663K202l235m176P53N284L049l806n771R60O687L854
1302F418l690o121j006N646M997j950n589k414K863M212M67m344l557J971M040
1317A943L97l881l311J742N196J281m930m173K153O108K692m154n830P30O267
1332B230L679k950n006j106M118M006j597m864j379L541L114j456m891j979L918
$$ y = [2197, -4854, -6389, -520, 4777, 2994, -3937, -7287, -2638, 3737, 3459, -1662, -4438, -1781, 2670, 3455, -99, -2373, 171, 3655, 3372, -147, -2687, -639, 4225, 4886, -172, -4627, -3283, 2143, 4907, 1144, -5199, -5791, -526, 3571, 1555, -3504, -5181, -1322, 3056, 1712, -2800, -3387, 834, 4234, 2537, -2215, -3325, 1673, 6017, 3858, -1678, -3898, -425, 4614, 4829, -469, -4397, -2680, 1698, 3342, 139, -4294, -4046, 617, 2819, -416, -4592, -3839, 1445, 4494, 688, -5083, -4123, 2564, 6418, 2728, -3393, -4399, 1247, 6244, 4294, -1295, -3709, -846, 3366, 3833, -511, -4068, -2097, 1943, 2340, -1541, -4852, -3110, 2086, 3367, -1563, -5736, -3583, 2525, 5217, 1063, -4767, -4037, 2230, 5909, 2959, -2047, -3153, 965, 4971, 3374, -1490, -2869, 672, 3786, 2330, -2561, -4540, -622]
1347f22M358j334n404k938L007N782J411n287m693J943N753K622k888m623%M628
1363A715K701k365l723J74L698K164k871m653K74M833K573l251n303j286M436
1378h84M882j461n671k841K942N280J299m210l695J766M492J512k606k987Q79
1393a303M129J580l517l533J479M347J658l640m828K24M782K744k706m588j364
1408d536L242L739q01m146j416K643K968j30l029j571K799L673o27l830j831K703
1424a50M480L98m813l489K288M390J030l276l940M2L760J847k322l245o0K659
1440d01J888j752l271M47L890K082k245l668k63M276L811j948m792j094L611L730
1456D301n15l963k564K357L232ml372k313J332L655L13m207k942K401M548Q33
$$ y = [-622, 3736, 2402, -3002, -5940, -2933, 2849, 4260, -1027, -5720, -3777, 1976, 4598, 1710, -2913, -2913, 1715, 4416, 2051, -1672, -1498, 2200, 4364, 1493, -3160, -2886, 1947, 4520, 1269, -4034, -5320, -884, 3998, 2537, -3134, -5975, -3033, 2247, 3546, -664, -4359, -2593, 1899, 3411, 805, -2182, -1303, 2826, 4406, 889, -2644, -1165, 3182, 4840, 1200, -3628, -3404, 1378, 4122, 1416, -3172, -4536, -1294, 2445, 1644, -2502, -3918, -1275, 1693, 1563, -1466, -3037, -238, 3435, 2808, -1022, -2853, -150, 4330, 4728, -85, -3574, -1286, 3104, 4134, 858, -3082, -3040, 720, 2567, 245, -3000, -3060, -401, 1487, -265, -3536, -3089, 801, 2883, 638, -3030, -3293, 983, 4794, 2846, -1946, -3040, 571, 4301, 3786, -177, -2741, -384, 2848, 2844, -528, -2841, -1509, 2146, 2459, -1748, -4690, -2289, 2259, 3092]
1472C092m067m305J566N580K685l437m625j12M311L865j479m438j220L118L107
1487C641r06l644j819K899L460j547m791j638L407M306n99n538l356L295N452
1502B622J150m320m518R50N562L213k951m465j34L920L297j497m245r47M058K873
1518D568j987m574j260L859L665j685n255k002L098M333L04m285l837J737M896
1533A575J409l031l340P44M003K043k687l192R76L749J787k388l999oM340K606
1549D589k626m370j167L206L647q77m361k353K341L490K18l117k317J816L486
1564A605n7k800j259J820L017O31k964k517J774L828J033k845l378K74L711J923
1580C796k376l412l38K480J952j320l111l61K704J515j766k564k07K985K618j331
$$ y = [3092, -975, -5280, -3714, 1866, 4551, 1114, -3511, -3623, 688, 4553, 3074, -1364, -2584, 534, 3641, 2735, -909, -2728, 171, 3631, 2084, -2707, -4345, -938, 3368, 2769, -2769, -6125, -2830, 2622, 3772, -548, -5066, -4116, 1446, 4659, 1708, -2757, -2891, 1029, 4326, 2829, -1416, -2363, 1695, 4568, 2581, -1993, -3253, 606, 4271, 2586, -2669, -4671, -1573, 2760, 3064, -1221, -5058, -3321, 1575, 2984, -47, -3387, -2643, 1360, 3403, 716, -2476, -1500, 2249, 4036, 1648, -2351, -2357, 1983, 4589, 1963, -2407, -3574, -368, 3279, 2402, -1959, -4312, -1971, 1519, 1737, -1380, -3697, -1881, 1605, 1548, -1252, -2511, -691, 2326, 2957, -7, -2524, -750, 3078, 4111, 1266, -2112, -1838, 1873, 3796, 1420, -1992, -2330, 150, 2102, 782, -2329, -2690, 14, 1529, -237, -2801, -3008, -23, 2595, 1264]
1596A264l649p79L035L371o6l590k570K202L860L05k821k427Q09K717Q85k627
1612h1k185J139K445J91k605k436J126L833J142l234l312N39M213K897j909m515
1628b752p25L879L376q97l371j867K356L347l87l358j604J857K795j38l556k480
1644c525K172L739Rl650l119J372M185J939l103l672N45L740K512j566l512m34
1660b368L304K472j457l097p76K839K876j350l967j503L022L346p04l996k753
1675d112K072L987O53l385k894P35L461J895k383k891O97L160J461j775k668L73
1691a614L471J793k302l166m7L256K465j607l936j281K752K655m75l178k016J482
1707a748L136M0k792j676J582K740K60k681j820J923L441L93k983k323J154L778
$$ y = [1264, -2385, -3164, -129, 3242, 3176, -414, -2984, -782, 3078, 3383, 562, -1865, -1056, 1661, 2546, -81, -2266, -1127, 1318, 1509, -1096, -3532, -2406, 1427, 2569, -665, -3977, -3438, 775, 3672, 1763, -2752, -3477, 402, 3778, 2881, -490, -2357, -1, 3346, 2959, -399, -2003, -146, 2649, 2511, -1045, -3525, -1353, 2386, 2395, -1255, -4374, -3002, 1183, 3122, 19, -3653, -3108, 632, 3144, 1578, -1934, -2368, 936, 3408, 1951, -1146, -1922, 917, 3793, 2443, -1524, -3027, -5, 3341, 2637, -1359, -4112, -2040, 1947, 2600, -785, -3679, -2944, 517, 2412, 29, -2862, -2165, 995, 2456, 681, -1987, -1614, 1857, 3650, 1348, -1818, -1865, 1391, 3856, 2249, -1687, -2968, -216, 2439, 1964, -1214, -3230, -1748, 1388, 1428, -1364, -3040, -1458, 1282, 1542, -1139, -2959, -1036, 2405, 2798, -185, -2508, -1354, 2424]
1723B424J539k552l363J20K933K123j250l213j101K226J933j159k374o84J939
1738d59J961j123l017m24K894K434p49l316j554K611L764K58l350k457J291L527
1754B291J463k548l024N28K742J158j860k576K5K644J213k190k581J61K702J844
1770A992j494l215n28K847K848o45k992j681K066L475K10l032j694J683K566K85
1786B691k584k069J585K585k1k776k078J103K886R58k721k818N01K868J924j339
1802F95l041o29K609K590p95k519p18K068K145n09k691n45K207J908p72k742j455
1819b194J974K862n38l062k011J289K738Q48k392k431O01K769J011j548j952K29
1835a807K527J447j726k273N53K609J646j421l049m51L045K157j029l220j539
$$ y = [2424, 3963, 1411, -1952, -1832, 1101, 3224, 1974, -1239, -2340, -114, 1819, 660, -1714, -2398, -459, 1502, 379, -2638, -3062, -168, 2266, 1517, -1799, -3353, -742, 3022, 3280, -70, -2527, -1236, 2291, 3754, 1206, -1818, -1290, 1452, 2610, 750, -1826, -1801, 843, 2056, -134, -2715, -2554, 148, 1992, 498, -2717, -3245, -398, 2450, 1805, -1187, -2868, -802, 2673, 2883, -149, -1843, -160, 2406, 2691, 107, -1962, -377, 2208, 2187, -589, -2667, -1564, 1322, 2280, -441, -3259, -2758, 110, 2034, 695, -2346, -2975, -366, 2224, 1429, -1090, -1808, 260, 2405, 1896, -795, -1340, 867, 2775, 2003, -739, -2194, -220, 2642, 2104, -958, -2969, -1680, 1058, 1906, -486, -2917, -2316, 453, 1464, -84, -2036, -1807, 720, 2167, 441, -1832, -1279, 1330, 2976, 1555, -1494, -1945, 1100, 3257, 2228, -992, -2531]
1850b531J903K933k94k983j640J325K232K22k212j488J268K336pj918j387J225
1866a016K701R09k467k469J062L089J684j833l198n35K973K324j418k971j073
1881b238J958K225n66k851r87J807J903n12k341j211J793K752k30k595j553J486
1897a160K930R79k241k428P03K845J205j546k402j96K360J477j738k352o1K003
1913C78J465j289k668o45K432K282j163k636j134J912K938j5k643j470J391K475
1929A610P07j767j827Q21K136N16j766j567N70J949Q09k127k317N84K409J097
1945A837j588k696m09K656J883j123k304n30J741J914j46k040o22J572J629j62
1961A612j820j038J536K087k35k490j445J249K298L85k318k134L93K590Q25j467
$$ y = [-2531, -628, 2305, 2011, -972, -2612, -1287, 945, 1167, -1045, -2533, -1265, 1071, 1064, -854, -2241, -1016, 1685, 2594, 127, -2342, -1280, 1809, 3493, 1660, -1538, -2073, 900, 3224, 1806, -1165, -2238, -280, 1945, 1379, -1472, -2459, -652, 1251, 739, -1602, -2813, -1020, 1732, 1502, -1093, -2646, -1160, 1770, 2749, 508, -1920, -1217, 1628, 2833, 1287, -1115, -1311, 1049, 2526, 788, -1564, -1625, 378, 1843, 554, -2114, -2759, -327, 1955, 792, -1844, -2978, -1066, 1872, 1857, -786, -2256, -865, 1610, 2317, 550, -1277, -456, 1680, 2196, 430, -1137, -567, 1382, 2191, 64, -2253, -1669, 740, 1837, 249, -2447, -2856, -200, 1683, 560, -1744, -2274, -533, 1381, 1235, -805, -1427, 145, 1774, 1612, -208, -1246, 290, 2377, 2142, -348, -1793, -544, 1754, 2139, -179, -2313, -1920, 670, 1495, 28]
1977B8k098LJ940J427j172j661J60J627J373r79j968J11K307J501j280k369m66
1994a516K105K189p04k891j329J709K144jk132j944Q58K223L73j693j464N65K001
2011D93P52j692j714R10K420R06j549k096J65K433J831j381k499m39J835J878
2027B253n69k271j081J470J610m02j919j198J294K051j96k347j249J396K333O16
2043A791k247j975J039K772R73j621k037o2K310J555j090k122k70J487J181p02
2059I82k088m90J791J334j096k139o52J742K063m01k550j213J704K222L28j797
2075b60j696R25K208P15j366j418L35J825P65j351j791M75K000O12j559k068K5
2092a624K048J481j378k384n38J812J930l46k163r69J417J825j3j429q32J052
$$ y = [28, -2070, -2067, -127, 1300, 128, -1533, -1373, 254, 1627, 648, -1320, -1209, 1098, 2599, 1319, -1050, -1516, 589, 2778, 2074, -817, -2146, -437, 1707, 1706, -426, -2370, -1512, 711, 1084, -609, -2073, -1508, 493, 1245, -447, -2161, -1251, 1169, 2075, 526, -1570, -1405, 1028, 2859, 1478, -1021, -1460, 375, 2253, 1684, -587, -1668, -198, 1412, 1010, -909, -2107, -813, 1238, 1042, -1305, -2554, -1158, 1175, 1791, -456, -2431, -1392, 1380, 2353, 732, -1305, -1367, 943, 2498, 1408, -714, -984, 503, 1684, 982, -1106, -1596, 195, 1529, 433, -1706, -2358, -616, 1447, 1046, -1504, -2717, -1013, 1209, 1537, -260, -1956, -1031, 1177, 1892, 526, -892, -557, 1268, 2033, 682, -1109, -634, 1366, 1978, 419, -1649, -1624, 424, 1905, 527, -1857, -2395, -583, 1347, 1001, -1162, -2131, -714, 1111, 1098, -331, -1163, -111]
2108a11J540J40j855q30J269J858p7k035j585R95K322K89j847k009L0K131J239
2125A464j268k084r3J559J371n61j776k52J678J337p25j656k40J644J765m90k205
2142e32r67J718J861o9j996j652Q83J923M01j690j568L51J749O18j316j549M96
2159a339J827P12j311j610J90K141J475j197k155k83J955J781m32k164j059J431
2175c8J703r4j632j158N77J560J14j811r55Q80J398K38j597j413R05K183M73j573
2193b40j564K78K198J336r34k058j48J641J341m62j601o58J197J184n07j633m75
2210a105J171J265m95j972q85J471J590j21j850j259R29K114N49j370j352L66
2226i54J527R17q49j420M45J377M79j023j231J76J457P10j219j904J11J581J212
$$ y = [-111, 1429, 1569, -286, -1116, 153, 2011, 1934, -101, -1686, -691, 1631, 1920, 73, -1936, -1906, 225, 1464, 196, -1888, -1981, -422, 949, 388, -1388, -1640, 38, 1375, 650, -1006, -1246, 398, 2163, 1673, -532, -1499, 219, 2080, 2011, 15, -1637, -754, 1169, 1570, -120, -1688, -1337, 412, 1030, -286, -1835, -1339, 488, 1200, -111, -1721, -1531, 610, 2085, 888, -1267, -1550, 405, 2186, 1754, -410, -1469, -38, 1665, 1571, -61, -1219, -642, 918, 1032, -779, -1734, -854, 544, 782, -815, -2228, -1323, 860, 1333, -240, -1804, -1526, 672, 2008, 1074, -984, -1132, 509, 1850, 1388, -213, -871, 326, 1510, 1003, -630, -1105, 66, 1331, 836, -1136, -2021, -550, 1040, 919, -931, -2190, -1261, 853, 1402, 32, -1320, -954, 573, 1490, 641, -779, -334, 1043, 1522, 499, -732, -556, 901, 1611, 392, -1512, -1401, 180, 1392]
2243A392q03k052p72J704J537k74j573r99J047J567K92j575o10Q87J472K6j225
2260D1j047R85J666L5j545j331O22J710O20j419j836R9J489J039p64j603m81J474
2278b46J231p15j565k1J165J424m16j807m44J572J625k70j693j182J065J987K17
2295A927j625j587N29J472O68j160j579J12J492N39j051j229K39J436Q99j232
2311a50j462K58J754J175m98k011n84J653J816k84j724j046P30J748K81j467j344
2328a155P48J234J42j334j094O07J497K41j515j231N96J657R86j131j725q2J794
2345B35J401n81j580n90J307J409l01j456m38P10J054j76j476o48J082J116l02
2362G66j596j021R97J635K69j566j378O89J625Q74r68j659K34J538Q41p19j040
$$ y = [1392, 589, -1463, -2235, -531, 1006, 732, -841, -1840, -793, 774, 1066, -509, -1119, -232, 1240, 1266, 41, -1006, -21, 1645, 1680, 135, -1196, -574, 1136, 1756, 337, -1499, -1400, 89, 1128, 364, -1239, -1720, -246, 985, 270, -1295, -1316, -151, 1273, 857, -950, -1394, 178, 1803, 1533, -160, -1342, -277, 1710, 1927, 302, -1285, -756, 716, 1384, 224, -1355, -1243, 249, 788, -263, -1492, -1253, 183, 1082, -150, -1612, -1354, 400, 1575, 1077, -934, -1518, 135, 1951, 1667, -57, -1103, -373, 1375, 1656, 189, -1155, -407, 827, 969, -365, -1459, -852, 645, 886, -629, -1860, -1264, 393, 1379, 248, -1477, -1559, 235, 1636, 1055, -525, -1115, 192, 1601, 1300, -156, -594, 116, 1170, 994, -482, -1130, -48, 1068, 766, -830, -1851, -854, 781, 1050, -516, -1894, -1205, 420, 1294, 326, -1333, -1099, 439, 1280, 561, -479]
2379d79j13J325Q41r46j228P8J241O71o77j644m27J254J334m69j673q13R06J482
2397F63J49j358r04P07J273K31j007p91O76J397K54j317r32O81J449O68j272j584
2415a017Q3J632P71p93j454o83J219J151m19j370n23Q34J065k37j131m58J199
2432a31J089k89j295o14J148J602nj549j015O84J487P28j156j525J5J342O71p76
2450D11j218k35J002P75p84j253N8J268Q38p27j323k36J486J271l81j563n15R24
2468b02J548K32j383j053O93J166K12r20j046L47J104J96j225q52M34J131L24
2485G06j000j345L49J495Q19p45j446k47J330J351l15j401m90J026J023k2j142
2502e4n97Q47J024k89j239o95P42J163O0j543q79N88J367L92j066j365K48J462
$$ y = [-479, -592, 733, 1574, 628, -600, -522, 719, 1390, 713, -931, -1358, -104, 1230, 761, -912, -1725, -819, 663, 812, -546, -1450, -743, 530, 761, -246, -1037, -361, 1036, 1290, -27, -959, -278, 1171, 1839, 567, -1017, -934, 698, 1469, 676, -778, -1461, -242, 909, 490, -880, -1403, -569, 496, 259, -872, -1330, -131, 958, 669, -626, -1240, -92, 1510, 1505, -44, -1059, -375, 1112, 1840, 684, -841, -826, 516, 1187, 411, -807, -1042, -40, 735, -49, -1302, -1244, 24, 862, 135, -1188, -1424, 62, 1333, 952, -611, -1126, -202, 1346, 1578, 195, -858, -165, 1001, 1213, 293, -753, -406, 698, 894, -331, -1183, -749, 382, 706, -294, -1639, -1290, 205, 1024, 279, -1167, -1414, -84, 1267, 952, -449, -939, 87, 1110, 1088, -54, -651, 196, 1220, 931, -308, -1003, -261, 902, 962, -581, -1460, -872, 495, 887, -179, -1544, -1296, 166]
2520A66P03o75j095R1J135P94n86j138J76J180O41o75j296k02J246J061o56j567
2538f97n59Q88J284J56j603j087P17J192K49p68r59K38J166N59r64o42M24J139
2556G33L66q86j023L82J382N96q22j458j36J209J019n39j512m86Q03J022j52j055
2574e57o29O81R51j48r92l83P56J078M5j174q18Q93J307K67q95j209K12J463P31
2593A579r09j172k87R87P21m82j098k44R48M30m67r36k21R48Q95n34j182k77J039
2612b62J267J3j375o98Q07J228L87r77r82J62J261L30q87q55K89Q40K23p71j128
2631a128K84J105M79q42j137o2J146J105o69j241j90R52R83j5r24o57P97J023
2649A009j30q33o25P62Q86K7j400o86P92J040J9j045j122K21J371N84q88j106
$$ y = [166, 869, 194, -901, -810, 325, 1119, 533, -605, -429, 751, 1392, 717, -579, -781, 465, 1526, 870, -697, -1256, -368, 916, 1072, -531, -1618, -901, 291, 540, -228, -1187, -949, 217, 776, -188, -830, -406, 733, 1099, 213, -810, -428, 954, 1550, 728, -730, -866, 343, 1362, 823, -689, -1175, -372, 650, 498, -557, -1186, -505, 446, 298, -694, -1077, -321, 757, 802, -372, -1190, -297, 1010, 1277, 382, -827, -615, 848, 1579, 670, -502, -789, 198, 919, 437, -661, -905, 43, 473, 6, -930, -1151, -203, 692, 158, -1024, -1301, -262, 1005, 1018, -357, -1055, -248, 980, 1367, 390, -592, -430, 831, 1161, 274, -581, -292, 548, 771, 0, -1128, -844, 261, 740, -102, -1239, -1301, -155, 950, 281, -960, -1150, -198, 785, 770, -154, -811, -14, 1009, 879, 46, -579, 183, 1069, 1096, -304, -990, -198, 842, 861, -184, -1306, -1085, 286, 870, -18, -1124]
2667a124n2J068Q12l93r80l4Q12O64k28r13j82R49Q85n01j114k80R54Q58k46j262
2687c07q79P45J161J76j187r76K43J116N68q95q37K34R32M16n15p70J33J141N44
2706A043o62r05j19J174Q83m24j432l96J013Q74j53j128q05N63R99q2p87o52M88
2725e08P13J57q38n82O38R76J08q00p76M38J305M88r79q88L3R67P49l84j173k94
2745f50P67O50l63p51m81O44O86l09j025k48P59Q46j54r84o50Q15J073J32p82
2764b5p44K91J199M33q74p27L09P30M04n66q55L4Q35L79q10r20K7Q84Q61o80j266
2785a081j85R45R12r8j031n65O91J107l0p81m11M52P17K58p41o84N59Q27M5q37
2805F9q66L41J099K43r91r66J22R71P06n70j182j51J003P27k98q18k02P02Q71
$$ y = [-1124, -1176, -108, 704, 311, -669, -703, 109, 773, 545, -368, -550, 399, 1284, 783, -331, -611, 343, 1201, 955, -307, -1186, -441, 720, 896, -291, -1267, -1024, 92, 660, -235, -1072, -838, 94, 510, -5, -775, -642, 499, 1043, 381, -524, -643, 531, 1414, 990, -442, -838, 175, 1049, 896, -232, -1037, -474, 525, 443, -344, -996, -508, 205, 362, -476, -1058, -420, 556, 664, -136, -912, -474, 831, 1319, 340, -548, -515, 452, 1201, 817, -356, -650, 117, 767, 404, -347, -828, -184, 502, 193, -832, -1080, -321, 525, 371, -613, -1263, -448, 625, 757, -25, -769, -478, 721, 1154, 280, -447, -138, 592, 996, 430, -425, -391, 444, 823, 13, -907, -880, 4, 865, 185, -1081, -1266, -321, 591, 493, -538, -1103, -412, 695, 665, -116, -527, -75, 642, 900, 159, -525, 34, 861, 906, 69, -797, -456, 643, 886, -105, -1071, -949, 22, 728, 158, -1024, -1175, -172, 555, 257, -561, -763, -61, 810]
2824H10k09q67k77P08R07j78j007n92P28R97n4j087p44K31J152M09j007q98J50
2843h28Q99M41o29q00J26Q69M69m74q12J50R41N68l37j053j29J026P04k24j039
2862a32n00N68J003n9j072n34K38P98J74q07o80L82Q21K00p17o48K89J010K93
2881F27o20q00K15J036O20n06r65j21Q22P40l70q33m01O31O49k05j004j51M43
2900a93O43j26r22m93O35R00L9j050n29M48J058N12q30q27K92Q92M90m33o85j53
2920c32P28N56n91o99J9N84M62m23j052rP50O55l33j064l81P08J014j26q33n39
2940i06N03R00K97o65o52M22P59K05n62n58R5P69L65p87q64K87Q21M35o42j042
2960h20j43P85P22l28p95l98N05Q74K4p63m29N45P89k7n74m97N41R35pr85m54
$$ y = [810, 601, -266, -543, 165, 1072, 894, -113, -705, 23, 1020, 966, -121, -865, -634, 518, 927, -80, -978, -828, 71, 512, -117, -917, -791, 78, 547, 73, -739, -589, 352, 920, 583, -470, -599, 427, 1131, 907, -132, -632, -64, 939, 880, -192, -726, -488, 310, 484, -323, -1003, -621, 200, 400, -317, -965, -676, 334, 627, 7, -793, -578, 458, 1078, 572, -393, -514, 308, 1048, 678, -155, -556, 75, 724, 519, -485, -636, -193, 450, 324, -598, -1091, -456, 444, 483, -567, -1096, -648, 410, 922, 92, -735, -443, 449, 939, 506, -179, -332, 396, 952, 361, -338, -319, 265, 727, 304, -748, -757, -7, 648, 315, -749, -1130, -422, 592, 466, -367, -906, -403, 497, 794, 129, -523, -101, 658, 863, 301, -257, -162, 607, 972, 185, -679, -392, 429, 864, 222, -820, -963, -178, 544, 216, -579, -977, -472, 402, 426, -337, -766, -221, 568, 541, -33, -530, 11, 946, 939, -46, -500]
2981e00L21R38K36p93r20J75P85M06m54q73k04P45N20m11o45MM60O76l07o43j02
3002e86P93O33l38o89m00O44R13q7r23m06L27O52K85o94q39K23P01J54m48o02
3022f87J4P81J74n48n19J27R07L29l76q22j23R77O29k72p60l52N61P99j14p51
3042b6m29N07M46M8p34l99L96O64j88p25m23L13Q46J79p43o90L77Q70L85m48p82
3063e56M3Q36O08m43o98j0N75M82k40q68q6N83L96l01o81l67N46P26k10q32m64
3084i61M22P18L13o57q18N29Q02K57n01n17J26P51M18o10n77J61O75K72m38q71
3104e06K7O17N72m32q19j77L67P55q5p93l77M17O82O2n55m36L94P51j3n84l20
3125d53L63P18J97o56o66L81O92L40o77p12p8P47N70o09o94j54M70M40k08o47
$$ y = [-500, -179, 759, 995, 202, -718, -543, 242, 648, 194, -679, -883, -138, 382, -29, -674, -670, -210, 466, 159, -484, -586, 207, 840, 502, -187, -587, 57, 970, 883, -40, -446, -119, 533, 818, 124, -715, -492, 209, 363, -85, -687, -673, 108, 282, -266, -785, -658, 249, 578, 202, -620, -743, 234, 863, 591, -169, -521, 40, 839, 725, -26, -455, 52, 498, 546, -188, -587, -191, 473, 285, -440, -863, -550, 296, 475, -268, -958, -581, 289, 674, 226, -556, -513, 323, 931, 488, -210, -220, 355, 837, 597, -271, -357, 226, 622, 321, -360, -727, -181, 545, 335, -497, -961, -539, 179, 492, -165, -983, -454, 348, 605, 104, -413, -287, 464, 882, 272, -305, -144, 531, 803, 365, -506, -479, 138, 710, 278, -541, -718, -351, 404, 319, -474, -851, -434, 248, 310, -245, -681, -287, 464, 451, -133, -453, -90, 628, 825, 169, -497, -116, 576, 916, 239, -473, -551, 196, 766, 157, -537, -691, -221, 219, 11, -636]
3145f36n7N83N21k49o74j59O65O01mp42l83M55Q04J40o19p28K24P15K60n67m76
3166c26j60N65L30m56n95K00M43K17l55n39j37Q57N49m39o93n7O47O53k7p46l85
3187d54M25O85J07n69o25L67N71K0n85n18L53N15Q9o31n22K85O11K71n56n39P
3208f93P86M27l42o03k6N82N03r1o40j89M59N52l34n71j46M37L80m5p87l24L58
3229c07O03O5o59m89J69P91L27n84m53N9N45M84l91m16J8O06K14k56n13%N82M32
3251H27l87p63j35N14N58k27p59l89M90N79p7n46m64K70O84Q2m55m02L44N30K38
3272E12m52n36L46P05R5m18o75R0P99L89n27o04j86M86M50j58p18k38K85N61j44
3293F2m71j11K19O09j21n34k05M23O39R9o15n63L97Q27J47o01m66K7N81K75l11
$$ y = [-636, -693, -110, 411, 162, -512, -671, -6, 595, 591, -151, -534, -79, 725, 865, 246, -482, -258, 457, 717, 150, -326, -486, 79, 409, -47, -642, -442, 1, 218, -137, -676, -813, 44, 593, 154, -539, -596, 51, 704, 677, -69, -454, -29, 656, 763, 194, -431, -64, 507, 527, -58, -576, -223, 292, 381, -250, -772, -487, 124, 395, -161, -700, -693, 93, 520, 178, -425, -451, 131, 634, 543, -97, -286, 173, 725, 391, -180, -326, 111, 491, 446, -341, -665, -307, 296, 361, -298, -787, -618, 173, 500, -84, -537, -478, 67, 551, 160, -256, -238, 368, 582, 326, -187, -187, 395, 827, 440, -323, -458, 56, 614, 387, -372, -761, -271, 308, 231, -315, -779, -509, 175, 257, -198, -600, -256, 274, 512, 60, -476, -130, 575, 670, 252, -423, -333, 466, 855, 328, -276, -462, 24, 474, 316, -402, -640, -355, 206, 62, -409, -520, -301, 308, 187, -347, -552, -129, 510, 609, -6, -569, -172, 655, 802, 201, -265, -238, 343, 618, 307]
3314C07o59r4N74K25l86m21j08N35K98l32n35r0M72N40q2o37k45N91N19Qm21l92
3336c33K22O57R2m55m38J92M21J91n34m56J55M86J84m95n48Q6O05M03m31o17p
3357f20M40N37pn87l04N16N52j78k63k99L49M29j46m94k18L27N51j25o79l04K14
3378c09O24j8n20m04P2N27K60k28o17R5N67K63j52l86n3M40N14l99l95J6L99L89
3400F85j99o72k80M51N67j04o01m33K50N22J13m40l09K0M28K16l01m15L01M51
3420B50P9l42m08J46O48L86m75n79L1N33L84k10o13l76M36M78j77m76k25K58L61
3441A09K1n11k13K91M14R5k98l91K25O52J55m53m79J64O09K78l89n19L8N61J25
3462D84j53n09k43M15K63j41n13j50M74L97k52m82j40L02N60j01m76k16J67P67
$$ y = [307, -352, -446, 128, 353, -33, -454, -562, -27, 271, -61, -596, -686, -214, 326, 244, -393, -638, -47, 472, 480, 59, -333, -111, 546, 638, 183, -255, -63, 358, 549, 15, -441, -286, 200, 384, -111, -659, -573, 32, 435, 4, -613, -620, -180, 357, 350, -237, -541, -25, 527, 349, 86, -213, 136, 565, 419, -75, -293, 34, 585, 460, -219, -523, -309, 315, 297, -223, -627, -555, -28, 232, 4, -613, -518, 49, 312, 160, -226, -279, 161, 675, 276, -119, -103, 296, 685, 486, -186, -466, -15, 552, 448, -153, -586, -336, 186, 299, -141, -450, -430, -2, 214, -87, -502, -201, 250, 329, -13, -421, -275, 373, 759, 284, -295, -264, 269, 653, 443, -170, -546, -110, 368, 191, -285, -510, -252, 109, 130, -381, -594, -303, 111, 206, -92, -483, -258, 394, 549, 96, -383, -219, 390, 668, 279, -240, -202, 359, 484, 331, -178, -421, -6, 257, 116, -397, -547, -73, 324, 72, -410, -550, -248, 312, 211, -265, -481, -314, 453]
3482D53J48m76m21J20M57K59l73l29M1M08J50m11l36M2L50K36l38m92L4L87L58
3503B67j61m90j85L47N62q1l43k94K74M44J53m33j82J12M82o2l40k97J84M41J35
3524E33n91l69L0N66J89m10m83j9M97K89m8n38j8K42M00j0m02l2L51K15M8n28
3546h8j62L88L42Jn13l80L01N02P6n09m31L1N03J13k14m30O4M10K22k92k27M7
3568b46L62K85l56k69M5L94L04m2n71k22M31L81q5m50k56J45M15K7m45l44K66
3589b31K35R5l36k61J98L41J71l78k15R9M39L72k69m62k4M29L72j78m91q9K75
3610I2L17k20l32j00J43L50j35m03j70K87M45j14n62j15J72N63M7l49l85K00M78
3631B09K80k08m82O5M27J91j81l47p8K98K40k38m29j8K45L47k29n31j59L77L86
$$ y = [453, 601, 125, -296, -176, 281, 540, 167, -162, -121, 287, 437, 26, -310, -268, 82, 318, -20, -512, -478, -91, 267, 106, -384, -569, -222, 340, 259, -84, -378, -104, 340, 493, 60, -122, -10, 472, 410, 70, -227, -43, 398, 533, -58, -427, -397, 169, 358, -52, -535, -554, -57, 232, 184, -354, -372, -130, 270, 260, -142, -174, 177, 392, 440, -88, -250, 138, 480, 481, -32, -412, -111, 391, 467, -42, -473, -442, 61, 174, -40, -470, -406, 4, 226, -66, -293, -246, 116, 401, 45, -224, -179, 215, 519, 477, -94, -316, 115, 496, 411, -39, -295, -150, 265, 292, -153, -497, -231, 4, 99, -237, -498, -300, 41, 212, -166, -381, -282, 157, 529, 260, -202, -226, 203, 575, 397, -94, -183, 92, 409, 189, -143, -243, -100, 250, 115, -288, -458, -171, 274, 160, -402, -517, -345, 218, 265, -84, -469, -269, 209, 489, 281, -201, -136, 291, 482, 301, -46, -124, 174, 414, 176, -253, -271, -26, 321, 92, -439, -598, -221, 165]
3652A65k3m01j79J04M38J40k26k74J47L15J76k63k55J58L72L5k74l13R0L16K01
3673D49m20l38k6M82J97l34l78j06K21M09j03l64k4K02L04K7j53l03L20M10j13
3694C59l75j84J88M79M8l90m09J18M02J83l08n11m0L14L96l05l40J7K03L47j88
3715Dm23J01L58K97k83k34l9K78M72j39l33k11K00L12P6l03l84R7L05K3k34k79
3737c39Q6K72J41l71j98J76K95J98k32m54R1M53L00j40m19m8K58M81j21m43r8
3758a12J37L68l7l83j67J05K34%m52j18K19K73J65l67k99O0N01J80l13k85n6M65
3780A18K63j54j97j22J96L28j11m15m9K96J45q7l86j90K78K86p9m01k39J64M83
3801A27%l57k29K20L27J85k12l30R8K96J83k38k43K30J68J76k94k48k2L81K03
$$ y = [165, 142, -259, -438, -334, 104, 244, 18, -256, -109, 206, 382, 119, -136, 22, 394, 429, 155, -158, -68, 248, 449, 29, -309, -335, 147, 344, 10, -368, -474, -253, 156, 53, -311, -335, -133, 171, 198, 45, -258, 62, 472, 359, -16, -200, -12, 467, 515, 125, -284, -166, 236, 419, 111, -400, -440, -126, 270, -35, -375, -358, -155, 192, 4, -419, -318, 40, 337, 54, -180, -219, 59, 531, 392, 59, -152, 48, 360, 436, 133, -251, -154, 151, 174, -60, -339, -253, 19, 160, -211, -409, -233, 62, 260, 28, -426, -335, 118, 418, 278, -141, -189, 69, 550, 429, -14, -112, 25, 393, 356, -27, -194, -89, 145, 145, -307, -425, -206, 67, 232, -135, -434, -374, 127, 307, -6, -291, -347, 118, 381, 227, 30, -92, 104, 432, 321, -94, -143, 153, 298, 211, -175, -365, -87, 199, 120, -281, -520, -356, 127, 127, -230, -459, -239, 88, 273, 61, -269, -171, 125, 308, 70, -173, 57, 225, 401, 107, -141, -163, 218, 421]
3822D21j82l88k21L03L31j48l54j73K20J60J86l48k13K36K51J15l13q4J39L93
3842C31P4l54j81M0L76J41k73l12l7L63K22k22l92p9K10K13r9j67k35K41K69q5
3864D4k69j21K82L65k01k42j13K41L64P3l19k98J12L18P3r3k93n9K45J03k08k15
3886b11l4J88J46j81j56j45L99J57r4l86l8K95K86J17l86j51J57L78M8k41k90
3907a42J05K82Ol38m3mK53K4k30l39K09L06J12l54k65nM53J18j52k12J0K39L06
3930C39q2k08j43K05K44o2j71k00J18K47m9l48j07N0K71L4k67l35J61L46J57k62
3952f2j69k3K52K22k05k05O0L16J51j89j57j45K30L53k51k19j23J97L79k04l57
3973a49j97J80K72m6k36k03Q5K73O7q7k80J28L02J19j52l03J87L52k5j52j63l
$$ y = [421, 239, -149, -370, -67, 264, 116, -238, -411, -191, -31, 155, -193, -406, -170, 81, 196, -117, -201, -62, 331, 405, 51, -130, -90, 286, 427, 154, -158, -195, 168, 390, 168, -224, -303, -93, 120, 21, -146, -381, -140, 129, 44, -225, -346, -64, 301, 100, -142, -255, -14, 350, 423, 104, -194, -82, 236, 309, 216, -77, -136, 109, 212, 4, -211, -245, -57, 89, -92, -248, -393, 6, 163, 69, -317, -355, -60, 226, 343, -43, -194, -37, 341, 389, 148, -142, -37, 245, 251, -87, -130, -134, 119, 143, -87, -426, -217, 89, 201, -153, -418, -423, 30, 148, -4, -216, -206, 33, 339, 257, 49, -94, 111, 355, 293, 122, -78, 40, 287, 238, -110, -217, -167, 104, 138, -129, -464, -303, 43, 200, -62, -231, -254, -2, 220, 15, -190, -130, 186, 337, 148, -9, -154, 76, 429, 178, -41, -164, 33, 412, 208, -149, -346, -166, 106, 60, -176, -379, -294, -21, 46, -41, -321, -193, 109, 228, 76, -227, -40, 312, 287, 135, -28, -31]
3995c1K73K24k22l95l9J53L09p9k95k03J33K66o2k29j64J93K54L3k90j18J41L80
4017B32lk32k12J21L27J79k14k95M7K56J73j32k90j42K00J40m1l97K5K44J38j88
4039f4j65j06K47K15Q8n25o1L03K82M1k23m5l4L37P5j73k94J14J75N5j21l45J08
4062a16K80l5j51l15M8K73K13k04k69mK58J84m0k40r2K07K74p2j27j69J37K50
4084B90K7k04k03J63J91j0j85k92l2L67J08l04k14k5K20K94k07k46l9K24J89R
4106A21k17mJ52J98o8k29j5J16K57o4l36p0J56K54jl15k32N7K65Q5j62k56R6L09
4130I7k0j00k09L9K85J30j51k36MK43K37j36k57j09L20J64k8l14j65K10J51Nk20
4153f0j83J21J36l3j56j28Q4K49P6j85j85J31K76L1j06k26M1K69K11j66k83p2
$$ y = [-31, 242, 466, 244, -151, -190, -37, 272, 193, -102, -305, -172, 94, 32, -197, -361, -168, 86, 119, -171, -289, -148, 232, 229, -3, -215, -94, 233, 412, 198, -97, -50, 206, 379, 247, -43, -185, 15, 155, 114, -283, -258, -14, 124, -64, -229, -335, -88, 127, 215, -310, -371, -68, 214, 255, 32, -13, -47, 290, 365, 192, -102, 12, 187, 242, 121, -224, -116, 164, 129, -22, -337, -289, -16, 197, -7, -276, -280, -22, 162, 122, -118, -210, -3, 271, 199, 72, -97, 40, 290, 317, 113, -90, 73, 264, 254, 69, -223, -255, 112, 220, -84, -298, -323, -103, 191, -16, -262, -301, -77, 112, 121, -96, -100, 52, 250, 182, -47, -62, 54, 311, 247, -89, -159, -3, 251, 250, -65, -297, -240, 25, 110, -52, -308, -212, 97, 77, -23, -232, -193, 92, 222, 71, -165, -161, 82, 319, 183, -74, -183, 137, 301, 273, -41, -206, 4, 155, 160, -60, -243, -122, 14, -19, -175, -303, -219, 30, 106, -79, -264, -133, 143, 174, 68, -158, -117, 152, 363, 197, -86, -158]
4175a58K52J43Q9l55j54J21J49p7j67l2k5L17m7k41j31J55L00j01r3k10J58L55
4197B48lj77k07R3J90J81j63j85JP1K40j70j06k33L01R8j47k87j17K67K44j8l37
4220b16j00K55J79O6l40N7o1L93R3l01j24Q3K37J03j82k34Q7J68Q1j39j90k6R4
4243a7K25j07l41j06K40K46j8l28r7J37K16R5k17j64K50J35j0j16r3J43L03j13
4265B63k71o4j9K48J27k90j36j6J29J15m5k71o7K18K05j15j76j10J53L65r5k27
4287g9J3J72K28j96r7k15K25K49Kk52k32Q3J14K59k84k41J30K0K20j71j76O0J73
4310EJ19j71j87L8K16J99l7l31l5K87K10q8j66j26M4K72p5j67j54M3K55l7k18
4333a04j47J31J11R7k42j78Q3K62J83l04o7kK10K27n6k96M4J84N4L3l37J1J31
$$ y = [-158, 94, 237, 326, -29, -183, -62, 87, 10, -157, -189, -214, 103, 56, -185, -316, -161, 139, 38, -55, -265, -107, 248, 245, 68, -139, -46, 144, 325, 162, -23, -22, 49, 289, 119, 13, -220, 81, 179, 32, -255, -372, -105, 139, 121, -216, -316, -61, 118, 184, -156, -99, -160, 233, 326, 25, -99, -16, 221, 324, 142, -92, -5, 163, 244, 105, -85, -111, -17, 208, 101, -240, -346, -106, 140, 122, -206, -303, -166, 50, 145, -72, -236, 14, 149, 139, 23, -70, 73, 376, 263, -8, -72, -91, 157, 284, -6, -142, -158, -29, 86, 41, -230, -297, -79, 126, 11, -165, -275, -122, 243, 148, -79, -66, 106, 334, 138, 41, -174, 51, 300, 302, 50, -182, -99, 15, 274, -10, -251, -121, -101, 119, -52, -228, -168, 5, 124, -47, -234, -196, 20, 219, 182, -149, -184, 103, 313, 225, 59, -67, -23, 249, 174, 7, -147, -104, 151, 114, -104, -251, -120, -9, 88, -154, -332, -249, 13, 196, -108, -175, -177, 33, 260, 204, -92, -48, 136, 190, 223, -114, -103, 28]
4356B8K63j43k90n2J74J57j07j55j58J24L23j92j41p4J0L33j5n4j56N3J12K05
4378B45j39j66Q5Q8K28k26j44l6J94J05j59k74K2O1K58j49j54j48J83K43j6k29
4400a28j06Q6K00J55j76j65J72K45l4k10q9J01J10J60k63j13q0K55O8j60j68r2
4422b32J67J77p0k57j0J75L0L1j41n4J24J71jq5j32J10K22k2j42j13n2L06J8j59
4446F1j49P7J90oj62j27q7J48J54r7k27L5J65J46k6k82r9K84J77qn9j74R5J75
4470B04N1j74k43P0K44k7j15j08j5J82Rj65j10K3J13N1n3j41N0J11J73q2k64M8
4494a68J94K97j71j79j21K00J12L9j19k4nR7k4j53l3K2P2J7p5k79Q7J82Q0j87
4518a39m6l0K32J09m6j23q0J62Q5q4jm4J89N7j39j17n5K35k6j4j98j62J09K53
$$ y = [28, 291, 148, -142, -194, -20, 137, 30, -125, -283, -159, 164, -28, -169, -243, -233, 100, 85, 31, -125, -72, 40, 245, 106, -60, 25, 113, 341, 115, -29, -65, 129, 234, 75, -199, -177, -116, 142, -7, -161, -309, -126, 117, 101, -128, -234, -148, 52, 207, 31, -134, 38, 283, 249, 39, -50, 51, 161, 321, 58, -55, -135, 120, 188, 28, -140, -232, -65, 112, 42, -215, -225, -50, -20, 11, -130, -184, -60, 111, 110, 25, -107, 3, 225, 203, 61, -52, -104, 202, 220, 61, -88, -11, 179, 173, 11, -116, -203, -55, 99, 2, -225, -190, -25, 121, 95, -187, -286, -2, 175, 167, 108, -66, 29, 204, 255, 81, -162, -92, 152, 125, 10, -98, -113, 69, 78, -87, -197, -174, -61, -10, -63, -204, -154, -43, 130, 48, -216, -168, 26, 323, 152, -27, -148, 52, 164, 203, 84, 60, 55, 152, 128, -25, -58, -36, 36, 53, -22, -301, -214, -32, 48, -139, -185, -215, 17, 126, 80, -43, -123, 39, 124, 40, 39, -5, 184, 241, 102, -15, -70, 165, 139, 125, -73, -235, -126, 127]
4542A27j10q1k11P6K05L7m0j70N7K42N9j25l5j8J58N1j91j51P2J66J48j54j17
4565ej45K08J47j20k28j13J33J65m1r8q7N9J96o3k4j50J6L00J8j62j78J21J55
4588A04K41j81k24kJ52J40j35r6j81K03l2R0k42lL5J71lk15n4J87J91j9k33j19
4612b25J92K34j3j35j30J0K72L3p3j33j10J25K11k20j26q3K34K7j18j98P4O5J48
4635F1K4k90r2K49J33N1k18j42J54K16pn6j55J35R7J07k13p1KJ30P8j32j67N3
4659e3M6P4m0k45L1J57J52j70q7j22J93K10Lk41L5N4J49L4j22j18J38J06o7p9
4683C8k34J50J67M6k20j60M3J81J26q2k25J9J50J29o7j88m8J82J22o4j63Q7J33
4706A22JM5k33n0K58P0J3j76j60M0O9J63k24j15pJ18M2q0j15Q8J90L1j18r0k4
$$ y = [127, 17, -64, -275, -199, 6, 43, 3, -167, -110, 132, 191, 66, 31, 13, 171, 222, 31, -120, -48, 118, 266, 112, -5, -150, 58, 205, 85, -143, -256, -123, 42, 1, -97, -184, -125, 71, 8, -16, -166, -150, 150, 168, 6, -172, -51, 104, 345, 164, -60, -62, 90, 230, 95, -1, -182, 21, -11, 79, -163, -166, -131, 40, 37, -178, -232, -45, 146, 127, -106, -225, -33, 201, 188, 53, -77, -67, 205, 238, 165, 32, -78, 47, 258, 38, -88, -171, 63, 90, -28, -226, -152, -87, 61, 85, -205, -297, -48, 85, 136, -82, -224, -70, 146, 139, 83, -72, 63, 160, 267, 54, -17, -15, 115, 193, 61, -106, -53, -7, 67, 27, -218, -187, -30, 122, -48, -135, -257, -64, 146, 149, -92, -57, -3, 146, 180, 58, -60, 78, 184, 117, 38, -196, -46, 121, 167, -53, -213, -170, 11, 137, 55, -170, -151, -1, 128, 61, -127, -175, 7, 129, 65, -98, -11, 122, 123, 168, -65, -115, 143, 213, 226, 50, -110, -70, -1, 162, -62, -177, -184, -66, -24, -104, -219, -131, 59, 90, -28, -118, -142]
4731a42K08J44j67j47K0K00P1r3n2j65J99J65o0k82O6M3L3Qj16p2K8J70Nk14O4
4756h6k6K17M3j60j82J17K23K9m0j01j19J53J94k19n2qJ08K3l7nj58J30K7j30
4780e9j24kP7K49j18j89K3K4K15L5j33j58Q5J95K5l1j58L2Q9J12j16r6L3J09J12
4805B31k17j88O4J32J74k15j79K8Q9J32J1j37j29J23J03L3N5k36lK76q2j5l5Q
4829B3J86Rj74j33K4J74lo5j72qJ32R7q2k06jQ7J60n4j07q5K62K3m8m5j62K62
4855I4R2j8k15o4J52K19J4l18r8J28L7K73l29p7j3N9J93j90l4L2O5J31j20k32
4879b19Q2J64J75p2j45j15K17Q7l8k13K1J47K6R5k57p2OJ53Q1k44q6R1J55K6r4
4904b9j25k2K15L7m6k03J00P8J14k8j43rJ47J24m4j92l8J05O0P2k08j14O2J87
$$ y = [-142, 66, 210, 43, -104, -84, 116, 187, 94, 42, -123, 76, 241, 181, -101, -35, 8, 41, 49, -67, -139, -111, 59, 64, -150, -86, -112, 105, 148, -12, -194, -77, 146, 175, 135, 34, -85, 68, 262, 43, -9, -17, 91, 114, 77, 72, -86, 44, 71, -59, -183, -185, -108, 141, 23, -166, -143, -119, 96, 131, -2, -160, -75, 120, 145, 114, -44, -12, 77, 189, 73, -23, 10, 119, 231, 14, -174, -110, 22, 196, -19, -198, -170, -81, 51, 62, -75, -204, -81, 22, 55, 110, -126, -129, 147, 65, 50, 15, 23, 209, 218, 44, -89, -65, 109, 106, 41, -131, -139, -7, 90, 8, -198, -199, -112, 48, -6, -113, -198, 64, 87, 39, -6, -168, 94, 186, 168, -47, -111, 41, 260, 274, -44, -142, -14, 23, 296, -33, -110, -123, -64, 129, -61, -95, -63, 2, 133, 13, -219, -137, 27, 202, 130, -15, -130, 87, 174, 136, -77, -56, 91, 117, 212, -45, -117, -111, 42, 123, -121, -207, -116, 39, 65, -29, -154, -176, 39, 76, 30, -173, -73, 5, 119, 91, -52, -61, 86, 210, 166, -26, -64, 41, 101, 173, -35, -149, -87, 100]
4928A00o0j86j85K85K0J07k15p3J33J57L3j30m5j0J11J78j36j7k0O3N1n0j64n8
4952a11R0K01r0j94r7J51J74q9k32N9K6J00N2j76m8LK78J30k67k6R7J43Ok0j66
4977fO5J28j6Jk06o3J31L5Lj81j04J63J51j44m0j54J06J25N6j75m4J06Q8J30k14
5002e9o8J26K41m7j51o0l1J82J68l06p0J6J30K9j1k10m8K4J96j38r8L2R4J92j87
5027e4m6lM6J99L2k29mN8K46rj66j98J00J98p5l8j00m7J14N4j70j53J61j9Q9k3
5053c7k14R1J96J00q3j87nJ61J48o6p4k53L34O8o1L0j12j4J54k1j81r4Q1J30j6
5078G5j33j27P7J47K9j15j50RJ69J15K5k83N5J91L0Mq6p7J35J32j51m8n6O2J24
5103A53j18j92l4R4J62rr7k21J53J18j7q3m0P9K32j34m1n0j9J82J0K3j31q0J88
$$ y = [100, 40, -146, -331, -46, -26, 81, -134, -207, -74, 83, 116, -14, -59, -69, 42, 220, 84, 67, 47, 110, 161, 111, -53, -111, -21, 180, 90, -104, -201, -50, 124, 35, -197, -138, -112, -12, 40, -136, -184, -181, 97, 227, -40, -66, 31, 174, 180, 160, -6, 59, 187, 171, 172, -34, -97, 34, 69, 72, -109, -213, -50, 101, -43, -83, -237, -131, -6, 50, -125, -169, -63, 25, 155, -59, -127, -1, 240, 193, 42, -18, -49, 133, 301, -5, -75, -59, 71, 100, 89, -121, -169, -145, 51, -87, -185, -153, -59, 133, -54, -100, -103, -57, 142, 174, -55, -59, -1, 245, 236, 70, -128, -28, 170, 95, 57, -43, -90, 24, 78, -92, -245, -84, -103, -14, -37, -251, -160, 36, 136, 53, -134, -139, 22, 170, 104, 30, -223, 111, 179, 118, 148, 36, 22, 176, 155, -26, -120, -39, 91, 75, -58, -185, -108, 39, 68, -47, -197, -188, -19, 96, 121, -162, -107, 84, 114, 118, 32, -45, 90, 222, 71, 23, -33, 29, 153, 35, -157, -191, -97, 65, 56, -41, -262, -109, 9, -8, -91, -131, -52, 180, 46, 5, -45, -64, 118, 128, 151, 20, -60, 128]
$$ [...]
8191h9
##END NTUPLES=NMR FID
##END=
