##TITLE=1H ikalashn
Am-2-i-H
15.10.2024
##JCAMPDX= 6.0         $$ Bruker NMR JCAMP-DX V2.0
##DATA TYPE= NMR FID
##DATA CLASS= NTUPLES
##ORIGIN= UXNMR, Bruker Analytische Messtechnik GmbH
##OWNER= root
$$ TOPSPIN		Version 1.3
$$ 2024-10-15 08:51:00.750 +0400  Irina@DPX200
$$ Compression mode = diff/dup
##.OBSERVE FREQUENCY= 200.131392401
##.OBSERVE NUCLEUS= ^1H
##.DELAY= (6, 6)
##.ACQUISITION MODE= SIMULTANEOUS
##.ACQUISITION SCHEME= undefined
##.AVERAGES= 64
##.DIGITISER RES= 18
##SPECTROMETER/DATA SYSTEM= spect
##.PULSE SEQUENCE= zg
##.SOLVENT NAME= CDCl3
##.SHIFT REFERENCE= INTERNAL, CDCl3, 1, 17.95386
##AUDIT TRAIL= $$ (NUMBER, WHEN, WHO, WHERE, WHAT)
$$ ##TITLE= Audit trail, TOPSPIN		Version 1.3
$$ ##JCAMPDX= 5.01
$$ ##ORIGIN= Bruker BioSpin GmbH
$$ ##OWNER= Irina
$$ $$ F:/spectra/data/iren/nmr/1H/4/audita.txt
$$ ##AUDIT TRAIL=  $$ (NUMBER, WHEN, WHO, WHERE, VERSION, WHAT)
(   1,<2024-10-15 08:45:00.281 +0400>,<Irina>,<DPX200>,<TOPSPIN 1.3>,
      <created by zg
	started at 2024-10-15 08:40:47.437 +0400,
	POWCHK disabled, PULCHK disabled
       configuration hash MD5:
       BE 6D 3F 07 2A EA 11 49 91 17 2B D3 AF B3 58 0D
       data hash MD5: 16K
       63 8E 31 F8 E7 29 5A 72 98 53 F8 20 30 D6 A8 B6>)
$$ ##END=
$$ 
$$ $$ hash MD5
$$ $$ D9 31 04 65 89 6F 76 9B E5 8F C7 2C 90 74 FE CE
##$RELAX= 
##$RELAX= 
##$RELAX= 
##$RELAX= 
##$RELAX= 
##$RELAX= 
##$RELAX= 
##$RELAX= 
##$RELAX= 
$$ Bruker specific parameters
$$ --------------------------
##$DU= <F:/spectra>
##$EXPNO= 4
##$NAME= <1H>
##$PROCNO= 1
##$TYPE= <nmr>
##$USER= <iren>
##$AMP= (0..31)
100 100 100 100 100 100 100 100 100 100 100 100 100 100 100 100 100 100 
100 100 100 100 100 100 100 100 100 100 100 100 100 100 
##$ANAVPT= -1
##$AQSEQ= 0
##$AQ_mod= 1
##$AUNM= <au_zg>
##$AUTOPOS= <>
##$BF1= 200.13
##$BF2= 200.13
##$BF3= 200.13
##$BF4= 200.13
##$BF5= 200.13
##$BF6= 200.13
##$BF7= 200.13
##$BF8= 200.13
##$BYTORDA= 1
##$CFDGTYP= 0
##$CFRGTYP= 5
##$CHEMSTR= <none>
##$CNST= (0..63)
1 1 145 1 1 1 1 1 1 1 1 1 1 1 1 1 1 1 1 1 1 1 1 1 1 1 1 1 1 1 1 1 1 1 
1 1 1 1 1 1 1 1 1 1 1 1 1 1 1 1 1 1 1 1 1 1 1 1 1 1 1 1 1 1 
##$CPDPRG= <>
##$CPDPRG1= <>
##$CPDPRG2= <>
##$CPDPRG3= <>
##$CPDPRG4= <mlev>
##$CPDPRG5= <mlev>
##$CPDPRG6= <mlev>
##$CPDPRG7= <mlev>
##$CPDPRG8= <mlev>
##$CPDPRGB= <>
##$CPDPRGT= <>
##$D= (0..63)
0 2 0 0 0 0 0 0 0 0.06 0 0.03 0 0 0 0 0.0002 0 0 0 0 0 0 0 0 0 0 0 0 0 
0 0 0 0 0 0 0 0 0 0 0 0 0 0 0 0 0 0 0 0 0 0 0 0 0 0 0 0 0 0 0 0 0 0 
##$DATE= 1728967499
##$DBL= (0..7)
120 120 120 120 120 120 120 120 
##$DBP= (0..7)
150 150 150 150 150 150 150 150 
##$DBP07= 0
##$DBPNAM0= <>
##$DBPNAM1= <>
##$DBPNAM2= <>
##$DBPNAM3= <>
##$DBPNAM4= <>
##$DBPNAM5= <>
##$DBPNAM6= <>
##$DBPNAM7= <>
##$DBPOAL= (0..7)
0.5 0.5 0.5 0.5 0.5 0.5 0.5 0.5 
##$DBPOFFS= (0..7)
0 0 0 0 0 0 0 0 
##$DE= 6
##$DECBNUC= <off>
##$DECIM= 32
##$DECNUC= <off>
##$DECSTAT= 4
##$DIGMOD= 1
##$DIGTYP= 9
##$DL= (0..7)
0 120 120 120 120 120 120 120 
##$DP= (0..7)
150 150 150 150 150 150 150 150 
##$DP07= 0
##$DPNAME0= <>
$$ [...]
##$SW= 21.9925939549014
##$SWIBOX= (0..15)
0 0 2 0 0 0 0 0 0 0 0 0 0 0 0 0 
##$SW_h= 4401.40845070422
##$TD= 16384
##$TD0= 1
##$TE= 300
##$TE2= 300
##$TE3= 300
##$TEG= 300
##$TL= (0..7)
0 120 120 120 120 120 120 120 
##$TP= (0..7)
150 150 150 150 150 150 150 150 
##$TP07= 0
##$TPNAME0= <>
##$TPNAME1= <>
##$TPNAME2= <>
##$TPNAME3= <>
##$TPNAME4= <>
##$TPNAME5= <>
##$TPNAME6= <>
##$TPNAME7= <>
##$TPOAL= (0..7)
0.5 0.5 0.5 0.5 0.5 0.5 0.5 0.5 
##$TPOFFS= (0..7)
0 0 0 0 0 0 0 0 
##$TUNHIN= 0
##$TUNHOUT= 0
##$TUNXOUT= 0
##$USERA1= <user>
##$USERA2= <user>
##$USERA3= <user>
##$USERA4= <user>
##$USERA5= <user>
##$V9= 5
##$VALIST= <valist>
##$VCLIST= <CCCCCCCCCCCCCCC>
##$VD= 0
##$VDLIST= <DDDDDDDDDDDDDDD>
##$VPLIST= <PPPPPPPPPPPPPPP>
##$VTLIST= <TTTTTTTTTTTTTTT>
##$WBST= 1024
##$WBSW= 25
##$XGAIN= (0..3)
0 0 0 0 
##$XL= 0
##$YL= 0
##$YMAX_a= 1190519
##$YMIN_a= -1875248
##$ZGOPTNS= <>
##$ZL1= 120
##$ZL2= 120
##$ZL3= 120
##$ZL4= 120
##$ABSF1= 10
##$ABSF2= 0
##$ABSG= 5
##$ABSL= 3
##$ALPHA= 0
##$AQORDER= 0
##$ASSFAC= 0
##$ASSFACI= 0
##$ASSFACX= 0
##$ASSWID= 0
##$AUNMP= <proc_1d>
##$AXLEFT= 0
##$AXRIGHT= 0
##$AXTYPE= 0
##$AXUNIT= <>
##$AZFE= 0.1
##$AZFW= 0.1
##$BCFW= 1
##$BC_mod= 2
##$BYTORDP= 1
##$COROFFS= 0
##$CY= 7568.61572265625
##$DATMOD= 1
##$DC= 2
##$DFILT= <>
##$DTYPP= 0
##$F1P= 17.9538593292236
##$F2P= -4.03888763876832
##$FCOR= 0.5
##$FTSIZE= 32768
##$FT_mod= 4
##$GAMMA= 1
##$GB= 1
##$INTBC= 1
##$INTSCL= 1
##$ISEN= 128
##$LB= 0.02
##$LEV0= 0
##$LPBIN= 0
##$MAXI= 945.577
##$MC2= 0
##$MEAN= 0
##$ME_mod= 0
##$MI= -402.1523
##$NCOEF= 0
##$NC_proc= 0
##$NLEV= 6
##$NOISF1= 8.587773
##$NOISF2= 6.764455
##$NSP= 1
##$NTH_PI= 0
##$NZP= 0
##$OFFSET= 17.95386
##$PC= 1
##$PHC0= 323.0903
##$PHC1= 10.11988
##$PH_mod= 0
##$PKNL= yes
##$PPARMOD= 0
##$PPDIAG= 0
##$PPIPTYP= 0
##$PPMPNUM= 100
##$PPRESOL= 1
##$PSCAL= 0
##$PSIGN= 0
##$REVERSE= no
##$SF= 200.13
##$SI= 32768
##$SIGF1= 18.5376
##$SIGF2= -6.396296
##$SINO= 400
##$SIOLD= 32768
##$SREGLST= <1H.CDCl3>
##$SSB= 3
##$STSI= 0
##$STSR= 0
##$SW_p= 4401.40845070423
##$SYMM= 0
##$S_DEV= 0
##$TDeff= 0
##$TDoff= 0
##$TI= <>
##$TILT= no
##$TM1= 0
##$TM2= 0
##$TOPLEV= 0
##$USERP1= <user>
##$USERP2= <user>
##$USERP3= <user>
##$USERP4= <user>
##$USERP5= <user>
##$WDW= 1
##$XDIM= 8192
##$YMAX_p= 0
##$YMIN_p= 0
$$ End of Bruker specific parameters
$$ ---------------------------------
##NTUPLES= NMR FID
##VAR_NAME=  TIME,          FID/REAL,        FID/IMAG
##SYMBOL=    X,             R,               I
##VAR_TYPE=  INDEPENDENT,   DEPENDENT,       DEPENDENT
##VAR_FORM=  AFFN,          ASDF,            ASDF
##VAR_DIM=   8192,          8192,            8192
##UNITS=     SECONDS,       ARBITRARY UNITS, ARBITRARY UNITS
##FACTOR=    0.0002272,     1,               1
##FIRST=     0,             0,               0
##LAST=      1.8609952,     -121,            -114
##MIN=       0,             -1875248,        -1875248
##MAX=       1.8609952,     1190519,         1190519
$$ Real data points
##PAGE= N=1
##DATA TABLE= (X++(R..R)), XYDATA
$$ [...]
2866c679k916J0752K648j3412r35J4567o37j2964K462J0766k699p625k17O758
2880B869L342p696m949J0528M430j2537k485J2883l48j1242J854R092j561o652
2894b472j149O315L243q169m536J1037L899j3089j852J2548O16j2348Q08Q830
2908C681J046p730k806P544N252r034o438J0946N035j1941l391J1510J802r401
2922c925j235P394K005o546l703P037N024q112n346J0068M583j1408k929J0921
2936C828J947r831j534Q456L453p811n389P981O743r463o634J0798N579j0394
2950b271m248R617L569q199m302O992M931o215n974P170O428q287o308Q932M733
2965F568r098l751Q515L499p319m086O648N376p345o288P869O629q742n993R163
$$ plain form
2866 -3679 -6595 4157 6805 -6607 -7542 7025 6388 -6576 -4114 6652 3953 -3672 -3889 2869
2880 2869 6211 -1485 -6434 4094 8524 -4013 -6498 6385 6037 -5205 -3351 5741 4180 -2472
2894 -2472 -3621 2694 5937 -2232 -6768 4269 8168 -4921 -6773 5775 6391 -5957 -5149 3681
2908 3681 4727 -3003 -5809 1735 6987 -2047 -8485 2461 7496 -4445 -7836 3674 5476 -3925
2922 -3925 -5160 2234 4239 -2307 -6010 1027 6051 -2061 -7407 2661 7244 -4164 -7093 3828
2936 3828 5775 -4056 -5590 2866 6319 -1492 -6881 1100 7843 -1620 -8254 2544 8123 -2271
2950 -2271 -6519 3098 6667 -1532 -5834 1158 6089 -126 -6100 1070 7498 -789 -7097 1835 6568
2965 6568 -2530 -6281 2234 5733 -1586 -5672 976 6352 -993 -7281 588 7217 -1525 -7518 1645
2980A645N171q658n092P558N494o133o180O067O843o290p546O513P353p186n695
2995f136O807N486n884n358N102N428n276n776N120P333o221o937O798O000o424
3010F2n937O020N826n318o384N169P206m432q998N049Q513n595q504O443P817
3025F937n485p257M524O263l691o588K606Q133k798q986M322Q633n822q108O478
3040h39O061n221n941M267O803l917p173L020R163l883j0324N634R762n870q345
3055f803O313O773m783p092L292P062j224q456J773J0102l281j0157M367R177
3069G063n515p034N627N996m099n582J822O226j159q231J598J0205k857j0366
3083f306M334R336o023p386N133O010k998n922J006O798K64q938j25R885j626
$$ plain form
2980 1645 6816 -1842 -6934 624 6118 -15 -6195 -128 6715 425 -7121 -608 6745 -441 -6136
2995 -6136 671 6157 273 -5085 17 5445 169 -5607 -487 6846 625 -6312 486 6486 62
3010 62 -5875 145 5971 653 -5731 -562 6644 2212 -6786 -1737 6776 1181 -7323 -880 6937
3025 6937 1452 -5805 -1281 4982 1291 -5297 -2691 5442 2644 -6342 -2020 6613 791 -7317 -839
3040 -839 5222 1 -5940 -1673 5130 1213 -5960 -2940 6223 2340 -7984 -2350 7412 1542 -6803
3055 -6803 -490 6283 1500 -5592 -2300 4762 3538 -4918 -3145 6957 3676 -6481 -2114 7063
3069 7063 1548 -5486 141 6137 2038 -3544 -1722 4504 3345 -4886 -3288 6917 4060 -6306
3083 -6306 -1972 7364 1341 -6045 -912 5098 2100 -3822 -2816 3982 4246 -4692 -4817 5068 3442
3098C442r627K927Q613l803o448L080M964j937m400p37O298J115p645n88R189
3113D443j202r862K945Q699l728n800L045M462M8o266j709P192L082q865j831
3128e347J0805j97j0418J599Q220j926n908P13N296J304m892l917O945M014q795
3143b504k707R828N77r429J418P524j302n990n54N230K002n933l543Q065M151
3158F833j0510k579J0548P54j0423N18Q835l89n614k204N316L545o227n648Q583
3173A338N024r437l489J0064J394r668L00P469j28n358j623N342L599o142m785
3188f100P890M399r955k290J0239Q90r284p8P395Q87n997k173N488M458o366n227
3204e824P657N461r717l622R313J451p359r66O425J341m590l497M296M427n834
$$ plain form
3098 3442 -6185 -3258 5355 1552 -4896 -1816 3148 1211 -3189 -3926 2372 3487 -4158 -4746 4443
3113 4443 3241 -6621 -3676 5023 1295 -4505 -1460 3002 3050 -3216 -4925 2267 5349 -3516 -5347
3128 -5347 5458 5261 -5157 -3558 4662 2736 -3172 -2459 2837 4141 -751 -4668 2277 6291 -2504
3143 -2504 -5211 4617 5194 -4235 -2817 4707 3405 -2585 -3139 2091 4093 -1840 -5383 2682 6833
3158 6833 -3677 -6256 4292 5046 -5377 -4859 3976 3587 -2027 -4231 1085 4630 -1597 -7245 1338
3173 1338 6362 -3075 -6564 3500 4894 -4774 -4474 2995 2867 -2491 -4114 1228 4827 -1315 -6100
3188 -6100 1790 6189 -3766 -6056 4183 5073 -4211 -4289 3106 3993 -2004 -4177 1311 5769 -597 -5824
3204 -5824 1833 7294 -2423 -6045 3268 4719 -2640 -3606 2819 4160 -430 -3927 369 4796 -1038
3219a038m737P492M369q275l081Q221J451p001j509N815K167m648l829M874N098
3234E369n912o047O792N482p094m203O938L010n826k675M251M022l969m839L680
3249a021O334m917n700N337N160o286l833N893L172m275l684M074M119l167o287
3264e081M386O014m952n893N806N693n754n399N104N214m336n289L599N835l513
3279A434o692L878O732m301o419M802N407m527n365M223N028l143n553K605O352
3294D461l649o151M100O251m576n462M517N267m175n578L720N477k665o506L591
3309a378O477l570o835L553O602l169n802K942N636k556n697J899O163j771o494
3324d000J740P374l069o153K893N971l234n097K631N212k193n466J450O681k009
$$ plain form
3219 -1038 -5775 1717 6086 -2189 -5270 2951 4402 -2599 -4108 1707 3874 -774 -4603 271 5369
3234 5369 -543 -6590 202 5684 -1410 -5613 1325 4335 -1491 -4166 85 4107 138 -4701 -1021
3249 -1021 5313 396 -5304 33 5193 -1093 -4926 967 4139 -136 -3820 254 4373 1206 -5081
3264 -5081 -695 5319 367 -5526 280 5973 219 -5180 -76 5138 802 -4487 -888 4947 1434
3279 1434 -5258 -1380 5352 1051 -5368 -566 4841 314 -5051 -828 4200 1057 -4496 -1891 4461
3294 4461 812 -5339 -1239 5012 436 -5026 -509 4758 583 -4995 -1275 4202 1537 -4969 -1378
3309 -1378 5099 1529 -5306 -1753 4849 1680 -4122 -1180 4456 1900 -3797 -1898 4265 2494 -4000
3324 -4000 -2260 5114 2045 -4108 -1215 4756 1522 -3575 -944 4268 2075 -3391 -1941 4740 2731
3339B731p176K106P252k932o345K519O378k745n414J385N385n28n890m63P030
3354C293j67p485J535O580j796o483K197N154j721m249N88M932N23o286l30O991
3370C276k02p857J662P765k578o395K426M979q74m714n94N260K123p262r93P834
3386C856M45q430O75P302j198n268O01M863J88m374k089N797K057o633j652P358
3402C498Q30p867R33O677j638n604J436L904M05m334k037O047K063o973k430Q365
3418C275P25p949L77O780m61n440k39L825K079m375k934N150L713o510k993P221
3434B244J533p036p4N711k57m277m13L642K038l933l740N555L693p017k692Q082
3450C059J539p954J58N786k31l959j604M037L486m116m578M835M899o525l527
$$ plain form
3339 2731 -4445 -2339 4913 1981 -4364 -1845 4533 1788 -3626 -2241 3144 2616 -3274 -3737 3293
3354 3293 3126 -4359 -2824 3756 1960 -4523 -2326 2828 1107 -3142 -2554 2378 2901 -3385 -3715 3276
3370 3276 3074 -4783 -3121 4644 2066 -4329 -1903 3076 2202 -2512 -3106 2154 4277 -2985 -3978 3856
3386 3856 4301 -4129 -3454 3848 2650 -2618 -2017 2846 3034 -1340 -3429 2368 4425 -2208 -3860 3498
3402 3498 4328 -3539 -2606 4071 2433 -3171 -1735 2169 2574 -1760 -3797 2250 4313 -2660 -5090 3275
3418 3275 4000 -3949 -3572 3208 2747 -2693 -2932 893 2972 -1403 -4337 813 4526 -1984 -4977 2244
3434 2244 3777 -3259 -3333 2378 2121 -2156 -2569 1073 3111 -822 -4562 993 4686 -2331 -5023 3059
3450 3059 4598 -3356 -3198 2588 2357 -1602 -3206 831 4317 201 -4377 458 5357 -1168 -4695
3465d695P279J770o101j097M352R20l069j758K521L296l281m301N098M318o225
3480i73m052P104J722o344l44M630R00l267k364K452M656m084n359N232N280o291
3496a102m182O435K776n356j710L748J894k593l028K246M660k997n375M517M664
3511D597n637l175N593K316m862j389L437K062k802l487K634N282l475n869M851
3526G6N101n299m352N376L260m526k680K892L352k073m471K173N384k693n915
3541d395L901M602m475l281L740L580l789l091K541L597k399m293K596M868l087
3556F15n645L994N205m126m159L631M113l150l610K063M441j769n051J563N738
3571C853k375n453K951M748k932l728K594L390j612m053J680M010j096m610J178
$$ plain form
3465 -4695 2584 4354 -1747 -2844 1508 2428 -641 -2399 122 3418 137 -4164 934 5252 -973
3480 -973 -5025 2079 3801 -2543 -2887 1743 2643 -624 -2988 -536 4120 36 -5323 -91 5189 -1102
3496 -1102 -5284 1151 3927 -1429 -3139 609 2503 -90 -3118 -872 3788 791 -4584 -67 4597
3511 4597 -1040 -4215 1378 3694 -1168 -2557 880 2942 140 -3347 -713 4569 1094 -4775 76
3526 76 5177 -122 -4474 902 4162 -364 -3044 -152 3200 1127 -3344 -1171 4213 1520 -4395
3541 -4395 -494 4108 -367 -3648 92 3672 -117 -3208 -667 2930 531 -3762 -1166 3702 615
3556 615 -5030 -1036 4169 43 -4116 -485 3628 478 -3132 -1069 3372 1603 -3448 -1885 3853
3571 3853 1478 -3975 -1024 3724 792 -2936 -342 3048 1436 -2617 -937 3073 1977 -2633 -1455
3586a455N184k169n101L095M110k622m394K217M038j251m740J470M956j702n046
3601c410J803N041k076m951J897M371p46m468L86M524n04m868L71N126j034m473
3617c011P76N068j748m303J837L790q94m117L71M408k52m934P03N175q76n340
3633c347J097N165j010m501N02M734j06m562q69N495K59n472J23N283r5n087O73
3650a718M013l17l689K0L543Q24m108j414N517J24n345J71O072j489n268J404
3666a660M239p50l813p14M472J300n295j155N805R96o419k2N592l80m661N63L388
3683A486J99k930j487M014J548m710j523N321P01n454L55M685o00m033M70L395
3699A437K65k501j693L514K617m973k298N521J532n686M0M637m08l028o66K514
$$ plain form
3586 -1455 3729 1560 -3541 -446 3664 1042 -3352 -1135 2903 1652 -3088 -1618 3338 1636 -3410
3601 -3410 -1607 3434 1358 -3593 -1696 2675 1929 -2539 -2153 2371 1867 -3001 -2630 2496 1462 -3011
3617 -3011 -2235 2833 1085 -3218 -1381 2409 1515 -2602 -2231 2177 1925 -3009 -2306 2869 1993 -3347
3633 -3347 -2250 2915 1905 -2596 -2094 2640 2534 -2028 -2897 2598 2857 -2615 -2492 2791 2696 -2391 -1718
3650 -1718 2295 1978 -1711 -1691 1852 2676 -1432 -2846 2671 2795 -2550 -2379 3693 2204 -3064 -1660
3666 -1660 2579 1829 -1984 -2698 1774 3074 -2221 -3376 2429 3425 -2994 -3016 2576 2196 -2465 -1902 1486
3683 1486 1685 -1245 -2732 1282 2830 -1880 -3403 1918 2619 -2835 -2480 2205 1605 -2428 -1958 1437
3699 1437 1702 -799 -2492 1022 3639 -1334 -3632 1889 3421 -2265 -2225 2412 2004 -1024 -1690 824
3715H24J564k307k849L322L478m612k833M913J851n030r01M116K72k499l00J314
3731C23J800k363k966L335L938m884l049N080K106n176r53M016J108k882j565
3746b132J544K987j977m375L491M626m941l454N122K132m308j228L686N67k193
3761d53j921J453L472k052l847L171M277m329l691N472J870n120m77L318J391
3776B534k337k799K080L915k525m630L812M423m460l889N133K193m569j297K824
3791D08J667j337l001J390L768j754m879L283M379m445k909M348J740l625j440
3806b407K256K076j750k660J533L998k341m235L103L907l762l258L862K213k909
3821c74j496J674J978p72l499P22M628j520m720K612M304l055l580L150K034j956
$$ plain form
3715 824 2388 81 -2768 554 4032 -580 -3413 1500 3351 -1679 -2580 1536 1808 -691 -991 323
3731 323 2123 -240 -3206 129 4067 -817 -3866 1214 3320 -1856 -2809 1207 2315 -567 -2132
3746 -2132 -588 2399 422 -3953 -462 4164 -777 -4231 891 3023 -1285 -2513 1173 1740 -453
3761 -453 -2374 -921 2551 499 -3348 -177 4100 -229 -3920 1552 3422 -1698 -2175 1143 2534
3776 2534 197 -2602 -522 3393 868 -3762 50 4473 13 -3876 1257 3450 -1119 -2416 408
3791 408 2075 738 -2263 -873 2895 1141 -3738 -455 3924 -521 -3430 918 2658 -967 -2407
3806 -2407 -151 1925 175 -2485 -952 3046 705 -3530 -427 3480 -282 -3540 322 2535 -374
3821 -374 -1870 -196 1782 1010 -2489 -1767 2861 1341 -3379 -767 3537 482 -3098 52 2086 130
3837A30j621J169K283o93l354R48M127j665m301K110M495k727l605K506K611j611
3853H02k740O96L333o57l940M91M907r77m963J683L706j425l573J842K966j089
3869A062k809jL740l38m319N64M176l42m787J709L972j692l570J395L161o60l463
3886b202L35M330m95m693N62N138r00m805J499L548q83l227J26L617K87l844j51
3903a758L695J10m094P43M099p57m292J127L075l46l451N12L684n77l183n94M279
3920B272j52m136J56M190q87l535Q08K846k36l069l77L523J131m290p29L748P20
3937A983m014P1L101J60k835k00K714O12l097p37L340P03l641l46L853L6l385
3954a682J10K992K68l007n16K830J475l518j463L908J520m003j354L998P59l729
$$ plain form
3837 130 -1491 -322 1961 1268 -2086 -1138 2989 1324 -2977 -867 3628 901 -2704 -198 2413 802
3853 802 -1938 -1242 2091 1434 -2506 -2015 2892 1915 -3048 -1365 2341 916 -2657 -815 2151 1062
3869 1062 -1747 -1748 1992 1654 -2665 -2101 2075 1733 -3054 -1345 2627 935 -2635 -1240 1921 1261 -2202
3886 -2202 -1867 2463 1968 -2725 -2163 2975 2075 -2730 -1231 2317 1434 -1793 -1667 1950 2237 -1607 -1758
3903 -1758 1937 2047 -2047 -1304 2795 2038 -2254 -1127 1948 1602 -1849 -1337 2347 1770 -1413 -2007 2272
3920 2272 2120 -2016 -1860 2330 1443 -2092 -1284 1562 1326 -1743 -2120 1403 2534 -1756 -2485 1263 1983
3937 1983 -2031 -1960 1141 1301 -1534 -1734 980 1592 -1505 -2242 1098 1801 -1840 -2186 1667 1703 -1682
3954 -1682 -1572 1420 1688 -1319 -1835 995 2470 -1048 -2511 1397 2917 -1086 -2440 1558 2317 -1412
3970a412r6K789R91k519j652K744J749k975k249L935J439l805r83L418N55k750
3986h21o40J983J359j979k216K284K487l382k155M315J637m346r52L426Q78k917
4002a039j155K458J654k313k273K465K915k932l139L775K329m189j101L624M16
4017A495k032j316J804J621j370k699K182L215l501k305L966J795m021o35K965
4032A164P14k445j292K100K384j709l709K304L461l115l506M224K225l420j343
4047a963K426J097j403j618P75K278p39l758K249L686l121k667L112J968l191
4062h69r57J767J143r98j775R56K959j707l264K120L663l070l012L311J726k254
4078b61j653J756J597l70k439K35K711n00l398J574L566k308l186K972J733j998
$$ plain form
3970 -1412 -1508 1281 2272 -247 -1899 845 2594 -381 -2630 1305 2744 -1061 -2044 1374 1929 -821
3986 -821 -1461 522 1881 -98 -2314 -30 2457 -925 -3080 1235 2872 -1474 -2426 1000 1878 -1039
4002 -1039 -2194 264 1918 -395 -2668 -203 2712 -220 -3359 416 2745 -1444 -2545 1079 1495
4017 1495 -537 -1853 -49 1572 202 -2497 -315 2900 -601 -2906 1060 2855 -1166 -1801 1164
4032 1164 1878 -567 -1859 241 2625 916 -2793 -489 2972 -143 -3649 575 2800 -620 -1963
4047 -1963 463 1560 157 -1461 -686 1592 853 -2905 -656 3030 -91 -2758 354 2322 -869
4062 -869 -1826 -59 1084 86 -1689 -733 2226 519 -2745 -625 3038 -32 -3044 267 1993 -261
4078 -261 -1914 -158 1439 1069 -1370 -1135 1576 1076 -2322 -748 2818 510 -2676 296 2029 31
4094C1j508J271J516q24j545K8L269r42l909J767M161l072k902K690K124j961
4110A94j439O83J962k98k588k49L390k82l697J033L773k063k949K086K038j386
4126B08j514N01K067m22k306j93L615o47l885J246L800j785k989J969J559r57
4142B67j662K63K483L36k816o69M078n29l641N87L745j683j977J31K513l50j933
4159h57k95K100R49k807r81L372R1l308O55K582l85k408O23J950M0k422m28K944
4177A415J86k743p42L031k1l181J013K187J3k204m56K401J14k008j017K900O96
4194A584l011m90L221q4k794j8K339J57j974l36K059P24k256p98K458R92l176
4211a403k36K972P1k458j18K057O84k018j393K628J306k617j316K534J450k539
$$ plain form
4094 31 -1477 -206 1310 486 -1059 -1031 2238 1296 -2613 -846 3315 243 -2659 31 2155 194
4110 194 -1245 -562 1400 1102 -1486 -1735 1655 1373 -2324 -1291 2482 419 -2530 -444 1594 208
4126 208 -1306 -805 1262 840 -1466 -1659 1956 1309 -2576 -1330 2470 685 -2304 -335 1224 267
4142 267 -1395 -1132 1351 1687 -1129 -1798 2280 1751 -1890 -1303 2442 759 -1218 -1087 1426 1076 -857
4159 -857 -1152 948 1897 -910 -1891 1481 1572 -1736 -1081 1501 1116 -1292 -669 1281 1321 -1101 -1529 1415
4177 1415 1601 -1142 -1884 1147 1126 -2055 -1042 1145 1158 -1046 -1502 899 1013 -995 -2012 888 1584
4194 1584 -1427 -1917 1304 1220 -1574 -1592 747 904 -1070 -1406 653 1377 -879 -1677 781 1773 -1403
4211 -1403 -1639 1333 1404 -1054 -1172 885 1569 -449 -1842 786 2092 -525 -1841 693 2143 -396
4227c96q65K148J108k397j006J882Q80j370j777K592J001k229j654K643J476k951
4243i15p73K659J20j944j031K452P76j903j524K300J649k644j361K968J035k779
4259i15l36J769R77j981j290J586J839j986j711K239J607k683q10K556O32k174
4275f81o47J488J107j473j313J456J761j854j619K234J414k307j161K742J75j733
4291d11q38J459J653j152k313J705J946j890k036K336J550k134j317J781R14j496
4307b43l80L38J639j028j639O58K466j990j899J964J743j934j199J819M34q61
4323a12q61K1K182n00k478Q33K938j498k309J175K246k045j027J424J265q52j543
4340a141O21J727j67k362M21K816j307k591J738J975j803j155J212R43n91j062
$$ plain form
4227 -396 -1261 887 1995 -402 -1408 474 1354 -16 -1793 799 1800 -429 -2083 560 2036 -915
4243 -915 -1688 971 1091 -853 -1884 568 1344 -559 -2083 217 1866 -778 -2139 829 1864 -915
4259 -915 -1251 518 1495 -486 -1776 -190 1649 -337 -2048 191 1798 -885 -1695 861 1493 -681
4275 -681 -1328 160 1267 -206 -1519 -63 1698 -156 -1775 459 1873 -434 -1595 1147 1322 -411
4291 -411 -1249 210 1863 711 -1602 103 2049 159 -1877 459 2009 -125 -1442 339 1253 -243
4307 -243 -623 -285 1354 326 -1313 -655 1811 -179 -2078 -114 1629 -305 -1504 315 749 -112
4323 -112 -973 -952 1230 730 -1748 -915 2023 525 -1784 -609 1637 -408 -1435 -11 1254 402 -1141
4340 -1141 -520 1207 1040 -1322 -901 1915 608 -1983 -245 1730 -73 -1228 -16 927 336 -726
4356g26J10K059n4k976Q54L083k129k144J705K098j908j253R37J716l09k241q6
4373a264K441K81k977P09K601j157k304J081J906j158j505Q38J159R3j958J10
4389a104K461j51k997Q63K798j276k580J560J832j499j234R00J518L30j972q36
4405a387K385N93k790K88K692r87k047P58J814o69j072j35J510N0j724j27K103
4422A255L45l035J104J854r26j961Q04J562k89j623L17J008O79j868p86K667M12
4439A519k594j7K191n14j795J90J656J11j150q47R92J471j621j489K616N35k726
4456a472l3K689n82j586j90J657O26j498o96J530J161k145q57K389N62k521m32
4473a398K341K02j778J23J009R11j520p41J370J100j793j262K199N85k068m15
$$ plain form
4356 -726 -616 1443 1389 -1587 -733 2350 221 -1923 -218 1880 -28 -1281 -344 1372 1063 -1178 -1264
4373 -1264 1177 1458 -1519 -810 1791 634 -1670 -589 1317 159 -1346 -508 651 744 -1214 -1104
4389 -1104 1357 1206 -1791 -928 1870 594 -1986 -426 1406 -93 -1327 -427 1091 1421 -551 -1387
4405 -1387 998 1591 -1199 -911 1781 794 -1253 -495 1319 650 -422 -557 953 1003 -721 -848 1255
4422 1255 1600 -1435 -331 1523 597 -1364 -560 1002 713 -910 -593 415 1094 -774 -1560 1107 1519
4439 1519 -1075 -1092 1099 585 -1210 -1020 636 747 -403 -1250 -258 1213 -408 -1897 719 1254 -1472
4456 -1472 -1505 1184 602 -984 -1174 483 1109 -389 -1085 445 1606 -539 -1396 993 1555 -966 -1398
4473 -1398 943 1145 -633 -510 499 1410 -110 -851 519 1619 -174 -1436 763 1348 -720 -1135
4489a135J787M17j404q67J742Q08j433j373K015J152k609n95K490N49k400k43
4505a099J651M96j673n40J205J225j521j120J431J563k290r07J935R37j881j025
4521a613J571R32j161j378J584J321j067j563J926P69j666o99J469P66j490j163
4537a462J942Q71j427j355J597J856j989j175J440J466j577j286J872M32q78j271
4553i44P39J376q98j617J469J734j722j447J722R82j553r90J115P21o51j057N09
4570e12J637j012j792J369J648j960q38J310J098r88j037L49J615m84j552N46
4586f03J636n07k114J126J826j236j496J611P50j077j076R90R57M7j880O26J653
4603A233p34j848J230J693j550j036J366M09o84n84k5J544r6j941J67K535j076
$$ plain form
4489 -1135 652 1069 -335 -1202 540 1348 -85 -1458 557 1709 -900 -1495 995 1544 -856 -1099
4505 -1099 552 1048 -625 -1165 40 1265 -256 -1376 55 1618 -672 -1579 356 1293 -588 -1613
4521 -1613 -42 890 -271 -1649 -65 1256 189 -1374 552 1321 -345 -1044 425 1191 -299 -1462
4537 -1462 480 1351 -76 -1431 166 2022 33 -1142 298 1764 187 -1099 773 1205 327 -944
4553 -944 -205 1171 273 -1344 125 1859 137 -1310 412 1394 -159 -1149 -34 687 36 -1021 -512
4570 -512 1125 113 -1679 -310 1338 -622 -1460 -150 948 -40 -1077 -728 887 403 -1149 -603
4586 -603 1033 526 -1588 -462 1364 128 -1368 243 993 -84 -1160 -170 787 834 -1046 -420 1233
4603 1233 499 -1349 -119 1574 24 -1012 354 763 79 -505 -530 1014 918 -1023 -856 1679 603
4620F03j869J026J386q72j472R25J187o60p96k98J375K53j719j71K124l71k057
4637a406R27J462n74j236L17J085l33j112O5J893k96k152J34K650o17k041O54
4654e80K178j295j248M70J447j98j182n20J168J102k352J77K142l86j900K94J801
4671A118n54j105R1Q92K93j037o92J589O98k470K32J978M2j917M75J522j041n03
4689c89l41J409N96j844n98J513J096k459m29K352K01k234L56J231P4r97l87P90
4707f0O40q35q71J672P98k389k2K144l53j280k39J376k83o69k05Q33R81j232j347
4726a341J843R49k016l81J844J1j329j56N96K84k89j176J240J337j652q99J806
4743F71P28k005l27J803j49j340J44M05Q50p28j100R95Q60n86j550J561Q85j870
$$ plain form
4620 603 -1266 -240 1146 274 -1198 -273 914 254 -542 -840 535 788 -931 -1102 1022 651 -1406
4637 -1406 -479 983 409 -827 -510 575 242 -870 -805 1088 792 -1360 -1226 1424 807 -1234 -580
4654 -580 1598 303 -945 -475 972 774 -408 -928 240 1342 -1010 -833 1309 923 -977 -683 1118
4671 1118 564 -541 -450 442 735 -302 -994 595 1293 -1177 -945 1033 1075 -842 -367 1155 114 -389
4689 -389 -730 679 1275 -569 -1167 346 1442 -1017 -1446 906 1107 -1127 -771 460 534 -463 -850 -60
4707 -60 580 -255 -1126 546 1344 -1045 -1067 1077 724 -556 -795 581 298 -371 -576 257 1238 6 -1341
4726 -1341 502 1451 -565 -946 898 909 -420 -576 20 304 15 -1161 79 1416 -236 -1135 671
4743 671 1399 -606 -933 870 721 -619 -475 -70 780 52 -1048 -53 807 221 -1329 232 1117 -753
4761g53m71J833j56j128o0M20J063n72j493J253J405j822r27J556R97j659n91
4778a105J469R4p85j26M38P72n33r42M56J071j094q26J356J205j498p98J596j4
4796G36q78o60L57J398o17j270Q08J297j091r98R56J050j051n56L20J024o56r33
4814g64M94J367j024r77Q52J043j096j128J188J005r64q93O56J301n50j420N07
4831d03J159m20j639J099J426j153j198Q58R25o99j039Q28J059k1j941P89J400
4848A030m62j390O99J175p37r90M24J225o43j341O27J353m20j511L55J502p69
4865A27j075O32J419q07n98K41J434m07j793J78J860q41q71K46J262p60j501J034
4883b20O06J03j200N70P24K65j524J06J099oj740O61J253m85j164J071Q05m76
$$ plain form
4761 -753 -1224 609 453 -675 -735 -315 748 176 -1317 -64 1341 -481 -1408 148 1145 -514 -1105
4778 -1105 364 458 -327 -453 -15 757 224 -718 -262 809 -285 -1111 245 1450 -48 -846 750 736
4796 736 -142 -802 -445 953 336 -934 -126 1171 80 -918 38 1088 37 -519 -199 825 169 -764
4814 -764 -270 1097 73 -904 -52 991 -105 -1233 -45 960 -4 -897 -241 1060 510 -910 -403
4831 -403 756 336 -1303 -204 1222 69 -1129 -271 654 -45 -1084 -256 803 782 -1159 -370 1030
4848 1030 568 -822 -123 1052 315 -675 -251 974 331 -1010 -383 970 550 -961 -606 896 127
4865 127 -948 -316 1103 296 -302 -61 1373 966 -827 -649 1211 370 -501 -255 1007 247 -1254 -220
4883 -220 386 489 -711 -141 583 848 -676 -570 529 523 -1217 -556 697 212 -952 119 924 448
4901D48j046L40O73M79j604j22J822o40j507N77J328n95p22O6R12M20j313l93
4919h77J043N67j158l88J489j13j391L04J331p34n45K11O93j22p72j25R76P11
4937A100j326p13J740K9j666L96J216m65p73r6Q86K55q35m96P38J013j780n15
4955a292J938M07j909N5J451j03j003kN29N36j062k77J300N90j580n21K016j20
4973I53j741K44J073L3p49m12P91O75j197p42J360Q94j517n66J408M13j229l56
4991f65J173m53j93n91O86Q79p02j168J267R86j685n27J842l52j142N2J130j05
5009D32j89r40P33Q79o44r70P01J030j393n33J347K83j416K55Q16k77r3q84M66
5028c97J172j044o22R19J067j447p05J337L20k89q79P38L42k22q19O32J067q62
$$ plain form
4901 448 -598 -258 415 894 -710 -832 990 350 -1157 -580 748 153 -569 -503 409 829 -484 -877
4919 -877 166 733 -425 -813 676 563 -828 -524 807 73 -472 -261 432 310 -462 -587 389 1100
4937 1100 -226 -939 801 830 -836 -440 776 311 -462 -558 328 583 -252 -748 -10 1003 -777 -1292
4955 -1292 646 1053 -856 -801 650 547 -456 -458 71 607 -455 -732 568 1158 -422 -943 1073 953
4973 953 -788 -544 529 562 -187 -599 192 867 -330 -1072 288 1182 -335 -901 507 920 -309 -665
4991 -665 508 55 -138 -729 -43 836 134 -1034 233 1219 -466 -993 849 497 -645 -593 537 432
5009 432 243 -697 36 915 271 -699 2 1032 -361 -894 453 736 -680 -425 391 114 21 -863 -397
5028 -397 775 -269 -891 28 1095 -352 -1057 280 600 311 -568 170 512 290 -529 103 1170 308
5046C08j301J066J013j132p26Q43O99p64m98M34N94j70r60J21J248k39j549R77
5064c6J076j104l72L39P42n02p46N56L24R3j278K10J506m10j463J008P70n20r06
5083g13Q30K69o85n87N17O28K79j368L98R54o30j129J040J010j064n31L06J017
5101E41l04o73n5R82k40j012K82J363n27j187N60J287p58q23N69P05m47q41K01
5120c77J091l69q69L71J111j60j441O01O02l34p28O08K50Nq34k2R56J45j330M15
5140c09J104l17j177R0J115j73m57j47M16J33q98L6J140k26j373Q75N45r7r48
5159f68K48O76k0p71j1R50R0p35m48J269K6j295L64P94P3p13k24N93L91q73l40
5180f24J234J50j042m83J500l25j148Q15P24l85n22n79J008K15j185K47Q72J56
$$ plain form
5046 308 -993 73 1086 -46 -772 71 770 6 -492 -58 536 366 -594 -473 775 536 -1013 -36
5064 -36 1040 -64 -436 -97 645 143 -603 -47 277 370 -908 -698 808 398 -1065 -57 713 193 -713
5083 -713 117 386 -299 -886 -369 259 538 -830 -432 522 -108 -1237 -197 813 -251 -782 -476 541
5101 541 237 -436 -491 491 251 -761 -479 884 357 -830 -270 1017 259 -564 5 710 263 -578 -377
5120 -377 714 345 -524 -153 958 798 -643 -42 560 226 -502 106 356 361 -473 -495 461 606 -724 -309
5140 -309 795 478 -699 -609 506 333 -124 -271 145 278 -620 -584 556 330 -1043 -168 377 280 -668
5159 -668 -420 256 236 -535 -546 404 494 -241 -689 580 606 -689 -325 469 542 -171 -395 198 589 -284 -624
5180 -624 610 760 -282 -765 735 410 -738 77 801 416 -106 -685 323 538 -647 -400 472 628
5198F28j316M3J282k82j010M22N01O1m76l74N94M37r08n93J318K27r65k76J143
5217D56k2p13k34N23K52k19m31K47Q01r83n40J024N43j113m37J344P2j031j08
5236e69O51O31p51o14O99Q13j029q26J684J48j483J77Q44L40q46k35O8P95k08
5255B89o28M96K17o19o29J210O09j216J07O51k74l58l39O22L75n16p58O66R75
5274H80j065q13R31Q08j104j04M20M16l23n92P76M13l99r90Q43P65p56j026R76
5293E6K68l98l48J96M93l21l87J3J019m05r24N24J194o78j097R15P12j257J76
5312b49K41K87l25m23J85Q85j96j099L63J487r04r86O79O26o55j50J44J05O9k04
5332a20m7R01m33r24K72J076r64k78M75K56n88J38j97P47m54k79j28J028lj464
$$ plain form
5198 628 -688 -645 637 355 -655 -233 268 329 -147 -521 73 510 -398 -991 327 554 -411 -687 456
5217 456 434 -279 -513 10 262 43 -388 -141 660 -323 -863 161 704 -409 -846 498 570 -461 -569
5236 -569 82 713 -38 -652 47 860 -169 -995 689 837 -646 -469 375 715 -131 -366 -298 497 289
5255 289 -339 157 374 -245 -874 336 945 -271 -164 487 213 -145 -484 138 513 -3 -761 -95 880
5274 880 -185 -998 -67 741 -363 -467 -47 369 46 -546 230 643 244 -746 97 862 106 -920 56
5293 56 324 -74 -422 -226 267 -54 -441 -428 591 186 -738 -214 980 302 -795 120 832 -425 -249
5312 -249 -8 279 -46 -469 -284 601 405 -694 -331 1156 252 -734 -55 571 -84 -234 -90 15 84 -120
5332 -120 -167 734 301 -623 -351 725 -239 -517 -42 214 -374 -236 -433 314 -140 -419 -547 481 478 -986
5352i86O31J018o34p49N32M44l28K42m01L37L9o75J79J141J08j896P77Q00n08
5371G1n68K74L14J74l77l89Q06L80j036%J070ok040J206Q23n59n61J95N07L57
5391F41j027J68P30j88o69k08R58k87m67J06Q64n42k78j77M90L9l68m33P45Q05
5411I02j432L41N36j66j007O24M11P5m25q8J99M51m21k57O75L64q20o12J143m2
5431D51r58K13M04K13n88L63L56R0q60l30R35M09j053k24J301k17q47P1N27L3
5451B89m09l09O28N51m98n82R60K89j275l28R86L19n86n11K58P77p75j91L81K97
5471B71m62o61J036K19n96l49P73K51q46P5L39N33n91p42J104Q9l97n28N78N58
5491F54o46l73O07j51k78M2L31K63j02q10M36M88k98n11N93M7m98j69M60K85R
$$ plain form
5352 -986 -355 663 29 -720 -188 256 -72 170 -231 106 145 -530 -351 790 898 -998 -221 579 71
5371 71 -497 -223 91 265 -112 -501 305 685 -351 -351 719 713 -1327 -121 702 143 -418 -223 284 641
5391 641 -386 -218 512 324 -345 -553 405 118 -349 -243 621 79 -199 -376 114 153 -215 -648 97 902
5411 902 -530 -189 347 181 -826 -202 209 284 -141 -229 -30 421 0 -257 418 782 -38 -650 493 451
5431 451 -507 -294 110 323 -265 98 454 544 -316 -646 289 698 -355 -579 722 505 -342 -271 256 289
5451 289 -120 -429 199 750 252 -330 630 919 -356 -684 302 621 35 -476 -218 559 -216 -407 -26 271
5471 271 -191 -852 184 403 -193 -542 231 482 -364 -289 50 583 -8 -750 354 443 46 -482 96 654
5491 654 8 -365 242 91 -187 -145 186 449 347 -463 -27 461 163 -348 245 292 -206 -375 85 370 379
5512C79o18N6Q42q42o7K87L79m91l09L41K15l36l5K15J07J88p24j88P16L0r85
5533h40R84L72n59m29N31l1Q5n40L46K96j91k66J85M78k58n26M38O31o73m09Q97
5554E21l90j77k39K61N86l89o88K61J109o84j080N70J258o74n87K43L97j00p18
5573e20LN91K86p56J8J090o45o71N91O01n03l94M03o9K29o21Q9O00k19k31k60
5594c88R50n01o89O39L64n64J33j09O2J39k48MJ32N71q29j79P93K97j261O46J86
5615A48j50m78L01L8N74k06o38L88P62p77l01J016l66n81kO44j79k94q6J83M69
5636D65m20n61K99R58j172K5R97j15p55P4O88m14k05l83O89N7l4p58O11M01r93
5657e46o3O70L34r13L18K27J26k7m85L16O03n05l98P76Q9o25m87J013j5q05L79
$$ plain form
5512 379 -239 -183 659 -183 -250 37 416 -75 -384 -43 172 -164 -199 16 123 311 -413 -601 115 145 -840
5533 -840 144 516 -43 -472 59 28 113 -427 -81 215 24 -242 -57 421 163 -363 75 706 33 -376 521
5554 521 131 -46 -285 -24 562 173 -515 -254 855 171 -909 -339 919 245 -342 -99 298 198 -520
5573 -520 -517 74 360 -396 -378 712 67 -604 -13 588 85 -309 94 25 254 -367 -278 322 103 -128 -388
5594 -388 562 61 -628 11 375 -189 -56 -165 -103 36 -212 -208 -76 495 -334 -513 280 577 -684 -38 148
5615 148 -2 -480 -179 -141 433 227 -411 -23 739 -38 -339 677 311 -270 -272 372 193 -101 -187 -4 465
5636 465 45 -516 -217 741 -431 -406 591 476 -279 -205 483 69 -136 -519 170 227 193 -565 46 447 -546
5657 -546 -609 61 395 -518 -200 27 153 126 -359 -43 560 55 -343 433 522 -103 -590 423 408 -397 -18
5678a8K94Q6n90k0K11R23o42o78O16J58m05l88K85P31q12m0L85L51l29m68K75
5699g5J07j16m40P50L14q83j08O29J12n65%O9L77j06o45O29N43o62n85O56M48
5720D49o65KM80l4n75L98mj11k99l28R82M76j036j88P23L74j024j07Q76J46m07
5741A28l43K99J52l64k22M66M96o48l21K55M53m68k19J72N34l35k20k07P23l62
5761c1n05M53N43j05q78P06M2o65J55k12Q63j2q26J76J066m31j069Q75M63n77
5781C1l23K05K61L01n64PN2O5l61k39Q88l25q33R35K71j1r69J81Q06n12k64N21
5803A23K79Q4r43K21R57q10o79R92L60m28m37M04O48m27n49qO45oq36k8N28K32
5825C22l18n68Q69R8o86r7K32N40o34k30O54N1r13M18N50o5m76P53n22m2M8j67
$$ plain form
5678 -18 276 362 -228 -248 -37 886 244 -434 182 340 -65 -453 -168 563 -249 -289 96 447 118 -350 -75
5699 -75 32 -84 -524 226 540 -343 -451 178 290 -275 -275 -206 171 65 -580 49 592 -70 -655 1 449
5720 449 -216 -214 266 232 -343 55 51 -60 -359 -687 295 771 -265 -453 270 644 -380 -487 389 535 128
5741 128 -215 84 236 -128 -350 116 612 -36 -357 -102 351 -117 -336 -164 370 35 -185 -392 331 -31
5761 -31 -536 -83 460 355 -523 183 225 -440 -285 -497 366 354 -472 -296 770 339 -730 145 608 31
5781 31 -292 -87 174 475 -89 -82 -30 35 -326 -565 323 -2 -835 100 371 360 -609 -428 378 -134 -398 123
5803 123 402 486 -457 -236 721 -89 -768 224 584 156 -281 123 771 344 -205 -213 432 426 -410 -438 90 322
5825 322 4 -564 305 403 -283 -380 -148 392 -242 -472 182 233 -680 -262 288 223 -253 500 -22 -64 -16 -183
5847a83M96k04l58l08O08K9m71J19L19P7m96K53N08j57o94J48N24l7k83l78R42
5868D54O1r03J77N78k63m26L73R2M4l03k52P18l89j39m5M22K95j221N53N85J24
5889E35l98j52L23M9k73o09O44M74p92m99P59N03o44m76Q26j42j70l39J72N89
5909C80n02k94K39L82m45k60P00J18j056K66N69k05N7k81J03M80j62l95K90O06
5929E90p13n21Q43Ll19J98k02M38l74n10L43M79n5p60M53O17m51m68M99N05p82
5950a87j00L32J19n83L66k04Q07m95p44Q13L70o23o13Q60J52n59k01K15J31N82
5970D38r60l7O80P1p05K26P73p40m08O05K96m26j81M68j57K80m12j59M00K87p79
5991d40L70N00o02k45O75n0l27j17L40K22l45j59L3N96k95n06K61J006r37k23
$$ plain form
5847 -183 313 109 -249 -557 51 80 -391 -272 47 124 -372 -119 389 232 -462 -314 210 173 -110 -488 454
5868 454 515 -388 -211 367 104 -322 51 143 187 -116 -368 350 -39 -178 -223 199 494 -727 -174 411 535
5889 535 137 -15 308 357 84 -525 119 593 -199 -698 61 564 -80 -556 270 128 -42 -381 -209 380
5909 380 -122 -416 -177 205 -240 -500 200 318 -738 -472 97 -108 -51 -332 -229 251 89 -306 -16 590
5929 590 -123 -644 199 202 -117 81 -121 317 -57 -567 -224 255 200 -560 -107 510 59 -409 90 595 -187
5950 -187 -287 45 164 -419 -53 -257 550 55 -689 124 494 -129 -742 118 270 -289 -490 -275 -144 438
5970 438 -522 -559 121 192 -513 -287 486 -254 -662 -57 239 -187 -368 100 -57 223 -189 -348 52 339 -440
5991 -440 -70 430 -172 -417 258 208 -119 -236 104 326 -19 -178 -145 451 156 -350 -89 917 -20 -243
6011b43L05K40n2l13j04K71K18p22K14L94K38p37m9P67m42m46N10j22Q2j22j87
6032c00K84J44m91k87Q81j61k08J60J99j5m14m6N24j80k5l87N29j60k64J29L58
6053B70M21o52j49O86j67l99j09M20q8l73R8K88J39o93j13M86M16p43L5M83l15
6074e9J86n08Q23j77m81nL05j32l67J64M50j93J21l50L12Q6l19J66J22Q2k32j74
6096a80M03k46k50K6O16l28j96m32O65L51j95o14L73N10p43J58J06J15j55R4J78
6117B56m4Q6k00j14L09j94o31N75J08m64k16O44J76n6p08Q41k47O2n69K21K50
6138H5J25n48L35O47q51j99J003k96q77L65J90J96k1m40K24P62m38n35L85L78
6158D90o90j87O37Qo69M66k25N54m21l81K30Q80o70k29r4P30p37K88J85l0N5o53
$$ plain form
6011 -243 62 302 250 -63 -167 104 322 -400 -186 208 446 -291 -340 427 -15 -461 49 -73 9 -113 -300
6032 -300 -16 128 -363 -650 231 70 -138 22 221 206 -208 -254 270 90 65 -322 207 47 -217 -88 270
6053 270 691 39 -110 576 409 10 -99 321 233 -140 -42 246 385 -308 -421 65 481 -262 -227 256 -59
6074 -59 127 -381 442 265 -216 -221 84 -48 -415 -251 199 6 127 -223 89 175 -144 22 144 226 -6 -180
6096 -180 223 -23 -273 -247 369 41 -155 -587 78 429 234 -380 -7 503 -240 -82 24 139 -16 78 256
6117 256 212 298 98 -16 293 99 -532 43 151 -313 -529 115 291 235 -473 368 121 183 -386 -165 85
6138 85 210 -338 -3 644 -207 -406 597 301 -576 -211 -21 175 154 -286 -62 700 262 -273 112 490
6158 490 -200 -387 250 258 -411 55 -170 384 -37 -418 -188 692 22 -207 -301 429 -308 -20 165 135 190 -463
6180d63L20J05J27n04L69M60k05q78R80K6n81J36L26j97J9k26J18M95p8k41m99
6201c91O95k16k82L62J63n83j10N24K93n13j6j9J90n5o44N74O90n93n74P35J49
6222C79n58j00J69K67j01n49J30L12K96n01L84L79n66m28L80M73n42j36K30j4
6242i6J20j15N7k8p8m49L50M88k39l71P1N32l00l64J51L63M66n58m69Q90m6p77
6264d02N73N80q55j12l05O74K7n41k04N59L45n06j07P63j99n41L9N5J07j76J04
6285a22L02l0n70L13L59J43m74l64P29J42n71j41O61p3l58j52L13k9q5rL64k14
6307A34k77j98P64L4m72l44L89M13q45M83j32M3j7j05M26M09p98k30M04Rl56j15
6329c81O39j32k95j76O51q4k65o87L92Q78q98n1P37J95n88N9J90L1o26L26N0k05
$$ plain form
6180 -463 -143 -38 89 -415 -46 414 209 -669 311 337 -244 -108 218 21 40 -186 -68 427 349 108 -391
6201 -391 304 88 -194 168 331 -252 -362 162 455 -58 -74 -93 97 42 -602 -28 662 69 -505 230 379
6222 379 -179 -279 -110 157 56 -493 -363 -51 245 -256 128 507 -59 -487 -107 366 -176 -312 -82 -96
6242 -96 24 -91 -34 -62 -140 -589 -239 249 10 -361 -290 242 -58 -422 -271 92 558 0 -469 421 375 -402
6264 -402 171 751 -104 -216 -521 153 180 -361 -565 -6 339 -167 -274 489 290 -251 -212 -157 -50 -226 -122
6285 -122 180 150 -420 -107 252 395 -79 -443 286 428 -143 -284 377 304 -54 -206 107 78 -7 -16 348 134
6307 134 -143 -341 423 457 -15 -359 30 443 -402 81 -51 -8 -25 -130 296 705 -93 -323 81 90 -266 -381
6329 -381 258 126 -169 -345 306 222 -43 -730 -338 540 -358 -409 328 523 -65 -6 184 215 -411 -85 -35 -240
6351b40J68R1K4j30j47k13M74R8o9Q7PJ20k09m49M07K31k39j53R9L31l52k63L97
6374G0J93l25j43N03m61L81l41J54N55o02l56P49j04l10j74M75j24l02l13M26
6394d9L56m47o3L32K45k81o80P21L99m36n44M80J56k11Kq0K53j67K2k21N56k35
6416A08p67P57R2k03j68N48J55o84j19L39L63m94l36L86L57m63j1J58M24p35J85
6437a08L3J61j34k15K12K72m64j58N08J96l73r9N51J29k64m11L4O15j81o74L71
6458AL84l28k83M07l5k93j75O71l39jo9k22N44m69n1J37M94j92p49J85N05j86
6480f4k24J8P36p63K85p2j13M43o72j8N23J5l23k10N44k25k44M16J45k85o9J58
6502Ap1M91o86q0R59k84r91M48P33o38l21J68N69k8n66K54J73L15n00o9L98l2
$$ plain form
6351 -240 -72 19 43 -87 -234 -447 27 125 56 143 150 270 61 -388 19 250 11 -142 -43 288 -64 -327 70
6374 70 263 -62 -205 298 -163 218 -123 31 586 -16 -372 377 273 -37 -211 264 140 -162 -475 -49
6394 -49 307 -140 -203 129 374 93 -587 134 533 97 -447 33 189 -22 -20 -100 153 -14 8 -213 343 108
6416 108 -659 98 190 -13 -181 367 522 -162 -281 58 421 -73 -409 -23 334 -129 -140 18 442 -293 -108
6437 -108 -75 86 -48 -263 -51 221 -243 -401 107 303 -70 -169 382 511 247 -164 -130 485 304 -370 1
6458 1 385 57 -226 181 146 -147 -322 349 10 9 -60 -282 262 -207 -258 -121 373 181 -568 -383 122 -64
6480 -64 -288 -270 466 -297 -12 -84 -197 246 -426 -444 79 94 -229 -439 105 -120 -364 52 197 -88 -157 1
6502 1 -70 421 -265 -345 614 330 -661 -213 520 -118 -439 -271 298 270 -296 -42 131 446 -54 -123 275 243
6524B43o84M76L66jn92k2M02K3j25m8j15M95o73P7N30m01m46J82N00O0m29L6K92
6547A46K18n13j85M54L94o43n16O71J66l03p7J88L52p56K29J46JJ59n25O86L78
6568F70j179K65M17J4k48k03N51j71m49L57P9K61o13o6P71q4n30k85R42k04m78
6589a83p6M86k81m1J24j82L72j07p29N78M16n99j95N41n8m77M82J44O2k06k22
6610a51p7P20n11n76Q72M7p72L32M08k73m21J42M63K04n3m15J95K86n95j33M97
6631A89J43l09k86N43j37k73k58N11K35l76J90n91P99m79m82N54L00k26l49M47
6651A45K57m18n99K86L44K80n45L09N10n50n23O61l22J73k33M20p0j61j38J65
6671iM40n01j03J33J93m7o18L60L28j37n49P46o3j92l2j5N1J49m93J76O30k41
$$ plain form
6524 243 -441 35 401 400 -192 -214 188 211 86 38 -77 418 -255 -178 352 -49 -495 -313 187 247 -182 -146 146
6547 146 364 -149 -334 120 514 -129 -645 26 192 -111 -188 0 352 -404 -175 -29 -28 131 -394 292 670
6568 670 -509 -244 173 187 -61 -264 287 116 -333 24 103 364 -249 -315 456 372 -158 -443 499 295 -183
6589 -183 -259 227 -54 -95 29 -153 219 112 -617 -39 377 -222 -417 124 66 -411 71 215 277 71 -151
6610 -151 -228 492 -19 -595 277 324 -448 -116 292 19 -402 -260 203 407 354 -61 134 420 -175 -308 189
6631 189 332 23 -263 280 143 -130 -388 123 358 -18 172 -419 380 -99 -581 -27 273 47 -302 145
6651 145 402 -16 -615 -329 15 295 -250 59 569 19 -504 157 -165 8 -225 195 125 -36 -174 -9
6671 -9 431 -70 -173 -40 153 106 -512 -152 176 39 -510 236 173 -19 -51 -66 -15 134 -359 -183 447 206
6693B06o58M92J50P2o60K99P74l56n17J8J87N34o37o1J40J18n17M14L58l67l02
6714c13L04M91p98p4N15N08k08q71P74j05j90m42J09M88k07k42J61L76j01p02
6734e27J52R07o08j88K33K49l13l33O5O84j85m64n4P94Rp08P9N68l77n96O18M29
6756D34r8m31j46M55jl83K6N25m0l19j00L39K8o60M82L45j52m28K30M08J53q77
6778b10k19N89j24j94K83Q9P8o19P2O06k28l11M9K47M26o60r4N72J4o43N6M33
6800B12k15l38K65L94l28J26l49J7L44j62k31K17J84n79p9L56K58m08p0O28N9
6821C01l2o35N74J49j69l74J91K66m58J83K58L3p25M69n9K15k13m32O91J71m81
6842g7l55N20M82p82P5L46j35l17J02J97J51k12k37L09M98n59l56M36M19m65l81
$$ plain form
6693 206 -452 40 190 262 -398 -99 675 319 -198 -180 7 541 -96 -157 -17 101 -416 -2 356 -11 -313
6714 -313 -9 482 -316 -390 125 633 425 -446 328 223 33 -409 -300 188 -19 -261 -100 276 175 -527
6734 -527 -375 532 -76 -264 -31 218 -95 -428 -363 321 136 -328 -382 412 421 -287 -208 360 -17 -613 5 434
6756 434 336 -95 -241 214 213 -170 -144 381 341 22 -78 261 289 -371 111 456 304 -124 106 514 667 -210
6778 -210 -429 160 36 -158 125 214 292 -327 -255 351 123 -188 -139 108 534 -126 -220 352 366 -277 -221 212
6800 212 -3 -341 -76 318 -10 116 -233 -216 128 -34 -265 -48 136 -443 -522 -166 92 -316 -386 242 301
6821 301 269 -366 208 357 188 -186 5 271 -187 -4 254 287 -438 31 -28 187 -26 -458 233 404 -77
6842 -77 -432 88 570 -212 -137 209 74 -243 -141 56 207 -5 -242 67 565 6 -350 86 505 40 -341
6863c41N14M0m11j70LQ55n96k74K32P43p71j11K00M74o39j65N57r8j3o69M55P30
6885E45n07p33P06O33q73j37L73J04j23J27K23k0j12j88P7K56j11o03M57J19n52
6906c39j41L44M50n78L2oM22l48j98K80M75k74r61O74M34j86q06P41l2k57k9J54
6928a49J09J41k81j86P12p9n69M02L53o92K15K09l4j88j33L1L01J47n23L44M29
6949E59r1p75J29J067j149j82N98K85j91n54L99k6L72o37J20K34J76q28M34O41
6969E81n09j0l18M68r5q87P40J28J99p22P2N85l5l64J32N2L89o57J83K03Np70
6991f30M33N28l49k69K7L02J52n84Q7M70k81%k09N58L0o65R1O23k7m60K31N70
7013F28k60o53M61k96L43o24K30L92K66p53J34M32k62j41l92O39l15j98N37N22
$$ plain form
6863 -341 173 213 -198 -368 -365 490 -106 -380 -148 595 -176 -287 -87 387 -252 -417 140 42 29 -640 -185 545
6885 545 38 -695 11 644 -229 -366 7 111 -12 115 338 318 206 18 95 351 240 -363 94 213 -339
6906 -339 -480 -136 314 -264 -232 -238 184 -164 -362 -82 393 119 -842 -168 266 80 -726 15 -17 -274 -303 -149
6928 -149 -40 101 -180 -366 346 267 -302 100 453 -239 -24 185 151 -37 -170 -139 162 309 -214 130 559
6949 559 468 -307 -178 889 -260 -442 156 441 250 -304 95 69 441 -196 -76 158 334 -494 -60 581
6969 581 72 62 -256 212 117 -770 -30 98 297 -425 -353 232 197 -167 -35 17 406 -251 -68 135 140 -630
6991 -630 -197 331 -18 -287 -260 42 194 -390 -303 167 -114 -114 -323 235 265 -400 -309 314 287 -173 58 628
7013 628 368 -285 176 -120 223 -401 -171 221 487 -266 -132 300 38 -103 -495 144 -171 -369 168 690
7033F90l36l68l13K20K49o46L84O85n4p14L15j07p3m90L38M14k4j97n58N95J63
7054A73m07J86L68L47r29k04N02j73n8l11O25N1l25l64L08N06o50K8K16J83j10
7075c8n10R62l53p5j44K79K92l83m61O03J62n47P8M07K17l29k22N79j63l65n35
7096e46L11O90j55n14M11K12m79m27P29J02j022Q15Q1j54K54p25K81R64j179k3
7116c74P07j9q12J87N80l11m47R2J09P48m13l59K76J46K8k42K90J88m11N4m1R4
7138G0m43N29k49N91k57n49K73M72k00p87O76K12o82J61K97P6m02p7M0L26K5o57
7160e55O32N44n75o10M44N48q36J06O20n4m33l36m9J020k16p77K42Q81k57q01
7180d62O22L11o54j28K08J30P0m77J20M89j52q68M85J088r53n75O27M40j69r6
$$ plain form
7033 690 354 -14 -327 -107 142 -504 -120 565 511 -203 112 5 -68 -558 -220 194 170 -27 -585 10 173
7054 173 -234 -48 320 667 -262 -466 36 -137 -195 -506 119 170 -155 -519 -211 295 -355 -327 -111 72 -38
7075 -38 -548 414 61 -14 -158 121 413 30 -431 172 334 -213 -135 272 489 160 -62 517 354 -11 -546
7096 -546 -235 455 300 -214 197 409 -70 -497 232 334 -688 127 208 54 308 -417 -136 828 -351 -374
7116 -374 333 314 -498 -311 269 -42 -489 -397 -288 460 47 -312 -36 110 138 -104 186 374 -37 17 -24 70
7138 70 -373 156 -93 498 241 -308 -35 437 237 -550 126 338 -344 -183 114 190 -212 -289 -249 77 102 -555
7160 -555 77 621 46 -564 -120 428 -408 -302 318 264 -169 -505 -554 466 250 -527 -285 596 339 -462
7180 -462 160 471 -183 -311 -103 27 97 -380 -260 229 77 -791 -306 782 -171 -746 -119 321 152 56
7200E6P5K42j42m44j92O91k77k12l52R51p5q60N74N6k00k37Q4K27K00k41j50O49
7222D23k89m63L03K10k98n26P95J54j99k84J07N30n19k12j29M71J31p50J54Q80
7242D89k72r77P47K95n12o0j12O25M39q73k40N49M0o07M05L12m82pp4P81l27j21
7264A8l26N31K56m49l9N87o39n85M36K30K86l74k17M53K36o11j64M92j63l34K38
7285a38M05j59m83K77N15j94j17l67N69q2j02l01K94J88p18J60L92J02m98k08
7305d65L68R0j94o2K22N46o58k72Q05m30p8n9L32J83q18nL63M19m24r3M77p0l42
7328a65m41M27L68p06J99M25K53n04k79P37n9l15m2M37k51k00k19P80k53k46k77
7349c31N93m90o5q8K82N34k66l77K65N44l70n05L27L76o21l4L54l70M9q1J48K20
$$ plain form
7200 56 131 373 231 -213 -405 286 9 -203 -555 396 321 -539 35 91 -109 -346 -262 -35 165 -76 -226 423
7222 423 134 -329 -26 184 -114 -640 155 309 110 -174 -67 463 -56 -268 -397 74 205 -545 -391 489
7242 489 217 -760 -13 282 -230 -290 -402 223 662 -211 -451 98 138 -469 -64 248 -234 -241 -315 466 139 18
7264 18 -308 223 479 30 -9 578 -61 -646 -210 20 306 -68 -285 168 404 -207 -371 121 -42 -376 -138
7285 -138 267 108 -375 -98 417 223 106 -261 308 226 124 -177 117 305 -413 -253 139 241 -257 -465
7305 -465 -97 -7 -201 -263 -41 505 -153 -425 380 -50 -128 -187 145 328 -490 -495 -132 287 -137 -230 247 177 -165
7328 -165 -606 -179 189 -517 -318 107 360 -144 -423 314 255 -60 -102 335 84 -116 -335 445 192 -54 -331
7349 -331 262 -228 -293 -381 -99 435 169 -208 57 601 231 -274 53 429 -192 -226 128 -242 -193 -274 -126 94
7371I4K71o20L25L34p16n4M98j46m29M8L48M51l64m37L90L50l63l90L89K02n32
7392c51J35M29K51k16o57K03O85o33l89N17L39k63k72j9P29n28j73J24M65p36
7412c60P1O7L34r9j04J97M64m85o30Q86Q8k06o69M33o9j39k89K24N06k66k34q8
7434c68J081o23q09Q81L05m66m8K67JMl61L29j69M95r14K42O38q22p3L85M52o14
7456a87J14J46L42l09l26m0P32K31q31m04O97k05j45K6O84l11k37J4K37j38m73
7477c83J46O27j44o93K32N37j36o12M67J92k98n93N80N3R9j44l83Q91k09n83O2
7498b92P19k51n01M06N11n88l0r6J90j74j24mO08K03n98k16O52p42p1N74J16j60
7520A32k40l08P59M5q49k12O80K19n64m3J081p06r4J36K29m92j42O2K47L8l38
$$ plain form
7371 94 365 -255 70 404 -312 -366 132 -14 -443 -395 -47 404 40 -397 -7 343 -20 -410 -21 181 -351
7392 -351 -216 213 464 248 -409 -206 479 -154 -543 -26 313 50 -222 -241 488 -40 -213 -89 376 -360
7412 -360 -289 -222 112 13 -91 106 570 85 -545 341 429 223 -446 -13 -82 -221 -510 -286 220 -46 -280 -368
7434 -368 713 90 -719 162 467 1 -47 220 221 225 -136 193 24 519 -395 -153 485 -337 -410 -25 427 -187
7456 -187 -73 73 415 106 -220 -260 472 703 -128 -532 165 -40 -185 -159 525 214 -23 -9 228 90 -383
7477 -383 -237 390 246 -447 -215 322 186 -426 41 233 -65 -658 -78 -25 74 -70 -453 438 229 -354 -292
7498 -292 427 176 -325 81 592 4 -26 -122 68 -106 -230 -234 374 577 -21 -237 415 -327 -398 176 292 132
7520 132 -108 -416 343 388 -461 -673 7 226 -338 -381 700 -6 -100 36 265 -227 -369 -307 -60 -22 -360
7541c60k39O73K53m66J3O48k47l52P1j49J91M3k49j22L55n69K14K80L29o04k02
7562d89N87J21j44k01K55N09p93l26J21Q11o99m6O83k63n22l9O98J18n27m4k3
7583b13M52k09k86L04Qq2l40Q35mr58J64M71K43m05l67N84M11n62p61P84L83p90
7605c38j01Q06J64o70O0M17O8m47J28L8M64p42j46L94J16j24k52M77m3n81J02
7626b10K88k1r2m73N84J95n41l44P86J24l68r6M12N6n37k9J35K08j87l79J73M89
7648A73n33j9j37N91m87J00N83j72j23N0J49j14R8l65L38J39om07J62J93p08M68
7670b7j4K63l23m72O04k23r9K13k54L95j93M0J80L33q6l59j84L17K2o16L02N95
7692D14l59l71O11K96q19n12N79J44m6r9N08Lk12l07j43O98k79p16L84O75k93
$$ plain form
7541 -360 -599 74 327 -139 -126 522 275 -77 -6 -155 36 79 -170 -292 63 -506 -292 -12 317 -287 -489
7562 -489 98 219 75 -126 129 638 -155 -481 -360 451 -248 -294 389 126 -396 -435 263 381 -146 -190 -213
7583 -213 239 30 -256 48 56 -26 -366 469 465 -493 -329 142 385 -20 -387 197 608 46 -715 69 452 -338
7605 -338 -439 367 531 -139 -79 338 406 -41 87 125 589 -153 -299 95 211 87 -165 312 269 -312 -210
7626 -210 78 57 -35 -508 76 271 -270 -614 172 296 -72 -168 244 300 -237 -266 -131 77 -110 -489 -316 173
7648 173 -360 -379 -516 75 -412 -312 271 99 -24 26 175 61 159 -206 132 271 265 -142 20 213 -495 -27
7670 -27 -41 222 -101 -573 31 -192 -291 -78 -332 63 -130 -90 90 423 337 -22 -206 111 133 -483 -181 414
7692 414 55 -316 295 591 -228 -740 -161 -17 -63 -162 346 349 137 -170 -313 385 106 -610 -226 449 156
7713A56l88N3N75n04j86M30QK08l74L9L80j22m23o4Q57p40r1K87K36l6n34j26
7735c59J95K31m25M0M02j16j88k34Q85m42j8l37J95O8J37r7M26K88o81n49J073
7756D94k3r06K83R55r19K21O6M2J02n36J08q9O72m61k30P26m30n13K75M81m19
7777a01j08K00M59k79m55l10N01L44r98M30L31K51o30O9N38l37J23l08M2M17m46
7798b67k22P18K86p54r0L70M53n05j02J65j29j3oj11k3J92k50N36N17j071l4L30
7820a0L50m82k34O61nj17l92L90L44m76k51K67K97n86p5R47n90j83J50j6n5L96
7842C30r17N82O36l14r66O18L81m12k1J99K09p89K25K65K56k67m00N24M07m19
7862A27o12P61K65n28k17M94l5n56m14P15N3n6l02L69P8o7m06L78K62m07k60N07
$$ plain form
7713 156 -232 -179 396 -108 -294 136 144 352 -22 17 397 275 -148 -212 645 -95 -186 101 337 301 -233 -359
7735 -359 -164 67 -358 -318 84 -32 -220 -454 431 -11 -29 -366 -171 -103 34 -63 363 651 -30 -579 494
7756 494 471 -435 -152 803 -116 105 171 213 315 -221 -113 -202 470 9 -221 505 75 -438 -163 318 -101
7777 -101 -209 -9 450 171 -284 -594 -93 251 -747 -317 14 265 -365 -296 242 -95 28 -280 -238 179 -267
7798 -267 -489 229 515 -239 -329 41 494 -11 -113 52 -77 -90 -96 -207 -230 -38 -288 248 765 -306 -340 -10
7820 -10 340 -142 -376 285 280 163 -229 161 505 29 -222 45 342 -244 -319 628 38 -145 5 -11 -66 330
7842 330 -587 -5 631 317 -649 -31 350 -62 -83 116 325 -464 -239 26 282 15 -385 139 546 127
7862 127 -485 276 541 13 -204 290 255 -301 -715 0 53 -3 -305 64 142 75 -331 47 309 -98 -358 149
7884A49K72p04O5j45P84l37l94j2L57k18m55L02N12m07k74M49K41j12l80K87K91
7905B71J08q26O00L43m83m68L06O46m26Kp6P9n4O1r5J45k19l48L09N34k45k76
7927a12L95J72l50j86K52K9m59L4J70k71L26m38L38O73n61n09L16L01k38M5p1
7948a44L55J4n52M38O7o2o22K56N16j90l49RM93j61l76J67L97p1j88k38P94l93
7970A60m79j5O15l24j09J05jM30o68j78Q18q8o60l3J067q40k23P75r9l43J52K36
7992B98K3j21m62l92J026r7m30p6O54n97j38K89L98p44R0K97J24J24m63q0L72
8013I5r9p7P5L97o08q9K13K03J69m11J31Q6k8k01k44O00k37k61N29kk74j77M65
8036B55k44J11J00m44M00K52m19j99P16l49m15J20M03r8m64N45m96L70j54m20
$$ plain form
7884 149 421 -283 -218 -363 421 84 -310 -322 35 -183 -638 -336 176 -231 -505 -56 185 73 -307 -20 271
7905 271 379 -447 153 496 13 -455 -149 497 71 73 -3 76 22 83 -12 133 -86 -434 -125 409 164 -112
7927 -112 283 455 105 -81 171 200 -259 -225 -55 -326 0 -438 -100 573 12 -497 -181 120 -118 -73 -144
7948 -144 211 225 -327 111 178 116 -506 -250 266 76 -273 -264 229 68 -308 -141 256 185 -3 -241 553 160
7970 160 -319 -334 281 -43 -152 -47 -48 382 -286 -464 354 266 -394 -427 640 -200 -423 352 253 -90 62 298
7992 298 321 200 -262 -654 372 275 -155 -231 423 -174 -312 -23 375 -369 -279 18 142 266 -197 -277 95
8013 95 -4 -81 -6 391 -217 -306 -93 110 279 -132 -1 85 57 -144 -388 212 -25 -286 243 241 -33 -210 255
8036 255 11 122 222 -222 178 430 11 -188 528 179 -236 -116 287 189 -275 270 -226 144 -10 -430
8056d30J83N47q42l27J009K46p94J63P01l79n34J49L15j00J32k29L44M10p84k66
8076d86P59J83o68j40O28k14J17n17L77N2k49k14L68M41l63n3L75j22p68O14k9
8097I1l82L96j92K77J58N4q27M22M36o82j12P58J42n50K49k15P0j26l54J18N79
8118C10N7o25O94M06j068K10J79j36k29L69K97l56k37r5R5Q52q11m00L57M14j47
8139A36o57Q31k57j02k52R8M43k36m72L81L48J47p16L93J23r8l66L01r6K62L5
8160B46j35j4k17J17k86J062m47p04M40N40o41J2k8N07k07n82K00L75K12j013
8180e63L48P51m54o59O78K34o01N0J97Q6j88
$$ plain form
8056 -430 -247 300 -542 -869 140 386 -408 -245 456 77 -457 -308 7 -93 39 -190 154 564 -220 -486
8076 -486 273 456 -212 -352 276 62 179 -338 39 91 -158 -372 -4 437 74 21 396 274 -494 120 91
8097 91 -291 105 -87 190 348 402 -425 -3 433 -249 -361 397 539 -11 238 23 93 -33 -387 -269 310
8118 310 367 -258 436 842 -226 -16 163 27 -202 167 464 108 -129 -224 -129 723 -88 -488 -131 283 136
8139 136 -521 310 53 -49 -301 -203 240 4 -468 -87 261 408 -308 85 208 110 -256 45 -51 211 246
8160 246 111 97 -120 -3 -289 773 326 -378 62 602 -39 -27 -55 452 245 -337 -137 238 450 -563
8180 -563 -215 536 82 -577 101 335 -266 -216 -19 67 -121
8191a21
$$ Imaginary data points
##PAGE= N=2
##DATA TABLE= (X++(I..I)), XYDATA
0@%%%%%%%%%%%%%%O4j28J28j28J28j58K22k56L19l83L85m49N76o41P06q33R61
31E13j090J223j413J603j797K038k282K549k824L137l495L876m284M733n233N779
47C033o371P018p733Q514r376J0334j1403J2607j3967J5518j7298J9369k1815
60a1570K4758k8390L2988l9012M7284n9406P8880j15097K04277p94365j215595
71a875248K122988R42779j357905p82144J122558N67764q40132n39807Q71218
80B32071M68094j014492n47697J249059N92974j242387n60643J138153M27494
89G42626q73355k96064O44829J69023m93039o3297O31893N2639r51696k61302
99f97743J113413L65506j086486k89153J022153J86424q63305r8455O95830l347
$$ plain form
0 0 0 0 0 0 0 0 0 0 0 0 0 0 0 0 64 -64 64 -64 64 -94 128 -128 191 -192 193 -256 320 -321 385 -448 513
31 513 -577 646 -767 836 -961 1077 -1205 1344 -1480 1657 -1838 2038 -2246 2487 -2746 3033
47 3033 -3338 3680 -4053 4461 -4915 5419 -5984 6623 -7344 8174 -9124 10245 -11570
60 -11570 13188 -15202 17786 -21226 26058 -33348 45532 -69565 134712 -659653 -1875248
71 -1875248 247740 1190519 -167386 -949530 173028 740792 -99340 -639147 232071
80 232071 700165 -314327 -862024 387035 980009 -262378 -823021 315132 742626
89 742626 -130729 -426793 218036 387059 -105980 -169277 462616 515255 -436441 -697743
99 -697743 415670 781176 -305310 -594463 427690 614114 -249191 -347646 348184 344837
109C44837p40712j27571Q01470L18080q06111l60592Q61791L07621r18773k71192
119e91152Q09333J41310o65052R407O37488j5998p10494j73677P41989L66508
129E49662p51188m46947P85204M70033p38908l97167O25571K34568n95045j96005
139d60222N84310L24272m96521m23833M79084N11824n09537n89469M67322N37018
149D24248l93811l65781L73534K52747l30009j99623K86871J90267l09585k48796
159c19938L81385L67089l91342l95708L84307L11872m28984k51104M51753K59653
169C68983l79150k42576L44184K63318l69749l62474L61462M18963l62512m04509
179c64060M16425M18132m08835m19260L30757L61260k93191l43968K78205L87360
$$ plain form
109 344837 -395875 -523446 278024 596104 -210007 -570599 291192 598813 -319960 -591152
119 -591152 218181 359491 -305561 -296154 341334 325336 -385158 -558835 183154 549662
129 549662 -201526 -648473 136731 606764 -132144 -529311 96260 330828 -264217 -460222
139 -460222 124088 448360 -48161 -471994 7090 518914 9377 -580092 -112770 424248
149 424248 30437 -335344 38190 290937 -39072 -238695 48176 238443 -71142 -319938
159 -319938 61447 428536 37194 -358514 25793 337665 -91319 -342423 109330 368983
169 368983 -10167 -252743 91441 354759 -14990 -377464 -16002 402961 40449 -364060
179 -364060 52365 470497 61662 -357598 -26841 334419 41228 -302740 -24535 362825
189C62825k40766m08035K22260L81969k70747l82491K95004L77795k80225l45278
199b87689K69832L32100k64889l76263K02252L73980j71849l46224K08898L65532
209C05680k18748l81260J79463L30737j85370l06423K01691L35423j69832l38697
219b47336J48322L26418j59934l37737J47541L31308j18656k85970J29425K75081
229B08462j39343k98867J16691L00520j12341k88316J46954L14903j43272l24418
239b19027J11994K96353j02146k91136R0054L18036m6215l12407M6789L17564
249B09859q0207l53636P4457L56788m4375l05007M8405K87221l1072l00167k1223
260a58957K95077M2797k92774j6114L24058K816l24951O954K83700l8167k63643
$$ plain form
189 362825 122059 -285976 -63716 318253 47506 -334985 -39981 337814 57589 -287689
199 -287689 -17857 314243 49354 -326909 -124657 249323 77474 -268750 -59852 305680
209 305680 86932 -294328 -114865 215872 30502 -275921 -74230 261193 91361 -247336
219 -247336 -99014 227404 67470 -270267 -122726 208582 89926 -196044 -66619 208462
229 208462 69119 -229748 -113057 187463 75122 -213194 -66240 248663 105391 -219027
239 -219027 -107033 189320 87174 -203962 -113908 204128 157913 -154494 -107705 209859
249 209859 129652 -223984 -149527 207261 162886 -142121 -93716 193505 162433 -137734 -158957
260 -158957 136120 178917 -113857 -129971 194087 196903 -128048 -121094 162606 124439 -139204
271a39204L5200K62593J5368k48287m0479K59002K7565l22138l2988L51008K5127
282A92767l33001R168L06970k3702k86410j4759K45785M0456k51560o5760K98309
293A18263R4842l33807r7858L26718M1496l29109j3586L03634K7584k37914m2673
304a42410J98812N7540k28049j00740K66075J18943k93071q0833L28993M9927
314A75187l21798l6809K65089K5128k16062l6836K19882J06856k21142j48844
324a89349K43892J39993k93487j11814L26021R5325k85674n5539K38122M7476
334A54966k02089q8409J73769J38269j72868j50463K30360J58320k77012j41584
344a76741K73172Q0366k55008l7577K31145N8169j84813j02916J54349J36243
$$ plain form
271 -139204 -104004 158589 173957 -74330 -114809 144193 171758 -150380 -183368 167640 192767
282 192767 -140234 -131066 175904 152202 -134208 -148967 96818 137274 -114286 -180046 118263
293 118263 213105 -120702 -218560 108158 149654 -179455 -193041 110593 138177 -99737 -142410
304 -142410 56402 113942 -114107 -214847 51228 170171 -122900 -203733 125260 175187
314 175187 -146611 -183420 81669 106797 -109265 -146101 73781 180637 -40505 -189349
324 -189349 54543 194536 -98951 -210765 115256 210581 -75093 -130632 107490 154966
334 154966 -47123 -135532 38237 176506 3638 -146825 83535 241855 -35157 -176741
344 -176741 96431 176797 -78211 -115788 115357 173526 -11287 -114203 40146 176389
354A76389j91125j81439K35530J93994k62473j55202K71807J03950k62261j00016
364a70846J95385J04983j41714j30101J37931J83510j64101k29819J83493K06461
374A75182k22683j62728K41202J28996k04371j01289J51259R4897j31576j44637
384a75748J25578K00920j34719k10843J87049J99910k35237j83510K28746J46278
394A48424j88375j12367J60927J36766j23035j84064J05567K16020j32182k32117
404b04436J81276K37181j91926j92296J90328J43717j75332j36825J34282J58796
414A44765q7533j75856R5797K10597j33185k39003J59067K21609j80860j79205
424a63807J92452J58623j61056j53706J11439J56335r7485j94963J01097K40755
$$ plain form
354 176389 -14736 -196175 39355 233349 -29124 -184326 87481 191431 -70830 -170846
364 -170846 24539 129522 -12192 -142293 -4362 179148 15047 -214772 -31279 175182
374 175182 -47501 -210229 30973 159969 -44402 -145691 5568 100465 -31111 -175748
384 -175748 -50170 150750 16031 -194812 -7763 192147 -43090 -226600 2146 148424
394 148424 -39951 -152318 8609 145375 22340 -161724 -56157 159863 27681 -204436
404 -204436 -23160 214021 22095 -170201 20127 163844 -11488 -148313 -14031 144765
414 144765 57232 -118624 -22827 187770 54585 -184418 -25351 196258 15398 -163807
424 -163807 28645 187268 26212 -127494 -16055 140280 42795 -152168 -51071 189684
434A89684j08040k44165J32120K15325j65135j98339J50378J72246j09356j48685
444a13967Q3477J60187p1443k00373O0815K14008q5324k12926J22201K08295j29382
455C5568j82711J13638J45912j06292j49054Q6947J79045n8432j97374O2113K12438
466A41798r0748k29555J00004K19227r5065j84841R4731J74371p4713j81097M0698
477h5190J83487l2170j95297M7549K20353m8928k16762N4365J89623p1027j76788
488a30785O8123J76499m2080j68040L4382J78432l8175k05354L3332K11697l6935
499H1096j97744N6819J99342n4188j97913L3093J82070k6640j83719K7059K07755
510A27030r517k09252M273J96074j9300j97344K1209J96027p517j78883Q523J76653
$$ plain form
434 189684 81644 -162521 -30401 184924 19789 -178550 -28172 144074 34718 -113967
444 -113967 -30490 129697 58254 -142119 -81304 132704 47380 -165546 -43345 164950 35568
455 35568 -147143 -33505 112407 6115 -142939 -55992 123053 64621 -132753 -70640 141798
466 141798 51050 -178505 -78501 140726 45661 -139180 -44449 129922 55209 -125888 -85190
477 -85190 98297 66127 -129170 -81621 138732 89804 -126958 -72593 117030 46003 -130785
488 -130785 -62662 113837 71757 -96283 -61901 116531 78356 -126998 -93666 118031 81096
499 81096 -116648 -59829 139513 85325 -112588 -79495 102575 75935 -107784 -80725 127030
510 127030 117513 -91739 -87466 108608 89308 -108036 -86827 109200 101683 -77200 -68677 107976
522A07976j2252j93638j149J91711L679j81099J2772J84827j6772j89147L935
533h9157J78529p966j82961R537J99024m92k02463k811J94164r005j99791J653
545a11739J92899J0893j78057j1889J80213J4284j97449l1906J91662K8412j81152
556i3829p941J83147N064j75054j3196J52029J1668j50560j5301J68995L5132
567A00154j71444l3389J73490J2838j83648k098J81896Q971j56649o433J50858
578G4546K0804j56667m9290J60680O5716j62169n3234J74782M4413j67333l1252
589g9004J46972J8659j32590k6978J24333N8511j11625p2802J16431O9463j42182
600c0812o6529J50008M9104j39683j9615J33818J2921j29692m3620J09856O7346
$$ plain form
522 107976 95724 -97914 -99063 92648 96327 -84772 -72000 112827 96055 -93092 -89157
533 -89157 89372 81406 -101555 -92018 107006 106514 -95949 -98760 95404 86399 -113392 -111739
545 -111739 81160 92053 -86004 -97893 82320 96604 -100845 -132751 58911 87323 -93829
556 -93829 -101770 81377 86441 -88613 -101809 50220 61888 -88672 -103973 65022 100154
567 100154 -71290 -104679 68811 81649 -101999 -104097 77799 86770 -69879 -76312 74546
578 74546 95350 -61317 -110607 50073 115789 -46380 -99614 75168 119581 -47752 -79004
589 -79004 67968 86627 -45963 -72941 51392 109903 -1722 -74524 41907 111370 -30812
600 -30812 -97341 52667 101771 -37912 -57527 76291 89212 -40480 -84100 25756 93102
611I3102j09703q5063J31521R9764j50002r9044J46016O5839j48139m9302J37415
622C2404N9529j09479p9688Q5826R6296r2050j21439J05118J23849j18033r9366
633a17033J34087P2365j33302n9584J08804N6163q8248p0119Q7103J07698q8472
644I462j29285J04085J23412j33188j08395J51511R7253j32620p8071J07965P9674
655I1803q6158j05882O8527J35572o5860j39362R4112J37506j19657j21222J22586
666A1965R1846j09385o8372R2794P3710o6862r3963N7087J14150p4729j33806
677a05565J02033J33688j21901j12439J32907R0574j22995q9275Q6042R1205n8158
688B6116j07080N5988J36890o6546j56807P6245J41274r8210j18977J04829R9920
$$ plain form
611 93102 -16601 -101664 29857 129621 -20381 -119425 26591 92430 -55709 -105011 32404
622 32404 91933 -17546 -97234 -11408 84888 -7162 -128601 -23483 100366 -17667 -117033
633 -117033 17054 89419 -43883 -103467 5337 61500 -26748 -96867 -9764 97934 9462
644 9462 -119823 -15738 107674 -25514 -133909 17602 114855 -17765 -95836 12129 91803
655 91803 5645 -100237 -31710 103862 38002 -101360 -7248 130258 10601 -110621 11965
666 11965 103811 -5574 -73946 18848 92558 25696 -68267 -11180 102970 28241 -105565
677 -105565 -3532 130156 8255 -104184 28723 119297 -3698 -92973 -6931 84274 26116
688 26116 -80964 -24976 111914 45368 -111439 -35194 106080 7870 -111107 -6278 93642
699I3642q2624q2685N1568P6147m0755j00967L8254J27263m4722j32713O8764
710b8828J22781r3300j09189R2087Q7817p3002p4117N3813Q5892l4805j10119
721h0970K8848J31666m2035j44685N9384J42006o2721j14355O1916R0806n0188
732A9672q7337K4134R5400k938j05701J0231J27970k4362j40940L4987J25700
743G6816m7323j01261N5143R2225l7429q9402J4601R2247r173j14645J4162J40298
755H6259j6170j43475K8261J29287l9972j17497L3400J03819j5575r5669L126
766d4206J05478O243j21759j0049J27074l825j27403J9715J21957k0836j04021
777e1632J7313Q6896j5711r1626K601J03616R243j09053k279J17358j2042j26590
$$ plain form
699 93642 11018 -71667 -20099 56048 15293 -85674 -47420 79843 35121 -97592 -28828
710 -28828 93953 653 -108536 -16449 71368 -1634 -75751 -21938 63954 29149 -80970
721 -80970 -52122 79544 37509 -107176 -47792 94214 31493 -82862 -20946 69860 19672
732 19672 -67665 -43531 51869 48931 -56770 -46539 81431 57069 -83871 -48884 76816
743 76816 29493 -71768 -16625 75600 38171 -51231 -36630 55617 46444 -68201 -54039 86259
755 86259 70089 -73386 -45125 84162 44190 -73307 -39907 63912 48337 -47332 -44206
766 -44206 61272 67515 -54244 -64293 62781 58956 -68447 -48732 73225 52389 -51632
777 -51632 -34319 52577 36866 -54760 -52159 51457 60700 -48353 -50632 66726 54684 -71906
789g1906J0851J15724j2064r7663J4619R6805l912j04967j5948J02720J8103j08233
801e5871j2237J19086J3037j14280j2597R7877M398r1931p747R0498J9802q5869
813c5834k0586R0789J8658j01393k1645R9863K0118r1089j0256R2317J3924q9612
825c4746k2355Q4646K2852q8987k1131J01452L2046r7564l3000R2612K7927r3096
837b9344l3631R1841M4219q1178l9613Q4317L6836r2742m2911Q9534M1395q1821
849a3098l4344Q3701L7918q2105m7455P4337M4508q1009m3305R1908M6530r1178
861a3592m4852Q4939L5822q7861m3608Q0779N4347p2268n7608P5450O0044q8428
873a6836o8708Q6087O1187q4201m9189Q3501M9350p3455n6747N7563N5478o0096
$$ plain form
789 -71906 -61055 54669 42605 -55058 -40439 56366 52454 -52513 -68461 34259 52362 -55871
801 -55871 -68108 50978 64015 -50265 -62862 35015 39413 -52518 -60265 30233 50035 -35834
813 -35834 -56420 34369 53027 -48366 -70011 29852 49970 -41119 -51375 40942 54866 -34746
825 -34746 -57101 27545 50397 -38590 -59721 41731 73777 -23787 -56787 35825 63752 -29344
837 -29344 -62975 28866 73085 -8093 -47706 36611 73447 -19295 -62206 27328 68723 -13098
849 -13098 -47442 36259 74177 -7928 -55383 18954 63462 -17547 -60852 31056 77586 -13592
861 -13592 -58444 26495 62317 -25544 -69152 11627 65974 -6294 -63902 11548 71592 -16836
873 -16836 -85544 543 61730 -22471 -71660 11841 61191 -12264 -69011 -11448 44030 -16066
885a6066o0972P1944P1417p6284o6178Q2080N1222q8601m6245Q1860M8002o3190
897a1011m5690O0679N6934o5032p3621O8806P8224p6753o7850R1442O5439q5666
909d099n8650O7853N1147n4760n5909M9745P5320m2394q1686N1726P9838p0498
921G633p6760P5854O5670o5552m7251N8375M4146m8018n9806L3797P0095l7074
933B1109p8876N5588Q6652o8820q2875O9096O1512o8633n3491N4227N8154l2296
945B1347o6174K1302P7733l2168r7420M1044R8178n0346q0564N9262O3942n5297
957H39n6989L3063N1659j8469o0774J8307Q3727k2579r6416L5708R0945n6145
969B876q1348O3495P1244m7755n5870L2395N6319k0633p5399J1072R5374j2937
$$ plain form
885 -16066 -77038 -5094 66323 -9961 -76139 5941 57163 -31438 -77683 4177 52179 -11011
897 -11011 -56701 3978 60912 -4120 -77741 -8935 69289 -7464 -75314 16128 81567 -4099
909 -4099 -62749 5104 56251 1491 -54418 -4673 70647 28253 -53433 -1707 78131 7633
921 7633 -69127 6727 72397 6845 -40406 17969 62115 14097 -45709 -11912 58183 21109
933 21109 -57767 -2179 84473 15653 -67222 1874 63386 -5247 -58738 -4511 53643 21347
945 21347 -44827 -23525 54208 22040 -75380 -34336 63842 13496 -67068 -7806 56136 839
957 839 -56150 -23087 28572 10103 -50671 -32364 51363 28784 -67632 -31924 59021 2876
969 2876 -78472 -14977 56267 8512 -47358 -14963 41356 20723 -54676 -43604 51770 38833
981C8833j00037L3775J01232m6437r1073M3891O8623l4230n4035K1979O1962j745
993D2738p4078m638Q4236r465r6867K7461R7253l5693p8107M0596O0327l5745
1005A8018n7787J4435O1142J636p1615k59R2108q358j04835J7543R4328l1497
1017B4859p9456L5071O9269j8364o0705j807N9283R977p6547j2813R1977P929
1029D8673r2923J0415Q6036k6055p6115K1150N9656r519n0997Q0O1408J1125p7964
1042c5030j6642Q6224L157r1727J2558R1660j6261p6808J2029O1377m779o1325
1054c5567j2549O8143K7138p3691k3251Q4206J1214r0726m919Q0908p38o4944
1066c4776M115N8140Q142n5673k2881N7431K4741o8171j9481Q2005J6065q1229
$$ plain form
981 38833 -61204 -27429 73803 27366 -63707 -19816 48807 14577 -39458 -17479 44483 42738
993 42738 -31340 -35978 48258 38793 -58074 -30613 66640 30947 -47160 -6564 53763 18018
1005 18018 -39769 -25334 35808 37444 -34171 -34430 57678 49320 -55515 -37972 56356 24859
1017 24859 -54597 -19526 49743 31379 -29326 -31133 28150 38127 -38420 -51233 40744 48673
1029 48673 -44250 -33835 52201 26146 -49969 -28819 30837 21318 -29679 -29599 31809 42934 -35030
1042 -35030 -51672 34552 37709 -54018 -41460 50200 33939 -42869 -30840 30537 25758 -35567
1054 -35567 -48116 20027 47165 -26526 -49777 34429 45643 -45083 -50002 30906 30168 -34776
1066 -34776 -30661 27479 35621 -20052 -42933 14498 39239 -28932 -48413 33592 49657 -31572
1078c1572n556P3749j492o8934m275O2065J8789n5920k4395O3442K9117p5377
1090b0359l1694P8342K4584p4834j5042P3659J5594o3600k2625N2883K4538n3610
1102a2164k9821O1433L5452o4359l1832O7309K1110p1433k0098O6172K0705n7562
1114a5088k1066N6524K5406o2175l4407O2388L4306o7586l1324P2573L2018o9347
1126a7778l3249N9712K9777n8871l3655N8191M0363n4676m0118N5967L6049o0292
1138a8580l8178N7060L7369n0703l1004N1471L2576n3153l6553N2160L5175n4021
1150a6381l1750O0473L5820n7429l6369N2831L5668n1850l8447N3220M5513n0358
1162I41m4163N4231M3093n6539m3789N2122M1988m4042l7974M2126M2046l8471
$$ plain form
1078 -31572 -37128 36621 35129 -33805 -38080 23985 42774 -13146 -37541 25901 55018 -20359
1090 -20359 -52053 26289 50873 -23961 -39003 34656 50250 -13350 -35975 16908 41446 -12164
1102 -12164 -41985 19448 54900 -9459 -41291 26018 47128 -24305 -44403 21769 42474 -15088
1114 -15088 -36154 20370 45776 -16399 -50806 11582 45888 -21698 -53022 19551 51569 -17778
1126 -17778 -51027 8685 38462 -20409 -54064 4127 44490 -10186 -50304 5663 41712 -18580
1138 -18580 -56758 302 37671 -13032 -44036 7435 40011 -13142 -49695 2465 37640 -16381
1150 -16381 -48131 12342 48162 -9267 -45636 7195 42863 -8987 -47434 5786 51299 941
1162 941 -43222 11009 54102 -2437 -46226 5896 47884 3842 -34132 7994 50040 11569
1174A1569m7429L6632M5227m3113m3605N1074M2848m8726l8166M3488L1008m2237
1186a430l5875L6572M3861l2925m8114L8072N0353m8905n5164M8491N0105m5814
1198g73m1967L9911M0786l1647m6152K0486M9570k1099n6499K7134O1175l2349
1210H576n5908L5850M6233l7348l9869K8586L6966j7675l7453J6372M9049j8487
1222A4892o1138K3245O2519l2743n6366M2240N3737l5987m6090K3317M0648j5031
1234A3243m8603J1301O5163o052p1241J4069O9225k6959o5179L0855N5117k2519
1246A8420m1699J5412M0081p182m9764j072O0595l596o7913J6141P1471k6935
1258B3959o4181L0396M9909k8947m4326J6727M6184j431n3438l018O6055k913
$$ plain form
1174 11569 -35860 772 45999 2886 -40719 10355 53203 4477 -33689 9799 40807 -1430
1186 -1430 -37305 -733 43128 10203 -37911 161 50514 1609 -53555 -5064 45041 -773
1198 -773 -42740 -2829 37957 6310 -39842 -19356 30214 9115 -47384 -20250 40925 8576
1210 8576 -47332 -11482 34751 -2597 -42466 -13880 23086 5411 -32042 -15670 33379 14892
1222 14892 -46246 -23001 39518 6775 -49591 -7351 46386 10399 -35691 -12374 28274 13243
1234 13243 -35360 -24059 41104 35052 -36189 -22120 47105 20146 -45033 -14178 40939 18420
1246 18420 -23279 -7867 32214 25032 -24732 -25804 34791 31195 -36718 -20577 50894 23959
1258 23959 -40222 -9826 40083 11136 -33190 -16463 29721 28290 -25148 -28166 37889 34976
1270C4976p9283R132P5658j8721o1811K6011N2161j9468m6723J903M1517P640
1282B2992m8705p943O4846N462p2101M583O5506k0260n7410K5034M8258j4470
1294A5792l8329K093M0086O587n3645j2840O5571Q383o9826N809P0321j4158o1105
1307c5261J2043M5865n103l9284o887M3800K2081n0534k4021N8919J3445o8468
1319c3405k598O5291l146m9361Q358L8500k516l7359j4679L9085K5029m6535k0792
1332c4128O1973J4655o9191p760O1747j490n1577K472M5510J0931l9463k3830
1344c0151M0258K9852n2731l1759O2971K7149o2066j4681N7654O539n0272j0685
1356b7922L7740J8047l3110k4702M1093L2497n0344l4177N4618K2163n9492j2372
$$ plain form
1270 34976 -44307 -35175 40483 21762 -40049 -14038 38123 18655 -28068 -26165 15352 22992
1282 22992 -25713 -33656 31190 36652 -35449 -30866 34640 14380 -43030 -17996 30262 15792
1294 15792 -22537 -20444 19642 26229 -27416 -40256 25315 33698 -36128 -30319 40002 25844 -35261
1307 -35261 -23218 22647 17544 -21740 -28627 15173 37254 -13280 -37301 21618 35063 -33405
1319 -33405 -36003 29288 26142 -23219 -14861 23639 21123 -16236 -30915 8170 33199 -13336 -34128
1332 -34128 27845 42500 -26691 -34451 27296 25806 -25771 -23299 22211 33142 -6321 -30151
1344 -30151 10107 39959 -12772 -44531 18440 45589 -16477 -31158 26496 33035 -17237 -27922
1356 -27922 9818 27865 -5245 -29947 11146 43643 -6701 -40878 13740 35903 -23589 -35961
1368c5961N8712J1998m7985j4087L7579J7776m0437k9370M5436L8061m9645l4802
1380d2725N6221K6234o0159k3277N1921J9972m1934j8983L7587K7403l6390l6333
1392d0463L8289L5848m5634l2021N1611K8808m9192k0326M3959J7225m1158k1820
1404c4874L6200K9741l4007l0821M1185L4247m7152l6278M6744L1234m4062k4507
1416c2350M3928K8820l6558l3798K9828L5044l1690l7981L6817M1790l4974l7839
1428b8963L4117L1382l6029l1019L1197L3191k6573l2411K7295L4422l1309l8564
1440c3264L0834L6010l2493l4078L4635L5149l2197l7750K7499L6528k9311m1318
1452c9756K9844M5066k8218m2601K7539L9727l0130m1802K4873M1869k0061l9993
$$ plain form
1368 -35961 22751 34749 -13236 -27323 10256 28032 -12405 -41775 3661 41722 -7923 -42725
1380 -42725 13496 39730 -20429 -43706 8215 28187 -13747 -32730 4857 32260 -4130 -40463
1392 -40463 -2174 33674 -11960 -43981 7630 36438 -12754 -33080 10879 28104 -13054 -34874
1404 -34874 1326 31067 -2940 -33761 7424 41671 -5481 -41759 4985 36219 -7843 -32350
1416 -32350 11578 40398 3840 -29958 -130 34914 3224 -34757 2060 43850 8876 -28963
1428 -28963 5154 36536 507 -30512 685 33876 7303 -25108 2187 36609 5300 -33264
1440 -33264 -2430 33580 1087 -32991 1644 36793 4596 -33154 -5655 30873 1562 -39756
1452 -39756 -9912 35154 6936 -35665 -8126 31601 1471 -40331 -15458 26411 6350 -33643
1464c3643K1397M2921k3183m6417K2533M3003k4623l8486K7826L9939k3654l9316
1476c1703J9381L9203k0305m3111K2283M9616k1301m7981K4930M5525k7462m3981
1488c4906K3590M2675j6586m0120J4350M5252j1278n1345J0757N1476j5580m8960
1500c0675K1300M6778j9336m0617J4861L5051j2614l8362P939M4612n731m7718
1512b4512J1007M9774j9267n1874K0544M5562j9863l8006J6191L8212r239m3000
1524b4471K45M7601k071n3527P140N7732j0782n2990J3388M3548j4869l8956P703
1537b0309L6888K449l7305n381M5169K547n3779J341N4169r115m7676J6354M2504
1550B7856j3419l6461L774L3383L208l9293p015N0514Q597n5985j651N5726q514
$$ plain form
1464 -33643 -12246 30675 7492 -38925 -16392 26611 1988 -36498 -8672 31267 7613 -31703
1476 -31703 -12322 26881 6576 -36535 -14252 35364 14063 -33918 -8988 36537 9075 -34906
1488 -34906 -11316 31359 14773 -25347 -10997 34255 22977 -28368 -17611 33865 18285 -30675
1500 -30675 -9375 37403 18067 -22550 -7689 27362 14748 -23614 -15675 28937 23206 -24512
1512 -24512 -13505 36269 17002 -34872 -14328 31234 11371 -26635 -10444 27768 18529 -24471
1524 -24471 -24226 23375 21304 -32223 -25083 32649 21867 -31123 -17735 25813 10944 -28012 -20309
1537 -20309 16579 19028 -18277 -23658 21511 24058 -29721 -28380 25789 16674 -31002 -14648 27856
1550 27856 14437 -22024 -18250 15133 18341 -20952 -27967 22547 31144 -24841 -26492 29234 20720
1563B0720n1335R817M2765l880l3314k228L2771J0963m0204j7000M6377J4137
1575B9589n1463l295N3182l582m6452N955L4936m610k9494l791L2387J4506l7700
1588i832j7231M6473J1138n4533n558N4451o59m4972M081L7449M85l2087j3562
1601b4357L1283K0795l6526k2299M7117K0501n1663j2560M6165K506l9606p93
1613a9437L1811Q032k4632j5590K5749K0647l5764k4378M4070J9583m6957r597
1625b6463M6601L228m0458n532L0151J0126k5695j8561L0464K7879l6480l0411
1637c5151M1691K3172m6582j5946M3436J2671l2857j1034K4593J5320k2664k5244
1649b8595K4092L0797k9282k7833L8910K3218m2334j7348L7310J1438l0652j0142
$$ plain form
1563 20720 -30615 -20798 21967 18087 -15227 -17455 15316 26279 -13925 -30925 15452 29589
1575 29589 -21874 -25169 28013 24431 -22021 -16066 18870 14260 -15234 -19025 13362 27868 -9832
1588 -9832 -27063 19410 30548 -23985 -29543 24908 24249 -20723 -16642 20807 21292 -10795 -24357
1601 -24357 6926 27721 -8805 -31104 16013 36514 -15149 -27709 18456 20962 -18644 -19437
1613 -19437 12374 20406 -4226 -19816 5933 26580 -9184 -33562 10508 30091 -16866 -26463
1625 -26463 20138 23366 -17092 -22624 7527 17653 -8042 -26603 3861 31740 -4740 -35151
1637 -35151 6540 29712 -16870 -32816 10620 23291 -9566 -20600 3993 19313 -3351 -28595
1649 -28595 -4503 26294 -2988 -30821 8089 31307 -11027 -28375 8935 20373 -10279 -20421
1661b0421K6244J9427k3240k6323K5265K9798l3387l0774M0064K8180l8549k0147
1673b3863L5212J5976k9803j9471K1698K5716j8503k9014K3492L2710k8972l2775
1685b7597L0181K5818l1607j9894K9521J9355k3762j9718J7573K2553k0064k9654
1697b7295K3061L2953k6369l0645L0450K6329l2763k5316K6451K3996k1262k4770
1709b5180J8788L0614j8088l5693J7914L4733k2541l2806K5553L1023k2071k6739
1721b4493J8430K3770j6801k7361J5323L1663j3808l1359J8715L1730k2816l1898
1733b8905K2672K9667k0285k6991K0978K9417j7015l2713J5104L3476j6264l4945
1745b5804J9181L7199j7700l3589J5572L1669j6457l1637J2871L3115j0287l1718
$$ plain form
1661 -20421 5823 25250 2010 -24313 952 30750 -2637 -33411 6653 34833 -3716 -23863
1673 -23863 11349 27325 -2478 -21949 -251 25465 6962 -22052 1440 34150 5178 -27597
1685 -27597 2584 28402 -3205 -23099 6422 25777 2015 -17703 -130 22423 2359 -27295
1697 -27295 -4234 28719 2350 -28295 2155 28484 -4279 -29595 -3144 20852 -410 -25180
1709 -25180 -6392 24222 6134 -29559 -11645 23088 547 -32259 -6706 24317 2246 -24493
1721 -24493 -6063 17707 906 -26455 -11132 20531 6723 -24636 -5921 25809 2993 -28905
1733 -28905 -6233 23434 3149 -23842 -2864 26553 9538 -23175 -8071 25405 9141 -25804
1745 -25804 -6623 30576 12876 -20713 -5141 26528 10071 -21566 -8695 24420 14133 -17585
1757a7585J2156L2449j4253l4108J3290L0633j4263k8067J4756L0082j3110l1716
1769a9736R650L1285j2886l3760J4909L5308j3248l3460J2572L0174j2877l2010
1781b4079Q131L3827m460l3976N645L4994p554l6704P472L2967p884k8792Q628
1794a1785K7750n017k7410J323K8035k438l1368M419L5332n055l3259Q507L1010
1807B0044j0840k9716O466K9010j060k7583m60L2098K446l7784l017L7767p9l4856
1821a7564L811L3679k090k9117k458K4438N034k5632q395L1485R667l3665o345
1834a7152L4649j59l4299K205K9749j536k4382j055K4373O845k8735j2284L2686
1847A0905J0834l7520o669M1101L683l6665k791K9721K133k6660p809K6265J5831
$$ plain form
1757 -17585 -5429 27020 12767 -21341 -8051 22582 8319 -19748 -4992 25090 11980 -19736
1769 -19736 -10086 21199 8313 -25447 -10538 24770 11522 -21938 -9366 20808 7931 -24079
1781 -24079 -15948 17879 13419 -20557 -14912 20082 12528 -24176 -16704 16263 8379 -20413 -11785
1794 -11785 15965 10948 -16462 -15139 12896 10458 -20910 -16491 18841 13786 -19473 -10966 20044
1807 20044 9204 -20512 -14046 14964 13904 -13679 -14139 17959 20405 -17379 -20396 17371 17292 -17564
1821 -17564 -13753 19926 17836 -11281 -13739 10699 15733 -9899 -18294 13191 22858 -10807 -17152
1834 -17152 17497 17338 -16961 -14756 14993 13457 -10925 -11980 12393 19238 -9497 -21781 10905
1847 10905 21739 -15781 -22450 18651 22334 -14331 -17122 12599 14732 -11928 -19737 6528 22359
1860B2359k6826j7887L1708J4583l8058j1316L7576O045l1618r66K7560K041k4589
1873i388q902K1828J4810k5813j5530L3398J5095l8469j0789L7510M267l3791
1885a5774k626K8436O779k2902j2238K2378J8490k7691k2457L2002J9700l4629
1897a0532j2649L5416P586k9722o802K1284Q081j7163j2992J9194K0912k2840
1909b27k2424K7284J7500l2865j2401L3810R235k6550o895K0138J0152j8722j8008
1922a9973J8990K5524k2334k5145K8483K2045l1773j7780K8802J2825k2179j2380
1934a4895J6900J5814j2590k1812J4267K5050k0197k6309K4922K2538k6621j6506
1946a9439K5809J2425k1476j4344J4971J7195j2854k2503J6710K7990k1725k9175
$$ plain form
1860 22359 -4467 -22354 9354 23937 -14121 -25437 12139 18184 -13434 -14400 13160 15201 -9388
1873 -9388 -18290 3538 18348 -7465 -22995 10403 25498 -12971 -23760 13750 18017 -15774
1885 -15774 -18400 10036 16815 -6087 -18325 4053 22543 -5148 -27605 4397 24097 -10532
1897 -10532 -23181 12235 19821 -9901 -16703 4581 12662 -4501 -17493 1701 22613 -227
1909 -227 -22651 4633 22133 -10732 -23133 10677 19912 -6638 -13533 6605 16757 -1965 -19973
1922 -19973 -983 24541 2207 -22938 5545 27590 -4183 -21963 6839 19664 -2515 -14895
1934 -14895 2005 17819 5229 -16583 -2316 22734 2537 -23772 1150 23688 -2933 -19439
1946 -19439 6370 18795 -2681 -17025 -2054 15141 2287 -20216 -3506 24484 2759 -26416
1958b6416K4296K3864k6630j9747K5356J8372j9128j8567J2829K0948j1879k6915
1970b3617J3817L1069j7241k9012K1098K5056k3129k0321K0346J7690j5320j7051
1982a6615J2202K1552j0734k6265J2989K8434j7599k7805K2211K5644k1499k1010
1994a8495J9068J8890j4666k0893J0399K5027q568k7717J2019K9549j5090k9001
2006a9478J5819K4690j5432k0647J3837J9571r879k1388O868K2464p306k5881
2018a6762J0091K6634j2701k5468J3932K3243j5130k1798J1706K1218q763k2279
2030a6077O666K5517o530k8461O982K7937r430k6516R414K5535p276k3452M882
2043a0809K2377l679k3861K200K5412j147k5683M118K4792n311k4884N482K3194
$$ plain form
1958 -26416 -2120 21744 -4886 -24633 723 19095 -33 -18600 -5771 15177 3298 -23617
1970 -23617 -9800 21269 4028 -24984 -3886 21170 -1959 -22280 -1934 15756 436 -16615
1982 -16615 -4413 17139 6405 -19860 -6871 21563 3964 -23841 -1630 24014 2515 -18495
1994 -18495 573 19463 4797 -16096 -5697 19330 10762 -16955 -4936 24613 9523 -19478
2006 -19478 -3659 21031 5599 -15048 -1211 18360 8481 -12907 -6039 16425 9119 -16762
2018 -16762 -6671 19963 7262 -18206 -4274 18969 3839 -17959 -6253 14965 6202 -16077
2030 -16077 -9411 16106 9576 -18885 -11903 16034 6604 -19912 -10498 15037 7761 -15691 -10809
2043 -10809 11568 7889 -15972 -13772 11640 10493 -15190 -11072 13720 8409 -16475 -10993 12201
2056A2201l539k2089L778K3839k900k5046K168K5951k511k6736L849K6908k530
2069A3343k5464J643K4865r05k5641j332K7019J983k6711l64K6697l75k5870j281
2083a2393K4103J126k2526j975K3859L054k5136l561K5383J398k6629Q72K5529
2096A3104j26k4120n05K2477J041k3381m182K5535N737k6680m857K7680L713k8090
2110a2654l079K5243L023k2752l773K1722O714k0814r775K1773R645k4785p630
2123a7142K6250N548k4802k378K2035J953k0199m759J9137P442j8760r721K3287
2136G891J0077k6591r531K7355N917k5716l745K3580N264j9785q513J7025J1776
2149A5004j8577j5324K2774J5223k4227j1858K4989P348k3099n819J8695O071
$$ plain form
2056 12201 8662 -13427 -9649 14190 11290 -13756 -11588 14363 11852 -14884 -11035 15873 13343
2069 13343 -12121 -10478 14387 13482 -12159 -13491 13528 15511 -11200 -11564 15133 14758 -11112 -12393
2083 -12393 11710 12836 -9690 -11665 12194 15248 -9888 -13449 11934 13332 -13297 -12425 13104
2096 13104 12978 -11142 -11647 10830 11871 -11510 -15692 9843 15580 -11100 -15957 11723 15436 -12654
2110 -12654 -15733 9510 12533 -10219 -13992 7730 14444 -6370 -16145 5628 15273 -9512 -17142
2123 -17142 9108 14656 -10146 -12524 9511 11464 -8735 -13494 5643 13085 -5675 -15396 7891
2136 7891 17968 -8623 -18154 9201 15118 -10598 -14343 9237 14501 -5284 -13797 3228 15004
2149 15004 -3573 -18897 3877 19100 -5127 -16985 8004 15352 -7747 -13566 5129 11200
2161A1200j4181r156J4860J2944j7189j5653K0236J4703k4202j0547K5258P710
2173A5983k2293n879J7984O712j5080j1509J4081J7518j6525j8469K0494J7197
2185B0214k3888j4335K2991J0140j8873p408J4609R358j0671j4583R992J7442
2197A4988j3629j9038J8862J7707k1419j3109K0804Q376j8400q043J3766J0378
2209A1243r881j5034J0573J9458j4654k2006J8092J9334k0088j5318K0494J1706
2221A3919j5689j1260R708J2677o835j7067Q181K1424j0955k1372J4966J8034
2233A5731j8198j4222J7496J0723j2378q998Q776J2724o837j7738P144K1714j1514
2246D423k1620J6222K0277j7709j5784J5475J2362j1032j2966P134J6502m003
$$ plain form
2161 11200 -2981 -12137 2723 15667 -1522 -17175 3061 17764 -6438 -16985 8273 15983
2173 15983 -6310 -12189 5795 12507 -2573 -14082 -1 17517 992 -17477 3017 20214
2185 20214 -3674 -18009 4982 15122 -3751 -11159 3450 12808 2137 -12446 -2454 14988
2197 14988 1359 -17679 1183 18890 -2529 -15638 5166 13542 -4858 -12901 865 11243
2209 11243 1362 -13672 -3099 16359 1705 -20301 -2209 17125 -2963 -18281 2213 13919
2221 13919 -1770 -13030 -3322 9355 2520 -14547 -6366 15058 4103 -17269 -2303 15731
2233 15731 -2467 -16689 807 11530 -848 -9846 -1070 11654 4817 -12921 -5777 15937 4423
2246 4423 -17197 -975 19302 1593 -14191 1284 13646 2614 -10352 -3218 13284 9281
2258I281k0219M925K2812r228k3384J2333K0192j3390j5106J2000J1957q409j2763
2271h999L590J5123k763j9050N510K1902q856k2078J0924J8656j2783j5249J0371
2284c702J4157o281j4504K699J7411k231k1876L099K3517n629k2422Q745J9827
2297A2810r196j6433N847J4318k978j3740p2J8126L75j9921P34K1532m674k0487
2311a3759P249J8741o617j5308N025J4037j777j6947N85J9304L16k0899J392K2629
2325A3971l257k1787L350J9434l039j7021R26J7071J946j7680l492J8983J985
2338A1390k0625j174K0874j33j9200K191J6777j627j7060l61J6960J290j7468
2351h166j553J9374R21k0860j119K0719p39j9399N46J9214Q30j7727l391J8327
$$ plain form
2258 9281 -10938 -6013 16799 7571 -15813 -3480 16712 3322 -11784 216 12173 3764 -8999
2271 -8999 -5409 9714 6951 -12099 -6589 15313 6457 -15621 -4697 13959 1176 -14073 -3702
2284 -3702 10455 4174 -10330 -7631 9780 7549 -14327 -11228 12289 6660 -15762 -7017 12810
2297 12810 3614 -12819 -6972 7346 4368 -9372 -9444 8682 9057 -10864 -10130 11402 6728 -13759
2311 -13759 -6510 12231 5614 -9694 -4669 9368 7591 -9356 -8771 10533 10849 -10050 -8658 13971
2325 13971 10714 -11073 -7723 11711 8672 -8349 -7423 9648 11594 -6086 -9578 9405 11390
2338 11390 -9235 -10409 10465 10332 -8868 -6677 10100 8473 -8587 -8948 8012 9302 -8166
2351 -8166 -9719 9655 10576 -10284 -11403 9316 8577 -10822 -10276 8938 9768 -7959 -11350 6977
2365F977L591j9532l468J9621L864j9522k577J8532J882j6883k813J5777L864
2378I313j5658m297J7146M092j7362l237J7317J695j7193j526J7022L057j6119
2391e750l333J5506N042j8096n517J8555O141j8755m619J8282L936j6807n405
2404a0820J4908O447j3188q147J4425Q772j5823q853J6578O673j6298m930J5446
2417E190M434j3177n330J1869O758j2167r524J4590J0240j6867q408J7873P073
2430A2554j7999n725J4988O163j2960p866J2215J1007j1948j3015J3815J2689
2442A3918j6253j1640J7265R573j5486o778J2617O024j0374q662R137J1416j0265
2455D92j2527J3263J2642j6319j1241J6969Q371j5660o344J2780O811r523j0399
$$ plain form
2365 6977 10568 -8964 -12432 7189 11053 -8469 -11046 7486 9368 -7515 -10328 5449 9313
2378 9313 -6345 -10642 6504 10596 -6766 -10003 7314 9009 -8184 -9710 7312 10369 -5750
2391 -5750 -9083 6423 11465 -6631 -12148 6407 12548 -6207 -10826 7456 11392 -5415 -10820
2404 -10820 4088 10535 -2653 -10800 3625 12397 -3426 -12279 4299 10972 -5326 -10256 5190
2417 5190 9624 -3553 -8883 2986 9744 -2423 -11947 2643 12883 -3984 -12392 5481 12554
2430 12554 -5445 -11170 3818 9981 -2979 -10845 1370 12377 429 -12586 1229 13918
2442 13918 -2335 -13975 3290 12863 -2623 -9401 3216 9240 -1134 -9796 -659 10757 492
2455 492 -12035 1228 13870 -2449 -13690 3279 11650 -4010 -10354 2426 9237 -286 -10685
2468a0685Q578J3979j1010j6126J3937J5233j5470j2475J6317R008j3619p934
2480a0267R463Q190o500j0385O290J4452p768j6794J1489J4021j4033j0725J5202
2493B635P960j2707n887Q620P417o336j1131O366J5341q382j6003J1527J5018
2506A4438j3727j2347J3289Q979r615p993N865J0024k753j3330K180J6204n003
2519F211j8383R328J5724j0504j1612R533Q772q042q038L480J0167j644j3122
2532h130K627J6848o055j8910Q822J6367j0873j2458J0192R851o166j0181J375
2545f691J2190N50j6577R83J9675l542j9455O669J6810q029j3736O979J0656l309
2559C173r691N05J2713J218j6377K73J8420m238j8166P788J6959q678j2788O851
$$ plain form
2468 -10685 -2107 11872 862 -15264 -1327 13906 -1564 -14039 2278 11286 -2333 -10267
2480 -10267 -804 7386 886 -9499 -3209 11243 3475 -13319 -1830 12191 -1842 -12567 2635
2493 2635 10595 -2112 -7999 621 8038 1702 -9429 -3063 12278 3896 -12107 -580 14438
2506 14438 711 -11636 1653 10632 1017 -6976 -1111 8913 6160 -7170 -4990 11214 6211
2519 6211 -12172 -2844 12880 2376 -9236 297 9069 1027 -7011 -3531 6636 4992 -8130
2532 -8130 -5503 11345 5290 -13620 -4798 11569 696 -11762 -1570 8281 2115 -8066 -6691
2545 -6691 5499 6049 -10528 -9545 10130 6588 -12867 -6198 10612 2583 -11153 -4174 6482 3173
2559 3173 -6518 -6013 6700 7918 -8459 -8186 10234 5996 -12170 -4382 12577 3899 -8889 -2038
2573b038J0407m322j1123O02J5154J275j7680Q22J9086m041j9346N593J7072n971
2587E490j3210M929J1076j746j1910k132J4202K215j6380K10J7758l125j6853
2600i476M461J4023n811j1690L974J1022j130j1467j132J3949J002j7063R6J7267
2614H025j564j6636M072J4202l096j1931K89J0546J432j0909l124J3644M015j4592
2628e627k777J4540l08j3933J626J2670r30r500j113R453K475j1152l909J3068
2642D583L771j3193k075J4243L68j3491p48J1537K083j0868l341J1609M770j1739
2656b491o122J2773N085j3453m370J3024L921j1398l796J0415M373j0266o015
2669h320J0102O541j1395n267J2307M797j2554m525J1762L504j0780m231J1262
$$ plain form
2573 -2038 8369 4047 -7076 -6474 8680 9955 -7725 -6903 12183 8142 -11204 -5611 11461 5490
2587 5490 -7720 -2791 8285 6539 -5371 -7503 6699 8914 -7466 -7256 10502 7377 -9476
2600 -9476 -5015 9008 3197 -8493 -4519 6503 5373 -6094 -7226 6723 7725 -9338 -9242 8025
2614 8025 6461 -10175 -6103 8099 5003 -6928 -6639 3907 5339 -5570 -8694 4950 8965 -5627
2628 -5627 -8404 6136 5828 -8105 -6479 6191 5261 -4239 -5352 4101 6576 -4576 -8485 4583
2642 4583 8354 -4839 -6914 7329 7697 -5794 -6542 4995 7078 -3790 -7131 4478 9248 -2491
2656 -2491 -8613 4160 9245 -4208 -8578 4446 8367 -3031 -6827 3588 7961 -2305 -8320
2669 -8320 1782 8323 -3072 -8339 3968 8765 -3789 -8314 3448 6952 -3828 -8059 3203
2682C203N537j1173o933J1759O589j2708o610J3469O423j2170n770J0332P120
2695I068j1191p265J0319Q088j0451p944J1786P476j1350p077J0665N711j0190
2708b355n398Q987P226q749p803R162P774j0801p938J1595Q079j1905o152J0517
2722B239O026r862o800Q284Q305p549j0080R280J0117j0039j0612J0958Q119j0181
2736a795o576Q979O328o021p617N084Q535n773j0094P793J0340r080r014J0087
2750A176P587j0205n922P867O202n872p528N117J0611n665j2741P462J2655r677
2764A067j0582J0072Q808q226p073N417P066l595r154K345J1741l626j2049N665
2778b124J2161q264j0991Q983P529p507n523M389O733k504r212J694J2120l784
$$ plain form
2682 3203 8740 -2433 -9366 2393 8982 -3726 -10336 3133 9556 -2614 -8384 1948 9068
2695 9068 -2123 -9388 931 9019 -1432 -9376 2410 9886 -1464 -8541 2124 7835 -2355
2708 -2355 -7753 1234 8460 -289 -8092 1070 8844 -1957 -9895 1700 9779 -2126 -8278 2239
2722 2239 8265 -1597 -8397 -113 8192 643 -9437 -157 9960 -79 -10691 267 8386 -1795
2736 -1795 -8371 608 6936 915 -6702 -1618 6917 1144 -8950 -1157 9183 103 -8911 1176
2750 1176 8763 -1442 -7364 503 6705 833 -6695 -1578 9033 3368 -9373 -1911 10744 1067
2764 1067 -9515 557 9365 1139 -5934 -517 6549 2954 -6200 -3855 7886 4260 -7789 -2124
2778 -2124 10037 1773 -9218 -235 7294 -213 -5736 -1347 5386 2882 -6330 -4636 7484 3700
2792C700j3665O519J2617p892j0727Q372P954o503p361K704R096q58j0924J018
2806e950J2699j630j4535M262J3046o239r949P077P234l980o532P12P670O90j0482
2821e907J48J3409j783j4378N467J2606o743j0288O242P551k981p246O04Q615
2835E316J502j1817j534J4576j367j4302L440J3248m706j0167L870O985j418o611
2849b985j895Q814L082j1397k044J3115q48j3842L606J1339m303r013L532O956
2863D117n54p871j553R181K673j1924k030J4462l75j4126K231J1825k618r281
2877e843R85P775J423p232m118R467M788j1511l605J2951R79j2263J639J0101
2891E536j637p679L12O687J774p244l555R545M717j2303k980J2972O46j2712Q06
$$ plain form
2792 3700 -9965 -3446 9171 1279 -9448 -1076 6878 375 -6986 -4282 4814 3956 -6968 -5950
2806 -5950 6749 5119 -9416 -5154 7892 1653 -8296 -1219 6015 2035 -4497 -3785 3885 4575 -5907
2821 -5907 -5759 7650 5867 -8511 -3044 9562 2819 -7469 -1227 6324 3343 -3903 -3299 5316
2835 5316 6818 -4999 -6533 8043 6676 -7626 -4186 9062 4356 -5811 -1941 5044 3626 -2985
2849 -2985 -4880 3934 7016 -4381 -6425 6690 5842 -8000 -4394 6945 2642 -6371 -2839 4117
2863 4117 3563 -4308 -5861 3320 5993 -5931 -7961 6501 6126 -8000 -5769 6056 3438 -5843
2877 -5843 -4858 2917 4340 -2892 -7010 2457 7245 -4266 -7871 5080 6059 -6204 -4565 5536
2891 5536 3899 -3780 -3468 3219 4993 -2251 -5806 3739 8456 -3847 -6827 6145 6791 -5921 -5115
2906e115J0734l25q104j390O904M209q786n594R782O095j1465m349J1812K525
2920F933j1047j261Q827J182p325k458O277N018p545n636R327M958j0780m113
2934g643J1201K188r636j654Q981K038q173m016P253O067q392o662J0512N643
2948G707j0240n127J0406L827r184l617P707M449o268n686O802O066p246o851
2962g255Q832N223q488m299R062L329q638l375P125M271o845n241P332O292q048
2977g23o488Q817N409r105m769P965N631p416n588O430N941n786p742O371P583
2992F530o419o622O996N601o781n171N896M955n022n618M918O937n874p063O669
3007f8O562o754o112O336O134o087n338M995P141n032q069M716Q391n248q201
$$ plain form
2906 -5115 5619 5294 -2810 -4200 2704 6913 -1873 -7467 2315 8410 -3055 -7404 4408 6933
2920 6933 -4114 -5375 3452 4634 -2691 -5149 1128 6146 -1399 -7035 2292 7250 -3530 -7643
2934 -7643 3558 5746 -3890 -5544 3437 5475 -2698 -6714 539 6606 -1786 -8448 2064 7707
2948 7707 -2533 -7660 2746 6573 -2611 -6228 1479 5928 -340 -6026 776 6842 -404 -7255
2962 -7255 1577 6800 -1688 -5987 3075 6404 -2234 -5609 1516 5787 -1058 -6299 1033 7325 -723
2977 -723 -7211 1606 7015 -2090 -6859 1106 6737 -679 -6267 163 6104 318 -7424 -1053 6530
2992 6530 111 -6511 485 6086 -695 -5866 30 4985 -37 -5655 -737 6200 326 -6737 -68
3007 -68 6494 -260 -6372 -36 6098 11 -5327 -332 6809 1777 -6292 -1576 6815 1567 -6634
3022f634O282P920o135p390M865O395m217n888L134P383k315q794L092Q693m841
3037A550q695O358P366n873o277M974O021l932p122K552Q924l154j0051M522R829
3052F992n210r605O473P339n521o659L951O744j744q126J887Q881k369j0118L436
3067c649J0034m210q525N217O771n001n220K925N662j230p152J519R224k161j0892
3082f688M124J0177n943p581N586O729m648n416J688O516l94p666l55R390m87
3097E032j0817K729R581m118p108L323N500k016m973N27M900J465o976j307Q444
3112D186k80r769J849R325l239o774L269M858j800n291q58O143L276q247k352
3127e704R836J90j0301P20R546j769o500J300N017P45m969k865O029M058q044
$$ plain form
3022 -6634 -352 7568 1433 -5957 -1092 5303 1086 -4802 -1668 5715 3400 -5394 -2302 6391 1550
3037 1550 -7145 -787 6579 706 -5571 -597 5424 1492 -5630 -3078 5846 2692 -7359 -2837 6992
3052 6992 1782 -7823 -1350 5989 468 -6191 -2240 4504 2760 -5366 -3479 5402 3033 -7085 -3649
3067 -3649 6385 2175 -6350 -1133 5638 637 -4583 -1658 4004 2774 -4378 -2859 6365 4204 -6688
3082 -6688 -2564 7613 1670 -5911 -325 6404 1756 -3660 -1972 4544 4150 -3516 -3871 5519 5032
3097 5032 -5785 -3056 6525 2407 -4701 -1378 4122 2106 -2867 -2340 2560 4025 -2951 -4258 4186
3112 4186 3906 -5863 -4014 5311 2072 -4702 -1433 3425 1625 -3666 -4524 1619 4895 -3352 -5704
3127 -5704 4132 4322 -5979 -5259 4287 2518 -3982 -2682 2335 3080 -1889 -4754 1275 5333 -2711
3142b711k903J0050J359j0184J34Q803j563o585J485M867J087n055k904O526M133
3157F539r019l805J0484K000j0472o4R532o44p508m36N734K270n711m425P044
3172A519N466q805m611R698K079r718j83P815J22n748j265N205K493n384m606
3187e923P204M741r179l516J0463J612r666m79Q218P19p230j432N934L131n310
3202g13n484P189N522q429m514R242L032q654j440O921J325n619k054M027M040
3217D391m822m875O516N055p818l724P928K613q043j178O487J677n034l099M001
3232G5N199n573n733P005N236p519m246P111L315o261k992M896L480m000m436
3247d443L744N695m490n999M967N966o383m538N957M228n320l529M149L940l755
$$ plain form
3142 -2711 -5614 4436 5795 -4389 -4255 4548 2985 -3600 -2115 2752 3839 -1216 -4120 2406 6539
3157 6539 -2480 -6285 4199 6199 -4273 -4337 5195 4551 -2957 -3393 2341 4611 -1100 -5525 1519
3172 1519 6985 -1820 -6431 3267 5346 -4372 -4555 3260 3382 -2366 -3631 1574 4067 -1317 -5923
3187 -5923 1281 6022 -3157 -6673 3790 5402 -4264 -4743 3475 4194 -3036 -4468 1466 4597 -713
3202 -713 -6197 992 6514 -1915 -6429 2813 5845 -2809 -4249 2672 3997 -1622 -3676 351 4391
3217 4391 -431 -5306 1210 6265 -1553 -5277 2651 5264 -2779 -3957 2530 4207 -827 -3926 75
3232 75 5274 -299 -6032 973 6209 -1310 -5556 1555 4870 -1391 -4383 513 3993 -7 -4443
3247 -4443 -699 4996 506 -5493 -526 5440 -943 -5481 476 4704 -616 -4145 4 3944 189
3262A89n347M359O018m587o233N512O114o247n188N172M602m004m637L564N404
3277D691k957o605L524O821l990o529M272N749m215n207M265M721l707m961L022
3292a106N741l437n797L306O513m356o016M459N483m148n489L784N411k925o156
3307d733K773O632l112p208L722P035l870o277L491N860l274n225K069N888j761
3322B010o407J980O844k617o019K861N873l324n437L177M497j616n143J704N699
3337D082j444o899K084P280k303p531L260O545k834n905J888N250q06n854J75
3352c012P131m37p430Q65P488k087o442K138N333j838m351O11M809j74n480o14
3368c490O774L72p750J033P277j896p014K444N891j971n080L69N086J737o787
$$ plain form
3262 189 -5158 -799 5219 632 -5601 -89 6025 -222 -5410 -238 4364 360 -4277 -713 4691
3277 4691 1734 -4871 -1347 5474 1484 -5045 -773 4976 761 -4446 -181 4540 833 -4128 -1106
3292 -1106 4635 1198 -4599 -1293 5220 864 -5152 -693 4790 642 -4847 -1063 4348 1423 -4733
3307 -4733 -1960 4672 1560 -5648 -1926 5109 1239 -5038 -1547 4313 1039 -4186 -2117 3771 2010
3322 2010 -4397 -2417 4427 1810 -4209 -1348 4525 1201 -4236 -1059 3438 1822 -3321 -1617 4082
3337 4082 2638 -4261 -2177 5103 2800 -4731 -1471 5074 2240 -3665 -1777 3473 2667 -3187 -3012
3352 -3012 4119 3682 -3748 -2883 4605 2518 -3924 -1786 3547 1709 -2642 -2031 2778 2604 -2876 -3490
3368 -3490 3284 3656 -4094 -3061 4216 2320 -4694 -2250 3641 1670 -3410 -3041 2045 3782 -3005
3383c005j324P412J144q937O03P858j196o664J612N383n81m296r64M813J679n456
3399a919k203P104J583p984l17Q114j790o057J718M947m32m295j287M743K610
3414D535o600k354Q073J539q591O7P547m26o322L94M183R58l886k839M654L597
3430D529n712l802P446K089q045J77O369k89n481L38L623J104l610k649M538L927
3446D552o239l386P602J686p578p52P021l5n036j035M200K505l529m449M539M583
3462D649n654m640P311L261p053j480O071L80l790j469K978K451k770l791M189
3477F43M389n780l929O848K349o620j415O080L03m030j457K915L346l639m548
3492d545M397N392n913m667N865L680n694k342M612K021l207k085J976L932k633
$$ plain form
3383 -3005 -4329 3083 4227 -4710 -4107 3751 2555 -4109 -2497 2886 2305 -1991 -2955 1858 3537 -1919
3399 -1919 -4122 2982 4565 -3419 -3736 4378 2588 -3469 -1751 3196 2764 -1531 -2818 1925 4535
3414 4535 -2065 -4419 3654 5193 -3398 -3331 4216 3790 -2532 -2138 2045 3003 -883 -3722 932 4529
3430 4529 -1183 -4985 2461 4550 -3495 -3318 3051 2762 -2719 -2381 1242 2346 -1264 -3913 625 4552
3446 4552 -1687 -5073 2529 4215 -3363 -4115 2906 2871 -2165 -3200 1000 3505 -24 -4473 66 4649
3462 4649 -1005 -5645 1666 4927 -2126 -3606 2465 2845 -945 -2414 564 3015 245 -3546 643
3477 643 5032 -748 -4677 2171 4520 -2100 -3515 2565 2868 -1162 -2619 296 3642 3 -4545
3492 -4545 -148 5244 -669 -5336 529 4209 -1485 -3827 785 2806 -401 -2486 -510 3422 789
3507G89n730M244M901m499m587N699K902n194j759M251J658l100k815K517M645
3522C922l238n691M404N948n753m674N738L649m560l445M010L057k631m073K146
3537a191N435k737n426L298N119m029m319M139L407l989k278K273L435k465l492
3552b820J801N332l675n153L856N021m146m667M511L542l385l648K419M068k001
3567A055m692J452O096k326n864K863N096k897m604L339L470k116l679J730M002
3582B925j550m577J815M896k257n015L040M568l114l939K648L670j774m068J202
3597a530M661j433m708J433N684j874n302J769M737j472m432Q23M622j001m330
3612b353J23M778m25m896R42M879j440m890J814L947j442l909Q27M330n51m793
$$ plain form
3507 789 -4941 -697 4204 -295 -4882 817 3719 -1475 -3234 1017 2675 -425 -3240 -723 3922
3522 3922 684 -5007 -603 5345 -408 -5082 656 4305 -255 -3700 310 3367 736 -3337 -1191
3537 -1191 4244 1507 -3919 -621 4498 469 -3850 289 3696 -293 -2571 -298 3137 672 -2820
3552 -2820 -1019 4313 638 -4515 -659 4362 216 -4451 60 3602 217 -3431 -1012 3056 1055
3567 1055 -3637 -2185 3911 1585 -4279 -1416 3680 783 -3821 -482 2988 872 -2807 -1077 2925
3582 2925 1375 -3202 -1387 3509 1252 -3763 -723 3845 731 -3208 -560 3110 1336 -2732 -1530
3597 -1530 3131 1698 -3010 -1577 4107 2233 -3069 -1300 3437 1965 -2467 -1644 2978 1977 -2353
3612 -2353 -2230 2548 2123 -2773 -1831 3048 1608 -3282 -1468 2479 1037 -2872 -2045 2285 1734 -3059
3628c059K96N662q06n385J113N185j122m748NM668L27m667m73M851J054n951Q9
3645b961N489j92n434O55M716k73l835k36M070O02l865j353N121L39n444J99N996
3662C594r99n412J616M009j050l703M63L586J134n018j194N363J219o198k98N997
3678C109m45n004K43M012L3l545n28L013J896l901k218N205J092n897M14M862
3694B341l95m222L62L471K1l139j099L187J937l685k511N068J674n700q5N054
3710B279M9m303r7K961R04k080k474L083L184m191l125N076K315n047r02M683
3726B315j7l343l81K220R41j822k221K809L081l779l653N232K418n583j018M966
3742B165M75l405j022J830K453j954l675K406M627l997m330M659L895n565j640
$$ plain form
3628 -3059 -2763 2899 2093 -3292 -2179 3006 1884 -2864 -2859 1809 2136 -2531 -3004 1847 2901 -3050 -2961
3645 -2961 2528 2336 -3098 -2443 2273 2000 -1835 -2071 1999 2601 -1264 -2617 2504 2843 -2601 -2402 3594
3662 3594 2595 -2817 -1201 2808 1758 -1945 -1482 2104 3238 -1780 -2974 2389 3608 -2590 -2888 3109
3678 3109 2664 -2340 -2097 1915 1948 -1597 -2125 888 2784 -1117 -3335 1870 2962 -2935 -2521 2341
3694 2341 1946 -2276 -1914 1557 1578 -1561 -2660 527 2464 -1221 -3732 1336 3010 -2690 -2775 2279
3710 2279 2328 -1975 -2072 889 1793 -287 -2761 322 3506 -685 -3810 1266 3581 -1466 -2368 2315
3726 2315 2298 -1045 -1426 794 1735 -87 -2308 501 3582 -197 -3850 1382 3800 -1783 -2801 2165
3742 2165 2640 -765 -1787 43 2496 542 -3133 -727 3900 -97 -4427 232 4127 -1438 -3078
3757c078M052J191k664k138J841K835j203l993K776L889m298l770N106L214n131
3772a371j858M572Q64k860j938K039L144j561m548K995M785m222m118M811L091
3787C825m840j844L658J419j970j961R72L106j076m742K924M302l733l605M611
3802A046J967l809j462L208J054k086j789J323L652k095m599K885M243l207l919
3817c588L804K933l489k201K337K107j529k726O53M050q33m735K111M391k863
$$ plain form
3757 -3078 974 2165 -499 -2637 -796 2039 836 -3157 -381 3508 -790 -4560 546 3760 -1371
3772 -1371 -3229 1343 2207 -653 -2591 -552 2592 1031 -3517 -522 4263 41 -4077 734 3825
3787 3825 -1015 -2859 799 2218 248 -1713 -741 2365 1289 -3453 -529 3773 40 -3565 1046
3802 1046 3013 -796 -2258 950 2004 -82 -1871 -548 3104 1009 -3590 -705 3538 331 -3588
3817 -3588 216 3149 -340 -2541 -204 1903 374 -2352 -1699 2351 1518 -3217 -1106 3285 422
$$ [...]
8191a14
##END NTUPLES=NMR FID
##END=
