##TITLE=1H ikalashn
7174-N
24.10.2024
##JCAMPDX= 6.0         $$ Bruker NMR JCAMP-DX V2.0
##DATA TYPE= NMR FID
##DATA CLASS= NTUPLES
##ORIGIN= UXNMR, Bruker Analytische Messtechnik GmbH
##OWNER= root
$$ TOPSPIN		Version 1.3
$$ 2024-10-24 14:10:38.484 +0400  Irina@DPX200
$$ Compression mode = diff/dup
##.OBSERVE FREQUENCY= 200.131300845
##.OBSERVE NUCLEUS= ^1H
##.DELAY= (6, 6)
##.ACQUISITION MODE= SIMULTANEOUS
##.ACQUISITION SCHEME= undefined
##.AVERAGES= 32
##.DIGITISER RES= 18
##SPECTROMETER/DATA SYSTEM= spect
##.PULSE SEQUENCE= zg
##.SOLVENT NAME= CDCl3
##.SHIFT REFERENCE= INTERNAL, CDCl3, 1, 17.49637
##AUDIT TRAIL= $$ (NUMBER, WHEN, WHO, WHERE, WHAT)
$$ ##TITLE= Audit trail, TOPSPIN		Version 1.3
$$ ##JCAMPDX= 5.01
$$ ##ORIGIN= Bruker BioSpin GmbH
$$ ##OWNER= Irina
$$ $$ F:/spectra/data/iren/nmr/1H/4/audita.txt
$$ ##AUDIT TRAIL=  $$ (NUMBER, WHEN, WHO, WHERE, VERSION, WHAT)
(   1,<2024-10-24 14:10:14.140 +0400>,<Irina>,<DPX200>,<TOPSPIN 1.3>,
      <created by zg
	started at 2024-10-24 14:08:04.609 +0400,
	POWCHK disabled, PULCHK disabled
       terminated by command 'halt'
       configuration hash MD5:
       BE 6D 3F 07 2A EA 11 49 91 17 2B D3 AF B3 58 0D
       data hash MD5: 16K
       6A A2 98 42 FA 88 00 23 DA B3 16 60 2B 14 00 DD>)
$$ ##END=
$$ 
$$ $$ hash MD5
$$ $$ 7A FF 18 C6 93 65 6E 52 6F 48 14 F2 BF E2 B3 19
##$RELAX= 
##$RELAX= 
##$RELAX= 
##$RELAX= 
##$RELAX= 
##$RELAX= 
##$RELAX= 
##$RELAX= 
##$RELAX= 
$$ Bruker specific parameters
$$ --------------------------
##$DU= <F:/spectra>
##$EXPNO= 4
##$NAME= <1H>
##$PROCNO= 1
##$TYPE= <nmr>
##$USER= <iren>
##$AMP= (0..31)
100 100 100 100 100 100 100 100 100 100 100 100 100 100 100 100 100 100 
100 100 100 100 100 100 100 100 100 100 100 100 100 100 
##$ANAVPT= -1
##$AQSEQ= 0
##$AQ_mod= 1
##$AUNM= <au_zg>
##$AUTOPOS= <>
##$BF1= 200.13
##$BF2= 200.13
##$BF3= 200.13
##$BF4= 200.13
##$BF5= 200.13
##$BF6= 200.13
##$BF7= 200.13
##$BF8= 200.13
##$BYTORDA= 1
##$CFDGTYP= 0
##$CFRGTYP= 5
##$CHEMSTR= <none>
##$CNST= (0..63)
1 1 145 1 1 1 1 1 1 1 1 1 1 1 1 1 1 1 1 1 1 1 1 1 1 1 1 1 1 1 1 1 1 1 
1 1 1 1 1 1 1 1 1 1 1 1 1 1 1 1 1 1 1 1 1 1 1 1 1 1 1 1 1 1 
##$CPDPRG= <>
##$CPDPRG1= <>
##$CPDPRG2= <>
##$CPDPRG3= <>
##$CPDPRG4= <mlev>
##$CPDPRG5= <mlev>
##$CPDPRG6= <mlev>
##$CPDPRG7= <mlev>
##$CPDPRG8= <mlev>
##$CPDPRGB= <>
##$CPDPRGT= <>
##$D= (0..63)
0 2 0 0 0 0 0 0 0 0.06 0 0.03 0 0 0 0 0.0002 0 0 0 0 0 0 0 0 0 0 0 0 0 
0 0 0 0 0 0 0 0 0 0 0 0 0 0 0 0 0 0 0 0 0 0 0 0 0 0 0 0 0 0 0 0 0 0 
##$DATE= 1729764611
##$DBL= (0..7)
120 120 120 120 120 120 120 120 
##$DBP= (0..7)
150 150 150 150 150 150 150 150 
##$DBP07= 0
##$DBPNAM0= <>
##$DBPNAM1= <>
##$DBPNAM2= <>
##$DBPNAM3= <>
##$DBPNAM4= <>
##$DBPNAM5= <>
##$DBPNAM6= <>
##$DBPNAM7= <>
##$DBPOAL= (0..7)
0.5 0.5 0.5 0.5 0.5 0.5 0.5 0.5 
##$DBPOFFS= (0..7)
0 0 0 0 0 0 0 0 
##$DE= 6
##$DECBNUC= <off>
##$DECIM= 32
##$DECNUC= <off>
##$DECSTAT= 4
##$DIGMOD= 1
##$DIGTYP= 9
##$DL= (0..7)
0 120 120 120 120 120 120 120 
##$DP= (0..7)
$$ [...]
##$SW= 21.9926040160658
##$SWIBOX= (0..15)
0 0 2 0 0 0 0 0 0 0 0 0 0 0 0 0 
##$SW_h= 4401.40845070422
##$TD= 16384
##$TD0= 1
##$TE= 300
##$TE2= 300
##$TE3= 300
##$TEG= 300
##$TL= (0..7)
0 120 120 120 120 120 120 120 
##$TP= (0..7)
150 150 150 150 150 150 150 150 
##$TP07= 0
##$TPNAME0= <>
##$TPNAME1= <>
##$TPNAME2= <>
##$TPNAME3= <>
##$TPNAME4= <>
##$TPNAME5= <>
##$TPNAME6= <>
##$TPNAME7= <>
##$TPOAL= (0..7)
0.5 0.5 0.5 0.5 0.5 0.5 0.5 0.5 
##$TPOFFS= (0..7)
0 0 0 0 0 0 0 0 
##$TUNHIN= 0
##$TUNHOUT= 0
##$TUNXOUT= 0
##$USERA1= <user>
##$USERA2= <user>
##$USERA3= <user>
##$USERA4= <user>
##$USERA5= <user>
##$V9= 5
##$VALIST= <valist>
##$VCLIST= <CCCCCCCCCCCCCCC>
##$VD= 0
##$VDLIST= <DDDDDDDDDDDDDDD>
##$VPLIST= <PPPPPPPPPPPPPPP>
##$VTLIST= <TTTTTTTTTTTTTTT>
##$WBST= 1024
##$WBSW= 25
##$XGAIN= (0..3)
0 0 0 0 
##$XL= 0
##$YL= 0
##$YMAX_a= 255626
##$YMIN_a= -550857
##$ZGOPTNS= <>
##$ZL1= 120
##$ZL2= 120
##$ZL3= 120
##$ZL4= 120
##$ABSF1= 10
##$ABSF2= 0
##$ABSG= 5
##$ABSL= 3
##$ALPHA= 0
##$AQORDER= 0
##$ASSFAC= 0
##$ASSFACI= 0
##$ASSFACX= 0
##$ASSWID= 0
##$AUNMP= <proc_1d>
##$AXLEFT= 0
##$AXRIGHT= 0
##$AXTYPE= 0
##$AXUNIT= <>
##$AZFE= 0.1
##$AZFW= 0.1
##$BCFW= 1
##$BC_mod= 2
##$BYTORDP= 1
##$COROFFS= 0
##$CY= 7568.61572265625
##$DATMOD= 1
##$DC= 2
##$DFILT= <>
##$DTYPP= 0
##$F1P= 17.9538593292236
##$F2P= -4.03888763876832
##$FCOR= 0.5
##$FTSIZE= 32768
##$FT_mod= 4
##$GAMMA= 1
##$GB= 1
##$INTBC= 1
##$INTSCL= 1
##$ISEN= 128
##$LB= 0.02
##$LEV0= 0
##$LPBIN= 0
##$MAXI= 945.577
##$MC2= 0
##$MEAN= 0
##$ME_mod= 0
##$MI= -402.1523
##$NCOEF= 0
##$NC_proc= 0
##$NLEV= 6
##$NOISF1= 8.587773
##$NOISF2= 6.764455
##$NSP= 1
##$NTH_PI= 0
##$NZP= 0
##$OFFSET= 17.49637
##$PC= 1
##$PHC0= -47.35038
##$PHC1= 19.42503
##$PH_mod= 0
##$PKNL= yes
##$PPARMOD= 0
##$PPDIAG= 0
##$PPIPTYP= 0
##$PPMPNUM= 100
##$PPRESOL= 1
##$PSCAL= 0
##$PSIGN= 0
##$REVERSE= no
##$SF= 200.13
##$SI= 32768
##$SIGF1= 18.5376
##$SIGF2= -6.396296
##$SINO= 400
##$SIOLD= 32768
##$SREGLST= <1H.CDCl3>
##$SSB= 3
##$STSI= 0
##$STSR= 0
##$SW_p= 4401.40845070422
##$SYMM= 0
##$S_DEV= 0
##$TDeff= 0
##$TDoff= 0
##$TI= <>
##$TILT= no
##$TM1= 0
##$TM2= 0
##$TOPLEV= 0
##$USERP1= <user>
##$USERP2= <user>
##$USERP3= <user>
##$USERP4= <user>
##$USERP5= <user>
##$WDW= 1
##$XDIM= 8192
##$YMAX_p= 0
##$YMIN_p= 0
$$ End of Bruker specific parameters
$$ ---------------------------------
##NTUPLES= NMR FID
##VAR_NAME=  TIME,          FID/REAL,        FID/IMAG
##SYMBOL=    X,             R,               I
##VAR_TYPE=  INDEPENDENT,   DEPENDENT,       DEPENDENT
##VAR_FORM=  AFFN,          ASDF,            ASDF
##VAR_DIM=   8192,          8192,            8192
##UNITS=     SECONDS,       ARBITRARY UNITS, ARBITRARY UNITS
##FACTOR=    0.0002272,     1,               1
##FIRST=     0,             0,               0
##LAST=      1.8609952,     77,              -10
##MIN=       0,             -550857,         -550857
##MAX=       1.8609952,     255626,          255626
$$ Real data points
##PAGE= N=1
##DATA TABLE= (X++(R..R)), XYDATA
0@%%%%%%%%%%%%%%%L2o4O4o4O4r6J28j28J60j92K23k55K88l42L75m18M82n47O40
34C50p35Q22r18J026j154J285j441J604j771J967k186K419k669K941l239L571
50A872l935M337m783N276n824O437p138P936q854R934j1212J2763j4692J7169
64I286k0479K5151l2314M4783p2754K53412o9838l90695J78736J90026J7112j21254
76A1172N0900K2286j25888j64891R4421J96214J4428j98869p3451J23097J08328
87E7747o6426q0179K431K8808K033O3752R7529L326j20167p2058N8465P8530j6346
100C7445k3778N5684M0370q6653q8746N9904R8123n6970j10574O1715J64339k0474
112A30385k16908j15823J20374J29472m8815q4270O1187Q0052r6186j45397O2345
$$ plain form
0 0 0 0 0 0 0 0 0 0 0 0 0 0 0 0 0 32 -32 32 -32 32 -64 64 -64 96 -96 127 -128 160 -182 193 -225 257 -290 350
34 350 -385 437 -481 545 -609 676 -765 839 -932 1035 -1151 1268 -1401 1540 -1699 1872
50 1872 -2063 2274 -2509 2767 -3057 3380 -3758 4178 -4676 5258 -5954 6809 -7883 9286
64 9286 -11193 13958 -18356 26427 -46327 207085 137247 -253448 -74712 115314 132426 11172
76 11172 62072 84358 -41530 -206421 -112000 84214 98642 -100227 -173678 -50581 57747
87 57747 -8679 -88858 -86427 -57619 -55586 8166 105695 109021 -11146 -83204 -24739 53791 37445
100 37445 13667 69351 109721 23068 -65678 -5774 92349 35379 -75195 -13480 150859 130385
112 130385 -86523 -202346 -81972 47500 -1315 -85585 -24398 55654 -40532 -185929 -123584
123a23584J99870N0922j20295m3373J03303N3083r3297q0340N7813Q9259j1992
134H1369n9642m223M374o6846o5030M6838R1016K562n5782o424K3396k2298k6600
147e7290M8028O7059j9525o5026J6813Q1795o085j16074n1870R2950Q2120n0260
159B2635o3486M6818N2259p4893r5650N6399J43673K5414j06054n5408O1449L4447
171D7603p5923n3191P6955Q9738l7914r1886q961M3007r654l1422L9506P6348
183F4206K000p0485l6345L4102K8928j4465m022K7318n000n1002j3873M3449P838
196A2649o1187k7113O2394N9349k3656m3308J6831L1171k9195l8026N1356R4219
208A05484o739j07205n2830N6274M1301m4509l5736M3077L6933m8164o2937J8229
$$ plain form
123 -123584 76286 127208 6913 -36460 66843 119926 26629 -53711 4102 93361 81369
134 81369 21727 17504 21878 -44968 -109998 -63160 27856 30418 -25364 -31788 -8392 -30690 -57290
147 -57290 -9262 57797 38272 -26754 -9941 71854 65769 -50305 -102175 -9225 72895 22635
159 22635 -40851 5967 58226 -16667 -112317 -55918 87755 113169 7115 -48293 13156 47603
171 47603 -28320 -81511 -4556 85182 47268 -44618 -53579 -10572 -20226 -51648 -12142 64206
183 64206 66206 -4279 -40624 -6522 22406 7941 3919 31237 26237 -24765 -38638 4811 12649
196 12649 -48538 -75651 -13257 46092 22436 -20872 -4041 27130 -2065 -40091 11265 105484
208 105484 98745 -8460 -61290 -5016 36285 -8224 -43960 -883 36050 -12114 -75051 -56822
220e6822N9664K059m1436J0103O3746J5817n4697l3435L2364K9137j4162m147
232H191K9363M157m7563l5455K3152L5473m533j8979J2972K0724k0458l4133J2106
245a4983L5221r767l5876J1882M3849p790n9776k3715L8743K9073j9268j3237
257b5644L3587K6735l5134m2941K7456O4060P382m1520p310L2330r9m2445j7888
270b1431K6315J4568k5735k1048J5753J4214k7923l2533J7468M3179R400j7834
282e607K953J6088j0230j9366J5191L4243K583k8121j2226J5899M960k2513j3327
295a9473J9468J6987j6482j5263K0307J7410k5559l0509J6622L9770M950k9403
307a175j5132R298Q55j7652j659K7478J5500k3564k3570J6459K7537l123j4789
$$ plain form
220 -56822 2842 4901 -36535 -26432 37314 53131 -1566 -35001 -2637 26500 12338 8191
232 8191 37554 41711 -5852 -41307 -18155 17318 12785 -6194 6778 27502 7044 -27089 -14983
245 -14983 20238 10471 -25405 -13523 30326 22536 -37240 -60955 -22212 6861 -12407 -25644
257 -25644 7943 34678 -456 -43397 -15941 48119 55501 13981 6671 39001 38902 -3543 -21431
270 -21431 4884 19452 -6283 -27331 -11578 2636 -25287 -57820 -40352 2827 12227 -5607
282 -5607 -2654 13434 3204 -16162 -971 33272 35855 7734 -4492 11407 16367 -6146 -19473
295 -19473 -5 16982 500 -14763 5544 22954 -2605 -33114 -16492 23278 28228 -1175
307 -1175 -16307 -7009 -6154 -23806 -25465 2013 17513 -6051 -29621 -13162 14375 11252 -3537
320c537R416J8836q44j1443L064R019j0599k4705n337K1797J2382j9432k3833
333b5216p53N101m638M404K2874J1882j7609j6841J1444K3336O279r922l377P387
347A4351k61j1783j046J2342j925k2800r843J9946J8213q430j7456l391O008L312
361b763K681Q212O442j0136j9993m326J5932R951j0180r597M587M035l507O49
375h013R973O378l802k372P628J1803J150j0375p105L552J811n963l539R83o310
390d201j2588m032O045M498k518j440L687N949K253j627K206Q997N466l582k282
405F831K512p9m522j467J710j241l232j802M33K353J117l186k445K965M069j176
421B840j790r21k827m419j311K086J458j830m369l491L679Q437M006k233N26M744
$$ plain form
320 -3537 5879 24715 23871 12428 15492 24511 13912 -10793 -16130 5667 18049 -1383 -25216
333 -25216 -25969 -20868 -25506 -21102 1772 13654 -3955 -20796 -9352 13984 20263 10341 6964 14351
347 14351 14090 2307 1261 13603 11678 -11122 -20965 -1019 17194 8764 -8692 -12083 -6075 -2763
361 -2763 -82 8130 14572 4436 -15557 -19883 -3951 6000 -4180 -13777 -9190 -5155 -8662 -8013
375 -8013 1960 8338 4536 2164 9792 21595 22745 12370 5265 8817 10628 4665 1126 2109 -4201
390 -4201 -16789 -20821 -14776 -10278 -12796 -14236 -10549 -4600 -2347 -3974 -1768 7229 12695 9113 6831
405 6831 9343 9264 4742 3275 4985 3744 512 -1290 -857 1496 2613 -573 -3018 -53 4016 2840
421 2840 1050 129 -2698 -7117 -8428 -6342 -4884 -6714 -11083 -14574 -10895 -2458 1548 -685 -159 4585
437D585M011L135M534O82m532n598m20L154P07o741j1414l960L825J083l936J36
453a0749K331k156k978O742J0779L290o177n116M134Q674K102n025l184J64m084
468a253l574O006P659n526j2002P80J1704O126n033n685J496L321k196l029M678
483C472L508r824j2419L864J2394j8j0359j721P048K191k383L199R116J956q391
498A633m086J0393R180q382j3599K062R152l379r301R37N805m144q746L564J3213
513D302L333r996m848R931R198o009p398O194N895r736r964O978R100p659j4505
528a5184J017J2814K979q634k858R345N733p373j753J3245P326j2153r929R849
542D424J0649p566j2511K775Q876l974j1588J876J2077n34j4326k955J5635P645
$$ plain form
437 4585 8596 11731 16265 16947 12415 6817 6397 9551 10258 3517 -7897 -11857 -8032 -6949 -10885 -10749
453 -10749 -8418 -10574 -13552 -6810 3969 7259 1082 -4034 100 8774 10876 5851 2667 2831 -1253
468 -1253 -4827 1179 8838 3312 -8690 -7910 3794 9920 4887 -798 698 4019 1823 -1206 3472
483 3472 6980 -2844 -15263 -11399 995 977 -9382 -11103 -4055 -1864 -4247 -1048 8068 10024 1633
498 1633 -2453 7940 17120 8738 -4861 -2799 6353 2974 -6327 -5390 415 -3729 -12475 -8911 4302
513 4302 7635 -2361 -7209 2722 11920 5911 -1487 4707 10602 866 -9098 -2120 6980 -679 -15184
528 -15184 -14167 -1353 1626 -7008 -9866 -521 5212 -2161 -3914 9331 16657 4504 -5425 4424
542 4424 15073 7507 -5004 -2229 6647 2673 -8915 -7039 5038 4504 -9822 -12777 2858 10503
556A0503j2723j0097J0060Q906q594p690P712P628r402j1096Q391J6330q15j5903
570f790j661J6678P457j0680m399J2032L725j3821p172J2093P689j4275j6503
583a5627M601J3111l802j4538p25J1632L20j0858M166J8928K766j7273m345J9280
597G636J2703r892j1582N852R934o083j0792M846J0070q094j6545M443J8734j188
611A0042k1037n687J5046Q253j0293o137R211M086j2744q702J4009J5874r448
624B473j8220N095K0029K010j4866l8J3591J757j1074K190J5144M53k0273j1552
638a3281J4834J5359j0156j9089J014J0452n953j1554Q409J5545n978j7139L963
651a3574K0709N408j4998o987J3490J1316p786q503Q838N884j5225j2983J4623
$$ plain form
556 10503 -2220 -12317 -2257 6649 -1945 -9635 -1923 5705 -3697 -14793 -6402 9928 9113 -6790
570 -6790 -8451 8227 15684 5004 605 12637 16362 2541 -4631 7462 15151 876 -15627
583 -15627 -11026 2085 -1717 -16255 -16980 -5348 -5028 -15886 -11720 7208 9974 -7299 -11644 7636
597 7636 20339 10447 -1135 4717 14651 8568 -2224 2622 12692 4598 -11947 -7504 11230 10042
611 10042 -10995 -16682 -1636 6617 -3676 -9813 -602 3484 -9260 -17962 -3953 11921 2473
624 2473 -15747 -10652 9377 11387 -3479 -3517 10074 11831 757 2947 18091 18544 -1729 -13281
638 -13281 1553 16912 6756 -12333 -11319 -867 -6820 -18374 -9965 5580 -398 -17537 -13574
651 -13574 7135 12543 -2455 -9442 4048 15364 7578 -925 7913 13797 -1428 -14411 212
664B12J8673q893k1915n43J5962K318j2411j070J3123K395j4500n414J5409Q798
678A2144j6438j3570J3141J7385p304j4885L731J1082n052j0827P789J8538m44
691A5290j8771o863J5024Q271j2977p652J2808P949j4593j2915R065J1245r124
704c243j0763R597J5848n776j7968N9J8444N229j3922m316J5667N939j6490r831
718a1526J2890R500j2183j1639J0697J5080p023j7378n36J3674L004r138K687
731a891J4281j064j9813o371J7044J0767j0602q808P423O414r520j0243P724J1889
745G230m474j1626N595J5266l265j7860k433J6643N218j1000l013J1679J683j7114
759g471r940J4459J5785o787j5032L450J3508m342j5138K995J7214K128j3607
$$ plain form
664 212 18885 9992 -11923 -12466 3496 5814 -6597 -7667 5456 7851 -6649 -12063 3346 12144
678 12144 -4294 -17864 -4723 12662 5358 -9527 -5796 5286 234 -10593 -2804 15734 15290
691 15290 -3481 -10344 4680 12951 -26 -7678 5130 13079 -1514 -14429 -5364 5881 -3243
704 -3243 -14006 -4409 11439 5663 -12305 -12246 6198 11427 -2495 -6811 8856 14795 -1695 -11526
718 -11526 1364 10864 -1319 -12958 -2261 12819 5796 -11582 -12118 1556 4560 -4578 -1891
731 -1891 12390 11326 -8487 -14858 2186 12953 2351 -6457 966 7380 -2140 -12383 -4659 7230
745 7230 2756 -8870 -3275 11991 8726 -9134 -11567 5076 10294 -706 -3719 7960 9643 -7471
759 -7471 -17411 -2952 12833 6046 -8986 -5536 7972 3630 -11508 -8513 8701 10829 -2778
772b778k688J3176J698j5037p882J2185J2202n687j0751L147P060p161j0325Q288
786d553J5317k061j3276k4J0859j064j2428r89J2880N274r514n550P264L014j3315
801h166p990J5044J7382o243j7853l18J1500m49q870L753J4039J09j6000o565
815a0627J1933Q565j1476j1364Q450J3603l620j0942J338N672n908p267R412J6129
829A3898k01j5509q355O690O313k495J58Q518M26j3431p227J0308Q663q621q096
844h961Q169J0247n352j1468Q88R142j485r100K939J4924K725j6859j0072J0357
858c906J0980n694o273P992Q843p642j2729J491J0650K214p129N54Q703j21j3869
873e936p313Q869Q338k854l225M358N52q962n068P812R422j526o184K163O412
$$ plain form
772 -2778 -5466 7710 9408 -5629 -13511 -1326 10876 5189 -5562 -2415 4645 -2516 -12841 -4553
786 -4553 10764 8703 -4573 -4597 6262 5198 -7230 -8219 4661 9935 421 -5129 2135 5149 -8166
801 -8166 -16156 -1112 16270 10027 -7826 -8144 3356 2907 -5963 -2210 11829 11938 -4062 -10627
815 -10627 1306 9871 -1605 -12969 -4519 9084 5464 -5478 -4140 1532 -4376 -11643 -2231 13898
829 13898 13697 -1812 -10167 -3477 2836 341 499 9017 9443 -3988 -11215 -907 7756 -865 -8961
844 -8961 -792 9455 4103 -7365 -6477 2665 1180 -7920 -4981 9943 12668 -4191 -14263 -3906
858 -3906 7074 1380 -4893 3099 11942 4300 -8429 -6938 3712 5926 -1203 -649 8054 7933 -5936
873 -5936 -13249 -4380 3958 1104 -2121 2237 2789 -6173 -11241 -3429 5993 4467 -1717 446 6858
888F858k693q611J511R343q32q487J714J0859n5j5390q388Q710J0705k219n849
903b824K739L649p812j0209N530J6016L856j0696n694O050L341n935j885P148
917C274M934m234m434K906M193n936q324K446R236J986n208j940J34n213n532
932a1712N144J1020K324q020m712L581K866l640j056Q252O182n400q102L898O855
947G480l703q702J937R870J542p857n079K961Q40n296k375O946P172l536q586
962f386l50M312n72j529N260P159j272o758k759L001K794k98J107L395m57o824
978a77m104L958K978m605l752M458M392l636n411M5K632j242j646N041P931K74
994G136r176n964O044Q086l05k950J903Q98m303l513K590L571j988m836l41M678
$$ plain form
888 6858 4165 -4446 -2935 6408 5576 -2911 -1197 9662 9607 -5783 -14171 -5461 5244 3025 -2824
903 -2824 -85 3564 -4248 -14457 -8927 7089 10945 249 -5445 605 3946 -1989 -3874 3274
917 3274 8208 3974 -460 2446 6639 703 -7621 -5175 4061 6047 839 -1101 -967 -6180 -11712
932 -11712 -6568 4452 6776 -1244 -5956 -2375 491 -3149 -4205 4047 10229 4829 -3273 625 7480
947 7480 3777 -4925 -2988 6882 8424 567 -4512 -1551 -711 -6007 -8382 -1436 5736 2200 -6386
962 -6386 -6736 -2424 -2996 -4525 735 7894 6622 -136 -2895 106 2900 2602 3709 7104 6647 -177
978 -177 -4281 -323 2655 -1950 -5702 -1244 3148 -488 -5899 -5854 -3222 -4464 -6110 -1069 6862 7136
994 7136 -2040 -8004 -1960 6126 5821 2871 4774 5672 1369 -2144 446 4017 2029 -2807 -3148 1530
1010A530K039n100n914k2L127K312K948L015k654p178k808O038O789J530j439
1025D213j612p47j140J87K796K474k771m717O64N657Q6p370n792J867M317J153
1041g35j80m95j777l375j716L717P846K172m221k503K553L022m43q33N05M77j96
1058C818M82L96k272m072l074N49L873K344k637l430k103j107J024M304K993r38
1074A50k298L3K272J269j26K4R57K162K24p28p2j78k028k663J250L183O29l001
1092A059l318k026L5N13P39O4R27n87j558j182J624J918J798J232R30M80K40M08
1110C296l42K63J465M06j326q28J64j302k656j496q59L54Q62M7j187r54o75l64
1128e132J035K910K537k49n74l61m64P52K165J766q40j153m15L09j86p82j486
$$ plain form
1010 1530 3569 -1531 -7445 -7467 -4340 -2028 920 3935 1281 -5897 -8705 -2667 4122 5652 4213
1025 4213 2601 1854 714 901 3697 6171 3400 -1317 -653 5004 5090 -2280 -8072 -6205 -1888 -735
1041 -735 -915 -1410 -3187 -6562 -8278 -4561 3285 5457 1236 -1267 1286 4308 3865 3032 3537 4014 3818
1058 3818 4300 4696 2424 -1648 -4722 -4173 -300 2044 -593 -4023 -6126 -7233 -6209 -1905 1088 150
1074 150 -2148 -2115 157 1426 1300 1324 2281 4443 4667 3939 3867 3689 1661 -1002 248 3431 4060 1059
1092 1059 -2259 -4285 -4250 -3737 -2998 -2934 -2007 -2594 -4152 -5334 -3710 -1792 6 1238 2168 2648 2888 3296
1110 3296 2954 3217 4682 5088 3762 2934 3098 1796 -860 -2356 -3215 -2861 -1999 -1952 -3139 -4093 -4768 -5132
1128 -5132 -4097 -1187 1350 1101 527 166 -298 454 2619 4385 3545 2392 1977 2286 2100 1318 -168
1145a68L72Q36l94j467N3N14j646k406J053K644L91j581r27N03O63l0J5K096K306
1164B827m42j958N55K294l32j711P12J700n91k001j280k20m95q37j004R09Q20
1181a054j839j317J729K247o69j249J937K766k87j612P59J325o55j860R4K246
1197B561P12k988l047J009K032j108j149J688J196k814k209K495L457M1k996j041
1213b161K275J327j044j012J989N34k991r82M004K567k148l409L86K021K18j055
1229E19M46Q14k095l370k64M112J126l578k660K448K318j273k61K583J348k244
1245c1j093L264L462j118l991o80L059O90l086j447J920j188l841o53M090J867
1261A224l528l027J846L841J07j673O54K361q58k681J899M647n03n252j017L627
$$ plain form
1145 -168 204 1040 646 -821 -768 -254 -1900 -4306 -3253 -609 -218 -1799 -2726 -2223 -1560 -1590 -1575 521 2827
1164 2827 2385 427 982 3276 2944 1233 1945 3645 3054 1053 -227 -447 -942 -1779 -2783 -1874 -1054
1181 -1054 -2893 -4210 -2481 -234 -903 -2152 -215 2551 2264 652 1411 2736 2081 221 315 2561
1197 2561 3273 285 -2762 -1753 279 -829 -1978 -290 906 -1908 -4117 -1622 1835 1876 -1120 -2161
1213 -2161 114 1441 397 -615 1374 1908 -1083 -2065 1939 4506 2358 -1051 -665 1356 1574 519
1229 519 965 1779 -316 -3686 -3950 162 1288 -2290 -4950 -2502 -184 -1457 -1718 865 2213 -31
1245 -31 -1124 2140 5602 4484 493 -187 2872 3562 476 -971 949 -239 -4080 -4733 -643 1224
1261 1224 -2304 -5331 -3485 356 463 -1210 -556 1805 947 -1734 165 4812 4309 -943 -1960 1667
1277A667J478k370j205J373J148k439k025K851L164k173m782L32M059k62l254
1292b438n17K722q00l092L65M465J326l119j759L029L788j108k791J882L216k200
1308B969l502J047M059j965n186o57L222O95l360j552K143J404k330j309L692
1323f30L509k404m086K698M894p12l447O22L134r80l376r3L372O67m245k253L650
1340C20L151l021l331K358K427k379k684K366K959k195m135P14M004L97l237p09
1356b995L467J684k779j477M399K988l031l016K924L170k360l706R84K367j864
1371G55l818m08L403J11m550j672M179K431k714j657M164K707k668k465L416L998
1387E212j641l139K6L075l70l811l62L673r2m698j546M474K040m219k400K632
$$ plain form
1277 1667 3145 775 -430 943 2091 -348 -2373 478 3642 1469 -3313 -2981 1078 816 -2438
1292 -2438 -2955 -233 -1033 -4125 -3760 705 2031 -1088 -2847 182 3970 2862 71 1953 5169 2969
1308 2969 -533 514 4573 2608 -2578 -3235 -13 682 -2678 -4230 -2087 -683 -3013 -4322 -630
1323 -630 2879 475 -3611 -913 3981 3269 -178 444 3578 2598 -778 -871 2501 3168 -1077 -3330 320
1340 320 3471 450 -2881 -523 1904 -475 -3159 -793 2166 -29 -4164 -3450 554 951 -2286 -2995
1356 -2995 472 2156 -623 -2100 2299 5287 2256 -760 2164 5334 2974 -732 252 2619 755
1371 755 -3063 -3471 -68 43 -4507 -6179 -2000 431 -2283 -3940 224 2931 263 -2202 1214 5212
1387 5212 3571 432 458 3533 3163 -648 -1010 2663 2571 -2127 -3673 801 2841 -1378 -3778 -1146
1403a146K392j784k666J917K353j548l498R77M577J12m107o64M462J768k897n04
1419b56L419J718k973k101K867K779k481m398P2L196j286m026l58L049r48l883
1435e610L55M461J534l012j278L490L271j699k003K459L013k047l597J488L560
1450D385j152m857K4L380l2l861n66K837J170k864j314K503J971k879k652K571
1466a336L461j911l624O98L410k89k516J111L346p7l107k11L732K549k729k996
1482d89J779K483k242k861J454J994k906l778J299L690k28l520j066L339J942
1497H90j388p30K758J597k633j737L016K793k659l439R45K323j018k740K21K041
1513B40l38k567N45L354J247l596j941L556L087j877k319J034J449j708j915J378
$$ plain form
1403 -1146 1246 -538 -3204 -1287 1066 -482 -3980 -3003 1574 1686 -2421 -3085 1377 3145 248 -256
1419 -256 3163 4881 1908 -193 2674 5453 2972 -1426 -1354 1842 556 -3470 -3828 -779 -1727 -5610
1435 -5610 -5255 -794 740 -2272 -3550 -60 3211 1512 -491 1968 4981 2934 -663 825 4385
1450 4385 3233 -1624 -1600 1780 1748 -2113 -2679 158 1328 -1536 -2850 -347 1624 -1255 -3907 -1336
1466 -1336 2125 214 -3410 -2712 698 409 -2107 -996 2350 2273 -834 -1045 2687 5236 2507 -489
1482 -489 1290 3773 1531 -1330 124 2118 -788 -4566 -3267 423 195 -3325 -4391 -1052 890
1497 890 -498 -1228 1530 3127 494 -1243 1773 4566 1907 -1532 -587 1736 718 -2022 -1801 240
1513 240 -98 -2665 -2120 1234 2481 -1115 -3056 500 3587 1710 -609 425 1874 166 -1749 -371
1529c71K441j430l352J39L475O84k683j944L082J792j926r06K133P91l096j472
1545b643K463K375j103k918l29K452P97j920M40K727L2k250J44L030Q7l238k061
1562a915K050K237j595k886o17J058j232j546J370L113o89k906N53M311J169j495
1578I80p22K472J411j032q86O55M92k618k074J750K322j148m091j300K368O00
1594h21j571M5J805j42j804J45J782J314j673j759J935K933o91k094L5J857l1
1611A265o78K009J679q92k869n24K397P63j970j550p6O13j908j802N46O28j439
1628c808j241J968K952m85k242M19K662J896K46k8J032K1j326j273J836J355k306
1645A678k154O44P31j001j889m32J066j59m28Q26J075k94j863o74K243J852r00
$$ plain form
1529 -371 2070 640 -2712 -2573 902 1586 -1097 -3041 41 1833 -93 -999 1134 1925 -1171 -2643
1545 -2643 -180 2195 1092 -1826 -2155 297 1094 -826 -386 2341 2373 123 267 3297 3384 146 -1915
1562 -1915 135 2372 777 -2109 -2726 -1668 -2900 -4446 -3076 37 -652 -3558 -3005 1306 2475 980
1578 980 258 2730 4141 3109 2223 2878 3370 752 -1322 428 2750 1602 -2489 -3789 -1421 -821
1594 -821 -2392 -2347 -542 -684 -2488 -2343 -561 753 -920 -2679 -744 2189 1498 -596 -561 1296 1265
1611 1265 587 2596 4275 3383 514 -10 2387 3150 1180 -370 -446 167 -1741 -3543 -2997 -2369 -3808
1628 -3808 -5049 -3081 -129 -614 -2856 -2437 225 2121 2367 2339 3371 3392 2066 793 2629 3984 1678
1645 1678 -476 168 899 -102 -1991 -2423 -1357 -1516 -1944 -1118 -43 -337 -2200 -2874 -631 1221 321
1662C21j024P69M73j039l85J352J414p38q41R67J054l19j365m36J196Q16j366
1679H49j003N41l68k226q02J150J421r68o74pQ08L74j59N18J691J323p98k61O02
1698B011k53j545k14J118P63j291j602n5k1j72k96O90R24O0n02J33J127j00j065
1717b90L41J176J06p93m51n25k87p98J84J027Q98k70j285l41J076O54k97Q72N73
1736A570n06p68l11K90j59o27j3J60N63m35l88k17M48K11L05P27P09l18j068k39
1756f6Q3l17J66L01j82n28q07j92K96L43r4K69J002O34R9p11M98M26m0K17K01
1777A598k79p76q10p23N6K91q6k49O3l2p4j8K70M35N46P70K80j72l23m52j63l47
1799a95P50M37k44p44q38k46N06L71L88l02K79K77j41j30K25j42l77l42K85M61
$$ plain form
1662 321 -703 66 539 -500 -885 467 1881 1143 302 1269 2323 2004 639 203 1399 2215 849
1679 849 -154 387 19 -2207 -3009 -1859 -438 -1406 -2080 -2087 -1279 -905 -1064 -546 1145 2468 1670 1409 2011
1698 2011 1758 213 -1 1117 1880 589 -1013 -1068 -1089 -1261 -1557 -867 57 117 -385 -252 875 775 -290
1717 -290 51 1227 1333 540 89 -436 -723 -1521 -1337 -310 588 318 -967 -1308 -232 422 125 997 1570
1736 1570 1064 296 -15 275 116 -511 -524 -364 199 -236 -624 -841 -393 -182 123 850 1559 1241 173 -66
1756 -66 17 -300 -134 167 -15 -543 -1350 -1542 -1246 -903 -997 -728 274 908 1007 296 794 1220 1180 1397 1598
1777 1598 1319 543 -267 -990 -934 -643 -729 -978 -915 -947 -1021 -1039 -769 -334 212 982 1262 1090 767 315 152 -195
1799 -195 555 992 748 4 -834 -1080 -574 -203 185 -117 162 439 298 168 393 251 -126 -468 -183 278
1819B78m39m82j065Q7P92R83M99p7m47k76K05J166J03R2J1k69r10l71k7j60l55
1840f62m66k48M18M07j17o10M4J043J94R7Q76P68m75j185j51O87L19K48j107l83
1860c03j57o82l45N38Q90q5l29kQ68r7k00K8M66j99m72K50K22l87j004m18O50
1881g68O42Q2o10P02K16p58l4J384Q35o47p16n3N24j99n04r41N14L30n68j047
1901a616Q89O45j038n13Q73J533Jm10k03M91j84j01m65R09O8q09p13O21L66j041
1921f97n06R89Q16l42j81L21L26m12l72M88P34L3j405n06L56Nj074r5J129J67
1941b26q85l27J065O08K02m09Q31Q04j31r12J72Q02k14j507m29J263K5j296k91
1960h55K80j5j07l00O84Q10q46j015M39J268K1q22q8R06p4j139M60J105J02j193
$$ plain form
1819 278 -161 -643 -1708 -1621 -829 154 653 576 129 -147 58 1224 1327 1419 1430 1161 251 -120 -147 -307 -662
1840 -662 -1128 -1376 -958 -551 -668 -1278 -1234 -191 3 100 976 1744 1269 84 -67 620 939 1187 80 -303
1860 -303 -460 -1142 -1487 -949 -59 -144 -473 -475 393 296 96 124 590 391 -81 169 391 4 -1000 -1418 -768
1881 -768 -126 -44 -654 48 264 -494 -528 856 1691 1044 328 275 799 600 96 -845 -331 -1 -569 -1616
1901 -1616 -727 -82 -1120 -1633 -760 773 774 364 161 652 468 367 -98 811 879 70 -643 -22 344 -697
1921 -697 -1203 -214 602 260 79 400 726 314 -58 430 1164 1197 -208 -714 -358 -353 -1427 -1522 -393 -226
1941 -226 -1111 -1438 -373 235 437 28 859 1663 1532 620 792 1594 1380 -127 -556 707 732 -564 -855
1960 -855 -575 -590 -697 -997 -313 497 -349 -1364 -925 343 364 -458 -546 360 286 -853 -393 712 814 -379
1980c79k32J202R98k84p35j34Q31J4q81M22P08j234j967m2J323n5j190j77J96
1999a616L01k99J64J197J182p17p98J415J357j01j217L36N02l99j107L58Q39m72
2017I25j546q42R15Q66o81j347J061Q04p43q00R36Q17p54o48N1J162O1p86k38
2036g87J102N69m37k79M72R30o73o47R73J121j131j436N43L19n85q55j61N76l67
2055g53j052n47J384P03q36m29J385R00o47l44J126N82m34q81M12M93M3j265l55
2074e15J196N4j588l55J164O70r55n42J063N75r87o04Q42Q85m23j087j53J079
2092C19nr18k29J538m04j524L77J581Q56j531k20N58N75o52l29O27P22j066j682
2111a407L58J481j17j306p1J079L98p41l59P79N08n39p0J82R25p43j219L51P98
$$ plain form
1980 -379 -611 591 1589 1305 570 436 1267 1281 400 822 1530 296 -1671 -1713 -390 -445 -1635 -1812 -1616
1999 -1616 -1315 -1614 -1450 -253 929 212 -586 829 2186 2085 868 1204 1706 1307 200 558 1397 925
2017 925 -621 -1463 -548 318 -363 -1710 -649 155 -588 -1388 -452 365 -389 -1037 -986 176 237 -549 -787
2036 -787 315 884 447 168 640 1570 897 250 1223 2344 1213 -223 320 639 54 -801 -962 -386 -753
2055 -753 -1805 -2352 -968 -265 -1101 -1530 -145 755 108 -236 890 1472 1038 157 569 1062 1105 -160 -515
2074 -515 681 735 -853 -1208 -44 626 -329 -871 192 767 -220 -824 18 903 480 -607 -760 319
2092 319 314 -604 -833 705 301 -1223 -846 735 1591 60 -160 398 973 321 -8 619 1341 275 -1407
2111 -1407 -1049 432 315 -991 -1062 17 415 -326 -685 94 602 63 -7 175 1100 357 -862 -511 287
2130B87j59j270J46R39j83j006N02P59L04p30oJ266Q72r54p16L70Q90m14j388
2149d91P46N55m17j856M46J097l58q54K91J012J10j148m89J213J148o09n18j46
2167b68J125p70j094J032R98l59j363Q8Q04Q05p53l78Q26O7o06n74J024M57j474
2186d13j062P43J124q12r11J30L80J57l66K51J054M21o92n94J432J030p97r19
2204A56N12O12l34p80M60p4q19r32L15J059O44j637p03O92R91o93k21J152j11
2223B89r75l79J145Q70l29j021K09N81j12J0l2Q41n05r47K82J170R9j037o35N63
2243H7K21n77l38M29k7m53o96L47P51J86m79k45J011N25p90qJ006K67q70J25N53
2264A025N1l50r64J28M35j51o89n3O22k03r66L09R22j5m92j63N21K38l34k76N63
$$ plain form
2130 287 128 -1142 -996 -57 -240 -1246 -744 15 319 -411 -417 849 1721 767 51 421 1311 897 -491
2149 -491 255 810 393 -1463 -1017 80 -278 -1132 -841 171 281 -867 -1356 -143 1005 396 -122 -268
2167 -268 857 87 -1007 25 1023 664 -699 -611 193 998 245 -133 693 760 154 -420 604 1061 -413
2186 -413 -1475 -732 392 -420 -1331 -1201 -821 -664 -1030 -779 275 696 4 -590 842 1872 1075 156
2204 156 668 1280 946 166 626 552 -267 -1199 -884 175 819 -818 -1521 -829 162 -531 -752 400 289
2223 289 -686 -1065 80 950 621 -400 -191 390 278 288 256 1097 592 -355 -73 1097 1196 159 -476 87
2243 87 308 -269 -607 -178 -205 -658 -1354 -1007 -256 -70 -549 -794 217 742 -48 -56 950 1217 347 472 1025
2264 1025 1076 726 -238 -110 325 174 -515 -568 54 -149 -1115 -806 116 101 -391 -554 -33 205 -129 -405 158
2285A58M12l59n63N03M35l20q68N59N16j59l19L09L25j82p35Q5N92N5p98k25j06
2306f85P34n60m02M44K35K06p75P96N72n7j59j61L00O31m36n44L81J15n88q24
2326g77M84M91m78n33L8O63l63l89L78M00K60p85J08Q85M00r10r4O67K53p24K52
2347B26R3K88J34r46J14N82k11l07n7K63J22m10k76K14J26m34j37J46L42m49K54
2368c23r3L86M8L6K79J06J6m61J83N62m3l44k76J95M4o44j05J09j51k37l09M04
2390f18K19K09n39K28P38Nj51m0K17J65j73j23K24K63k75j99J19M6l02k81J2M78
2412B22k34k11J19k63K30j53k34M18j03Q4p7r1J24J02J35J34R2J5k5m3K22Q4j15
2435D32R4p5l22r8o9q1k8m16j43J4J0N37n84K61M97j92k7N55J49Q4k09K82k40
$$ plain form
2285 158 570 211 -352 151 586 266 -602 -43 473 314 -5 304 629 447 -288 -203 389 444 -354 -579 -685
2306 -685 49 -511 -913 -469 -234 -28 -803 -7 565 508 349 188 488 1119 683 139 520 635 47 -777
2326 -777 -293 198 -280 -813 -775 -112 -475 -864 -486 -86 174 -611 -503 382 782 -128 -222 445 698 -26 226
2347 226 319 607 741 -205 -91 491 280 -27 -84 179 301 -109 -385 -171 -45 -479 -616 -470 -128 -577 -323
2368 -323 -416 -30 18 54 333 439 455 -6 177 739 696 352 76 271 315 -329 -434 -325 -476 -713 -1022 -618
2390 -618 -399 -190 -729 -501 237 242 91 51 268 433 260 137 361 624 349 150 269 315 13 -268 -256 222
2412 222 -12 -223 -104 -367 -137 -290 -524 -106 -209 -125 -202 -293 -169 -67 68 202 294 309 284 241 463 547 432
2435 432 526 451 129 31 -38 -119 -147 -563 -706 -692 -682 -145 -729 -468 29 -163 -190 365 514 598 389 671 431
2458D31K81l01k2l01J9K0j70Q6l52k53J05L3J99J05j59l74J15M53pM6K54q6K6
2481A48L49k02L8n6M0j20K71R5l28K60n13o4J48j06m0j83j48k28j56K83K8K48
2503b36j35K18j08J75O73l71o2L11K28P0J81j86k60j91L1l3q5p7o06J64k93j30
2525g22j39K00R8l6q9K00L88k60L18P2K38lL33O9m21J46K0J1K72J6m93j75k91
2548b48K02K49o93J35L7Jj10l5j18o4J60NK19O10k92k45J91M78M0n5L36j12k03
2571D88K28j58k69L8m97k26J96J18l04k49K5l6j35M7O09Mj93j12R0M81M78l49
2593B74K01P4j25J92j98mJ40m13k83K55L0k91l99j04M41k20K6Q4K42k73o4Q0N29
2616A94J14j48j48L55L43m53R7n7L28k98K18r1M2m29k06j78J78J06k76j27J29
$$ plain form
2458 431 712 411 389 88 107 127 -43 43 -309 -562 -457 -424 -225 -120 -279 -653 -538 -85 -92 -46 208 122 148
2481 148 497 295 333 277 317 197 468 563 235 495 -18 -82 66 -40 -80 -263 -411 -639 -795 -512 -484 -236
2503 -236 -371 -153 -261 -86 587 216 154 465 693 763 944 758 498 307 338 305 220 143 -463 -299 -592 -722
2525 -722 -861 -661 -563 -599 -688 -488 -100 -360 -42 30 268 265 598 667 246 392 412 423 695 711 218 43 -248
2548 -248 -46 203 -490 -355 -318 -317 -427 -462 -580 -644 -484 -479 -260 350 58 -187 4 482 522 467 803 691 488
2571 488 716 558 289 327 -170 -396 -200 -82 -386 -635 -610 -646 -781 -734 -125 -121 -314 -426 -336 145 623 274
2593 274 475 549 424 616 418 414 554 141 -142 113 143 -148 -547 -651 -210 -430 -404 -320 -78 -351 -415 -335 194
2616 194 308 160 12 367 710 257 354 297 625 327 545 454 496 67 -139 -317 -139 -33 -309 -436 -307
2637c07p1m51n2P33P9k68L3L47J89O5r8k18N64J73k70n0K79m18m00J88L07k87
2659F7o9n92K27K03n17j60R8N94k64q8K00M46r0J16r9K64o8j6J74p0j64K49k48
2682A93J28J05m37k9j62L30j90m17mL67k29l01K04M3K01L9K7L56J29q7k66K48
2704B48L76j48m77N74O0l82m85J50q5J26l68Q2J65K10k03m28K16L47j43m49L89
2725b25K99k65K7K75N17o41K2J10K76K2k17j85K73j11k51q3J81k2k45j31nK24
2747a55k55j4M06j16j24l6K78K12J32j23L2K01l68j75K3M86k13k73J86J38r6k13
2769f7j07j65K89j19k84n9O22j48k89L2M39k89Oj02K22M74m19Q8J9P0j28k08o3
2792a86N82k86m34J02O86m76l51O0M03k65l10J76J05K80p4l18J17K56J06m54L87
$$ plain form
2637 -307 -378 -829 -881 -148 -69 -337 -304 43 232 297 199 -19 545 718 448 398 677 259 -141 47 354 67
2659 67 -2 -594 -367 -164 -681 -841 -743 -149 -413 -501 -301 145 55 171 72 336 268 252 426 356 192 441 193
2682 193 321 426 -11 -40 -202 128 -62 -479 -483 -116 -345 -646 -442 -399 -198 -159 -132 224 353 266 0 248
2704 248 624 476 -1 573 633 251 -234 -84 -169 -43 -411 -329 -164 46 -157 -585 -369 -22 -165 -614 -225
2725 -225 74 -191 -164 111 628 -13 9 119 395 417 200 15 288 177 -74 -157 24 2 -243 -374 -379 -155
2747 -155 -410 -424 -18 -134 -258 -294 -16 196 328 205 237 438 70 -105 -82 404 191 -82 104 242 146 -67
2769 -67 -174 -339 -50 -169 -453 -512 110 -38 -327 -295 144 -145 -139 -241 -19 455 36 124 143 213 85 -123 -186
2792 -186 396 110 -324 -222 464 -12 -363 -303 100 -165 -475 -299 -194 86 12 -306 -189 67 173 -281 106
2813A06L14M1p05K85K89M5m27J9J63K91l35m03L23k86L3m33K65L67J23m14J01
2834b38J08K80k43r5K98J48k17P5J04J52k85k41J8N70l13m43L84J29j87l67J53
2855b10M95m76k23oQ05n94n7q3L86j2q0lO4M73m28k25K40K75k03k97K01K31l40
2878f7k97L87J37j18l77j54L25J38j81O5J87k9m9R1K0J93J03k57l15M72j17k22
2900f5r0N11j90k09k47L87j73J0k10L44r3r6J09j64K89j87L2l62N67Mm14O9L61
2923A83M0k92j86N67m8p0L5L5M1q6n10K67K06k8k97LP2R0m16J9L92J15k04j42
2947b14q6M17j2n1K2l3M2l10K81K45j82k47K0L10Q0k73J14O1k41L41l99j92N13
2970B06j91k55J38J48m3l00jJ72J03k58J87NK53j40p8J71K45j83k51L37k28K71
$$ plain form
2813 106 420 461 -244 41 330 375 -52 -33 130 421 86 -317 6 -280 -247 -680 -415 -48 75 -339 -238
2834 -238 -130 150 -93 -188 110 258 41 116 220 372 87 -154 -136 434 121 -322 62 191 4 -363 -210
2855 -210 285 -191 -414 -420 385 -209 -266 -349 37 25 -55 -58 6 479 51 -174 66 341 138 -159 42 273 -67
2878 -67 -364 23 160 42 -335 -489 -164 -26 -207 -142 45 16 -33 58 78 271 374 117 -198 274 157 -65
2900 -65 -155 356 166 -43 -290 97 -76 -66 -276 68 -25 -121 -12 -176 113 -74 -42 -404 163 167 -247 -178 183
2923 183 223 -69 -255 312 264 194 229 264 305 219 -291 -24 182 154 -143 -140 -68 22 -394 -375 17 132 -72 -214
2947 -214 -300 117 105 54 76 43 85 -225 56 301 119 -128 -108 202 282 9 123 184 -57 284 -115 -307 206
2970 206 15 -240 -102 46 3 -297 -298 -126 -23 -281 -94 -89 164 24 -54 117 362 179 -72 265 37 308
2992C08j29k67Q3O8j27l34O89m19k84J78L35k35j66k5L93p4r9q6M56R9k49k25
3014a10L86l38J88rr6K38k13n1L2Q9J75j04n18M76j07j60k5K40Q9k46P8n8J21
3037G7m5l32j04L31L68p4l07K47j48J42l0K95R3m97j55J83kK56l0k76q9j08k25
3060d30K13M14r6l35p9L64Q3j07KJ69R0m47K97j6P5m6l50N7M06R1m49L8o9L78
3084B53j08J73j12lj15M1j28O%l24j64K79J95j00M9J46k94j2k37L71J91l00K29
3107C6k71M17J2l15M0J50p4J05K30k56k34n3K48K03n0n5o8L7J39j62j29lJ33r7
3131a7m0k88K32l87J62M23j70K5P7m07K19L12q2L58k74K0J30k84J17K69m29K24
3153A90l39r0L26p9J14p8j88l79L98p6K22r8j57K19J80l87L83k27J06k78l0oL07
$$ plain form
2992 308 179 -88 -5 63 -64 -398 291 -128 -412 -234 101 -134 -300 -325 68 -6 -105 -191 265 364 115 -110
3014 -110 276 -62 126 117 21 259 46 -5 27 116 291 187 -331 145 38 -122 -147 93 182 -64 14 -44 77
3037 77 32 -300 -404 -73 295 221 -86 161 13 155 125 420 513 16 -139 44 42 298 268 -8 -97 -205 -430
3060 -430 -217 197 101 -234 -313 51 134 27 29 198 288 -159 138 122 197 151 -199 -142 264 355 -94 -56 -125 253
3084 253 145 318 206 203 88 129 1 7 7 -317 -481 -202 -7 -107 -58 88 -206 -218 -455 -84 107 -193 36
3107 36 -235 182 194 -121 -81 69 -5 100 330 74 -160 -213 35 238 188 133 65 102 241 79 -50 -53 80 -17
3131 -17 -57 -345 -113 -500 -338 85 -85 -60 17 -390 -171 141 59 417 143 163 293 9 126 395 -34 190
3153 190 -149 -239 87 8 122 44 -144 -523 -125 -201 21 -77 -234 -15 165 -222 161 -66 40 -238 -268 -274 33
3176C3j24J42j1L2L01k70j19J26N0k4k5n4j89J55l45K70k65J01J71m6p2o1m3K5
3200b42K85J84m3j25j73K38j49K7P8l8N8K6R9n37J68K14j98K73l22J04K7n0M0
3223e6Q0k3k5J8j40J7K87k95K62k16R8k11K04Mk77M26r0l1L27j69j28pM5J40k98
3248e8L8p3k14J27K36k23J76j5j2Nj12K08q7N6p8O9l92L54L08m56J63Q4Rj73l2
3273i2r1J51J73L7q7j99J85K25j95o6q0r4j82L62j16p5j46J90M1k31J8K06J27
3296F1p3k3J59j60J68j75jrK16j16N1j54Q5K2k26J07L57m51L37m90K14J81l75
3319b95J2L86m6j60k24M24k23o0J99J37r8j45O7o3J90J12j04J43k02l2j96O34
3341D56k24k45j38J21k07R6m1P6k32k2M63k89P5M35O4k10Q5j93J5K38j08j15j31
$$ plain form
3176 33 -91 51 40 72 373 103 -16 110 160 136 111 57 -132 23 -322 -52 -317 -216 -45 -91 -163 -224 -267 -242
3200 -242 43 227 184 59 -114 124 -25 2 80 42 100 126 225 -312 -144 70 -128 145 -177 -73 -46 -96 -56
3223 -56 24 1 -24 -6 -146 -129 158 -137 125 -91 7 -204 0 4 -273 153 63 32 359 190 62 55 100 240 -58
3248 -58 -20 -93 -307 -180 56 -167 9 -6 -18 -13 -125 83 -4 52 -26 43 -349 5 313 -143 20 104 113 -60 -92
3273 -92 -183 -32 141 178 91 -108 77 302 107 41 -39 -133 -315 47 -69 -144 -290 -100 -59 -290 -272 -66 61
3296 61 -12 -35 124 -36 132 -43 -44 -53 163 47 98 -56 29 51 -175 -68 289 -162 175 -315 -101 80 -295
3319 -295 -283 103 57 -103 -327 97 -126 -186 13 150 52 -93 -26 -89 101 213 109 252 50 18 -178 456
3341 456 232 -13 -151 -30 -237 -141 -182 -106 -338 -360 103 -186 -111 324 388 178 263 70 85 323 215 100 -31
3364c1L62k64k84J74l48L5J13K49m3j65j55L14k8L16Ok71k0K46r8j57K78L3l23
3387f1K63j33r4m7R3J61j74K33j97P8lk74O1r4Pp9J26Q2J54p7k27J93J9q4O8J74
3413A68j09R1j68K34m4J94k55J86k73K2j47m11L98O0j62P0l1L08j08k93K14r0
3435a46K00J63K6j40P4j39m1RM6R3k09K06j95j1p1l6L1J08R5m0J43k56j61R8K15
3460F2p4Jl6K82l33k61J45J34J63O7l47J24K64k07K68m05L70n2l91J63J16p1k02
3483b20j1O1L46l97k15K52M43k00n6J1M78l26j02M0K16k61J44m11J58K7J1j01
3505a13k88L21j01qLL71k01j21O2L60k01J80j49K33j30k46K77j6K04m12r4J70
3527A01q0k12KK45p0J09l91j03P9m5K04J84k98N3M5J10k13M83q1J25qP3K00k17
$$ plain form
3364 -31 331 67 -217 -43 -391 -356 -243 6 -37 -202 -357 -43 -71 245 251 -20 -40 206 108 -49 229 262 -61
3387 -61 202 69 -25 -72 21 182 8 241 44 122 119 -155 -94 -188 -181 -260 -134 -52 102 25 -202 -9 10 -74 -6 168
3413 168 59 150 -18 216 172 366 111 297 24 46 -101 -512 -114 -54 -216 -146 -177 131 23 -270 -56 -146
3435 -146 54 217 243 103 177 38 -3 6 52 145 -64 142 -53 -64 -135 -171 -140 -32 63 23 166 -90 -251 -153 62
3460 62 -12 -11 -47 235 -98 -359 -214 -80 83 150 -197 -73 191 -16 252 -153 217 165 -226 -63 53 -18 -220
3483 -220 -231 -170 176 -221 -436 -184 259 59 3 14 492 166 64 104 320 59 203 -208 -50 -23 -12 -113
3505 -113 -401 -80 -181 -189 -186 185 -16 -137 -75 285 84 264 115 348 218 -28 249 233 437 25 -69 101
3527 101 21 -191 -189 56 -14 95 -296 -399 -320 -365 -161 23 -275 -222 -177 -67 -280 203 122 247 239 312 512 295
3551B95r3J92j15L5l64K66k40l41J61J21K0j90j84N3J63j51N0r9M74j67R2M8K13
3574B39r7M0j33M21k64k08j24M37n7j71j95J36N3j32Pk36M8K09k94J52K06k44
3596b07J86j23R7K1j66J12K28P1j36J85L4j02J37o1L3k55K69k59l9M8l1j13m60
3619e31J99j05L59j41J42j35q6J33L2L58R2Qj47%M2p5n8K61k30o9l31K54Q9k20
3643a59K35q7J17j66k01K36N8L01m05p5K63J95k31m08O2L96k13j89n8M47K08o75
3665c49K74K38k4j98J39L00l55r2j73K40N6j16j21L49l26K13qk38L80j48J85n65
3687c39L64P1J05l43L2R7p1O4J3P7m11j02N81k01j46J05k3J71j83k9Q7J69j07
3710a9Q7J95Rj62j33J53q9L2J7k05J25k13L40k47m2J70k18J89P8k95K34l62L09
$$ plain form
3551 295 202 394 279 314 -50 216 -24 -365 -204 -83 -63 -253 -437 -384 -221 -372 -322 -421 53 -114 -22 26 239
3574 239 142 182 49 470 206 -2 -126 311 254 83 -112 24 77 -55 -48 -284 -236 -27 -321 -169 37 -207
3596 -207 -21 -144 -47 -26 -192 -80 148 219 83 268 302 200 337 276 309 54 323 64 25 73 42 -71 -531
3619 -531 -332 -437 -78 -219 -77 -212 -298 -165 -133 225 317 325 178 178 220 145 87 348 118 49 -282 -28 61 -159
3643 -159 76 -11 106 -60 -261 -25 33 334 -71 -146 117 312 81 -327 -265 131 -82 -271 -329 118 326 -349
3665 -349 -75 163 139 -59 80 380 25 -67 -240 0 56 -60 -181 168 -158 55 47 -191 189 41 226 -339
3687 -339 25 96 201 -142 -110 -13 -84 -20 -7 70 -341 -443 138 -63 -209 -104 -127 44 -139 -168 -81 88 -19
3710 -19 68 263 272 110 -23 130 41 73 90 -115 10 -203 137 -110 -152 18 -200 -11 67 -228 6 -356 -47
3733d7n8l9j8K77q0o1P7m5M3L68n34K58j4j3L2J99j90j02j00o0k0j9r9j31L54
3758b2l03M59k84J62l5J11K7j00K16Pj7k51L53k94K02k2j44k05K43l05L81l55
3780a76J22M2l13M26k51P2J65n00M54O0l26Q6J79O6j0l1k9M2p3m6KK27k75J02
3804A5j46n1R7r8K66j9j44J9l51M49j23j07M7NJ6R4R0Kk2l1NP2mJ72k27J22J00
3831B48l55Q2J2n1m9k1m8J99N3o7k88J03O1k54K30n9L54j60q0J80J9j16K25j15
3855A03p0K00l24j76M81j07J05n12K73O1k9k9j17K93k48j80J06J41J47q1k83J17
3877a29l5NK31J64r7k12L96j86K26m36K08k0K2k58q9J82m3J94l73p7J26R0Q4K61
3901B34n39M74k82k5K46K0k30K44qK6o6r2n2l48M17P0k33K22Rj75J36j83K15k81
$$ plain form
3733 -47 -105 -144 -162 115 35 -26 51 6 49 417 -117 141 127 114 146 345 155 53 -47 -107 -127 -146 -245 -376 -22
3758 -22 -325 134 -150 12 -23 88 115 15 231 238 221 -30 323 29 231 209 65 -140 103 -202 179 -176
3780 -176 -54 -12 -325 101 -150 -78 87 -413 41 101 -225 -139 40 106 96 65 36 78 5 -41 -39 188 -87 15
3804 15 -131 -182 -85 -183 83 64 -80 -61 -412 37 -86 -193 -146 -141 -125 -31 59 61 39 8 13 85 81 253 26 148 248
3831 248 -107 -25 -13 -64 -113 -134 -182 17 70 3 -285 -182 -121 -375 -145 -204 150 -10 -90 90 109 -7 218 103
3855 103 33 233 -91 -267 214 107 212 -300 -27 34 5 -24 -141 152 -96 -276 -170 -29 118 37 -246 -129
3877 -129 -164 -159 72 236 139 -73 323 137 363 -73 135 115 137 -121 -210 -28 -71 123 -250 -327 -201 -111 -27 234
3901 234 -305 169 -113 -138 108 128 -102 142 134 160 94 2 -50 -398 19 89 -144 78 87 -88 48 -135 80 -201
3925b01n2J05J9J71k28R9J1o8J42M4k64J73J27m0K27j1p2j35L2p0K67p2k89k41
3949c26L02rK8O1M1k69L9J46%O1jk9J04K4j54L42r4j92J65q0j21j06k63L31J48
3974A48p1m39L31l0P3k17L15l08P3Q2J33N4k04K4P8q7J69j50J87j1k82K87j4m4
3998I7j42q4J2J39j08O5J79l93K07j34K35l2k30q2M32l3l14J21J06K62k19j22
4020c8J50l03N61l57J44j43o8j61J40j91R5j04K57k87K47j77K9j7J52J10k46N14
4042C07k08r3J24k45J01J07j02R3L7K8O1J1k87K6p5j52K50J16K2l34K53l1n3K24
4066A80l33j35L14j60J84m0O6J33p6K02j11l60K92p5j00K18k11L9j20J87l81k5
4088c12O8J52Jj35K74j59j39M88k8k06J37q3j39J52K80L9m62J85rJ9j88R8m1O1
$$ plain form
3925 -201 -253 -148 -129 42 -186 -87 -76 -144 -2 42 -222 -49 78 38 265 254 182 47 79 9 276 204 -85 -326
3949 -326 -24 -33 -5 56 97 -172 -133 13 13 74 73 44 148 172 18 360 266 74 239 159 38 -68 -331 0 148
3974 148 77 -362 -31 -61 12 -205 110 -198 -125 -43 90 144 -60 -36 42 -45 124 -26 161 150 -132 155 141 97
3998 97 -45 -129 -117 22 -86 -21 158 -235 -28 -162 73 41 -189 -271 161 128 -186 -65 41 303 84 -38
4020 -38 112 -191 370 13 157 14 -54 -215 -75 -266 -171 -275 -18 -305 -58 -235 -206 -223 -71 39 -207 307
4042 307 99 6 130 -115 -14 93 -9 84 121 149 210 221 -66 -40 -115 -267 -17 99 121 -213 40 9 -44 180
4066 180 -153 -288 26 -134 50 10 76 209 133 335 224 -136 156 81 -19 199 -12 27 -93 94 -287 -312
4088 -312 -244 -92 -91 -226 48 -111 -250 238 210 4 141 58 -81 71 351 390 -72 113 104 123 -65 33 -8 53
4112E3O1l5j52J72m5k85M63j71l48J04M27k32o7j76K07j46K90J0JM5k3R6j60k4
4136F5k10n2J85j15P5Ml8l62L99k67J40J46J16k52K66k86J67K07J8l13j2L53k63
4159b9K68j51j09P4J01o2K9K7q3p9j17M2p0K02J73j97k13J36J59Q4j59j48M11
4182B89j00j50k32J63J95j60M6O7j11j9M53l57j21J61k20J02Lj5l43K35K04J43
4204B33k89o6Q5J91K9l24K47Q9m7m5ln7O1j65l9J63K0l1p9p0rr2O4O1K22m19L11
4231D1l38J61O7J89Q7j43r8J08O3l5j46L97m60k15L21Q5j34Q2J00j62N4k43N09
4254B90n23j65K91K06q4j40K09P8j38r1L47k42m0k9J4J2K14k80PK90l41L0J60
4277G5NK20l20k29o0J72L25n6lR1k94n5L05J69j62k47L17l44J12M33l42k27R0
$$ plain form
4112 53 114 79 -73 99 54 -231 232 61 -287 -183 244 12 -55 -231 -24 -170 120 130 131 176 153 249 89 65
4136 65 -145 -197 -12 -127 -52 -48 -86 -448 -49 -316 -176 -30 86 -166 100 -186 -19 188 206 -107 -119 234 -29
4159 -29 239 88 -21 53 154 92 121 148 65 -14 -131 -89 -159 43 216 19 -194 -58 101 185 26 -122 289
4182 289 189 39 -193 -30 165 5 51 118 7 -12 441 84 -37 124 -96 6 9 -6 -349 -114 90 233
4204 233 -56 -122 -37 154 183 -141 106 195 148 103 100 43 104 -61 -100 63 83 52 -27 -97 -106 -198 -134 -73 149 -270 41
4231 41 -297 -136 -69 120 207 64 -34 74 137 102 -44 353 -107 -322 -1 84 -50 32 132 -30 24 -219 290
4254 290 -233 -398 -107 99 15 -125 84 162 24 -67 280 38 -2 -31 -17 -5 209 -71 -64 226 -115 -85 75
4277 75 80 300 -20 -249 -309 -137 188 132 129 220 -74 -129 176 345 183 -64 253 -91 21 454 112 -115 -25
4300b5p7m7J96j42K0j85J62p8R8j35K19q4N8n5M9m8L6J50k96L50r7j20L03l22
4324g0Km5J89P4k02J97k90J98j75J45j02k36M51k36q7K11n5J5J62l04J3N2J46
4347E3q0r9K20j39Q4j12o7K41k82J7k16J97q8K65k19J27l3O8m1N3K81l40j18K9
4371a99N48l10P3m3j08L41k87k28J83J46j2l22L17O1j35j7L0j81P4K3j26K82k53
4394a43j31M00j96J65k60J79oL47k55r3j51L4L28N6pl87J77M3R5j97j76P8j72
4417b72M37Q7k55J49l41L86l74L65Oj28L56k25N2j31k21J30N1k8J97k96J70l61
4439b46N55k68l08J41m1oK35k08J46j10J31J65J4k85J52J34l34K66k63O6J40J39
4461B15j56j93K82j71k07K84k23J67NJ17m3o3K02k30P0j25J79m9pL4j02j13k5
$$ plain form
4300 -25 -102 -149 47 -95 -75 -260 -98 -176 -78 -213 6 -78 -20 -75 -26 -74 -38 112 -184 166 69 -51 252 -70
4324 -70 -68 -113 76 150 -52 145 -145 53 -122 23 -79 -315 136 -100 -187 24 -31 -16 146 -158 -145 -93 53
4347 53 -27 -126 94 -45 39 -73 -140 101 -181 -164 -380 -183 -271 -6 -225 -98 -131 -63 -104 -51 230 -110 -228 -199
4371 -199 349 39 112 69 -39 302 15 -213 -30 116 104 -218 99 160 25 8 38 -143 -69 -46 -172 110 -143
4394 -143 -274 126 -70 95 -165 14 8 355 100 7 -144 -110 218 274 267 -120 57 100 195 -2 -178 -100 -272
4417 -272 165 252 -3 146 -195 191 -183 182 188 60 416 191 243 112 -109 21 72 44 241 -55 115 -246
4439 -246 309 41 -267 -126 -167 -173 62 -146 0 -110 21 186 200 -85 67 201 -133 133 -130 -64 76 215
4461 215 59 -134 148 -23 -230 54 -169 -2 3 120 77 14 216 -14 56 -69 110 61 54 88 -14 -127 -152
4484a52O4J36j34K59j51K46l21J23j34J20j4K10l81Q3J8L4p1O5j2N3k81K96M4
4507A00j19J94k32j22J47R9k18J82k00J75lJ04Q0j37k45J79k09J42J64j39J4j4
4529e8J53Kj62L0K09j54j1k36L11n9j20j32M93l84k40M36J37n63r7L80jJ89N2
4552A75j04j92L53j94J38j34N0L2o3R3r7J05k7r9Q1Pj02q2J6Q7l3j08K60j83L9
4577A8k84K79p7K20l87J77O6L02q5j00j21jj14m7K65o1q2L42k94r5L56j03j39
4600C5l02K16K23k93J83k83P7m6j11L94n9K01l06K84j83j59K49N8K8l41R5n9K79
4623A80m3j92J63J10K2k63R1l41J67K67j03j12k49M60j35k75K94o7n7J68n8j03
4645g6M3J41j67L88j96l9J43k22k2J4k7j06K1J63j87J65j53m6J94j28k5K12o5
$$ plain form
4484 -152 -88 48 -86 173 22 268 -53 70 -64 56 42 252 -129 -46 -28 6 -65 0 -12 41 -240 56 100
4507 100 -19 175 -57 -179 -32 67 -151 31 -169 6 3 107 187 50 -195 -16 -225 -83 81 -58 -44 -58
4529 -58 95 97 -65 -35 174 20 9 -227 84 25 -95 -227 266 -118 -358 78 215 -348 -445 -65 -66 123 175
4552 175 71 -121 232 38 176 42 92 124 61 154 57 162 135 36 117 124 22 -60 -44 43 10 -98 162 -21 18
4577 18 -266 13 -64 156 -231 -54 12 314 229 129 8 7 -107 -154 111 50 -32 310 16 -79 277 174 35
4600 35 -267 -51 172 -121 62 -221 -144 -190 -301 93 34 235 -71 213 30 -129 120 178 206 -135 -40 -99 180
4623 180 137 -55 108 218 240 -23 68 -273 -106 161 58 -54 -303 157 22 -253 41 -26 -83 85 27 -76
4645 -76 -33 108 -59 329 133 94 237 15 -7 7 -20 -126 -105 58 -129 36 -117 -163 31 -97 -122 90 25
4668B5L9k11L55l21l9O7q0J85J74k98L80l25J87m58L38J21n2J1k04l2K03k9q8
4691e2J52j66k4J17J27k52L05k40r6j9j14P94o91J61J11j0m21M57j7k59K15k83
4713b05K42j97J95k32L6J21l0o3N9j05J27j6q7p2L49j25NJ91O6p6m33K77j03L52
4737B76k59k00MJ67R7jk83K24k44J83j17R4K62k41n5K05l29J57K47N1o1k01M1
4760A7O9n3j93K26k17J71r4O3n6R1j16P9n4m9J80n8j23J13K5Q7l7r3J29k34L37
4785B10j06N6k28m2J33O2K4k69J37L09k68o0K8J11q2k7n0L51q4k53Q9J63l68K58
4809I4r6j00K73n7J01k9j18j53J93p3m3j24j8N9P4l6j6Q7M3l3j99K48n7n1o4J13
4835A8l6K52o8j44O4j01L52j95j92L26k96K4K4j50J49J1n2o1mJ5k61K99L5l8J12
$$ plain form
4668 25 64 -147 208 -113 -152 -85 -165 20 194 -104 276 -49 138 -320 18 139 87 98 -106 -138 65 36 -52
4691 -52 100 -66 -90 27 154 -98 207 -33 -129 -148 -262 532 -159 2 113 103 -318 139 122 -137 78 -205
4713 -205 37 -160 35 -197 -161 -40 -70 -133 -74 -179 -52 -68 -155 -227 122 -3 2 193 259 183 -250 27 -76 276
4737 276 17 -183 -179 -12 85 84 -199 25 -219 -36 -153 -59 203 -38 -93 112 -217 -60 187 238 177 -24 17
4760 17 86 33 -160 66 -151 20 -74 -11 -67 24 -92 -13 -67 -116 64 6 -117 -4 21 108 71 -22 107 -127 210
4785 210 104 160 -68 -110 23 85 109 -160 -23 286 18 -42 -14 97 15 -12 -62 289 205 -48 41 204 -164 94
4809 94 -2 -102 171 114 215 186 68 -85 108 35 -8 -132 -150 -91 -17 -53 -69 18 61 28 -171 77 20 -31 -95 18
4835 18 -18 234 166 22 86 -15 337 142 -50 276 -20 4 28 -122 27 38 -14 -75 -79 -64 -325 -26 9 -29 83
4860H3k15J90J45k42M15K7l41J4K07k63j2j57J18Q7l42K79j63n7R0o2j31L09o4
4883h5P8k80J49j34L75J29m62K52J27j47k58O0L77k88J56R9j78k31J20N4J08J04
4905A25k34K30r6q2J28k25J81j57j71J17L6LL70nm2j26P0j02L7k60M2J22N8R5
4929A14j3J52l17l9J1j28K07k28J34J17j14q0mK17J04k55J90j11l4L01J50m65
4951i1K47K10l15j4K06l93j3J77k84M20m17L3K29j8Q4O2l25R5L1O8Q6k8p0k40
4975b60J7K85k39K51J52Ll76L62m96K89J25j3k71J92j53K69L3p4O1m12J60K62
4997A67J66l58P9L3j51O8K34r1K49l10r0Pn3K75k42K83l74L7R1pM0j09J34j89
5021a11Q1K74r1M2k00Q3k9J53j73J5j18j42K15M4J83k50J7j33J32q1J47J40l67
$$ plain form
4860 83 -132 58 203 -39 376 403 62 76 283 20 8 -149 -31 56 -286 -7 -170 -227 -137 -199 -330 -21 -85
4883 -85 -7 -287 -138 -272 103 232 -230 22 149 2 -256 -196 181 -107 49 148 -30 -261 -141 -87 21 125
4905 125 -109 121 25 -57 71 -154 27 -130 -301 -184 -148 -145 225 220 178 52 122 20 57 -203 -161 -39 19 114
4929 114 101 253 -64 -103 -92 -220 -13 -241 -107 10 -104 -184 -188 29 133 -122 68 -43 -77 224 374 -91
4951 -91 156 366 51 37 243 -150 -163 14 -270 150 -267 -234 -5 -23 61 123 -202 -107 -76 -8 78 50 -20 -260
4975 -260 -243 42 -197 54 206 209 -167 195 -301 -12 113 100 -171 21 -132 137 170 96 157 -255 -95 167
4997 167 333 -25 54 87 -64 4 238 147 396 86 -4 3 -50 225 -17 266 -108 -71 20 13 53 -56 78 -111
5021 -111 -30 244 153 195 -5 78 49 202 29 44 -74 -216 -1 43 226 -24 -7 -140 -8 -89 58 198 -169
5044a69J1N3J08j90J83k1J18j93L08j54j65J20J88j45l4N7Q3j64n3KJ78j46k0
5067d5J8j33j02Q7J82j38Q9k94j14L21J69M5N5k01J01p8O6M5K51k15J64l66L95
5090C02k09P8Lk90J50o1k01J58k11R4K10j32kJ77k14J51M39o83L46l6l2Rk4K82
5114C04j34l70L69Q2j74j04r7R9J22k30J43j41J11J12Q6k18J61j81k93R8J49O1
5136d5K14j39K44k56J49J23j79J33J17n18K54J03L8r9j71j16K58q6k8L3j14j00
5158a85J76n8J76q4j0J80m29J72L4q0J67K4j2j90K24J02ol29Q3K81l58N3J14k42
5182a97J78j16J96k06lJ15l35L45J3m7l4K33R8k5Lj09m32M76ok20M36j84k32J01
5206D8n2k04L44q9K4l50K34L5q%l9J80L5k91J95k1j95P3J5K35m90M04l6Lj71l7
$$ plain form
5044 -169 -158 -105 3 -187 -4 -25 93 -100 208 54 -111 9 197 52 18 75 158 -6 -59 -57 121 -25 -45
5067 -45 -27 -160 -262 -175 7 -131 -42 -336 -450 -129 40 85 140 -61 40 -38 28 73 324 109 273 -93 302
5090 302 93 171 174 -116 34 -27 -228 -70 -281 -187 23 -109 -111 66 -148 3 442 -241 105 69 37 46 22 304
5114 304 170 -200 169 251 77 -27 -124 -25 97 -133 10 -131 -20 92 178 -40 121 -60 -353 -255 -106 -45
5136 -45 169 30 274 18 167 290 111 244 361 -157 97 200 238 139 -32 -148 110 24 -4 29 -85 -185
5158 -185 -9 -67 109 25 15 195 -234 -62 -28 -108 59 83 71 -119 105 207 201 -128 -45 236 -122 -69 45 -197
5182 -197 -19 -135 61 -145 -148 -33 -368 -23 -10 -57 -91 142 240 215 218 109 -323 153 147 -73 363 179 -53 48
5206 48 -4 -208 136 47 71 -279 -45 -10 -18 -18 -57 123 158 -133 62 41 -154 -81 -66 169 -321 83 47 50 -121 -158
5232a58J90k13K26q7J89l56J77J49J2l5j25K24k31K37l45K37R1j68K40k99J45
5253A00L17j73M8n2m18%K70o4j84J29K07k00L2k5j07J33Q2r1j23J83K5k41J18
5276c4J92m3j88J71Q3m0l2k4k75l4K19k5j19l1J35j76J61M2J48j87R1oP0J1r5
5301A4KP9j77j57M50l00M04k67J90J3k09J76k42J37l97L87j13k5q4k4N8k0K4P7
5325dM2j34J77Q4Pj39l1J41l3K50j96K3p5K1k06J62J51k92K76k79M4p0q3J60M4
5350D0r2n7Q6L15r7l7l44N54n49K19L3K09k90J56n8j79m3M7K53j49j62j15O3P7
5374a20N5j0r8L69l2k76j06Q1K1r2J78P0j35j35K51K0Nj48P4K42k25n3O4J06k74
5399a68o5K15O4J65l57K86l90J93P4L7L5k39J80K13j58j31K04jk15J73m6j55J72
$$ plain form
5232 -158 32 -181 45 -42 147 -209 -32 117 129 94 -31 193 -38 199 -146 91 182 14 254 -45 100
5253 100 417 244 292 240 -178 -178 92 28 -156 -27 180 -20 12 -13 -120 13 95 4 -119 64 89 -152 -34
5276 -34 158 115 -73 98 181 141 109 85 -190 -224 -5 -30 -149 -180 -45 -221 -60 -18 130 -57 34 28 98 109 14
5301 14 16 95 -82 -239 211 -89 315 48 238 251 42 218 -24 113 -284 103 -10 -35 -119 -143 -85 -105 -81 -4
5325 -4 38 -96 81 165 172 33 2 143 110 360 164 187 112 133 -73 89 240 -52 224 -55 -11 -81 -164 -4 40
5350 40 -52 -109 -23 292 195 158 -186 368 -181 38 71 280 -10 146 88 -91 -134 -87 166 17 -145 -260 -197 -120
5374 -120 -65 -75 -173 196 164 -112 -218 -137 -116 -208 -30 40 -95 -230 21 41 46 -102 -28 214 -11 -64 0 106 -168
5399 -168 -233 -18 46 211 -146 140 -250 -57 17 54 89 -150 30 243 85 -46 158 157 -58 115 69 -86 86
5422H6k8l0J29k45K11Mm39L16j73j59L06QJ89R8m72K61k1j01J44km40L53r3J37
5446C9m2J83%j04j53M04k64j04l8N0L3j97K07n1oM2k06K28j70J73K1nj46j28L87
5471A53j55l8K10j72J41p0m5Rj81k39K37J67m9L1p0O0L7j08k0Q6Q9R6n0j30j94
5496b05K03K16k25K6j81K35p9J04j99J14k24K07J29j08N9j49R6k8K83j96j31J14
5518F1q4n9O0m6J09L7K52l27K06m23J65N5P4l91K87m5k7J3NJ82l9n5k24P1K30
5543H7M6j18o9m8K74j82J83j70J56o0l9j47Q2j5j49P3M35n27L42j55P0K4J20j33
5567H0j53J98N1j71J0p5k26R1L10j04J1K29k2m49L74k05M64l31O0j01j14j06J95
5590A6N4q0J71l51K09jJ7r0j3k68M01K2j0k1k44J98p1q9J89N3J54l27R7L4l9J22
$$ plain form
5422 86 58 28 157 -88 123 127 -312 4 -169 -328 -22 -14 175 273 -199 62 41 -60 84 82 -358 -5 -98 39
5446 39 -3 180 180 76 -77 327 63 -41 -79 -29 4 -193 14 -37 -43 -1 -207 21 -149 24 45 40 -106 -234 153
5471 153 -2 -40 170 -2 139 69 24 33 -148 -387 -150 17 -32 -1 -71 -11 26 -82 -102 -16 73 169 119 -11 -205
5496 -205 -2 214 -11 15 -166 69 -10 94 -105 9 -215 -8 121 13 72 -77 19 -9 274 78 -53 61
5518 61 -23 -82 -22 -68 41 78 330 3 209 -214 -49 6 80 -311 -24 -69 -96 -83 -78 104 65 10 -214 -143 87
5543 87 133 15 -54 -102 172 -10 173 3 159 99 60 -87 -5 -20 -169 -96 339 -188 154 -1 69 93 213 80
5567 80 -73 125 176 5 15 -60 -286 -195 115 11 22 251 229 -220 154 -51 413 82 142 41 -73 -179 16
5590 16 70 -10 161 -190 19 18 35 -55 -68 -336 65 87 77 56 -188 10 -61 -150 39 92 246 -81 16 50 11 133
5616A33j14j67m3L6k0J1j19N18j78j07J8o8k19J61r1K44j6O2j94J22PJ54j47R7
5640H0M4J55l04j31kK21k4n9j1pJ26N2k49j21L67j49J19M7k76L10j15m14O42o5
5664B36j11j15M5L8o9n7n3J69J69k27l06J51M4L07l16R3K41j49r5o8J1K26n6L3
5688A41l27L00k27J22K3J45j60j27LJ92j00l5J0Q6J21l71O7J55J6Q9j36J92j45
5711C4JK70l26K20k55Q5o4K70j08J32k23l1J47j05M0j34n4j19J05J60m0p2J75
5734A08r1K8r6l9L00j55j51J01j19R3Q7k4r0k6j0MJ01r7J4r6R6mJ91l05J04K08
5760A32p7nk30K65R6q7o5O7K27k91n1J08j6J3j08K70j06k00J0O5K32j79j24J47
5784I3k03J46j24m7j5Q0K90j87k88J36K86m57N5L46j47j2K34j95K9J31k98n4K00
$$ plain form
5616 133 19 -148 -191 -155 -175 -164 -283 235 57 -50 -32 -100 -319 -158 -249 -5 -21 41 -153 -31 -24 130 -17 80
5640 80 124 279 -25 -156 -158 63 39 -20 -31 -38 88 140 -109 -230 137 -12 107 154 -122 188 73 -341 301 236
5664 236 125 10 55 93 24 -33 -86 83 252 25 -281 -130 -86 221 -95 -2 239 90 -5 -73 -62 164 108 141
5688 141 -186 114 -113 9 32 177 17 -110 -107 85 -15 -50 -40 46 167 -204 -137 18 34 123 -13 179 34
5711 34 35 305 -21 199 -56 29 -35 235 127 259 36 5 152 47 87 -47 -101 -220 -115 45 5 -67 108
5734 108 17 45 -51 -90 210 55 -96 5 -114 -21 66 42 -48 -74 -84 -80 21 -76 -62 -158 -62 -66 125 -180 -76 132
5760 132 55 50 -180 85 181 94 29 96 323 32 -19 89 73 86 -22 248 142 -58 -48 17 249 70 -54 93
5784 93 -110 36 -88 -135 -150 -70 220 33 -255 -119 167 -290 -235 111 -36 -48 186 -9 20 151 -147 -201 -1
5807am8J65j29j61M10j28Mj34j18M06k9k65J55j84J44M0j00n6J25j90J2P7J86
5830A81l62O9Q8J21l31K17J22k66K19K63j45k59j78K64j01J09k78J39J31N7J21
5851A81j79j32J34J77p9m5J49j56k8p4p6J78Lq8J89P2k28Rrr9J08l4k3K12N0l10
5877i8j59N73o2l46J26K20j07k51K62N3j48k12K01j12J65M3l65P9Q6R1j9l40J83
5900a37J31K8jJ9J06j45O6MJ05j4k06K10O2j81j45j46K43K43k84J51L1j68J49
5923A21j04K28l20J78kj4k31L18k89J09J20k39J78K6j30Q2J64l40M04j69j0j07
5945b7N0o2L1j53J13K40l99J41J54k74L2K98k4k10J51j2K9j83M03m54K38R4J38
5968C14j40j26j41O8N2qJ66j83K58j30j14R6q5L4O9l14J74k5N1L7N1N0o5pK1K0
$$ plain form
5807 -1 -49 116 -13 -174 236 108 112 -22 -140 266 237 -28 127 -57 87 127 27 -29 96 -94 -82 -5 181
5830 181 -181 -112 -24 97 -234 -17 105 -161 58 321 176 -83 -261 3 -98 11 -267 -128 3 60 181
5851 181 2 -130 4 181 102 57 206 50 22 -52 -128 50 53 -35 154 226 -2 7 -2 -101 7 -27 -50 162 212 -98
5877 -98 -257 316 254 -92 34 254 147 -104 158 211 63 -149 52 -60 105 148 -217 -138 -52 39 20 -320 -137
5900 -137 -6 22 21 40 146 1 67 71 176 162 -44 166 228 47 -98 -244 -1 242 -42 109 140 -28 121
5923 121 17 245 -75 103 101 87 -144 174 -115 -6 114 -125 53 79 -51 31 195 -145 259 90 80 -27
5945 -27 23 -39 -8 -161 -48 192 -207 -66 88 -186 -154 144 120 -90 61 49 78 -105 298 -156 82 176 314
5968 314 174 48 -93 -25 27 19 185 2 260 130 16 112 27 61 130 -184 -10 -35 16 53 104 154 89 82 103 123
5994A23k55J49J15O0l27K2R9j85K53j55R4J95Jr8o4O0j00K58l59PK17j03n2M01
6018C56n2k4j63j07r7R6Q2q5m9K5lK1K6m1O9k05J38r9j04r2M36n4l7J00m7j24
6044c4Q9J8k63K54j09n3j45J09J17J4l9j19j73pJ92J82J08j17j60J9K21j67Oj5
6068g2K26j94K66k71p7K07J18l19L92k97m0O3R5pk87M8J60j77J08l8K30r7j16
6091g9L4J15J32r2j4J29k60J19l8m6J69Q0k85RJ07j33j4L7J97k28K15j63n6q0
6115a45N7K61j29k34J70Lr5p1K6J78J83j41K19o1j16m4l59M66q6l7m50M67j97
6138a35K69m0J0J31m04m6NL48m54J91J14Mj24o0K83k56Q9K20l53J97N5p6J1J91
6162A70j5j38k30J0J49n1j05k3K36l3J74l8q7P7n9p0J82k11M51n25K24q0J44p7
$$ plain form
5994 123 -132 17 132 192 -135 -113 -14 -199 54 -101 -7 188 189 91 27 87 -13 245 -114 -107 110 7 -45 356
6018 356 304 280 117 10 -87 9 91 6 -43 -18 -21 0 26 -15 54 -151 -13 -112 -216 -308 128 74 37 137 90 -34
6044 -34 55 73 -190 64 -45 -98 -243 -134 -17 -3 -42 -161 -334 -341 -149 33 141 24 -136 -117 104 -63 -57 -72
6068 -72 154 -40 226 -45 -122 85 203 -116 276 -21 -61 2 97 90 -197 -149 11 -166 -58 -96 134 37 -79
6091 -79 -45 70 202 110 96 225 -35 84 46 0 169 249 -36 -27 80 -53 -67 -30 167 -61 154 -9 -65 -145
6115 -145 -88 173 44 -190 -20 -17 -112 -183 -157 21 204 63 282 221 105 61 -298 168 82 45 -405 62 -135
6138 -135 134 94 104 235 -169 -215 -210 138 -316 -125 -11 -7 -131 -191 92 -164 -75 145 -208 -11 44 -32 -21 170
6162 170 155 17 -213 -203 -54 -105 -210 -233 3 -30 144 106 19 96 37 -33 149 -62 389 -136 88 8 152 75
6186G5k33J67j47J51ON6O8k82J40j9J3O9PK6j25J19J12l33J84k28K67J2Lkj34
6211b8J94O2k64J48j64j41K49K10k17k00M7K14l82K3K8M2P7J66K63l67j73J49
6233f4p0O4J18J89k45L23k18K3jk17R0j63k4K64j95j0J79j4K8n7J38k98j02O7
6257a95L14k16JK76j42L8N3M1m59L59R4m8J72m17L95k00l2j71J14J7j3O1k82K67
6281B7r8Q0J28j19r5L60j20q1J31k01j70K56mj53R4k05N6J22P0j74j50K62j70
6304a54K01k3j90M18m41J66J25pj11k2k06K22R6j81K43J11m17J25l9J77j17j04
6326a28L54k03J7j86K01l11J84p1n3J67J08k08K8R6j39M20l47J7L32j50j18kQ8
6349I6k07L39l38J54N6j52j40Q2J44j08M4j90J57J10j21j23K94j86R4J54j39r3
$$ plain form
6186 75 -158 9 -138 13 19 75 143 -139 1 -18 -5 64 71 97 -28 91 203 -130 54 -174 93 105 108 106 -28
6211 -28 166 228 -36 112 -52 -193 56 266 49 -151 -104 110 -272 -249 -221 -179 -102 64 327 -40 -213 -64
6233 -64 -134 -70 48 237 -8 315 97 120 119 -98 -8 -171 -195 69 -126 -136 43 29 57 0 138 -160 -262 -195
6257 -195 119 -97 -96 180 38 76 129 170 -289 70 164 116 288 -129 266 66 34 -137 -23 -6 -19 42 -240 27
6281 27 -71 9 137 18 -77 283 163 82 213 12 -158 98 94 -59 35 -170 -114 8 78 -96 -246 16 -154
6304 -154 47 24 -166 252 -189 -23 102 95 -16 -38 -244 -22 74 -107 136 247 -170 -45 -84 93 -24 -128
6326 -128 226 23 40 -146 55 -256 -72 -143 -196 -29 79 -129 -101 -5 -144 276 -71 -54 278 128 10 8 96
6349 96 -111 228 -110 44 100 -52 -192 -110 34 -74 -30 -220 -63 47 -74 -197 97 -89 5 159 20 -73
6371g3R2Q5k2k18K97k44J4J39J29k25j7J73k08O9p6J21n9r1p4J77qJ17p7j28K12
6396A05j15j57J65L38k55l45K35lK33k78P2p1J06O9j47O5j8P8k88o0K18k1mK16
6420A38j09k14J63J05l2m1M2J2n4m3J69J13l20L15o07K35J97j60R6j70K71o8j69
6443a31K5J88j71%PK05o2J26r6J10k05j1Q5Q6j28l3J41k73k2L93l67J49j33pM7
6468g7l7j97K40J77k25J50o3l5P4j00J70k05L84l56J48L4on3N0k59L49j9k5Jj96
6493g6M25o4n78K68qM8Q1j28P5j51k64L05L67l88j43J15J74j25J40J03l23K11
6515F4q9j40K77p7k4j64J64m6J99j51J77j16j32l7R8n5K33k81L6J68o0P0j98P4
6539a0r6L2j13K85o4m8o4RJ13J70m09K16r4K11j85L8j79J02J10k0P1k14L63k28
$$ plain form
6371 -73 19 104 82 -136 161 -83 -69 70 199 -26 -43 130 -78 -9 -85 36 -23 -114 -188 -11 -19 98 21 -107 105
6396 105 -10 -167 -2 336 81 -264 -29 -32 201 -77 -5 -76 30 99 -48 17 -1 77 -211 -271 -53 -74 -78 138
6420 138 29 -185 -22 83 51 10 52 64 10 -33 136 249 -71 244 -363 -128 69 -91 5 -165 106 38 -131
6443 -131 -106 82 -89 -89 -82 123 61 187 91 201 -4 -15 70 156 28 -5 136 -137 -159 234 -133 16 -117 -124 -77
6468 -77 -114 -311 -71 106 -119 31 -32 -67 7 -93 77 -128 256 -100 48 82 76 23 73 -186 163 144 119 120 -76
6493 -76 349 285 -293 -25 -33 15 96 -32 43 -108 -372 -67 300 -88 -231 -116 58 -67 73 176 -147 64
6515 64 -25 -165 112 35 11 -153 11 -35 164 13 190 74 -58 -95 3 -52 181 -100 -64 104 44 114 -84 -10
6539 -10 -106 -74 -187 98 34 -14 -78 -69 44 214 -195 21 -73 138 -47 -9 -188 -86 24 4 75 -139 224 -4
6563dP0k40K49k38K44o5M4j66KK39j82L1L9r5j76J22J8N2k49K96J01N8J06k25
6587C1r3k2K10K7k96Ll3J34K29L4j08q4j55J52k14J47P8o04O44j33j59M3K40l08
6611b37J28j11j4J72J43k0q8J55k27L9j54K24L20l07M7o8n6Jj97J66o3q1K68m8
6635hQq6J51q8O0j46r7K39Q4m05L91l02J82l8J70q8JJ31QN9j40j02r1K62J6k34
6661f3m4J35k32L08o2Q4m34M03j17j39J15m7j75K73J02j32P1j41j31L33j1k26
6683a30K58r1j83q8J46J73k94P6J16l9J10j6j30M2o9j25L18j39J62oK5M5q8R3
6707A66k62K23j89r9K7R3J18j91j07K67j57m4P4K90k41n1J3J09o2J82l41J69J65
6730A52l31J33j6N4K80n0j08j19J61k08j03J61L03j84J1k49kK99k8m8k5m5J39
$$ plain form
6563 -4 66 -174 75 -163 81 16 60 -106 -104 135 -47 -16 23 -72 -248 -126 -108 -56 -305 -9 92 150 256 31
6587 31 -62 -84 126 153 -143 -140 -173 -39 190 224 116 32 -123 29 -185 -38 40 -564 80 -53 -212 -169 71 -237
6611 -237 -109 -220 -234 -62 81 61 -27 128 -99 -60 -214 10 330 23 70 2 -54 -53 -250 -84 -147 -228 40 -8
6635 -8 0 -86 65 -23 37 -109 -206 33 117 -288 103 -199 -17 -55 115 27 28 159 167 226 86 -16 -107 155 171 -63
6661 -63 -107 28 -204 104 42 126 -308 95 -22 -161 -46 -93 -268 5 107 -25 46 -95 -226 107 96 -130
6683 -130 128 37 -146 -234 -88 85 -209 -133 -17 -56 54 38 -92 -50 -119 -244 74 -65 97 91 116 161 73 166
6707 166 -96 127 -62 -161 -134 -41 77 -114 -221 46 -111 -155 -81 209 -32 -83 -70 39 -23 159 -182 -13 152
6730 152 -179 -46 -62 -8 272 222 114 -5 156 -52 -155 6 309 125 136 -113 -115 184 156 108 83 38 177
6753A77q2r9K02k07%j76J47Pp6J32l7k72L39J11k62K0J66J39j97qj62l0k8R4P3
6778b9k73K64k17P0K23JR9m7N1k12O0J60o3j2k10K18j59O5m8J73q7O5k0n2j20
6803a00J09Q5k63M01l60K88l4M3r4j49P5K47l94j0N5j45J91K64k07k9q9K52m6
6826I0q1p0j69J95k46K07K42j02j67L07k00o5P3j74M15j62j73j16J37k1M7P2j25
6849h6K56k31K18j49q6j29M17j94j36M4p1n7K86P6l2j82J12J43j41pj12J68m8
6872E9Rn7m8O7M6l16M3P2L4m2q0J36Q8j1qJ8J50l14K12j23N1m1M8J17k28K07k19
6899a30K17O9j61j35J39p8l53L93p0L25j16M7N4k26mk3j53K44r5J3J80j89j52
6922b04K22p6n1l1l6K3K62K2k75L96l77L07j41k45P6J93k19J75R2j16r9k28K61
$$ plain form
6753 177 95 -4 198 -9 -9 -185 -38 -31 -107 25 -12 -284 55 166 -96 -76 90 229 32 24 -138 -168 -196 -102 -29
6778 -29 -302 -38 -255 -185 38 39 138 91 142 -70 -10 150 87 75 -135 83 -76 -11 -59 114 27 92 72 20 -100
6803 -100 9 94 -169 232 -128 160 126 169 75 -74 1 248 -146 -156 -101 -246 -55 209 2 -27 -116 136 90
6826 90 9 -61 -230 -35 -281 -74 168 66 -101 206 6 -59 14 -160 255 93 -80 -196 -59 -80 -33 39 -86
6849 -86 170 -61 157 8 -78 -207 210 16 -120 -76 -147 -204 82 158 126 -56 56 199 58 51 -61 107 59
6872 59 68 11 -37 30 76 -240 -197 -125 -91 -133 -213 -77 11 0 -8 10 160 -154 58 -65 -14 -55 -7 110 -118 89 -130
6899 -130 87 156 -5 -140 -1 -79 -432 -39 -109 216 100 147 201 -25 -29 -52 -205 39 -56 -43 137 -52 -204
6922 -204 18 -58 -109 -140 -176 -153 109 131 -144 252 -125 182 41 -204 -128 65 -154 21 113 -3 -102 -330 -69
6945f9qP4j56K19Lj78P9k00L35k96K90P9k88Q8j05Q8K9m2K25k43o7K53j99O5l3
6970e7J00L9r4m8R5j75L58k57K97m04L42j68J51j04n8n7o5J05MK56l04j5l9l3
6994a31J44j70J89J3O5k0n5L41k33O2j04J54k40M7J16k65N6OOo4R1j85K34j08
7018e1K24m15M23J92l81J2k44O5K80l12P7L17j29j31J05L0J4k79J87R1k7j99J85
7041C4k04J19J12p8J23l09K10J03k81J74k4J36l91K85ol7rJ9J94jm35M52o4k18
7065i6J64j26J96p6O5j60J59j32m0Q7M9l7j03q7M65j69l75K43j35O8p6M36m47
7088a27K08p6L5J19j95k1j71K48P2k18K99k74r0M44l64P3K23j72J51J07j49L7
7110A59m47K89j17j30L48J80j02k07n0j2J95J08j18k06J56j73J31L07j57J2l25
$$ plain form
6945 -69 -77 -3 -159 60 63 -115 -36 -236 99 -197 93 172 -116 -28 -133 -45 -16 -58 167 -76 -143 110 -89 -24 -57
6970 -57 43 82 -12 -60 35 -140 218 -39 258 -146 196 28 179 75 17 -40 -105 0 4 260 -44 -59 -98 -131
6994 -131 13 -157 32 45 110 90 35 376 143 205 101 255 15 62 178 -87 -31 -25 -19 -83 8 -177 57 -51
7018 -51 173 -242 181 373 -8 4 -240 -175 105 -207 -130 187 58 -73 32 62 76 -203 -16 75 48 -151 34
7041 34 -170 -51 61 -17 106 -203 7 110 -171 3 -21 115 -276 9 3 -34 -43 -24 170 169 -266 186 122 -96
7065 -96 68 -58 138 62 127 -33 126 -6 -46 41 90 53 -50 -137 328 159 -216 27 -108 -40 -116 320 -127
7088 -127 81 5 40 159 -36 -57 -228 20 92 -126 173 -101 -191 253 -111 -38 185 13 164 271 122 159
7110 159 -288 1 -116 -246 102 282 180 -27 -77 -89 106 214 96 -110 46 -127 4 311 154 166 -159
7131a59L33j90j6K81l78k0L08r4k99K83K09j59k55J59J54k14j0J69k71L00j04
7152B7j67K24j11K06j28q6J36K5j67n7L6J84o5k52J86K20n2j7j73n7K91j66q3
7175d6Nl5J96j47k40M80j19j16O5N1n37J93M1K09Q0q8J03n7L2J35O2k07j1mq6
7200d1O5l7J30k27J34K74j66m4J21j88J46j11K6k29L3NJ69o1n2J32j5K29l55k03
7224b65J52L3q4J28K61k15mk5k92K58r8J16L8P9o9J3j39j82N12m17J27J01Q0%
7248A08L18k38j94J45P7j99KMo6q4J1k5L67l86L57j9o1n7J23j69Q7Qk89J79J28
7273A27j84L4Qo3M0r4l9L63k29m2J59Pj64j0J34J31j92J5J1l42L26k44J47j40
7297b41L01k36K49k37M8J72j63J3K52j44j50K75k08J5n7J08j82K05k09K04N7l28
$$ plain form
7131 -159 174 -16 -32 249 -129 -149 159 65 -234 49 258 99 -156 3 157 -57 -67 102 -169 131 27
7152 27 -140 84 -27 179 51 -35 101 126 -41 -98 -62 122 57 -195 -9 211 159 142 -31 -88 203 37 -46
7175 -46 -41 -76 120 -27 -267 213 94 -22 43 94 -443 -250 -209 0 80 -8 95 38 70 205 267 60 49 45 -41
7200 -41 24 -13 117 -110 24 298 132 88 209 21 167 56 82 -147 -114 -109 60 -1 -53 79 64 293 -62 -265
7224 -265 -113 -80 -164 -36 225 10 6 -19 -311 -53 -151 -35 3 82 13 26 -113 -295 217 -200 -73 28 108 108
7248 108 426 188 -6 139 216 17 19 23 -43 -127 -116 -141 226 -160 197 178 117 60 183 14 101 109 -180 -1 127
7273 127 -57 -23 -15 -78 -38 -132 -171 192 -37 -79 80 87 -77 -87 47 178 -14 1 12 -330 -4 -248 -101 -241
7297 -241 60 -176 73 -164 -116 56 -107 -94 158 14 -136 139 -69 -54 -111 -3 -185 20 -189 15 72 -256
7319b56L16m6n5j11L3K60k18K3N0J23l00K96ln3k35K14M6j62J53j80O9m0r4K5
7343a45J50j09RK19k25k04K87Q9L3o0p0J30j77M7j5J49q7J56p8j08K26k39o2J72
7367H8j44K3L07n24J88J32J48j89j6p7q4J42j74J23J11l3n4q2K03j24OJ94k59
7390i5J36j69O0R9k93K13o9L26j25k26R0k0J96N6l64L60J05k08k54n3K26k95J54
7413a50J98j68K94l31L21m1k26J31Ln5K87o5l51K14K1R7J8k68J24j20K23j11j49
7436a04J14K22k21K32l05R7p8J31J1k01J84k94L26j34j41K15n8J4P1k90J3K96
7458A00j63J13R9Jk37J9j44K20M4j05K84k21j55k6N2M97k88j67J79L4j47RO5L6
7482I9j58L3P6j7p9J50k27J21J70j96J3J18J16m76O4J46K65l12J13R6k42K61o3
$$ plain form
7319 -256 60 14 -41 -152 -119 141 -77 -54 -4 119 -181 115 112 59 -176 38 84 -78 75 -105 -36 -76 -170 -145
7343 -145 5 -104 -95 124 -101 -305 -18 71 104 44 -26 104 -73 -26 -41 108 21 177 99 -9 217 -22 -84 88
7367 88 -56 -33 274 -250 -62 70 218 29 13 -64 -148 -6 -180 -57 54 21 -33 -115 88 -36 -30 164 -95
7390 -95 41 -128 -68 31 -262 -49 -118 208 83 -143 -53 -73 123 179 -185 175 280 72 -182 -235 -9 -304 -150
7413 -150 48 -120 174 -157 164 123 -103 28 31 -24 263 198 -153 61 82 179 197 -71 53 -67 156 45 -104
7436 -104 10 232 11 243 -62 35 -43 88 99 -102 82 -212 114 -20 -161 54 -4 10 81 -209 -196 100
7458 100 -63 50 149 150 -87 -68 -212 8 52 -53 231 10 -145 -171 -119 378 90 -77 102 136 -11 -2 63 99
7482 99 -59 -26 50 33 -46 104 -123 -2 168 -28 -15 103 219 -257 -193 -47 218 -94 19 115 -127 134 71
7505G1k30mL20j90L3R0k81K54k24M90j73l35K52l04K87j43J94q2j20L5n4M7Q9
7528B2j69J87j88J16j30Q5K6%k2J7l5R8j8r7L62k14k70M98k06j13L51m44N0J55
7552F1j9K8j10j10J75%l69J97J27K3LQ7j92k8K93j42j78J78J87l30R0Nj6J52p3
7577C9O9n8p1j21J37L6J21j37Q6Q7j97K6K60j80j22P4J36j54r1JK0k31Q7K43m4
7602A6N8o9o8K7J61r6r8R7O8j33j56K18k12n1L62j08k84L11j2O7j91J8J63N4j17
7627B5j31K09J79k00QoJ33k14L49m59p2P9L68m44K27R1p8J0q8KJ78K4l10m3K24
7652F1j13J02J07j79n9PJ31J20k23M7J46j74J81j96P7O5j80P7N9j74J17j65K98
7675A32m78L97Kk25R3j2N6n3M34m87L18k44l8R8J18k22J68K6p9j57O1K07Lk11
$$ plain form
7505 71 -159 -163 157 -33 0 90 -191 63 -161 329 156 -179 73 -231 56 -87 107 25 -95 -60 -114 -67 22
7528 22 -147 40 -148 -32 -162 -77 -51 -51 -73 -56 -91 7 -11 -108 254 40 -230 268 62 -51 300 -144 -94 61
7552 61 42 70 -40 -150 25 25 -344 -147 -20 3 6 93 -99 -127 166 24 -154 24 211 -119 -29 -24 -40 112 39
7577 39 108 50 -21 -142 -5 31 152 15 101 188 -9 17 277 97 -25 49 185 31 -60 -59 -39 -270 -183 60 16
7602 16 74 5 -63 -36 125 29 -69 28 96 -37 -193 25 -187 -238 124 16 -268 43 31 98 -93 -75 88 142 25
7627 25 -106 103 282 82 90 84 217 3 352 -107 -179 -100 268 -176 51 142 64 74 -14 -12 166 190 -120 -163 61
7652 61 -52 50 157 -22 -81 -74 57 177 -46 1 147 -27 154 -42 35 100 -80 -3 56 -118 -1 -166 132
7675 132 -346 51 53 -172 -79 -91 -35 -88 346 -141 177 -67 -105 -7 111 -111 57 83 4 -153 -92 115 118 -93
7699i3J47j68J48j41K41Q1l24K24k77J03K1M4n6j73R4K0j37J28n7k6K17J8M6j31
7723e1J09Kj9p7J93k24J29q0j60K25J00k83J09J23p0J61j48m3J36Ml5Q8j59j39
7747a09K99o1K06l06k97J16J94m30L84O9m0l25L15J02l23R3%R0K67j64k8M0k0
7770G2J71j01j46J62l3q7K74l62K1L29j54j00J67l35J14l2L6o5J67l18M14k93
7792i9K38l91J21j4p9K41J55o0j02j3K07l71K46%j41j32K30K9j07Q6r2j04j93
7815c45J90P1R1p5J88p9N8k27Q3p1q6L76n8J9j68o9K58j33q6M14l49K3p6K7J29
7840A05o0k29K11j11M4L59l88K40k2j2l97J50K06q7R4k0O5j70o1j20J46K42j43
7863D2k32K99j5J1l16N8J01m0n7R7J01l5j52J35J18O1k61J41Q2j39J28j7k93L66
$$ plain form
7699 -93 54 -114 34 -107 134 215 -109 115 -162 -59 -38 6 -50 -223 -129 -109 -246 -118 -175 -201 16 34 80 -51
7723 -51 58 60 41 -36 157 -67 62 -18 -178 47 147 -136 -27 96 26 187 39 -4 132 136 101 189 30 -109
7747 -109 190 129 335 29 -268 -152 42 -388 -4 65 25 -300 15 117 -206 -113 -113 -23 244 80 52 92 72
7770 72 243 142 -4 158 125 38 312 -50 -29 300 146 46 213 -122 -8 -40 -4 -69 98 -220 194 -99
7792 -99 139 -252 -131 -145 -224 17 172 112 10 -3 204 -167 79 79 -62 -194 36 65 -42 44 -48 -152 -345
7815 -345 -155 -84 7 -68 120 41 99 -128 -45 -116 -202 174 116 135 -33 -102 156 23 -63 351 2 25 -51 -24 105
7840 105 45 -184 27 -84 -40 319 -69 171 149 137 -260 -110 96 9 103 83 148 -22 -83 -203 -57 185 42
7863 42 -190 109 94 105 -211 -153 -52 -92 -149 -52 49 14 -138 -3 115 176 -85 56 138 -1 127 110 -183 183
7887A83j51J32P9k72l46M52N2k34L70l57q0L33j74J28j13M2J51pj25j64l8J70
7909C1p0J19j76J71Oo2r8R2p0M5j7R6p8J73o2k98J79m8J39M0j2j41j17R4J12K9
7935G7l38J79k4K10R5k97J56P3O8j77j13J14J48j16K97m08J50j6R2m51J67J27
7957A3lpk06L55j78K3J59m60M52j76q2K69j31%j0j7l2K31j18q7j67J25j34K21
7981D0M0j48O4j05M35p0j90k30O4K95k58J02J22m54K42N7J08q6n9K23j58l4r5
8004i5J34J29j67k2l5J39j86K34k02p8p9L10k49L61l29K53K03l64k07J77M5j40
8026a68n7J40Q4J05k50q0R3jL7j55J35K10J32j23l98L01J56o2j28K6J20J10m15
8049a88K02K2J66l61j3L79m05K42l15K73k57N9K60J13j62o0J00P4m17R1J69k6
$$ plain form
7887 183 32 164 243 -29 -375 77 129 -105 265 -92 -172 161 -13 115 2 44 195 188 63 -101 -139 31
7909 31 -39 80 -96 75 81 19 -79 13 -57 -12 -29 67 -11 162 100 -198 -19 -67 72 112 100 -41 -158 -64 48 77
7935 77 -261 -82 -106 104 199 -98 58 131 199 22 -91 23 171 55 352 -56 94 78 170 -281 -114 13
7957 13 10 3 -203 152 -26 -3 156 -304 148 -28 -110 159 28 28 18 1 -31 200 82 -5 -172 -47 -181 40
7981 40 80 -68 -4 -109 326 256 66 -164 -100 195 -63 39 161 -293 -51 6 114 28 -31 192 34 0 -95
8004 -95 39 168 1 -21 -56 83 -103 131 -71 -149 -228 82 -167 194 -135 118 321 -43 -250 -73 -28 -168
8026 -168 -225 -85 -1 104 -146 -226 -133 -134 -97 -252 -117 93 225 102 -296 5 161 99 -29 -3 117 227 -188
8049 -188 14 36 202 -159 -172 207 -198 44 -271 2 -255 -196 64 177 15 -45 55 129 -288 -197 -28 -54
8071e4L7J40l51K32j90J62P5Q7j41J7J76mj81K23l10K8J86l14R4K57j53L76n44
8094a52L49l2o9j87J26k2r6K07j97K69R6l36J95k48J67n7k00K50j41P0k38K56
8116A0Q3O9k98J88K3O5k25k2L26l26Jk0L5J14K7j9J23r1oj05m5n0J81j9k3j00
8142a04J23R1q7K7pm9J58o7j87J60j35J04K32l53M4L4j20OK38M4l56rJ66j41L56
8167A68q8l6K8J5k1j33J16k91J08JK56q6J60k69J11r2M37l58J1j55K20j68J5J28
$$ plain form
8071 -54 -17 123 -228 4 -186 -24 51 138 -3 14 190 186 5 228 -82 -54 132 -182 -88 169 16 392 -152
8094 -152 197 165 96 -91 35 13 -83 124 -73 196 292 -44 151 -97 70 13 -187 63 -78 -8 -246 10
8116 10 93 162 -136 52 75 140 -85 -107 219 -107 -106 -126 -91 23 50 31 154 63 57 -48 -93 -143 38 19 -4 -104
8142 -104 19 110 23 50 43 -6 152 85 -102 58 -77 27 259 -94 -50 -16 -136 -130 108 152 -204 -213 -47 -188 168
8167 168 80 44 72 87 66 -67 49 -242 -134 -133 123 37 197 -72 39 -53 384 26 37 -118 102 -66 -51 77
8191G7
$$ Imaginary data points
##PAGE= N=2
##DATA TABLE= (X++(I..I)), XYDATA
0@%%%%%%%%%%%%%%%%L2o4O4o4O4o4R6j28J28j60J92k24K56k88L21l53M16m80N44
35B88o08O73p59Q55r54J058j168J296j443J600j765J949k148K370k613K875l169
52a663L492l850M257m709N224n820O512p318Q283r470J0956j2888J5519j9322
66a0797K5335l6334O2933k41958l50036L77154L08274K2117j38065M8938N7054
77A24615p2810r4334J28530J69625n3901k37347p1473J31224P6606j18319j10046
88a27630K0256O1475J2448L3917M7958l5288j19515l5418R8897R3551k4470m5026
100a8845L0872K5982p5565o1200Q2737J07270m4774q8769P0274J39986m9254j99773
112h1059m9458J76537J32119q5300j23761K7728N1912j02032j24249P9774J77107
$$ plain form
0 0 0 0 0 0 0 0 0 0 0 0 0 0 0 0 0 0 32 -32 32 -32 32 -32 64 -64 64 -96 96 -128 128 -160 161 -192 224 -256 288
35 288 -320 353 -406 449 -505 553 -615 681 -762 838 -927 1022 -1126 1244 -1369 1506 -1663
52 -1663 1829 -2021 2236 -2473 2751 -3069 3443 -3875 4408 -5062 5894 -6994 8525 -10797
66 -10797 14538 -21796 41137 -200821 -550857 -173703 134571 156688 18623 67561 124615
77 124615 51805 -42529 86001 255626 201725 -35622 -107095 24129 100735 -17584 -127630
88 -127630 -107374 -45899 -33451 466 48424 13136 -106379 -141797 -42900 50651 26181 -18845
100 -18845 12027 38009 -37556 -98756 -16019 91251 46477 -42292 27982 167968 118714 -81059
112 -81059 -130517 46020 178139 92839 -30922 -3194 48718 -53314 -177563 -97789 79318
123G9318n499j65093n1600J13464N7525q2523m6333R9643J08226j9427p0692j010
135A5999K4486l5215l3876N8862P4572l3974r2030k4243K5601j2511k1816M1092
147a3053N2011k9361o1979K2400P6380j0535r6972j6972J12497P2432p3648q2202
159d9002L6228M5749o6108p0638P5025J28498j3435j29047m5340Q4108N1080n8331
171a1213l3422Q3850P1910o4778j04044K772O2247M21l3992K6038N0596k5764
183B4621p9990k0302N9152M4748j1831q310K3753q33l9748o070M4131O104n7753
196b2328k1831N7830L7645n1877o1409J2901L6117j6472k2472N4201P4675k6724
208E0256j00051j9340R1001N7805m3053l7208L8306K6617n7037o0469K5481N6804
$$ plain form
123 79318 73819 -91274 -142874 -29410 28115 -54408 -100741 -1098 107128 87701 17009 15999
135 15999 40485 5270 -28606 30256 104828 70854 -21176 -45419 -19818 -32329 -54145 -13053
147 -13053 38958 9597 -52382 -29982 46398 35863 -61109 -78081 34416 106848 33200 -49002
159 -49002 -12774 32975 -33133 -103771 -28746 99752 86317 -42730 -88070 -3962 47118 -11213
171 -11213 -44635 39215 111125 46347 -57697 -54925 7322 7743 -26249 -211 50385 24621
183 24621 -55369 -75671 -16519 28229 16398 8088 31841 31008 -8740 -14810 29321 35425 -22328
196 -22328 -44159 13671 51316 -561 -61970 -49069 -12952 -29424 -51896 2305 76980 50256
208 50256 -49795 -69135 21866 79671 36618 -590 37716 64333 7296 -53173 -27692 29112
220B9112j1491n3915Q64M9329J6o0727k2705N0876M1425j3156j0952K2693J628
233B2997m1185j9666L7277L8247j2589k9210N019J5689j8769k6474J9181L9339
245B9856o590l1863J2655L9175j3601n6806j0957M7322K5353l2261k7656J8435
257f938J1323l9890l5378L5860O0369l638m7813k150M2536J0422k9753j722M0729
270C3957K0105k5850k1300J3733Q680k9968l0463J7735L4532q158l5980q626J3760
283a7843m991j2287K0216L3511j481k8143n605K3385J0590j7908q139K1103J3829
296B6237k0005j8727J5532J3553k3736k2323K5318L9349m414l4981j1670J7813
308A946Q403j2607j161J9975L783l1981k5208J6301K4021j0041k0456P890K0081
$$ plain form
220 29112 17621 -36294 -35430 13899 13915 -46812 -69517 -18641 22784 9628 -1324 21369 22997
233 22997 -18188 -37854 -577 37670 25081 -4129 890 16579 -2190 -28664 -9483 29856
245 29856 23266 -8597 4058 43233 29632 -27174 -38131 9191 34544 2283 -25373 -6938
257 -6938 4385 -35505 -70883 -35023 25346 21708 -26105 -28255 14281 24703 -5050 -6772 33957
270 33957 54062 28212 6912 20645 29325 -643 -31106 -13371 21161 13003 -22977 -31603 -17843
283 -17843 -22834 -35121 -14905 18606 17125 -11018 -16623 6762 17352 -556 -8695 12408 26237
296 26237 6232 -12495 3037 16590 -7146 -29469 -4151 35198 30784 -4197 -15867 1946
308 1946 10349 -2258 -3419 16556 20339 -11642 -36850 -20549 3472 -6569 -27025 -19135 946
321I46n08j0486P151J5182j944j1176P991K6781Q725k4313k4031L070J0052n167
335B273m197Q497k533k5988j6834J5145K3446J206j3199j555J2130N843n650K550
349A134J3395n7j8169m366K1505J2080j7159k1676Q4J2047N287O55M230J791j0159
364F22j3003M465J9896P869j4570j3338L445L551p624m363M573J113p417l244
378a8025Q048J0245N54p259N43J2795R804n00o33L665k899r480j725N864r8q986
394A913q600j926N03l333m901N38O973M069l352q20N680M344p57J456M263K44
410F294k799j005R81N02n72l607j996L345M980p63k614J200O04j244J602L066
426G974l80m406o115m292J101K901k226q109k982L348K930J791L852K295q77J684
$$ plain form
321 946 438 -10048 -2897 12285 10341 -835 7156 33937 42662 18349 -5682 -2612 7440 2273
335 2273 -1924 6573 4040 -21948 -38782 -23637 -191 1015 -12184 -13739 -1609 4234 -1416 1134
349 1134 14529 14472 -3697 -8063 13442 25522 8363 -13313 -13229 -1182 4105 4760 8990 10781 622
364 622 -12381 -7916 11980 19849 5279 -8059 -4614 -1063 -8687 -13050 -8477 -7364 -14781 -18025
378 -18025 -9977 268 822 -6437 -5894 6901 16705 16205 15572 19237 16338 6858 5133 10997 10899 1913
394 1913 -6687 -8613 -8110 -11443 -16344 -15806 -8833 -4764 -8116 -8936 -3256 1088 331 1787 6050 6294
410 6294 3495 2490 3471 3973 3401 -206 -2202 1143 6123 5360 2746 3946 4550 3306 4908 7974
426 7974 7594 3188 -2927 -7219 -6118 -3217 -5443 -13552 -16534 -13186 -10256 -8465 -4613 -2318 -3195 -1511
442a511O892Q291L477l947n996N45N994L88p470m878j196n044n290L151N351k756
458c999q405k982O886R879K278n604j527L598P14j280N367M756p739j1537K729
473f866J1528K757q239n893L983N975M66j073M629L464p449q067O807J1350l998
488I374j4337l721N590L84n546l23N516m11p268r45J2161R535p436r450P186J2960
504A3269j770r942Q67N161n127r126K589R120k162j2332m750J0972Q599o026o529
519g187Q476Q305n962o461R560R208q825j3456K814J1594j030j3335n595P399
533d495L244q565l309J1677N909j1060o549J3603J2764p248j0722N703J1088l585
547H455j0416J901J0383k012j4841j844J4632N783j5038q840J1899R595q585q382
$$ plain form
442 -1511 5381 13672 17149 13202 7206 7751 13745 14133 6663 1785 589 -4455 -9745 -6594 -1243 -3999
458 -3999 -12404 -15386 -8500 1379 3657 -1947 -3474 124 838 -442 4925 9681 1942 -9595 -6866
473 -6866 4662 7419 -820 -6713 -2730 3245 3711 2638 7267 10731 3282 -4785 2022 13372 9374
488 9374 -4963 -8684 -3094 -2710 -8256 -8579 -3063 -3474 -10742 -11687 474 10009 2573 -6877 309 13269
504 13269 11499 1557 2424 7585 2458 -6668 -4079 5041 2879 -9453 -14203 -3231 5368 -658 -7187
519 -7187 1289 9594 3632 -2829 6731 15939 7114 -6342 -3528 8066 7036 -6299 -11894 -4495
533 -4495 -1251 -9816 -13125 -1448 4461 -6599 -13148 455 13219 5971 -4751 952 12040 8455
547 8455 -1961 -60 10323 8311 -6530 -8374 6258 12041 -2997 -11837 62 9657 1072 -7310
561g310P843O417r496r969P547J2565o276j7394j042J6995N266j2509m201J3831
575B267O184j0222k489J6233Q653j2160j1144R055J3815o006j6322k295J0119
588E688k713j4216q0J2756k901j8771k766J9644J0646j2526j0746J0421J3314
601G750l393q199O756J1003o072j3290O607J7089l954k1002l498J8012P217j2908
615B118q116Q550L792j1225o694J3204J0795j3114j8476N969J9108k538j7710
628a4337j128J4709K684j0244K618J4817O17j5964l603K0845J5231j1865j8318
641c938L966J3350m857j2655M816J0791j0550j8476L067J8267K22j8238n756J6104
655c887J1471q927q060R166Q159j0739p364J6294J6520j2812k2031L170J8708
$$ plain form
561 -7310 533 6950 -2546 -12515 -4968 7597 1321 -16073 -17115 -120 5146 -7363 -11564 2267
575 2267 8451 -1771 -4260 11973 20626 8466 -2678 6377 20192 14186 -2136 -4431 5688
588 5688 2975 -11241 -11321 1435 -1466 -20237 -23003 -3359 7287 -5239 -15985 -5564 7750
601 7750 4357 -3842 2914 13917 7845 -5445 1162 18251 14297 -6705 -10203 7809 15026 2118
615 2118 -5998 2552 6344 -4881 -11575 1629 12424 -690 -19166 -13197 5911 3373 -14337
628 -14337 -15465 -756 1928 -8316 -5698 9119 9736 -6228 -9831 11014 26245 14380 -3938
641 -3938 28 13378 8521 -4134 682 11473 923 -17553 -14486 3781 4003 -14235 -19991 -3887
655 -3887 7584 -1343 -9403 -237 7922 -2817 -10181 6113 22633 9821 -12210 -9040 9668
668I668J534j4287k201J1825J197j3569l916J4868P077j6125j0708J4819J5361
681A5543j0939j7615M167J2421m364j0354P044J4750m446j8844k423J8253R432
694A2625j1847o957J3650P763j4202j0952J1357J1795r767j2167Q297J2177r905
707A867j8021K445J8773L716j5571m221J5781N700j5297p465J5628J0441j2247
720A529j0238J1207J2225j0275j7557K182J5908K209j0910n57J1081k454j7118
733a2768j363J9674J0220j2690j0295Q188P170q845q670Q536J1097o434j2316
746h496M451J2445m690j7048J243J8699N236j2876m702J1529J292j4884n007J6969
760D161J3285j1237j6822L842J3080m047j3880L881J6905L29j5438k567J3148
$$ plain form
668 9668 11202 -3085 -5286 6539 7736 -5833 -9749 5119 12196 -3929 -14637 182 15543
681 15543 4604 -13011 -8844 3577 -787 -11141 -4097 10653 6207 -12637 -15060 3193 12625
694 12625 778 -6179 7471 15234 1032 -9920 1437 13232 3465 -8702 -405 11772 1867
707 1867 -16154 -13709 5064 8780 -6791 -11012 4769 10469 -4828 -12293 3335 13776 1529
720 1529 -8709 2498 14723 4448 -13109 -10927 4981 7190 -3720 -4277 6804 4350 -12768
733 -12768 -14131 5543 15763 3073 -7222 966 8136 -709 -9379 -843 10254 3820 -8496
746 -8496 -4045 8400 3710 -13338 -12095 6604 11840 -1036 -5738 5791 7083 -7801 -12808 4161
760 4161 17446 6209 -10613 -6771 6309 2262 -11618 -7737 9168 9497 -5941 -8508 4640
773D640K339j3415m136J5086J0339q999j2649L180P527n405p973Q183J3224n586
787F355j5326M54J2370k48j0682J477J3472L279j1283o342P419L490j0341m711
801a0617J5003J2813j2292j9414K255J4888J031q960L505J1914k585j5140k952
814a0551J4426Q098j1164j0097J0142J2196o897j3358P38P365l216n647Q753J1708
828A2496n732j7188m634J1950R041k937j755N158r70j1689l831J2405Q340r059
842A595p925P792Q671p312j2066K909J0363o33q234K956J1383j237j7048o726
856a5512J3837J1265p239q111O254O826q751j0647N141J2983J781p861q12P572
870F726j069j2120l102J2036R345o092o984K025J95p753k995R031P653m682q381
$$ plain form
773 4640 6979 -6436 -10572 4514 14853 5854 -6795 -3615 3912 -1493 -9466 -1283 11941 6355
787 6355 -8971 -8517 3853 3605 -7077 -5600 7872 11151 -132 -6474 945 4435 -5906 -10617
801 -10617 4386 17199 4907 -14507 -12252 2636 3667 -5293 -1788 10126 7541 -7599 -10551
814 -10551 3875 11973 809 -9288 854 13050 6153 -7205 -6467 898 -2318 -7965 788 12496
828 12496 6764 -10424 -15058 -3108 5933 2996 1241 6399 5429 -6260 -10091 2314 10654 1595
842 1595 -6330 1462 10133 2821 -9245 -6336 4027 3394 -4840 -1884 9499 8262 -8786 -15512
856 -15512 -1675 9590 2351 -5760 494 7320 -1431 -12078 -6937 6046 7827 -34 -846 6726
870 6726 5657 -6463 -9565 2471 11816 5724 -1260 765 960 -6793 -9788 -757 6896 2214 -6167
885f167J396N831k045o473L007R759M20q349J578J0250j539j3843m014J2753J0649
900A3213n239r106K98L180o276p250P285J4089q46j4613o139Q123M129n055j492
915e699P505M174n616m623L875M543l951n057M725R737M70p974l569J494k202
930b168k860O050Q418k798j1087n077N006L806l388j036O268L901o964o981N198
945c712P831k388p047M547J0189J99r019m126N007K916l644j641N927L985p129
960A895r553P55O014k99k549L077M205m012p775p75N909M389j9N10K299r67m647
977a543r93N677L953l406l410M265L098n517o013P87L321j064k017K631L915l681
993Cr559k914Q413Q253j466m901J006K273k488j267M427M659j737m340J222M144
$$ plain form
885 -6167 -4771 1060 -985 -7458 -4451 5308 5728 -2621 -1043 9207 7668 -6175 -10189 2564 13213
900 13213 7974 -1132 -834 2346 -3930 -11180 -3895 10194 9348 -5265 -11404 -3281 848 -4207 -5699
915 -5699 1806 5980 364 -4259 -384 4159 208 -4849 -124 9613 10083 2109 -1460 34 -2168
930 -2168 -5028 1022 9440 6642 -4445 -9522 -4516 -710 -4098 -5134 1134 5035 -1929 -8910 -3712
945 -3712 4119 1731 -5316 -769 9420 9619 600 -3526 1481 4397 753 -888 5039 9024 1895
960 1895 -7658 -6903 -889 -1188 -3737 -660 3545 -467 -8242 -9017 -3108 1281 1262 1772 4071 3104 -1543
977 -1543 -2536 3141 7094 3688 278 4543 7641 2124 -3889 -3102 219 -845 -2862 -231 3684 3
993 3 -9556 -12470 -4057 4196 2730 -2171 -1165 1108 -1380 -2647 1780 6439 4702 362 1584 5728
1009E728P16n805m974J937N022J086j078q03m682o400P0O882N824j677m317k449
1025d920N15J226J812L292J986j895l222K801N911p95o785k815M861M903o57l133
1041C085k967k413k726q95L758M670j738o399l232L598L850m31q36J839J811O86
1057A660J353R63j226j801p2K951L732J02m181m450j224J09J543J936M57l715
1073a863l673r0K021J171j035j26J251J827K14p84N67J028m32k05K822L914m86
1090F121l206k026J71J273J532J38j373r59j692k744j563J052Q89l18p81k17p73
1107d476j0O45O37J467K219J438j85K98J642k1o70K3O89P28N51j359k518j890
1125g92r27o06M05J094K74j975j675n40L86J351K349J186j198n06L69J344P59
$$ plain form
1009 5728 6444 639 -4335 -2398 2624 3710 2632 1829 -2853 -9253 -9183 -2301 3523 1846 -2471 -4920
1025 -4920 -4405 -3179 -1367 1925 3911 2016 -1206 1595 7506 6711 -74 -2889 1972 6875 6218 3085
1041 3085 118 -2295 -5021 -5916 -2158 2512 774 -5625 -8857 -5259 -1409 -1840 -2676 -837 974 1660
1057 1660 3013 3976 2750 949 877 3828 7560 7662 3481 -969 -2193 -2084 -541 1395 1852 -1863
1073 -1863 -5536 -5626 -3605 -2434 -3469 -3595 -2344 -517 -303 -1087 -520 508 76 -129 2693 6607 6121
1090 6121 2915 889 1060 2333 3865 4003 2630 1671 -21 -2765 -4328 -3276 -2387 -2705 -3486 -3703 -4476
1107 -4476 -4486 -3841 -3204 -1737 482 1920 1735 2033 3675 3654 2984 3007 3696 4424 4975 3616 1098 -792
1125 -792 -1719 -2325 -1920 -826 -552 -2527 -4202 -4742 -4356 -3005 -656 530 -668 -1174 -805 539 1298
1142A298k28p6P70J429k34j412K95N18j140j752J426J892n95k881j255L4K88j50
1160a773q45P87J209j337k163R20K808K19r25J420K415L9j674K35J356M67n71
1177B587n80K02o7k054k193J163J088j882k089J257J927j199j506J540J411K93
1193a02n16J071K405O76k667k044K040K677j212k357J320L10k825j707K053K957
1209B079j391l029p14K363J747j574j008J173P19k122q50L746K107l376k992J832
1225a290L168K15r05K29R12j455j822J065L976K42m761k737K038K320k391j959
1241c155J431L15k228r61L219K896j534k966J284M183J798k510n87K450r6l260
1257B79L9L750K14n093l198K425K904j287l093R1K079m10k366K102L634p24m450
$$ plain form
1142 1298 1070 994 1764 3193 2959 1547 1842 2360 1220 -532 894 2786 2191 -690 -1945 -1911 -1623 -1773
1160 -1773 -2618 -1831 -622 -1959 -4122 -3202 -394 -175 -1100 320 2735 2774 1100 1335 2691 3158 2587
1177 2587 2007 2209 2142 88 -2105 -942 146 -1736 -3825 -2568 -641 -1840 -3346 -1806 -395 -102
1193 -102 -618 453 2858 3534 867 -1177 863 3540 2328 -29 1291 1601 -1224 -2931 -878 2079
1209 2079 688 -2341 -3055 -692 1055 -519 -1527 -354 365 -1757 -2607 1139 3246 -130 -3122 -1290
1225 -1290 1878 2093 1188 1417 2329 874 -948 117 4093 4335 -426 -3163 -1125 1195 -1196 -3155
1241 -3155 -1724 -1409 -3637 -4598 -1379 1517 -17 -2983 -1699 2484 4282 1772 1185 3635 3539 279
1257 279 318 4068 4282 -811 -4009 -1584 1320 33 -3060 -2969 -890 -1300 -3666 -1564 2070 1346 -3104
1274c104q1M737J747k725j654K094Q68k246j274L284K570k174m373J170M781q3
1290C537l815m87K692j020l353N9L574k38m138k277K986K706j913k179K103L497
1306A734j155k612K501N012j582m298R68L973M01l769j930J773Q42l257j918K495
1322h22K142l711m045K771N016r38l782J001L863k98k527O83L543p4l577j189
1338a944L669K473l223l110K219K788j996k503K269K845k609l870J470M157r21
1353A714l900j327K800J041l297j680L335K634l111k538M059L711j840k482K289
1368A408L458p54l567O25L652m84m594k251L402J155m411k638L092J829l364k363
1384e805L335L665j406k921J043M143M26l053L82L832J38m098j077M395J416m426
$$ plain form
1274 -3104 -3185 1552 3299 574 -1080 1014 1882 -364 -1638 1646 4216 2042 -2331 -1161 3620 3537
1290 3537 -278 -765 1927 907 -2446 -2387 1187 949 -3189 -5466 -2480 226 -1687 -3866 -1763 1734
1306 1734 579 -2033 468 5480 3898 -400 568 4541 4942 1173 -757 1016 1858 -1399 -3317 -822
1322 -822 1320 -2391 -6436 -3665 1351 413 -3369 -2368 1495 1197 -1330 -647 2896 2822 -755 -1944
1338 -1944 1725 4198 975 -2135 84 2872 876 -1627 642 3487 878 -2992 -1522 2635 1714
1353 1714 -2186 -3513 -713 328 -2969 -4649 -1314 1320 -1791 -4329 -270 3441 1601 -881 1408
1368 1408 4866 4112 545 1170 4822 4338 -256 -2507 895 2050 -2361 -4999 -1907 -78 -3442 -5805
1384 -5805 -2470 1195 -211 -3132 -2089 2054 2480 -573 -191 3641 3779 -319 -1396 2999 4415 -11
1400a1k686L496K557k524k555J777K112j627l420J228L673o97n141q28M302R57
1416F13l779r27L440J748l134q87M267L001j810l417K181M121m69l517r7K474
1432C808p77m754l84L472k08m901j774L174K094k239k138J999L383j081k565K360
1448e31M198q35l695N76M033N5l948p94L228O19l258j134K247K000l071k340K615
1465c5L537k648m124J135L522r60l404N13K564k95l437j65M050J864k666k302
1481b851K810L364j243k257K285K410k457k966J907L036j689m450j037K648Q05
1496C15k365j142J525J486k442q52L442L405k545k957K419L173j037k742Q3J985
1512A751k65k666k45K421J59l933j540L996K952k444k346J828K053j396j125J834
$$ plain form
1400 -11 -2697 799 3356 832 -1723 54 2166 539 -2881 -1653 2020 1323 -3818 -4646 -344 613
1416 613 -3166 -4093 -653 1095 -2039 -2926 1341 4342 2532 -885 1296 5417 4948 1431 1334 3808
1432 3808 3031 -1723 -2107 1365 1157 -3744 -5518 -2344 -250 -2489 -4627 -2628 755 -326 -2891 -531
1448 -531 3667 2832 -863 -287 3746 3801 -147 -941 2287 2906 -352 -1486 761 2761 -310 -2650 -35
1465 -35 3502 854 -3270 -2135 1387 427 -2977 -2464 100 -195 -3632 -3797 253 2117 -549 -2851
1481 -2851 -41 3323 2080 -177 2108 4518 2061 -905 1002 4038 2349 -2101 -3138 -490 315
1496 315 -2050 -3192 -1667 -181 -2623 -3475 -33 3372 827 -2130 289 3462 2425 -317 -234 1751
1512 1751 1486 -1180 -1425 996 1155 -2778 -4318 -322 2630 186 -2160 -332 1721 325 -800 1034
1528A034K124j674l156K86L424N1l633j314K876J589k164j117K008R19k278j066
1544b091K871K156j959l299M01K290J48k064m65K082M6k322O51L194O80k744o07
1561a032L520K439j491k516r5J381p64j707O00J147k213l750k66L602J77k718
1577c686q03K538J887r81n2J565J226o28p51K376K706j630l905k41K843L27j960
1594H31j164J286m87k282QJ692M99k247j035J521K087j251k563M5J803K76j088
1611b069J300J749q10k067P07L450J279q97j106J328J441j417j536R11N59j832
1627I90k092O71J219k533l349M9K569R06j084k13P49J002p24N21K793K061j328
1644B207j524J351J675r77j860j85J061r3j283j99N86r75j840k4J874J849j636
$$ plain form
1528 1034 3158 1484 -1672 -1386 2038 2089 -1544 -2858 18 1607 -557 -1674 334 1253 -1025 -2091
1544 -2091 780 2936 977 -2322 -1921 369 517 -1547 -2012 70 116 -2206 -1555 1639 2319 -425 -1032
1561 -1032 2488 4927 3436 920 825 2206 1442 -265 335 1482 -731 -4481 -4747 -1145 -968 -3686
1577 -3686 -4489 -1951 -64 -1045 -1097 468 1694 1066 315 2691 5397 3767 -138 -379 2464 2791 831
1594 831 -333 953 466 -1816 -1808 -116 383 -1864 -2899 -1378 709 -542 -3105 -3060 -1257 -981 -2069
1611 -2069 -769 980 170 -1897 -1190 2260 3539 2642 1536 2864 4305 2888 1352 2263 2822 990
1627 990 -1102 -431 788 -1745 -5094 -5045 -2476 -1570 -2654 -2867 -2118 -1116 -1840 -1319 1474 3535 2207
1644 2207 683 2034 3709 2732 872 687 1748 1655 372 173 759 -216 -2056 -2080 -206 1643 7
1661Gj743K82Q68r06k85Q49J196p31j403Q61J367m36j251R06J701J528j351o18
1679H41R92N83j188n84J278M20j420j827l17M03n41j200L59J029M11n81m61R84
1697h19P48k07K85J791R43j293j130L28K32j68q7k92N5k64j416j29P72K37o72
1716a086N84J449K81j135l73N20J80l37M41M97r7j004j603m86J271Q17m88L19
1734b50O81k11r04M78P46L28r6j26jJ68m17j001l19K17L82j93K61K91J6j162M93
1755f19R90N08K60M75n40n02m45m02L90j01l82p56L96k45m31n76O61Q45L50K85
1775A61P61K86l81l4J96K45M12K26j103l20k76q57m69nJ69L9O05k7l16n68M71
1796g85N70O10L53L99j65q51k67J55J84K64n14l75L28J38m34k18M61J14K29J11
$$ plain form
1661 7 -1736 -1454 -586 -1492 -1777 -928 268 -463 -1866 -1005 362 -74 -1325 -419 1282 2810 1459 841
1679 841 1833 2416 1228 644 1922 2342 922 -905 -1222 -819 -1360 -2560 -2201 -1172 -761 -1342 -1803 -819
1697 -819 -71 -278 7 1798 2741 1448 318 646 878 710 623 331 386 122 -1294 -1423 -651 -414 -1086
1716 -1086 -502 947 1228 93 -280 240 420 83 524 1021 924 -80 -1683 -2169 -898 -81 -569 -250
1734 -250 431 220 -684 -206 540 868 772 646 645 813 396 -605 -924 -707 -325 -518 -257 34 50 -1112 -619
1755 -619 371 879 1139 1614 1074 572 127 -275 115 14 -368 -1124 -728 -973 -1404 -1980 -1319 -474 -124 161
1775 161 922 1208 827 793 989 1234 1646 1872 769 449 173 -684 -1153 -1158 -989 -950 -345 -372 -688 -1256 -785
1796 -785 -215 395 748 1147 982 131 -136 19 203 467 -47 -422 -94 44 -390 -608 -147 -33 196 307
1816C07Q89k12n02n32m90j52P34N10r02l30q18n52N75J130O92kJ40k1P1m9M52
1837I38L45Rn35P1j59j15q38j082k81R73n3l45M69N50p62n50N76J352P75J07m71
1858I74n16J66q1k50J68K88o07j044K50M35q3m07K27N73k80M00J38L99l36n10
1878i6n06P68Q55p68p25l33J7n26o9J265P67p73k48K32R93L16k97k06N40K58n66
1899H98q40R5L22j183p62P49R02n19r02m3P02K91j6K06P94J62o83l31Q32K67r38
1920Co18P39K26o06l55J84M42l18k60N24J188K89j310n85J451K03q90j54P89n35
1940D07j407o01O89M56o21k24J8R10j45m79Q22J080J83j126M67J149J92j290l77
1959A03O37L15r93n9J94M22j082j120O54J399Q5j201k18J244o0j208J84O84J63
$$ plain form
1816 307 1196 984 482 -50 -540 -692 42 552 -350 -680 -1498 -2050 -1475 -345 347 345 485 464 535 486 938
1837 938 1283 1292 757 828 669 554 -284 -1366 -1647 -674 -727 -1072 -603 -53 -815 -1365 -789 563 1338 1445 974
1858 974 458 624 543 293 461 749 142 -902 -652 -217 -300 -707 -480 93 -187 213 351 750 414 -96
1878 -96 -602 166 1021 253 -472 -805 -788 -1314 -1383 -118 649 -124 -372 -140 853 1169 872 666 1206 1464 898
1899 898 58 153 475 -708 -1470 -721 181 -338 -1240 -1283 -581 -290 -306 -100 694 856 173 -158 674 941 3
1920 3 -615 124 350 -256 -611 -427 15 -303 -563 -39 1149 1438 128 -457 994 1197 307 153 942 407
1940 407 -1000 -1601 -912 -456 -1077 -1301 -1283 -373 -518 -997 -175 905 1088 -38 429 1578 1770 480 103
1959 103 740 1055 62 3 197 619 -463 -1583 -929 470 555 -646 -864 380 320 -888 -704 -20 143
1978A43j360l6J037P08o30j088M64J351J34k73N37Q77o86j157P05J470q4j273
1996H39q22l6q2p79l74M78j0j151r06J142J742k55j234N93J498j07l69O34J000
2015A801r0j285k55J005N39p60j030L06O67o39q11L75O96m01j033P9J463p20j051
2034a144j00J094L03r96p61J005O30o46o24J499N83m71p50Q50J500l44p61P3Q90
2053A830o24j213q0O31k59j301p49P05R45j068p49J027R70q30l30Q11J351j37
2071I30j129K54J119J46j370n39J308K60r81m72P27M24j365j65R65J035p52j187
2089g92M87R80K16j047l25J064o61j129J93J293L76j558n58R92P47q0l22M52N33
2108H61m10r93N11J611k6k091J32O32M50j513k29J217L31j169j1O21Q14l40p81
$$ plain form
1978 143 -1217 -1253 -216 492 -138 -1226 -762 589 723 450 987 1864 1178 21 726 2196 2112 839
1996 839 17 -19 -101 -880 -1254 -776 -786 -1937 -2843 -1701 41 -214 -1448 -855 643 536 167 801 1801
2015 1801 1711 426 171 1176 1715 955 -75 231 898 259 -552 -177 519 118 -915 -836 627 -93 -1144
2034 -1144 -1244 -150 153 -843 -1604 -599 31 -615 -1239 260 843 372 -378 472 1972 1628 867 940 1830
2053 1830 1206 -7 -87 544 285 -1016 -1765 -1060 -115 -1183 -1932 -905 65 -765 -1095 -284 1067 930
2071 930 -199 55 1174 1320 -50 -589 719 979 -2 -474 253 677 -688 -853 112 1147 395 -792
2089 -792 -305 675 891 -156 -481 583 -78 -1207 -1014 279 655 -903 -1461 -469 278 198 -124 328 861
2108 861 451 -542 -31 1580 1554 -537 -405 227 677 -836 -1065 152 483 -686 -697 -76 738 398 -383
2127c83P94O24j87j052k3J127m29j100p5O19k18q82KR91M20n82q22J002J111m84
2147D53o82P44R95q74q47K54J305m25r61k37N91k94p44m06P00J090q90j090P00
2166f18R35o17p48P69J055o52r94p9J055M78p70k44P66L37o09N7R01L31p65q73
2186b85Q99J023o48j320J91M36m63n74L9L15j45r80k69J102Q87p88n66Q75J022
2205G51Pm47M09M25n11l90L21J206r17j161o75P61N81k49p11M80Np34m69R83P39
2226D04o41p91J7J066K03l15m25M90p9n09R6J188K02j051j65P88M45k73l13K66
2246F03L06p42m69L95N00m52j140j97O24K75p87l3Q30K70m86l59Q92O87m38o39
2266c60R07M62j11p76K08K97j15j138K67Q36l02j180L10N25L84l85m17M67L52
$$ plain form
2127 -383 411 1035 848 -204 -227 900 471 -629 -704 -85 -303 -1185 -1183 -192 228 -354 -1176 -174 937 453
2147 453 -229 515 1510 636 -211 43 1348 923 -38 -275 316 22 -722 -1128 -428 662 -228 -1318 -618
2166 -618 317 -300 -1048 -279 776 124 -870 -949 106 584 -186 -430 336 673 64 121 1022 1353 588 -285
2186 -285 614 1637 989 -331 -140 296 -167 -741 -702 -387 -532 -1512 -1781 -679 208 -580 -1146 -271 751
2205 751 758 311 720 1145 634 244 565 1771 854 -307 -982 -221 360 111 -600 -120 -115 -849 -1318 -335 404
2226 404 -237 -1028 -1011 55 258 -57 -482 8 -71 -580 -484 704 906 -145 -310 478 923 650 337 603
2246 603 909 167 -302 93 593 141 -999 -1196 -572 -297 -1084 -1117 -287 -17 -503 -862 30 717 279 -360
2266 -360 547 1009 898 122 330 627 512 -626 -359 477 175 -1005 -695 -170 214 -171 -588 -121 231
2285B31l10n29M89M68p9o25N8P15k64o62K87N78r0j06j02N35O24p21o85M89L96
2306F97m72n12mP34o80q08P5O40n4m08R6J79N13n2j98N33N92m64j52J24Q55o90
2328E44l48J48L81n11k76k07J36n9l30k15P29M4m70l48M80N01l18k25M45M26k75
2349B52o70N14M22l71j8j71M20K89m57O8K11P6n48r3K64J97n52m06J56K17l64
2370e64l33K51L74l2n9j27P18K51k54M6L16K55l27o3K26j31l41j53P1J95l04o22
2392f07K60l6j35j20j68P09j1k45J88K5K13N1k9K9L18l25J27L1O9Q2J2j42k91
2415EK08k62j81L84k36J37k67J29j14j13O7l04M95l14p2K05L03m2k43M72K31k09
2437B79n0N04J08l04k53R4m1k65J62n10m84K88k55K22M4j64K51m05O91R3K9L30
$$ plain form
2285 231 -79 -608 -119 349 270 -355 -297 418 154 -508 -221 357 267 161 59 594 1218 497 -188 301 697
2306 697 225 -287 -291 443 -237 -1045 -970 -330 -384 -792 -696 -517 -4 -56 -254 279 871 407 255 379 1234 544
2328 544 196 344 725 214 -62 -269 -133 -192 -522 -737 -8 36 -434 -782 -302 199 -119 -344 101 527 252
2349 252 -418 96 518 147 129 -42 378 667 210 278 489 565 17 -76 188 385 -167 -573 -417 -200 -564
2370 -564 -897 -646 -272 -304 -363 -490 228 479 225 271 587 842 515 452 678 547 206 53 124 319 15 -607
2392 -607 -347 -383 -518 -638 -806 -97 -108 -353 -165 -140 73 124 95 124 442 117 244 275 344 426 438 296 5
2415 5 213 -49 -230 154 -82 55 -212 -83 -197 -310 -243 -547 -52 -366 -438 -233 70 28 -215 257 488 279
2437 279 229 733 841 537 284 378 337 72 234 -276 -760 -472 -727 -505 -461 -625 -374 -779 -88 5 34 364
2459C64K9rR9R8L4p7j28l89N1O2J57j94j48k20j00j2J78k38q9m8J33J90K14r4
2483a37j07k3K23M96%r1Ln6l16N28M83k88n11J0M4l42L27L0l51l87nk0k59K90
2507d59k66m7K98L21J65k3M8l6jL07K33M23j66m03j2N3J02k73j52k35K35o70J87
2530c71k3j35j11j3J49K29j45k34K85K7L47P4L66L72k37l49oO35n7m37K41n5j37
2553D15j30q1j08m48l2Q8n2k8k21l88K39M82k47O2J65K9K37J01L06n5K97l05L15
2576F41J75K02k82p76K14p5m2l35K67k09m68k92N18R6m6J49l65J16M37p7q4M58
2598B22L21m65L42K88K70m72m77L87M8m08N4l0r5j50k59ML65k42k51k15L55M24
2620A6k93l12M25J57K74l0k5K1J69l43K24L81K28m42l00PL48o72j8M4N3j02m78
$$ plain form
2459 364 393 384 483 581 615 538 410 21 72 134 291 97 -51 -271 -371 -383 -205 -443 -532 -580 -447 -257 -43 -137
2483 -137 -244 -267 -44 452 452 361 364 308 -8 520 1003 715 204 214 258 -84 243 273 -78 -465 -470 -490 -749 -459
2507 -459 -725 -772 -474 -153 12 -11 37 1 0 307 540 963 797 394 382 435 537 264 112 -123 112 -558 -371
2530 -371 -394 -529 -640 -653 -504 -275 -420 -654 -369 -342 5 79 445 817 580 231 225 860 803 366 607 552 415
2553 415 285 204 96 -352 -384 -296 -348 -376 -597 -985 -746 -264 -511 -449 -284 -255 -18 83 389 334 631 326 641
2576 641 816 1018 736 -40 174 99 57 -278 -11 -220 -688 -980 -462 -366 -412 -263 -628 -512 -75 -152 -236 222
2598 222 543 78 420 708 978 506 29 416 464 56 110 80 -15 -165 -424 -420 -55 -297 -548 -763 -408 16
2620 16 -277 -589 -164 -7 267 237 212 233 402 59 283 664 892 450 150 157 505 -167 -185 -141 -88 -190 -668
2643f68P8K64l13j78M35M06J05j33k24M56L7J21%L43n3k57l76M02L3m11n9j0o
2666hp8n86K41K93o8j48k88M38q3k24k8N04J97l59J39L50K18K24o16L29P0l20
2688A97j42J94M1k13l50J42Nj20J9k72K22K3j42r3K67L58l28n0L89K92l78J59
2710B20j4L36j13l34J15L19k08k32J16j89L36n99j53K86J31m03k85M24j64K63
2730a48m15M39R6Q1O9k6J57L14l01l08L34K03j70k53q1L12m99J13K49r2n11q9
2752e26J71L44k43l3j37N68j6k16k85N10mQ1J05J60r7j04k93J59K43j72k84kL33
2775B62j27m92K5M43j08j72k57L54Jr5k72L53L17l55r0K50M28j49l79L3P24k17
2797D77m25J43K09l05k04j72K56r9l20J73K55j20Q1j94j96N80R9m65j56N28Q0
$$ plain form
2643 -668 -590 -326 -639 -817 -382 24 129 -4 -228 228 265 386 386 729 676 419 43 445 478 67 8 -2 -8
2666 -8 -86 -672 -431 -138 -206 -354 -642 -204 -287 -511 -539 -35 162 -197 -58 292 510 734 118 447 517 197
2688 197 55 249 290 77 -273 -131 -126 -246 -227 -499 -277 -254 -396 -489 -222 136 -192 -242 147 439 61 220
2710 220 206 542 429 95 210 529 321 89 205 16 352 -247 -400 -114 17 -386 -671 -247 -411 -148
2730 -148 -563 -124 -28 53 122 96 253 567 266 -42 292 495 325 72 -9 303 -196 -83 166 74 -437 -526
2752 -526 -355 -11 -254 -287 -424 144 128 -88 -373 137 133 214 319 479 382 278 -15 144 387 215 -69 -71 262
2775 262 135 -357 -332 111 3 -169 -426 -72 -71 -166 -438 -85 232 -123 -213 37 465 316 -63 -30 694 477
2797 477 52 195 404 99 -105 -277 -21 -120 -440 -267 -12 -132 -51 -245 -441 139 238 -227 -383 145 225
2818B25j45j16K50L0m3k63L15J48l90j03j17M45k50j63j55L32r3k84J86L45j96
2839d2k49o3N30o7m2l46L76M51k97m99J52L68j27j95J25L76N5n64j01L01j46q
$$ plain form
2818 225 80 -36 214 244 201 -62 253 401 11 -92 -209 236 -14 -177 -332 0 -93 -377 -191 154 -42
2839 -42 -291 -354 176 109 67 -279 97 548 251 -248 -96 272 145 -50 75 451 506 -58 -159 142 -4 -12
$$ [...]
8191a0
##END NTUPLES=NMR FID
##END=
