##TITLE=1H ikalashn
4174 ND
17.10.2024
##JCAMPDX= 6.0         $$ Bruker NMR JCAMP-DX V2.0
##DATA TYPE= NMR FID
##DATA CLASS= NTUPLES
##ORIGIN= UXNMR, Bruker Analytische Messtechnik GmbH
##OWNER= root
$$ TOPSPIN		Version 1.3
$$ 2024-10-17 11:32:19.171 +0400  Irina@DPX200
$$ Compression mode = diff/dup
##.OBSERVE FREQUENCY= 200.131392401
##.OBSERVE NUCLEUS= ^1H
##.DELAY= (6, 6)
##.ACQUISITION MODE= SIMULTANEOUS
##.ACQUISITION SCHEME= undefined
##.AVERAGES= 14
##.DIGITISER RES= 18
##SPECTROMETER/DATA SYSTEM= spect
##.PULSE SEQUENCE= zg
##.SOLVENT NAME= DMSO
##.SHIFT REFERENCE= INTERNAL, DMSO, 1, 17.95386
##AUDIT TRAIL= $$ (NUMBER, WHEN, WHO, WHERE, WHAT)
$$ ##TITLE= Audit trail, TOPSPIN		Version 1.3
$$ ##JCAMPDX= 5.01
$$ ##ORIGIN= Bruker BioSpin GmbH
$$ ##OWNER= Irina
$$ $$ F:/spectra/data/iren/nmr/1H/4/audita.txt
$$ ##AUDIT TRAIL=  $$ (NUMBER, WHEN, WHO, WHERE, VERSION, WHAT)
(   1,<2024-10-17 11:31:46.093 +0400>,<Irina>,<DPX200>,<TOPSPIN 1.3>,
      <created by zg
	started at 2024-10-17 11:30:45.359 +0400,
	POWCHK disabled, PULCHK disabled
       terminated by command 'halt'
       configuration hash MD5:
       BE 6D 3F 07 2A EA 11 49 91 17 2B D3 AF B3 58 0D
       data hash MD5: 16K
       00 F0 A1 00 71 30 F4 7A 63 BC C6 AA E5 34 2D 66>)
$$ ##END=
$$ 
$$ $$ hash MD5
$$ $$ 1D 5D 5D 24 9F 29 C9 DD 1B BA 66 FB 52 F6 0B 66
##$RELAX= 
##$RELAX= 
##$RELAX= 
##$RELAX= 
##$RELAX= 
##$RELAX= 
##$RELAX= 
##$RELAX= 
##$RELAX= 
$$ Bruker specific parameters
$$ --------------------------
##$DU= <F:/spectra>
##$EXPNO= 4
##$NAME= <1H>
##$PROCNO= 1
##$TYPE= <nmr>
##$USER= <iren>
##$AMP= (0..31)
100 100 100 100 100 100 100 100 100 100 100 100 100 100 100 100 100 100 
100 100 100 100 100 100 100 100 100 100 100 100 100 100 
##$ANAVPT= -1
##$AQSEQ= 0
##$AQ_mod= 1
##$AUNM= <au_zg>
##$AUTOPOS= <>
##$BF1= 200.13
##$BF2= 200.13
##$BF3= 200.13
##$BF4= 200.13
##$BF5= 200.13
##$BF6= 200.13
##$BF7= 200.13
##$BF8= 200.13
##$BYTORDA= 1
##$CFDGTYP= 0
##$CFRGTYP= 5
##$CHEMSTR= <none>
##$CNST= (0..63)
1 1 145 1 1 1 1 1 1 1 1 1 1 1 1 1 1 1 1 1 1 1 1 1 1 1 1 1 1 1 1 1 1 1 
1 1 1 1 1 1 1 1 1 1 1 1 1 1 1 1 1 1 1 1 1 1 1 1 1 1 1 1 1 1 
##$CPDPRG= <>
##$CPDPRG1= <>
##$CPDPRG2= <>
##$CPDPRG3= <>
##$CPDPRG4= <mlev>
##$CPDPRG5= <mlev>
##$CPDPRG6= <mlev>
##$CPDPRG7= <mlev>
##$CPDPRG8= <mlev>
##$CPDPRGB= <>
##$CPDPRGT= <>
##$D= (0..63)
0 2 0 0 0 0 0 0 0 0.06 0 0.03 0 0 0 0 0.0002 0 0 0 0 0 0 0 0 0 0 0 0 0 
0 0 0 0 0 0 0 0 0 0 0 0 0 0 0 0 0 0 0 0 0 0 0 0 0 0 0 0 0 0 0 0 0 0 
##$DATE= 1729150302
##$DBL= (0..7)
120 120 120 120 120 120 120 120 
##$DBP= (0..7)
150 150 150 150 150 150 150 150 
##$DBP07= 0
##$DBPNAM0= <>
##$DBPNAM1= <>
##$DBPNAM2= <>
##$DBPNAM3= <>
##$DBPNAM4= <>
##$DBPNAM5= <>
##$DBPNAM6= <>
##$DBPNAM7= <>
##$DBPOAL= (0..7)
0.5 0.5 0.5 0.5 0.5 0.5 0.5 0.5 
##$DBPOFFS= (0..7)
0 0 0 0 0 0 0 0 
##$DE= 6
##$DECBNUC= <off>
##$DECIM= 32
##$DECNUC= <off>
##$DECSTAT= 4
##$DIGMOD= 1
##$DIGTYP= 9
##$DL= (0..7)
0 120 120 120 120 120 120 120 
##$DP= (0..7)
$$ [...]
##$SW= 21.9925939549014
##$SWIBOX= (0..15)
0 0 2 0 0 0 0 0 0 0 0 0 0 0 0 0 
##$SW_h= 4401.40845070422
##$TD= 16384
##$TD0= 1
##$TE= 300
##$TE2= 300
##$TE3= 300
##$TEG= 300
##$TL= (0..7)
0 120 120 120 120 120 120 120 
##$TP= (0..7)
150 150 150 150 150 150 150 150 
##$TP07= 0
##$TPNAME0= <>
##$TPNAME1= <>
##$TPNAME2= <>
##$TPNAME3= <>
##$TPNAME4= <>
##$TPNAME5= <>
##$TPNAME6= <>
##$TPNAME7= <>
##$TPOAL= (0..7)
0.5 0.5 0.5 0.5 0.5 0.5 0.5 0.5 
##$TPOFFS= (0..7)
0 0 0 0 0 0 0 0 
##$TUNHIN= 0
##$TUNHOUT= 0
##$TUNXOUT= 0
##$USERA1= <user>
##$USERA2= <user>
##$USERA3= <user>
##$USERA4= <user>
##$USERA5= <user>
##$V9= 5
##$VALIST= <valist>
##$VCLIST= <CCCCCCCCCCCCCCC>
##$VD= 0
##$VDLIST= <DDDDDDDDDDDDDDD>
##$VPLIST= <PPPPPPPPPPPPPPP>
##$VTLIST= <TTTTTTTTTTTTTTT>
##$WBST= 1024
##$WBSW= 25
##$XGAIN= (0..3)
0 0 0 0 
##$XL= 0
##$YL= 0
##$YMAX_a= 402560
##$YMIN_a= -684949
##$ZGOPTNS= <>
##$ZL1= 120
##$ZL2= 120
##$ZL3= 120
##$ZL4= 120
##$ABSF1= 10
##$ABSF2= 0
##$ABSG= 5
##$ABSL= 3
##$ALPHA= 0
##$AQORDER= 0
##$ASSFAC= 0
##$ASSFACI= 0
##$ASSFACX= 0
##$ASSWID= 0
##$AUNMP= <proc_1d>
##$AXLEFT= 0
##$AXRIGHT= 0
##$AXTYPE= 0
##$AXUNIT= <>
##$AZFE= 0.1
##$AZFW= 0.1
##$BCFW= 1
##$BC_mod= 2
##$BYTORDP= 1
##$COROFFS= 0
##$CY= 7568.61572265625
##$DATMOD= 1
##$DC= 2
##$DFILT= <>
##$DTYPP= 0
##$F1P= 17.9538593292236
##$F2P= -4.03888763876832
##$FCOR= 0.5
##$FTSIZE= 32768
##$FT_mod= 4
##$GAMMA= 1
##$GB= 1
##$INTBC= 1
##$INTSCL= 1
##$ISEN= 128
##$LB= 0.01
##$LEV0= 0
##$LPBIN= 0
##$MAXI= 945.577
##$MC2= 0
##$MEAN= 0
##$ME_mod= 0
##$MI= -402.1523
##$NCOEF= 0
##$NC_proc= 0
##$NLEV= 6
##$NOISF1= 8.587773
##$NOISF2= 6.764455
##$NSP= 1
##$NTH_PI= 0
##$NZP= 0
##$OFFSET= 17.95386
##$PC= 1
##$PHC0= 302.2128
##$PHC1= 31.5639
##$PH_mod= 0
##$PKNL= yes
##$PPARMOD= 0
##$PPDIAG= 0
##$PPIPTYP= 0
##$PPMPNUM= 100
##$PPRESOL= 1
##$PSCAL= 0
##$PSIGN= 0
##$REVERSE= no
##$SF= 200.13
##$SI= 32768
##$SIGF1= 18.5376
##$SIGF2= -6.396296
##$SINO= 400
##$SIOLD= 32768
##$SREGLST= <1H.CDCl3>
##$SSB= 3
##$STSI= 0
##$STSR= 0
##$SW_p= 4401.40845070423
##$SYMM= 0
##$S_DEV= 0
##$TDeff= 0
##$TDoff= 0
##$TI= <>
##$TILT= no
##$TM1= 0
##$TM2= 0
##$TOPLEV= 0
##$USERP1= <user>
##$USERP2= <user>
##$USERP3= <user>
##$USERP4= <user>
##$USERP5= <user>
##$WDW= 1
##$XDIM= 8192
##$YMAX_p= 0
##$YMIN_p= 0
$$ End of Bruker specific parameters
$$ ---------------------------------
##NTUPLES= NMR FID
##VAR_NAME=  TIME,          FID/REAL,        FID/IMAG
##SYMBOL=    X,             R,               I
##VAR_TYPE=  INDEPENDENT,   DEPENDENT,       DEPENDENT
##VAR_FORM=  AFFN,          ASDF,            ASDF
##VAR_DIM=   8192,          8192,            8192
##UNITS=     SECONDS,       ARBITRARY UNITS, ARBITRARY UNITS
##FACTOR=    0.0002272,     1,               1
##FIRST=     0,             0,               0
##LAST=      1.8609952,     -29,             3
##MIN=       0,             -684949,         -684949
##MAX=       1.8609952,     402560,          402560
$$ Real data points
##PAGE= N=1
##DATA TABLE= (X++(R..R)), XYDATA
0@%%%%%%%%%%%%j4K8k8K8m2N6p0Q4r8J20j35J55j84K26k66L08l54M00m65N32o04
33c23O88p74Q71r82J103j235J380j537J709j901K106k328K577k846L138l460L811
50A997m198M626n098N620o205O866p609Q456r437J0583j1943J3590j5635J8255
64I868k1744K6653l4130M7035p5463K50328j92973n24686J92311L49263K93297
75C19759J2570j77504l09589p7928K08243K61289m7206k26629j31844O3431J01946
86c462J18350N2613j01174j84297n0279O7934R9277J00123M7408j12768j61562
97a27837j6925J32586Q8687l1864o3644k8053k8561K0906J17499M9487j54456
108d2175j36545Q9641J45295m886o5151j1697m181k1275K9012O2782j2019p9269
$$ y = [0, 0, 0, 0, 0, 0, 0, 0, 0, 0, 0, 0, 0, -14, 14, -14, 14, -28, 28, -42, 42, -56, 64, -71, 84, -100, 126, -140, 168, -186, 214, -251, 281, -323, 365, -409, 462, -520, 583, -652, 728, -809, 900, -1001, 1105, -1223, 1354, -1492, 1646, -1814, 1997, -2201, 2425, -2673, 2947, -3258, 3608, -4001, 4455, -4982, 5601, -6342, 7248, -8387, 9868, -11876, 14777, -19353, 27682, -47781, 202547, 9574, -515112, -322801, 26462, 319759, 332329, 154825, -154764, -232692, -24449, 236840, 189634, -36995, -168839, -105408, -3462, 114888, 167501, 66327, -117970, -168249, -100315, -1038, 99085, 146493, 33725, -127837, -144762, -12176, 76511, 44647, -18997, -47050, -75611, -54705, 62794, 112281, -42175, -178720, -89079, 56216, 51330, -13821, -25518, -29699, -50974, -21962, 40820, 28801, -50468]
120e0468J662J00878L3178p2723l5688K9479J2562O825K1442j4864k8986K2351
132B5648K4233l7030l8120K5717M1055j1325l6125n021M683j0135K9458M9496
144F2534n1356j05401K9031J26744J9574q4175l8357J6902N283J3402M2440N797
156D2418o4480m4779M9009N4350l1063m1200J9179J1461k6746p21K2017j61J316
169i400J1164k0381l1913J7497N0302J5704k8591k2075N923O403R599L6734R648
182E0614n8174k9854N8656L8273m2610k7385K6572P836k3710j05J9748q063k2625
195a0827J4088L0027k2919m6546J7866N0273l085l0107n080m479l900K7858K2101
208C5270k7354l3175P218K2832K115r431p68l589j7319J655K4549p498l1320J6106
$$ y = [-50468, -48806, 52072, 85250, 12527, -23161, 6318, 18880, 25705, 47147, 32283, 3297, 25648, 49881, 12851, -25269, 448, 41503, 30178, -5947, -10968, -6285, -16420, 13038, 62534, 11178, -94223, -65192, 61552, 81126, -3049, -41406, -24504, -19221, -5819, 36621, 42418, -22062, -66841, -17832, 36518, 5455, -35745, -16566, -5105, -31851, -32572, -10555, -10716, -9400, 1764, -18617, -50530, -33033, 17269, 32973, 4382, -17693, -11770, -5367, 4232, 40966, 50614, -7560, -37414, 21242, 59515, 16905, -10480, 16092, 23928, 218, 113, 19861, 11798, -10827, 3261, 33288, 10369, -36177, -18311, 31962, 28877, -1230, -6310, -10789, -14689, 13169, 35270, 7916, -25259, -18041, 4791, 6906, -2525, -3293, -6882, -24201, -22546, 2003, -5495, -36815, -20709]
222b0709L5276k3398l8303K1111L5615o012j4831N669J248j1291R131L2987M667
235C1160l7177j3242L3744J3945k0914N02J3102j3309j0356J4738K318j5630K198
248A079J5342m291k0220l640J7826P823j0475j001L377j6962k791L2853J0168
261B9088l3382j3328K0292M654j0294N618P926j3347j6307R200J7208r570j9910
274b2152J0499J6328j6314j3435J6802P216j2040M840R857j2129q639J7035J6597
287A4465o258j4405M33J0544P42q04J0075k807j8718M203J9996p370j7072R319
301B343J0425j1400p375Q132L902n088j337O421p98j2234J208K0226K099j8782
315b258p78J1656m641l722J1241o23j3963j652Q719O42p353l387L923J47q827
$$ y = [-20709, 14567, -8831, -47134, -26023, 9592, 3580, -11251, -5582, -4334, -15625, -6494, 26493, 31160, -6017, -19259, 14485, 28430, 7516, 8018, 21120, 7811, -2545, 12193, 14511, -1119, 1079, 16421, 12130, -8090, -11730, 6096, 13919, 3444, 2443, 5820, -11142, -13933, 18920, 29088, -4294, -17622, 2670, 7324, -2970, 2648, 10574, -2773, -19080, -9880, 7328, -2242, -22152, -11653, 4675, -11639, -25074, -8272, -1056, -13096, -8256, 1601, -10528, -19167, -2132, 14465, 8207, -6198, -5765, 4779, 5521, 4717, 14792, 11985, -6733, -2530, 17466, 10096, -6976, 2343, 12768, 1368, -6007, 2125, 6027, 939, -398, 6023, 5225, -7009, -5801, 14425, 16524, -2258, -3036, 8620, 3979, 257, 11498, 10875, -3088, -4740, 3979, 4621, -2732, -6119, -2196, -2049, -10876]
330a0876m59Q950l975r057P810N402j1143j688J2840J869n821J305K718j803K59
345c669N178O186l122r235K947J0640l347o732N468J038p493L488O511n445m032
360a619M288K573k100k253L29N173J873m444O20K772m677J073P926l028q614K612
376B504L698l394j872l6k963j033p07j638P69j528m093K342K032m840J09N319
392e331j399j856M037K64j870L222K166m64K314l08j477L379Q00k318K028N77
408C764l390J216L201k767j057J564j607N18K762k171j435L637m28j545L223n48
424D937k878K870K009k472m35M73j131P42o60l306O52O64m223J83K106m486j924
441f879L962j040l793K189J068j697O93R58O95J451j231o90M346M10l341K923
$$ y = [-10876, -11335, -2385, -6360, -15417, -7607, -2205, -13348, -15036, -2196, -327, -6148, -4843, -2125, -3928, -3669, 1509, 7695, 4573, -4662, -1715, 8925, 5578, -1154, 4314, 5352, -2141, 1347, 7858, 2413, -1619, 2669, 5242, 3142, 889, 1218, 6391, 8264, 3820, 4440, 7212, 2535, 3608, 11534, 8506, -108, 2504, 6202, 2808, 936, 900, -2063, -3096, -3803, -5441, -4672, -6200, -10293, -7951, -5919, -10759, -10650, -5331, -6730, -8586, -4549, -4285, -6155, -2933, -767, -1231, 1083, 775, -702, 2677, 3477, 1159, 3187, 3764, 374, 1590, 4791, 2024, 967, 2531, 924, 1442, 4204, 2033, 598, 4235, 3807, 2262, 5485, 4937, 2059, 4929, 6938, 4466, 4031, 4504, 3373, 4115, 3455, 149, 801, 1465, -2758, -2575, -469, -4955, -6879, -2917, -3957, -7750, -5561, -4493, -6190, -5497, -4539, -3844, -2393, -3624, -4314, 32, 442, -2899, 24]
457B4K375m593P36N351k700l909K624J512j567m14N2K30O34q40Q40K209k950j211
475a597O561R40o039J931M966k012j105L214j124k933J476J892l85l131k895K608
491B367K114n319k390L947k506l998M335J266o862n2N767o21l669K51J913J371
507b086j120k74K706p39m055M212N241o012m185O565J833n326J445K599l298j348
523c842M128K362k854l536K539N494j421m226L800K971m519J804O083l913n625
538g55N957M488n169l841K269J943j447k133M04m20m499K50O950k553r487K570
554e473P233m061l509M385K12m589K471M894k041m751J305P072n5p666j38P687
570B976j081n187M166J075p808J009R646j213q434j13N160R45k307O62K380k420
$$ y = [24, 2399, -2194, -1458, 3893, 1193, -2716, -92, 1420, -147, -561, -509, -279, 355, -485, 355, 2564, -386, -1597, 4964, 5904, -135, 1796, 6762, 4750, 3645, 6859, 5735, 2802, 4278, 6170, 5785, 2654, -241, 2367, 4481, -838, -3228, 719, -1787, -5785, -1450, -184, -7046, -7098, -1331, -1952, -5621, -5370, -3457, -2086, -3206, -3480, -774, -1513, -5568, -1356, 3885, -2127, -6312, 253, 2086, -3240, -1795, 804, -2494, -3842, 286, 2648, -206, -3742, -1203, 4291, 2870, -1356, 2444, 5415, 896, 2700, 8783, 4870, -755, 5202, 9690, 4521, 680, 2949, 4892, 3445, 1312, 1716, 1296, -3203, -2953, 3997, 1444, -8043, -5473, 1760, -2301, -5810, -1425, -1213, -5802, -3331, 1563, -478, -5229, -3924, 3148, 3093, -4573, -4711, 2976, 1895, -3292, 874, 1949, -5859, -4850, 4796, 3583, -4851, -4964, 196, 1141, -1166, -504, 1876, -544]
586e44k971O037M334p776k901R631J682q517M99N880k858k405M435N42o967k786
602d685O958N160o948o684N482L634o128O45P306m294p909O268O763o138m021
617d591N889L368n042l438L527L376l068q48M060l722p474O239Q749o827p818
632g620M816K777m345J876M898l213o244L295P558k176p444L418R155m254p590
647e093N632N443o408j70Q528l051j0653K443J0224O42p419k729L497l56k445
662a915M412L603p737m319P529K256o452J974N884m800n337M882L705l939j249
677a503M601Q8q024j691J0020L012j0206k752Q301j927p274N928O777p482n803
692g935O668M393n571k878O266M263n750m610N130L339l323K552L513p223n385
$$ y = [-544, -3515, 2522, 6856, -920, -3821, 5810, 7492, -1025, -526, 5354, 2496, 91, 4526, 5068, -1899, -4685, 2273, 7433, 485, -6199, -717, 2917, -3211, -2566, 4740, 446, -7463, -1195, 5568, -570, -4591, 1298, 4666, -376, -3814, -287, 3089, 21, -827, 3233, -489, -7963, -1724, 7025, 198, -7620, -2804, -27, -4372, -2496, 2402, -811, -7055, -3760, 3798, 1622, -5822, -2404, 6751, 2497, -5093, 539, 5982, -426, -596, 7932, 4881, -5772, -3329, 6895, 7537, 118, -2611, 886, 530, -1915, 2497, 6100, -1637, -5956, 1573, 3829, -2623, -649, 5235, 435, -4902, -20, 3685, -254, -1503, 3098, 3186, -4838, -6529, 3491, 6503, -3703, -6455, 1846, -81, -7355, -1427, 5350, -2132, -7935, -1267, 3126, -2445, -5323, 943, 5206, -544, -5154, -24, 3315, -8, 2544, 6057, -1166, -6551]
707f551Q098N453m593k352J007k917k131N471N157m831p624K852O939l658n029
722d709P164M013r570l568R620K084p045J386N920l588o786K802P630r23o841
737b411K31M457l080l502N442K592n838j045M056k943l027N951K972m326l421
752c892J816J105q22K824M602m009r751K556J1583n39q438K099L561o085j743
767e133Q942K922q194m386N622L483m101j956N909J416o799r92N804n48k522L863
783C330R72n687j171M667Q06j620Q76j13l774j789M134L420l569m021M026Q33
799A320p227R38R737o46r409k99N629q72k037M360K767n894n918M715P916j610
815C470n594J596J557l827J398N652j610m601J524J661k225K2L287J75k650p72
$$ y = [-6551, 1547, 7000, 2407, 55, 1062, -1855, -3986, 1485, 6642, 1811, -5813, -2961, 3978, 320, -4709, 2455, 6468, -3102, -6670, 2950, 5034, -2011, -625, 5295, 1707, -5079, -2277, 5353, 4430, -2411, -2180, 2277, -803, -4305, 1137, 3729, -2109, -3154, 902, -2041, -5068, 883, 3855, -471, -3892, -2076, -971, -1793, 1031, 5633, 1624, -8127, -5571, 6012, 5473, -2965, -866, 2695, -3390, -5133, 3809, 6731, -1463, -5849, -227, 3256, -845, -2801, 3108, 4524, -2275, -3267, 2537, 1989, -533, 3330, 4302, -1385, -2556, 2111, 2917, 1297, 2173, 2060, -1714, -3503, 631, 4051, 482, -3539, 487, 1320, -5907, -4969, 4768, 4122, -5287, -5586, 43, -829, -2866, 1494, 4261, -1633, -7551, -2836, 5080, 3470, -2124, -528, 1029, -2798, -1400, 4252, 2642, -1959, -435, 1226, -999, -977, 2310, 2485, -165, -937]
831i37J714j89k584L282M802m438o893M294N497l838j884N211r94p170j5O759
847B617J994n116k430L304l80m234K260O590k632o459J277L251j477R85L246j995
863H01m365M32L563J178q09n2j28k395j209M543K112m331j080M050j828m960L384
880a094N496k822m090J613J956k348o34M046K420m907m367M391L714k816p21L354
896C191k175m257K568L814j164j610K61p19j669P42K927J009l257j599J656k88
912e70j775L734K268m849l158L995J606k436P14K371j679l553Q55L488O11l005
928a383mK300j916k918L433L499l079j824J391j88r31J789K179j078k209o86J701
945G6J236l58J053L22l285p44L780R50k544O11J349k825j223K658J518j450j526
$$ y = [-937, 777, 588, -1996, 1286, 6088, 1650, -5243, -949, 4548, 710, -1174, 4037, 3043, -4127, -4142, 2617, 4611, -505, -2935, 369, -11, -4245, -1985, 4605, 1973, -4486, -3209, 42, -1435, -450, 2796, 801, -3564, -3132, 431, 1609, 800, 748, 620, -1775, -2984, 1559, 3671, -660, -1740, 2310, 482, -4478, -1094, 4402, 1580, -2510, -897, 1059, -1289, -1923, 2123, 4543, -364, -4731, -340, 3374, 558, -163, 3191, 1016, -3241, -673, 3141, 1977, 367, 628, -91, -1760, -1018, 1909, 2918, -339, -1938, -282, -570, -2345, 1389, 3657, -1192, -4350, -355, 1251, -1185, -471, 1900, 221, -3332, -2477, 1011, 1622, -1383, -1387, 913, -1003, -3921, -488, 3011, -68, -1892, -501, -689, -1620, 169, 2348, 1270, -939, -1625, 76, 1312, 954, 2007, 2329, -956, -1700, 2080, 3030, 486, 1097, 2446, -379, -1602, 1056, 2574, 1124, -402]
962d02k8O92j154n29K784N81l380j270K590n2j403J924R26k728j348J951R72j77
980e1k91k60k48q21j21K475K17k089K80J260j467m68K825L21k206k6O44J32l21
999b15J221O68p74j662pK179K62j250P10K74k127Q3K435%j628K56K3p70J53O73
1019E04M03j63j192l24R38l27m77J728k34k244J76J357l16j88J004p97j161L53
1037i60N86O19j88q31Q1M80j006J96J593m85j484N56P78j093N66J293o53p19K00
1056d71j3N07O49k61J27k01j029N99J621l91r12Q99m82p73R22O95o97L6j1n62
1076B52J61K51j17K56R5j232P7Q00o60k2P07r02p80N67K34k42M51l51p87M87k2
1097g77n9M00k7q33N01L15m99M08N86n75o8M18l81L38N13j18m85O88l43j55Q52
$$ y = [-402, -430, 262, -892, -1421, 1363, 1944, -1436, -2706, -116, -168, -1571, 353, 1279, -1449, -2797, -846, 126, -51, -342, -602, -850, -1671, -1792, 683, 900, -1189, -909, 351, -1116, -1584, 1241, 1562, -644, -670, -26, 106, -215, 1006, 1674, 900, -762, -769, 1410, 1672, 422, 1132, 1406, -721, -638, 1797, 1797, 169, 425, 448, -322, -169, 504, 907, 744, -448, -772, 166, -161, -638, 1090, 856, -1388, -1212, 145, -171, -359, 645, -152, -1313, -960, -374, 245, 57, -774, -693, -213, -1219, -1023, 570, 85, -1399, -843, -65, -1158, -592, 701, 48, -671, -471, -484, 23, 672, 411, 538, 337, -692, -93, 1528, 1137, 225, 1124, 642, -131, 791, 1486, 789, 825, 814, 252, 413, 664, 547, 803, 898, -334, -257, 543, -117, -139, 568, -334, -1114, -547, -313, -555, -104, -455, -1242, -755, -777, -836, -436, -463, -1296, -795, -480, -979, -571, 15, -560, -628, -210, -591, -253, 260, 142, -343, 345, 2, -153, 699]
1118F99J15n53J47K03l65M99L26l68M3P1o34L24N83o91j44M75m37l71M09l3l87
1139h9K67j65l76J71j02k29N68j81n69L86J93o94M88N15q53l02P95j71j43L00
1159a91j2k95K80M6j24N12o06j28R15k65p43O29O55r35N1P97p05j64N62J96j44
1180C31k54J55K87K50p59L05N57o43k61R00k6j091L43M88o15rL28o7j34j61N0
1201b6M34m43m94P47M53j060k16R41l72o42P17R6q77L0N74J38n30q5K83M73n37
1222c96m77O81J40q68N30J025j053o00J469J15p95L53M01j95k38Q3N36k91n33
1241a13K90J035o00j067Q23O66r96k06J023n01p38N14M27n42m40J62O77j03q36
1260e25K27O26o01l51J099j40j347K99J150n82p96M39M76j65j47K34J4m34l95
$$ y = [699, 814, 261, 408, 611, 246, 745, 1071, 703, 746, 817, 183, 507, 1090, 399, 255, 730, 293, -78, 331, 298, -89, 178, 13, -363, -192, -294, -523, 45, -136, -705, -319, -126, -820, -332, 183, -670, -972, -177, -348, -491, -191, -203, -498, -218, -172, -296, 216, -390, -518, 397, 132, -611, 18, 673, -262, -211, 586, -119, -283, 279, 475, 331, 77, 232, 519, 769, 10, 315, 872, 229, -32, 868, 842, -249, 94, 582, -33, -42, 286, 219, 85, -76, -26, 408, -35, -529, 218, 671, -389, -605, 336, -36, -678, 39, 135, -742, -712, -138, 0, -530, -615, -332, 141, -396, -873, -192, -52, -920, -390, 635, -418, -1018, 451, 566, -229, 124, 525, 330, 92, 175, 711, 420, -113, 177, 1212, 612, -455, 368, 1034, 38, -168, 855, 354, -384, 130, 557, 15, -425, -263, 414, 311, -525, -298, 328, -273, -624, 475, 335, -1012, -713, 437, -145, -941, -502, -26, -191, -338, -104, -90, -524, -919]
1279i19J086N23j269k12J185J63j097N16O02p68j17J078k4p07k87P97K96p10m04
1298b68P31J91j025L54J089j122p71J100N17j334k02J010K5n24J0K57p7l15J50
1317b04J038p17j013O05J141q25p60R80j86n66N80N10o72p80O09P21k57r08J84
1336e20O95l55m05Q34N8j311N14J474n50r44J12P84j82j30L21jm19n89J075M02
1356H63j129m04J089J77r64K66Q07p87k68Q79k47o27O8O65K80p54l10N73M00r67
1376c90M66O62j043o48J300L14j164m25J103M5p03k1N59j82k47J01K95l04p58
1395a040R43J090j022o56P41K43m40M74N73r17n42Q45L67p4o25J54M41m84k70
1414a99N42K87j118K28J020n02j108Q43N92k59m30P2J30k56M1L68M23j206j82
$$ y = [-919, 167, 690, -579, -791, 394, 557, -540, -24, 578, -190, -307, 771, 747, 40, -247, 550, 846, 136, -268, 463, 654, -371, -17, 1072, -50, -821, 279, 796, -538, -740, 270, 295, -229, -219, 38, -39, -354, -204, 834, 117, -896, -291, 850, 25, -735, 245, 59, -507, 73, 583, -89, -869, -260, 461, 204, -704, -520, 175, -180, -585, 249, 307, -1004, -490, 984, 434, -510, -398, 386, 204, 74, 395, 394, -25, -614, 461, 863, -266, -670, 419, 596, -368, -102, 705, -82, -350, 529, 282, -345, -277, 388, 668, -86, -396, 177, 577, -390, 76, 738, -305, -953, 347, 661, -503, -928, 175, 220, -483, -504, 55, -127, -374, -273, 22, -282, -1040, -97, 993, -29, -685, 56, 299, -141, 333, 906, -11, -553, 292, 659, 585, -40, 114, 555, 71, -199, 343, 630, -488, -260, 760, 258, -850, -7, 585, 326, -104, -32, 98, -158, -117, 251, 674, -532, -714]
1433g14Q59K37p76k7O63o12j98Q07k1o40J39K80Mn14K8Q77P9p98J21L85l00k92
1455d13R85L08j347k24J178L5l92Q2j77J33o25M07N13k75o60M55N29o08m97P49
1475A56K00m85R1L41o59j5N99L58l10o90n7O80J30l98M84l54o92L71R35m46p68
1496e29L61M51o54r5M85K73m19r8J91L9k75j23R55j94j051J72R52l61L5J20r0
1517A45p70L69O55k47l23O0J42K16m26qN25l20k13L38K89r54J20J069j10o02k35
1538b80M25j06J32K13M4o39l45O22P04o00o49N05Q4n86J63M50k79j22K17N9k91
1559b79k72N24K92n9m67J74J11j14K95L42m96q34N78O35k52k71L78m71K2m4M95
1580B87j31k76k12M95J19r21K37R26j51n89J73oq4K41M05m9p17l4L57K87k68k65
$$ y = [-714, 145, 382, -394, -421, 242, -370, -568, 239, 218, -422, -283, -3, 1, -513, -485, 392, 471, -327, -206, 179, -121, -413, 572, 880, -467, -691, 487, 522, 130, 212, 35, 168, -457, -50, 463, 188, -472, -17, 512, -96, -593, 156, 356, -129, -38, 303, -356, -371, 228, 586, 276, -414, -471, 209, 339, -59, 425, 71, -621, -250, 685, 239, -529, -168, 283, -371, -466, 19, 292, -127, -225, -34, 5, -270, -393, 562, 368, -683, -511, 441, 80, 115, 235, 145, -625, -256, 399, 152, -171, -111, 31, 247, -179, -187, 338, 18, -195, 143, 432, -522, -402, 667, 557, -45, -280, 145, 39, 171, 384, 428, -211, -556, 66, 770, 170, -479, 26, 110, -476, -313, 137, -142, -264, -47, 12, -279, -551, -27, 265, 206, -261, -87, 24, -90, 205, 547, 51, -783, -205, 430, 178, -93, 285, -186, -164, -208, 287, 156, -120, -332, 163, 282, -639, -402, 524, 373, -216, -43, -49, -133, 108, 513, 464, -253, -287, 70, 357, 89, -176]
1602a76Q7J40q3J86j8l08o6M49K9n12O7O32j10l46J02r1m8R0K35L12n33m74M27
1625iM09k65k00l5Q8k07L2K26p8j59J46M%k16l6M53j86j77L18j97k22N92L12n67
1649B6l03M45j48J0K74p8j72r8N4J82Q3k06j34L36k29l03K44K36j01rR7j69j17
1672h0K42n6K11l55j27R6N3J21J54j08l07q1K34J2k02K25j5j90m9J95n5J18n9
1695b3J00l65L86k22L20J58m39J1O4J41j69K75j24n2j53Q7L8R1j14kM9Mj69K77
1719A69l4p3K9j38p8j17L24J09j30N2q6j78J46K59k29M8r1k07L95j40k01K09N6
1742I4k12N6J4Q3j39K87j35l55J86J7K18rj49j46K59n9j02K38o0k28J05N0j1j7
1766a5j09l2K01j72J17L3J32l00L18j87Q3p4J00l6j9J23k20j5O4L4J13k5j36j40
$$ y = [-176, -89, 51, -32, 154, 136, -172, -238, 211, 240, -272, -205, 427, 317, -29, 73, -18, -66, 24, 259, 571, 38, -436, -9, 400, 135, -65, -100, -12, -219, -187, 39, -39, -198, -52, -48, -48, -264, -300, 153, -33, -210, 108, -89, -311, 281, 593, 26, -277, 168, 20, 30, 304, 226, 54, -44, 10, 192, 275, 69, -65, 271, 42, -261, -17, 219, 118, 109, 206, 37, -80, 162, 106, 317, -38, -165, -69, -16, 105, 259, 151, -156, -237, -3, 9, -193, 32, 17, -173, -222, -27, -82, 36, -23, 77, -288, 98, -124, 196, 354, -85, -74, -10, 131, -38, 237, 113, 61, -92, -5, 33, 124, 10, 8, 57, 61, -108, 169, 135, 62, 91, -47, -125, -242, 82, 191, 61, 113, 27, -151, -5, 254, 25, 73, -18, -225, 170, 30, -171, 38, 94, -118, -62, -48, 35, -104, 183, 48, -307, -121, -104, 114, 105, -44, -190, 69, 10, -92, 146, 86, -142, -37, 13, 2, -15, -124, -156, 45, -127, -10, 23, 155, -145, 173, -14, 69, -5, 95, 59, 40, 163, -57, -72, -8, 26, 139, 114, -22, -162]
1790a62J93J96l29J34J05j36j08J46j04J09p4p7j46K26J13k04R7K3k8J19j07j09
1812a23O4J60l3j80J59r7N8J06j44n1J23j11j2J34j37K23l8j1Pl7L5rJ15l15K03
1837H9O7n2q3rOo3J64k84K12k56J97J3j02J76pj97P6rj23K65ok31J07O6p3K4J83
1864A50k41j2K90j40j13M9k6K1K05r5j11lj4M4J95j45j23J25k4j09n9J83L9N6
1888A42j15j27K2J25l0k9J16l0l7R7r7l0Ol5m8j40K25j48J59r9l3j80L71j85R
1913i1Q9p2J5M0k3j27J75J78j00j39J79j20j37K16k01k9J55m8n1O5j8m3O8m0R0
1938C1J7Ro4k34L86r5rJ63j34P0j19n0L06k84o7J46o0j83J62R2j85o9L2K03l85
1963c21K19J95j13q2Qj7J26k55O5J68J20k9l1N5j12q3RK22j30J4%Jj24K26k11
$$ y = [-162, 31, 227, -102, 32, 137, 1, -107, 39, -65, 44, -30, -107, -253, -27, 86, -118, -21, 2, -26, 93, -14, -123, -59, 101, 68, -112, 47, -50, 8, 114, -30, -81, 42, -69, -81, 53, -84, 139, 101, 90, 97, 60, 95, 86, 201, -114, 89, 156, 104, 21, 12, 18, -45, 119, -165, 47, -209, -12, 1, -101, 75, 68, -129, -53, -62, -185, 80, 74, -157, -50, 16, -57, -33, 150, -91, -103, 187, 47, -66, -17, -43, -22, 183, 88, -23, -26, -40, 4, 199, 54, -69, 56, 32, -77, -136, 47, 86, 142, 27, -100, -78, 47, 17, -12, 104, 74, 37, 134, 37, 7, 13, -22, -70, -210, 15, -133, 26, -73, -106, -286, 85, -100, -91, -2, -74, -59, -19, -42, -169, 6, 184, 84, -55, 124, 4, -133, 83, -118, -147, 8, -40, -91, -26, -44, -87, -19, -59, 31, 48, 57, -7, -241, 145, 50, 41, 204, 70, 140, 21, -29, 277, -7, -74, 72, 12, -171, -9, 83, -102, -171, -139, 64, -321, -102, 93, -20, -102, -94, -111, 15, -240, -175, -7, 113, 84, 53, 108, -4, -87, -78, 144, 14, 28, 28, 29, -95, 131, -80]
1988h0O4k4Q3L0qk14J05K61j02J7q2p1n6J22N5l5mj48p5L14k91J24J63j58k71
2013b81K76N3k25J32j76J43n4K2K57p6k34J39j54K03r1J32J19k40J25K8j0k6k8
2036C4Q5p0j9%m5p5j07J90J08j77J88m4o5o5K45R7l92j50M70k4o7r4J08j88R0
2061C3L5m5K8j87J45J63j39j90J25R5p6k71M60k02k12K00J30k8j58J13k17K92
2083I4j82j69J30J98j71L6mP3r0J31R4k25J02m9J5J98j55K7L7k45K87j1J30j71
2107H0Q1Rj76P8J99j51k3r3K96l21K7MR1l9k13J29o4L0N6J7J5k87J8K26M7l45
2133c09K83n3ROL1J39j88R0J2o8j31J18K57k35p0J86n1j03P1Q6n6j5L9J95J61
2158D04l53L5Q5o1j94J66K4j06k12K72J80l39K31j1j1k31%P3j83K04q6J22j08
$$ y = [-80, -16, -40, 43, 73, 65, -149, -44, 217, 115, 132, 50, -21, -77, 45, 100, 65, 61, -87, -162, 152, -139, -15, 148, -10, -281, -5, 48, -177, -45, -221, -78, -132, -110, 147, 71, -163, -24, -178, 25, -66, 66, 185, -55, 70, 98, 88, 62, 34, 119, 49, 30, 30, -15, -90, -197, -7, 101, -76, 112, 68, 3, -62, 183, 280, -112, -262, 208, 184, 117, 23, 131, -57, 33, 68, 23, 51, -136, 9, 172, 33, -157, -32, 63, -13, -284, 176, -26, -238, -38, 92, 64, -94, 19, -198, 94, -88, -257, -127, 71, -100, -64, -68, 5, -85, 46, 140, -85, 17, -32, -17, 181, 26, 53, 90, -155, 132, 121, 251, 80, 161, 170, -6, 72, 271, 120, 97, 4, 300, -21, 6, 10, 101, 62, -151, -22, -86, -56, 0, 17, 32, -255, -237, -11, 36, -309, -26, -79, -70, -64, -33, 106, -82, 8, 20, -48, -179, -61, 196, -39, -109, 77, 26, -77, -6, 80, 24, 9, 48, 243, 404, 51, 86, 171, 110, -84, 82, 106, 0, -212, 60, 240, -99, 132, 121, 110, -121, -121, -48, -231, -27, -113, 9, -99]
2181i9p2J48J30k97J3J26Q3P3j08K59k57qP0Nk63K06q2K52j70k20J39P3j54J99
2205D6J53k14j16J67J40j72m3j6K49j05j32L7N9m5J5K25j99k26M08j29N7k26K25
2228A58m0j65P8lR3k68J43L0M1k07J30K02k67M2J61n5j23J11o7j61K8P4J37l3
2252C9j97O4J54j26pK04j30o3j34K40J3j6p6K85k99J48J33P0k2k68J11o0m2Q7
2276A08Oj18K20j78O2j36J8P9l2K2k25K07j97J99N5j71p8J86j93J52j17J74Mj17
2300g0o9MJ32J39k89L2JK9J39j31M2l2j82J05K31j48p2K17Qk25J06J25m2j2%Q2
2326A20o8NQ0N4O3k25j14K8J44n2N7j17k59L84K3j73L8kK38l32q1J45qK25j80
2351gP1j85j26J92J16O5N0j72l8L9J02j08q9j50J61mJ67M0k31N6J00j40m9L08
$$ y = [-99, -171, -23, 107, -190, -177, -51, 32, 105, -3, 256, -1, -9, 61, 66, -197, 9, -73, 179, 9, -211, -72, 1, -153, 46, 199, -15, -131, 36, 176, 4, -39, -55, 194, 89, -43, -6, 53, 8, 23, 248, 49, -177, 231, 102, 159, -67, 158, 118, -47, 31, 28, 121, -147, -4, 26, 67, -140, -10, 192, -75, -33, 128, 73, -50, 61, -6, -167, -139, -65, 72, 39, -158, -94, 60, -66, -73, 131, 1, -62, -196, 44, 57, 41, -35, 250, -49, 99, 232, 302, 280, 12, 123, 63, 21, 108, 114, -4, 216, 38, 100, -36, -18, 61, 29, 51, -174, 33, -164, 35, 90, -81, -159, 27, -166, -14, -131, 43, 47, -70, -139, -135, -3, 136, -153, -121, -120, -91, 48, -83, -41, -73, -255, -150, 81, -67, -139, 78, 86, -139, -33, 92, 50, 38, 38, 120, 52, 57, 137, 191, 254, 29, -85, -57, 87, 35, 92, -25, -284, 100, 123, -50, -12, -14, 224, -108, -189, -44, -52, 173, -7, 64, -121, -247, -55, 61, 126, 176, 4, -34, 5, 107, -1, -90, -240, -79, -83, 84, 124, -107, -51, 49, -91, -140, 168]
2375A68q2K9p7%mJ05j16Q7p8M6j31P4P4m6M5j55j38M4M10l18o4K54p3m7L0j36
2401i9P2J40r6O2K0o1J2J34j22j87L2k94M24j59K43j10l20K22q2J70r5j29J24
2424i9p2J05k46L02Q4j30j4Jj4J29J93j29Mj67M2O4J35K6j40M7l7K2k59K20j38
2449g1L61l55j44K91n0K0R7j78J4Koj17J42j8l21K47J09k22J71J47k57J8P3j81
2473b28P9L06j25j63n0J42j55J27J76k3Pk12O5R4pJ74p2r4m5l3R2J3N6j18J43
2498A49j11j24J70o7J08j22J09j39J74Mj87%r9J30j03L2R0R6j50j60O1K24j23
2521c8P3j05j23L21Lr6l9o2n8q8N6QJ95J9r0q3J04j35K03O2p9j14Q1J1Q0N6M0
2548B02k3K0r2o8N4J03j20j32K14k37J44J72k41J04L6j97L5R5M1k98L13K2j67
$$ y = [168, 86, 115, 38, 38, 34, 139, 23, 110, 32, 78, -53, 21, 95, 49, 94, -61, -199, -155, 255, -63, -127, 127, 54, 7, 37, -99, -27, 113, 17, 79, 99, 38, 50, 184, 62, -125, -93, -387, 37, -122, 121, 11, -309, -87, -169, 1, -94, -223, -99, -171, -66, -312, -10, 74, -56, -70, -69, -83, 46, 239, 110, 114, -53, -11, 53, 188, 214, 74, 121, 84, 106, -153, 67, -71, 290, -65, -209, 82, 32, 52, 149, -29, -15, -13, -19, -136, 6, -12, -333, -86, 23, -199, -28, 119, -138, -120, -47, -228, -149, 157, 32, -131, -181, -39, -194, -67, 109, 86, 93, -119, -54, 40, 33, 207, 135, 41, -4, -37, 55, 68, 124, 6, 149, 38, -86, 84, 17, 125, 3, 112, -27, 147, 151, -36, -36, -135, -5, -108, -76, 14, 110, -40, -200, -139, 85, -38, 35, -70, -193, 128, 131, 35, -4, -66, -124, -212, -156, -148, 47, 66, -24, -107, -3, -138, 65, 127, 48, -66, 15, 26, 106, 162, 202, 179, 199, 107, 39, 93, 196, 76, -56, 158, -79, 65, 237, -4, 100, 136, -61, -26, 69, 110, -188, 125, 147, -20]
2571b0j59J93P6q0k9k6p1J09rr7M0O6Q5j84P8q7J03j37Q5J8j92P2K09m9j93J84
2597a5p2J23N7j89K23m1j70J30J07n0k30K08J11l00P3J67j15j0n1J26J8m0j23
2620f3K4N3k11K24L2L8K3nn6j58J0J36j95Q3P8m6p9R2o3o6K03n2L0j9p3j23K71
2647H8k0j13J73k1j95J37J18k04J0K07k66J99j00M9m2J25j89J5Q3k69K24J40j07
2670D2j43J45j0j98O9O8M2k2M6J20j42R6r2O3l7J9j79J81r5J32J06j67K4j13O6
2695B1n1J97j97J69k57K44k30J15J43k24P3M1o8JP8o5j18M3J42k05J11P6j10o9
2719a40J2J31K5Q1l8m2r5O9J08k24K04j89J60O6j86mJ54o9p7j07Q0J53p8M0r6
2744f2j1J1n5K43j59J6J9P2j17q8J96k4p8P0rpj34R1Q7M4l0o1p4J43k8L4p7J50
$$ y = [-20, -179, 14, 90, 10, -19, -45, -116, -7, -16, -113, -73, -7, 78, -106, -28, -115, -12, -149, -64, -46, -238, -166, 43, -6, -199, -15, -87, 36, 93, -96, 127, 86, -84, 46, 153, 103, -127, 81, 192, -108, -35, 132, 17, 7, -44, 82, 100, 60, -63, -39, 14, -197, 27, 59, 97, 120, 115, 59, -99, -89, 47, -148, -65, 13, -33, -112, -20, -83, -149, 54, 2, 32, 13, -60, -183, 88, 68, -45, 128, 107, -88, 49, 167, -37, -27, 180, -86, 113, 13, 62, 20, 145, -44, -29, 54, -215, 9, 149, 42, -101, 44, 34, -164, -95, -27, 15, -7, 39, 159, 17, 113, 21, 84, 47, 66, -113, 68, -27, 105, 211, 44, 68, -45, 21, -30, 167, -30, 139, -118, 126, -104, 11, 154, -70, 3, 44, -24, -23, 55, -10, -128, -85, 57, -148, -37, 39, -71, -140, -128, 3, 28, 109, 71, 29, -66, 3, 111, -113, 91, -98, 62, 128, -58, -62, 92, 23, -54, -161, -81, 72, -6, 34, -62, -73, -62, -117, 126, -33, -17, 2, 74, -43, -131, 65, 41, -37, 33, 24, 17, -117, -26, 61, 105, 75, 14, -60, 83, 55, 89, 12, 162]
2772A62j00j7Rm6l9J12r3jnJ84j56J9k12M49k70K1K2n9O6j14J96j23Q4l9j33Q4
2798Aj55Q2J50J4N8k06Q5j00P3L4j01J64j33J91j39r7N5L4O1n8N0j08J0qJ14k54
2824a83J90j06p1J34j49P7K8P3P0q2J48k04j7O0M1n3J14M6l3p4L1m8j34J75K0
2849E3o2l1J9J7Q2P9j84M4k9j81K44m7L3j20J7J22o3n8J09L6%o3l2j16j9m4J67
2876b7O8L0p6mlJ6M5r1J40j39R1j41Q4qJ5NJ9j85K53r8OL9r8j25L06J9j09N8k53
2905a63J14LK26j42k4o9Q0J6n6o1Q8n1q5M4Q6k4j26Q4J45Q8k67Pk2J73j50J16
2931C0j4o9L0J67j76k0R9P4j10o5J43o4J4j31K83k17K0n1J25J46l24m3R4m7o0
2956a66K79k7k29qQ8J4m6J09j1j20K58j12J57k3j61n8n6J55j65Q2P5J49k51K23
$$ y = [162, 62, 45, 54, 8, -31, 81, -12, -13, -18, 166, 10, 29, -183, 266, -4, 17, 39, -20, 46, -68, 128, 5, 89, 50, -83, 1, -154, -72, 78, 92, 150, -56, 29, -71, 2, 36, -65, 99, -34, 157, 18, -79, -24, 10, 71, 13, 63, -45, -35, -43, 71, -183, 7, -99, -170, -36, -185, -108, -80, -7, 63, -19, 129, -75, -92, -32, 9, -44, 70, 116, 83, 9, 40, -8, -142, 33, 53, -9, -40, -21, -4, 78, 157, -27, 17, -12, -193, 51, 4, 37, -83, -66, 56, -7, -65, 44, 80, 80, 17, -15, -131, -150, -194, -27, 41, 71, -5, -9, -12, 4, 49, -42, 98, -41, 50, -91, -7, -15, 0, 5, 24, -161, 92, -6, 0, 39, -59, -184, 122, 141, 32, 90, -163, -49, -46, 180, 38, 14, -55, 25, 41, -15, -76, 12, -39, -124, -80, 6, -18, -144, -60, 85, 173, -94, -87, -109, 64, -86, 30, 16, -53, -23, 144, -32, -52, 47, 121, 11, -54, 89, 25, 39, -92, 191, -26, -6, -57, 68, 214, -110, -153, -59, -106, -166, 113, 86, -143, -151, -63, -49, -95, 14, 3, -117, 141, 29, 186, 163, 2, -56, -112, 43, -122, -40, 35, 184, -67, 156]
2980A56j46K5J62l92L67o1k45Q5J09j1j29J40l6j17O8j05Q3N1K6j07m6J44J9k0
3004B0Rj57O3K57k50n1J79k11J02J37r6N1n3o2n3J71k1k0J39o9M4k1r5q8J33L3
3030I1j3M1o1j12J70k75K04j12r0J37J54K5k62R9O4R8j83R2p1j60J82O6M0j40
3054a6%K04r8j83M6N8N1J4p8J4N0m0O2j42R1o5J86k09J01J7q9P2j60P8l3J20j49
3081i8q1K0J17j27O3lO8n8Q7J9J08j25o1M0Pj2L6l6L5k1J26o9j69J86k2q0J15
3108F5j5k26K03n2Kn9L1m8K23j92p6p5L09q4NN0j00R2jj50J2L5j4K0J34P5j31
3135C3kj06m9J52j96J54J25j24j42J65J01p9q6P8J10j68j5K8Ol9N5j88J54J30
3159I7k23p3J18l7Q0j7j0O2j18K76k58R6k4j7J96l3k99K95j59j34R5M7K6Q5oq0
$$ y = [156, 10, 35, 197, -195, 172, 111, -134, -49, 60, 49, -80, 60, 24, -93, -25, -130, -47, 4, 30, -77, -123, 21, 40, 20, 29, -128, -65, 192, -58, -109, 70, -141, -39, 98, 2, 53, 0, -62, -115, 56, 35, 15, 154, 85, 129, 108, 13, -75, 58, 91, 78, 119, 58, -54, 116, -159, 45, -67, -157, -20, 134, 159, -103, -4, 60, 158, -25, 67, -4, -164, 18, 84, 124, -16, -16, 188, 90, -93, -47, 11, 62, 76, -2, 12, 62, 22, 84, -58, 33, -32, 154, -55, 46, 63, -26, 46, -114, -36, -69, 51, -98, -179, -159, -42, -169, -106, -109, -41, -99, -12, 7, 115, -10, -71, -31, -24, -36, 0, -36, -1, -22, 104, 35, -134, 52, 30, -50, 65, 50, -176, 27, -25, -23, -82, -51, -99, 124, -68, -144, -219, 90, 6, 11, 61, -39, 53, 52, -98, -86, -51, -65, -45, 89, 164, 33, 31, -75, -124, 28, -168, -14, 111, -13, -155, 10, 111, 32, -54, 24, 134, -34, -49, -21, -15, -54, 1, -187, -33, 97, -126, -199, -81, -118, -38, -55, -65, -3, -121, 155, -103, -7, -31, -48, 148, 115, -184, 111, -48, -182, -87, -40, -14, 71, 65, -15]
3185a5Q0J1Lo8J17k17J15p3P9J3M1o2l7m2K03k19P8J70l92K65r3Q4j28J11l8O5
3211E1mN3m1%k15J23Rr5J44k12J69J0k1k0N3R9r8R0k0r0l0Q0P9J04j16r7o1mJ89
3240A29j57M1q3N7Qk3J81j04p8j14J32oM2j3j6Q4R8k41J02j99K63j14r9L1J50
3265G1M5k15J94r2K1p2M2O0L2o1J11J2k76L2L26j64l3M5k12L04j10R0q5k3L1k85
3291b12Q7K23j70L7pmL6J36j21n7N6o4L3R3O5j82J05q2p6R1Q1l1L6JP2j24J29
3318A51j06J5j2J13j82R4j6j62J90k39J38j27K51L1j50L9k24K68j90J05KL7j44
3341a18k0L88j50j44J24j04oJ46j88P8l9K0R7j33m5J04m7J89n1N9l6j66k4O4J0
3366Hq5J12j61N6l2N7K1m0k3J56k5k48K34R3j01r5J60j1n2L5j18K5J12J0j0l1
$$ y = [-15, 65, 76, 79, 11, 128, -89, 26, -47, 32, 45, 86, 24, -13, -55, 148, -71, 7, 177, -215, 50, -43, 41, -87, 24, -14, 51, 47, 100, 59, 59, -156, -33, -24, -119, 25, -187, -18, -8, -29, -49, 4, 103, 5, 95, 75, -15, -45, 35, 114, 218, 102, 5, -56, -60, 129, -28, 13, -70, -13, -5, -28, 153, 49, -29, -143, -11, -17, 25, 12, -4, 80, 178, -63, 39, -160, 103, -11, -110, -79, 71, 116, -99, 95, 3, 24, -48, -6, 54, 86, 25, 136, 148, -128, -96, 230, 66, 33, 78, -134, 170, 60, 150, 65, 42, 73, -212, -125, 98, -72, -35, -42, -46, -10, 126, 5, -52, 4, -60, -27, 66, 131, -51, 54, -28, -104, -13, 68, 37, 73, 74, 146, 22, 151, 45, 60, 48, 161, -21, 73, 57, -105, 85, -154, -16, -143, 108, 139, -11, 28, -196, 72, -118, -13, -11, 26, -118, -138, 250, 100, -44, 80, -24, -30, 116, -72, 6, -33, -13, 84, -49, -94, 10, -37, 152, 101, 160, 124, -42, -66, -2, 8, -77, 35, -126, -70, -102, -45, -24, -64, -87, 69, 44, -204, 30, 123, 22, -73, 87, 76, 24, 59, -59, -34, 78, 88, 78, 47]
3392D7k18K38l8N1o4l4j07L29j50q3J67l44K52j02O6j51J27J39j18J50K3j72j23
3415a15k2J48j85R9k1J4J68J3j17O5j24K77k24N5%n1q3J36L2j31J0N9j05M7L9
3440a6Q2p7o1Rr0J10J50j31OL0O8j8p8q5m8K31p0j45O9J66k37MK12k30RJ69j01
3467g2J02p2K0Q3j24O6O6l3j40J77o3K15j59m0J58j15j77k7R9n%O9pJ11j21J7
3493B8j12Q9j7L5j48J35M4m0rj9p4p8R1Q4p7J61l4k43P8R8J84j13k2L6n1MP8o5
3521D3o9J76q6j4r3j4L5M3O0r8J35j41N7J6r9l3Q9k0M3p3p3o8Q7J41r8n3O4M2
3549am1K75l43J4K1j64K69k38K92j42M9k0o3L1K44k14j16K25o3K0m1j56J49j6
3573b9p1P1J95k71R9J07j93p3N7Q7n9R8j24L42m50K88j04L2M3m2M1k5J49l38J93
$$ y = [47, -171, 67, 29, 80, 16, -18, -125, 204, 54, -29, 138, -206, 46, -56, 10, -141, -14, 125, 7, 157, 180, 8, -115, -137, 11, -174, -75, -96, -82, 86, 99, -18, 47, -77, 200, -24, 31, 31, -20, -103, 33, 65, -66, -56, 3, -102, -55, -16, 66, -11, -72, -63, -153, -43, 107, -24, -18, 12, 80, 62, -16, -101, -149, 82, 12, -133, -64, 102, -135, -131, 81, -149, -140, 29, -72, 30, -42, -22, 61, -63, 3, 69, 36, -104, 73, 10, 225, 66, 26, 184, 69, -108, -135, -36, -41, -41, 28, 21, 132, 11, 28, -84, 5, -12, 23, -125, 10, 54, 14, 5, -14, -88, -166, -75, 9, -68, 93, 59, -184, -106, -8, 176, 63, 41, 77, 26, 30, 108, 43, -26, 150, 64, 50, -43, -57, -22, 21, 81, -17, 118, -23, 34, 50, -49, -82, 7, -13, 30, -43, -116, -184, -97, 44, -54, -107, -43, -1, -42, 233, -110, -96, -75, -239, 30, -208, 84, -58, -9, -29, -92, -61, 183, -31, -147, 78, 15, 35, -6, -162, -13, -29, -100, -29, 166, -105, -6, 101, -92, -165, -108, -21, -80, 18, -106, 236, -214, 74, -30, 2, 45, 3, 44, 19, 168, -170, 23]
3598B3m7P7p2L2J0jj76J34j45Q4J54j52J89j89OK4L8or6m4J80j74K2N7K7M9N1
3625E5Lj10N0J28l5j37J31j2j7o1j0KP7J8o1R6k16O2P3R5Qj75J00j94J71r3pJ02
3653D3L7j3j30N5lk02J02K1o1J35k3M2J09q5kN0l07K47K18R2k66j02mJ8Q8k4p7
3680d2o6N7J18j48k3K55j29OQ1r7J57k03l0K3J64p6R2k4k50K00Q2J9k37J23K6
3705G8k38J44Q1j67K12j4j06j11P1m7N2m0m1K56k14O3j3J56j75n6J11J6r4K6O8
3730A8Jj35J91l2j3l3M1Q1j19Nl1J02k79J99R2Q7o1k51O0K3J11N9j56j57L81k83
3756i9K3Q8O4r6O7m1l6P4j6k4j24L13k71J1M3J14j88J69K7J3j90K59k23R1k19
3781a71J66q2Q1k9K0l3jM4j39J10N1Pk3m5p9J84n3k0q1p8J47J76m2j29R4r1K27
$$ y = [23, -24, 53, -19, 13, 23, 22, -154, -20, -165, -81, 73, -79, 110, -79, -73, -49, -11, -17, -113, -157, 23, -151, -129, -72, -45, 4, 55, 58, -52, -2, 126, 91, -46, 85, 73, 56, -5, -15, -13, 64, 82, 21, 117, -99, -37, 36, 131, 139, -36, 64, -130, 41, -52, -59, 43, 80, 67, -63, -8, -11, -213, -111, -90, -151, -16, -39, 3, 112, 27, 25, 75, -232, 15, 233, 325, 59, -43, -47, -29, 59, 35, -42, -108, -51, 67, -81, -104, 151, 22, 28, 109, 12, 169, -34, -64, -41, 123, 47, 139, 115, -135, 65, 147, 166, -71, 52, 78, -160, -16, 65, -102, 110, 96, -10, -121, -50, -97, -45, -85, -126, 130, -84, -21, -34, 122, -53, -109, 2, 18, -76, -50, 18, 19, -116, 75, 43, 30, -3, 38, 119, 0, 5, -26, 76, -203, -4, 88, 175, 114, -137, -77, -54, 57, 116, -40, -197, 184, -99, -76, 12, 76, -20, 47, 6, -30, 44, 28, 4, -120, 193, -78, -67, -24, 90, -98, 71, 98, 111, -79, 180, -43, 48, -171, -5, -87, -6, -35, -15, -48, -49, -5, -144, -34, 17, 24, 1, -44, -123, 61, 8, -12, -93, -171, -24, 152, 110, -19, 75, -16, 211]
3808B11k38L4L3M2j74N1J30p9j39K26l8o6j53K73j25J05Pj42m5Q1o7K01n9r5M0
3833A4r6P0p7O4o8r3J36J84j18o3j2R9j69o7K80o7j40K31r4r1J04J8pj68K20J2
3859A02R1l21J55N9J5j36P3j49o5N2O2J8Q1j36NQ6Q7k15J80K6l24J59J19k30J27
3884g9l8J56P7j53J5q4J67p4l6J9j61K55j29o4P1J10j08jJ41n3J8q3L8L5MJ2j29
3911g4J67o1p8j08N0J95m4j77J45j01P8q0RP5p5R4p8pJ53r3L8m6N8j42K13m4j23
3938e6q6K17Pj74J04j88M11j76J50j67j02N5M8n2P7M0j35QQ9k50J58Q0qk33L41
3963A58k25qJ12o3O3n5N7L4r6K7j7j7L1J5j20J02Oo6r2K23Kl1o1q0K43j69j2R4
3991E5k04J56qk27J46n3J52k12J40k03K42J55j02L4j58K6j62N0K16j48J48P2j98
$$ y = [211, -27, 7, 40, 82, -92, -41, 89, 10, -129, 97, 59, -7, -160, 113, -12, 93, 100, -42, -87, -6, -73, 128, 69, -26, 14, -82, -12, -89, -25, -93, -186, -50, 134, 16, -47, -59, 40, -129, -196, 84, 17, -123, 108, 14, -77, 27, 45, 38, -130, 90, 102, 193, -128, 27, 86, 101, -35, 38, -111, -176, -124, -62, -44, 37, -99, -94, -8, 79, -136, 44, 70, -254, -95, 24, -206, -79, -117, 39, 116, -37, -22, -106, 61, -13, -49, -30, -191, 64, -65, -129, -58, 52, -56, -57, 84, 31, 49, -34, 4, 39, 43, 55, -74, 93, 32, -46, -154, -104, 91, 47, -130, 15, -86, -8, -88, -79, -4, -79, 15, -63, -70, 83, -10, 28, -18, 40, -102, 111, 67, -56, -142, 75, 82, -92, 12, -176, 235, 59, 209, 42, -60, -5, 43, -9, 68, 108, -27, -19, 70, -180, -22, 58, 50, -183, 158, -67, -75, 37, -26, 37, -18, 39, 73, -23, 4, -13, -30, 1, 16, -104, -2, 4, -62, -154, 69, 71, 40, -21, -101, 142, -27, -39, 55, -149, 7, -1, -228, -82, -135, 17, -195, -55, -258, -16, 139, 37, 71, -87, -61, -223, -173, 43, -105, 43, 115, -83]
4014h3J47j78J94j64J31j23N7k0l3K09j02L6o2j9N1Q5r0j1O4J4j52J17j10j08
4038a50J29j4mo3J22J00j43P2k9M1j34R9k24L18r3Ql6o4J23K5j69K58j58N1k3
4063D2K7pL6k5j46J19m0L8p2M4o9K68k37j9K4J7p7O3l6J7J11j0j01po1Q4J79m14
4091b52J99p6J22mj15j3k1R5Q6Kl3J69j43j77M7K40j05o2r2J31J1j16K36k83R8
4116e6J20j33k3P3J30r0j49PO0Lr1pJ00K6L6j83J31k9m9J62M1j23J64j19lJ07
4142A05n0j9Rr6K2P1K9J82k66J2K7L8L1n9j1n4O9K0p4j76K52j02j4k4P1o9k1J22
4170B5j9J4r3Mr1P6qP4k01K5J65Q9M0l1M8o0k5j8J03o6J29k46R5p7J40j18o2k1
4198a09m3J25Qj0j61J83Q1L9j27R6l0k03Q2K2R6K2kj04l2q8K56k38J28J10j8o6
$$ y = [-83, 64, -114, 80, -84, 47, -76, -19, -39, -72, 137, 35, 71, 9, -10, 41, 126, 36, 25, 89, 103, -49, 68, -42, -150, -21, -35, -39, -102, 20, 120, -23, 49, 20, 61, -73, 26, -198, 120, 27, 35, -1, -65, 58, 83, -86, 172, 14, 65, 42, 69, 62, 98, 73, -73, 46, 6, 44, -28, 16, -53, 215, -22, -41, -17, 0, -77, -14, -50, -33, 78, 68, -33, -40, -101, -17, 162, -252, -53, -129, -7, -11, -126, -139, -160, -65, 21, 23, -10, 159, 16, -161, -114, 126, 21, -41, -133, -2, 9, -107, 129, -154, -56, 64, -69, -92, -19, 111, 21, -128, -121, -61, -58, -149, -156, -56, -30, 6, -177, -46, -75, -124, 38, 79, -44, 120, 1, -2, 105, 55, 36, 45, -51, -29, 42, 71, 253, -13, -1, 26, 64, 95, 36, 25, -29, 40, 60, -14, -190, 62, -40, -54, -78, -7, -76, -97, 25, 6, 20, -73, -69, -160, -84, -92, -18, -219, -194, -29, 60, 100, 69, 117, 57, 32, 14, 117, 51, 180, -66, 29, -48, 92, -26, -88, -109, -152, -27, -19, -29, -190, -7, 74, 113, -14, 82, 52, -151, -69, -47, 49, 71, 69, -35, -67, -155, 101, -137, -9, 101, 83, 17]
4224A7j22J82N0j05l9m4J37j04J6j56J55N8L5j06J69k49K41Jk56J93n0k9k6p7
4248a09K1J89m4l40J16J67l4M2k9J37j51lN0j29P4J83j06jj83J47Q2k2R9k76J19
4273aR1q0M7m3j09K10j34p6j60K99k34l5J98N8p6n7O0j80K41p0J06j82K37j44
4297c4K70m69J22p2kK48pm1L7o3p3Q7J23p7j01j8J17r8J6Oo4J92j07p8N9Q6j3
4324D6j44K15p8j0J00j15M0J8k26J17p4O5p7J70k28J59J1J30j65K7q6J19K6j0
4348C0K8j03J8RN3j41J89l9roJ48k20j9J07j03J31L0j79J14J58k40Q9n1j01K3
4373h4M0R0m8M2j15j3J03n4K9l0K9J06j95L22k52J21j75J60J08j84m1R3q2l5Q1
4398A6o0N8O3r9N7r7R9p7N0J1p3l6K26j49m3j12K06j1K2j29Pj93L09r1m5K00j6
$$ y = [17, -105, 77, 127, 22, -17, -61, 76, -28, -12, -168, -13, 45, 80, -26, 143, -106, 135, 136, -120, 73, 23, -6, -32, -109, -88, 101, 57, -283, -167, 0, -34, 8, -21, 116, -35, -38, 12, -117, -43, 140, 34, 33, -150, -3, 79, 57, 156, -120, -1, 90, 10, 57, 14, -95, 115, -19, -95, -255, 44, -190, -225, -27, 31, -45, -102, -42, -222, 19, -51, 55, -127, 110, -34, 236, -233, -111, -183, -185, 63, 56, 15, 52, -11, -84, 3, 126, 49, -52, -70, 47, -51, -35, -29, -93, 99, -8, -86, -27, 59, 46, -98, 117, 39, 29, 129, 14, 54, 72, -154, -37, -111, -46, -123, 47, -181, -22, -11, 119, -46, -19, -105, 14, 40, 30, 58, -45, -27, -18, 35, -106, 83, 44, 35, 29, 177, -43, -62, 45, -58, 73, 103, -76, 38, 196, -44, 45, -6, -107, -84, -44, 46, -2, 40, -75, -88, 15, -39, -10, -40, -11, 95, -100, 222, -30, 91, -84, 76, 184, 0, -41, 52, -30, -65, 16, -44, 14, 77, -22, 35, -62, 37, -40, 10, 21, -52, -88, 138, -11, -54, -166, 40, 29, 51, -78, -71, -264, 45, -46, -91, 109, 93]
4425I3r7K6K0m5J49k9j54J77j68n1J82N4k23p6K02l6N5J10j52k96K54N7j56K2
4449h2K18j81L3L9k0j5L2j18Q9L3L6j74P3p9J13K6p7L9M0k48J81o3Q6jK1k6J19
4476I4l5r7OPR3O4kj14j07q0K45k57K07Q8j49J3M3o1J03L0p4j34J84j05Q7r4j05
4503a50j16J88r5J60o8m2M2K26j73J86j35j4j17J05m9J65k54N8P1k1J15k34J53
4526AJ18k63J13o4P7j22L3R9rj93K77j9O8k41nk0N8m1kO0R7qM1N0k1j69J81L4
4554A30r0J29Pj94Q6K1j02R8O3j16lj22J94m8Pq3J06p1L0j30K50k32J11r5J6p9
4580a17J97O6l37J63J20p2o4r4n0K97j08L4j0o8J61j46J24j47K4k4OJ60L3k02
4604e4q1R6k8J20j80K51m6J0m5J68j73o7J88r7j50K60l21J53M1j52K17r1K5m4
$$ y = [93, -4, 22, 42, -3, 146, 117, -37, 140, -28, -79, 103, 157, -66, -142, 60, 24, 79, 189, 37, -259, -5, 52, -104, -82, 136, -45, -12, 27, 7, -8, 24, -94, -5, 28, 64, -110, -37, -116, -3, 23, -54, -15, 25, -223, -42, -105, -19, -20, 1, -25, 94, 59, -38, -32, -25, 68, 132, 130, 16, -91, -171, 74, -183, 24, 112, -37, -24, 19, -42, 61, 91, 17, -117, 67, -38, 49, -45, -150, -266, -78, -173, -13, -81, -123, -81, 145, -28, 158, 23, 9, -108, -3, -52, 113, -141, -83, -12, -33, 82, -152, 1, 119, -144, -31, -95, -18, -140, -107, -8, -17, -210, 67, 48, 116, -125, -130, -150, -92, -133, -135, -75, 22, 14, 55, 105, 84, -85, 96, 130, 40, 169, 176, -18, 68, 89, -13, 85, 148, 32, 29, -93, 101, 53, 60, -23, 83, 12, 42, -88, 162, -70, 41, -54, -38, -117, 80, 146, -191, -28, 92, 20, -44, -138, -188, 109, 1, 35, 25, -43, 118, -28, 96, -51, -27, -51, -45, 115, 148, -54, -135, -39, -67, 53, -127, 124, 78, 88, 43, 211, 38, -29, 159, 62, -88, 172, -149, 4, 45, -107, 110, 19, 44, 0]
4628@J57k67Q9N4j45J94J3p9J25j41L5j53J32n0R5j43MJ01l5J46k03O4J37l7j02
4653ir6o8J38N5rj26Q2L8m7J55k86J36l4R2l0L9o7K1jk44K92Q7m3j31L7P5Q2j75
4681c7k9J36n4k08K25Q9j17J24N0k98O5RL4Q9j95M6m5J05Q3l0j15J4P3O3j50J70
4707I7q3L8Ln1O3r5j01J78j75J47j4j8J1R5o4J6j25O1L7j8r8Q9J13j17P8j06N1
4734A2j4L0K6r5nM4j30R6N2q3m6O5oQ0n4m0J01M7p0K3j68O2M9P7m0l3K3o6Q0j17
4764a00J56J15j96R2n5j2j58J43J49j39l6J49qj45Oq8P0PP7P0ln3N8O1p9M1j12
4791A0N9Pk4o5l2l1M1l7J83j05p1J14j13J18r4M6j75R0J5O9l7j2l0N4J05j49J9
4818d5J5K95k84j6M9R2j7q1p6J78j09oL7m8k0L9l7j33M5P6K4Jj59J40J40n8q6
$$ y = [0, 157, -110, -21, 33, -112, 82, 95, 16, 141, 0, 35, -118, 14, -36, 59, -84, -80, 21, -14, 132, -71, -7, 130, 93, -9, -105, -173, -35, 20, 11, -115, -33, 5, -42, 113, -173, -37, -71, 21, -9, 30, -37, -16, -17, -261, 31, 118, 75, -56, -19, 56, 138, -37, -66, 70, 16, -192, 33, 122, 5, 129, 179, -119, -54, -45, -11, 78, -117, -71, -116, -11, 72, 42, -73, -59, 14, 77, -73, 97, 14, 52, 55, 4, 67, -28, -129, 49, -126, 21, 7, -11, 0, 95, 31, 47, -78, -17, 20, 2, -96, -7, 106, -11, 67, -39, 12, -2, 28, 54, -41, -46, -2, -132, -36, 16, -67, -113, -48, -54, 26, -28, -68, 33, 80, 10, 33, -135, -73, -24, 53, 13, -20, 3, -63, 17, -100, 56, 171, -25, 67, 12, 0, -158, -15, 134, -5, -41, 108, 100, -45, -39, -127, -57, -50, 27, 97, 94, 41, 99, 160, 81, 122, 10, 69, 76, 52, -13, -45, -76, -35, -72, 111, 6, -65, 49, -64, 54, -40, 6, -169, -79, -64, 5, -32, -44, -74, -20, 85, -64, -45, -30, 265, -19, -35, 14, 106, 89, 8, -68, 110, 1, -5, 32, -16, -36, 3, -34, -167, -122, -46, -22, -21, -180, -40, 100, 42, -44]
4845d4MK0l1j07L8K3P9K1j25PJ13R2jq8M5r1P2o1lJ52j4k00J40j28Q3N1P9k22
4873i6Np3N1J1O3O5o9M3j6J65k12J87k11O2K8L1L5pp2onM7m8J22J18j98KJ15k00
4902f3P4LQ5j6j17kJ82k27J53q0r5J88k88J75n0k4J51J04k31K83j61p2Q9Q9q2
4927F8o8o2J76k38K09j18J36M2m8m0n0l7j7L5J91j25j43j21J88O1qj31L59n26
4951b67J33r5K32k63L30n8N9j67M0k5K33l3j00J22j90j2J16m0K5j24j51J90J56
4974A11K2k58K20p3Kp2K0N9j6j15K07j29J22j26Q3j68M3J26j40J03j06M3J06K
4998F6J9j27n1OP0r3R9o6L5J51k4o5j34J43N9r9O2j37J22J49j77N5K0j40J70J0
5024A23q3L4j2q7J18j26J07r5J75j02j81J72o5p8J46m8l8j51K44q0o5K24j67Q5
$$ y = [-44, -40, -20, -51, -158, -120, -97, -18, 3, -122, -115, -2, 90, 89, 1, 46, -45, 27, -34, -37, 115, 101, -99, 41, -87, -4, 47, 126, -96, -91, -164, -113, -102, -39, 26, -43, 0, -16, 149, -63, 124, -87, -25, 3, 34, 69, 62, -10, -16, -21, 26, -22, 100, 218, 20, 22, 137, -63, 11, 14, 99, 83, -34, -36, 146, -81, 72, -8, -103, 85, -203, -28, -78, -102, 49, 153, -78, 205, 44, -28, 61, 150, 68, 0, -62, 114, -124, 85, -33, 103, 145, 97, 57, 7, -30, -47, -12, 179, 54, -89, -210, -22, 39, 31, -100, 259, -267, -134, -229, 3, -260, 70, 12, 71, -96, -56, -81, 152, 119, 19, 141, -49, -61, 55, 15, 40, -84, -235, -45, 111, 133, -125, 95, 22, 24, -48, -28, 31, 15, -100, 107, -22, 100, -26, 57, -111, -68, 58, -82, 21, -85, -42, 64, 66, 85, -42, -93, -87, -17, -110, -11, -77, -42, 109, 85, 20, -114, 29, 88, -11, 51, -86, 36, 185, 8, 63, 83, -57, 113, 123, 40, 74, 62, -25, 93, -33, 74, -21, 154, 52, -129, 43, -22, -100, 46, -2, -40, -191, 53, -27, -92, 132, -35, 50]
5048E0j00J6L0L6j30J71j74J07oO7m8J26j23m6j55P3L47l01L3K18j00K1k9l4J05
5073A54j79j8L2j18J94K0o5n2J84r6p3J00j89J37j92K54r1r5M2Q9nl4O5R3j05
5098E2r3K58l72L04J13l10o5J21kJ74j81n4N6Nj33R1k17J64J71j98k6K07N8j35
5122a2n8J09J3k26p4K39rJ7Q1j19O8k0O1j65qL83l69L21k24NN5j92K06J7j2j04
5148a7r0J19K6j40L1KJ48j13o2J05J51j49o1K5J02k58M6K68j64K51j94Ln7P1J58
5173B01l23N8P4p5j9J56j13kK03k31J35M5j48J22O3j37J2J17j72p7RML9J20l2
5198B9R3j02J20j72P9n8j41K47j70p8J50Q9Pj23k5Kj14J43K5o0K13r2o3J36j30
5223Ej28j6J18o4M3O3q0l4J60j13L9mK94k47k3k7j2J25r2J31L1k18J48l2j66M3
$$ y = [50, -50, -34, -4, 32, -98, 73, -101, 6, 0, 67, 19, 145, 22, -24, -179, -106, 241, -60, -27, 191, 91, 112, 83, 49, 154, -25, -43, -11, -129, 65, 85, 20, -32, 152, 56, -17, 83, -106, 31, -161, 93, 2, -93, -51, 38, 33, -1, 64, 157, 52, -41, 217, -155, 149, 262, -48, -113, 8, 6, 180, -1, -55, 1, 6, -127, -36, -253, -89, 82, -116, -142, 65, 123, -12, -70, 39, 52, -174, -248, -9, -18, -1, 80, -39, 29, 9, 70, -95, -103, 280, -89, 232, 8, 13, 68, -124, 82, 99, 87, -17, -107, 12, 38, -102, -71, -69, 79, -34, -96, 9, 160, 11, -50, -25, 77, -181, -135, 133, -31, 220, 26, 29, -28, 43, 201, -122, -64, 10, -65, -84, 72, -41, -43, 160, -71, 64, 109, -39, 83, 146, 9, 21, 138, -34, -111, -102, -98, -59, 61, 29, 122, 20, 140, -32, 47, -11, -152, 95, -75, -153, -3, 86, 93, -30, -55, -53, -167, -24, 1, -59, 154, 62, -1, 135, 5, -123, -139, -21, -85, -42, 21, -59, -93, 67, -46, -7, -11, 283, 36, 13, -14, -26, 99, 7, 138, 169, -49, 99, 67, -99, -56]
5249e6p0J12M7j0N9l9j60J37Ll1J70j4k58O5J45j29m9M5M4L8l4R1Q9k48j25N6
5275a22Q9oq0K58k81J06Q6n7K9o8j6p6K36j54k0O1OQ6M4j30J1M7n2l7J13p7J07
5302A03q7n4J13p3j2O7j29K35k23l6m5J24j20K24r4j14J04m0R8l5l3m7J49j14
5326c9J02J33k23O4m0J32l40L0P7J97k77J70o0N6R2j1m8L4M5k07J32j31J52k11
5350a71QN4R6J21j07N4J8q6O3j65J20j9q9Q7o2r0J82j68L22j61j5k4M7no1P6L
5377B8m2JO3L0j46J36j04K6mn2j00J63k11J97J16j82P1o9J62j28Q1J71j20j3j75
5402a01j01J76J24n9j87J51J06j09J35K2j73j33J44j17k6J53p4R7K3j07r1L8L2
5425g7K06j6j41J5P3j95J46J12j90J61j61P7q6J15j25J25r1J56j12J14j86J83
$$ y = [-56, -126, -14, 33, 23, 82, 43, -117, 20, 23, -8, 162, 148, -110, -45, 100, -29, -78, -33, 11, 49, 15, 106, 195, -53, -178, -122, -33, -39, -119, 139, -142, -36, 50, -7, 22, -46, -62, -138, 98, -56, -76, -15, -9, 77, 121, -9, 2, 49, -3, -40, 73, -4, 103, 16, -38, 75, 2, -10, 57, -72, 163, -60, -96, -141, -17, -137, 87, -7, -121, -17, -57, 41, 6, -27, -74, 75, -39, 63, 196, -27, 37, -3, 129, -211, -181, -104, 93, -184, -14, -74, -18, 74, 63, 15, 49, 94, -113, 19, -112, 40, -171, -163, -109, -13, 108, 1, 55, 73, -13, 50, -115, 5, -14, -103, -16, -78, -168, 14, -154, 168, 7, -8, -32, 15, 10, -51, 25, 28, -14, -13, 50, 80, -66, 70, -34, -8, -12, -64, -164, -1, -212, -15, 101, -81, -10, -79, 83, -45, 36, 207, 87, 74, -101, -202, -26, 98, 39, -148, 3, 109, 0, 135, 157, -16, -149, -5, -122, -148, 5, -69, 28, 51, -56, -147, -109, -77, 129, 113, -28, -13, 60, -135, 11, 123, -67, 94, -67, 10, -76, 39, -86, 39, -52, 104, -8, 106, -80, 103]
5447A03j38j9R5j53J62j14Q5j30j12L78l08R2J91P3j83l1j23O8K8j74K12J29p7
5470E4r2Q9K1k25n0K73q1k02J31l4J98L2j31K4j00JL8l9O7l0j01R1l0K63k45J17
5496C9j07m8J02J55r5j05Q2O0j20J68k09k0K6P4q9NJ04O9j14q0K03n3k1Ml4j57
5522a61K35m6J47j23N3r3L0jj19k5L4J04j18k8R2m1K62k10l2J4j7J00j60K38j28
5547GO8j58RK18ll6j10J9R3o2O4j64P0j79J39K13k29L2O4r7J03j07P5R9q7q0L8
5574aJ47j34l9J19j52O7K6Pj21J69j96R1j9J03q3j28l1L25k37k4K21k12J09ko1
5599e6Q4nj28Q4J62j89O1M6j13Q3N7k35J60L0O6p8P6P2k63PJ07Q9q1j07K3J70
5625A22r5j17Q1M1j15P9K0j96K60J09j92K0J6j9J09l2j25J18j04Q7r8p3p1K27
$$ y = [103, -35, -54, 41, -112, 50, -64, 21, -109, -221, 157, -151, -59, 132, 205, 22, -9, -132, -64, -36, -210, 2, 131, 54, -38, 51, 72, -153, -203, 70, -11, -213, -82, -116, 82, 114, -17, 7, -93, -92, -54, -93, -26, -56, -157, -66, -96, 167, -78, 39, -68, -116, -14, 141, 46, -59, 23, 83, -37, 131, -78, -98, -72, 2, -87, -82, 22, 91, -23, -103, 100, 47, 26, 30, -4, -161, 74, 28, 175, 52, 105, 12, 42, 41, -78, -103, -69, 35, -83, -111, -19, -60, 202, -8, -40, -26, -43, 57, -103, 135, 7, 75, -83, -74, 144, 141, 105, -5, 14, 107, 45, 109, -55, 15, -164, -25, 188, -41, -9, 55, -42, 61, -46, 29, 128, 41, -39, -1, 146, 12, -27, 92, -60, 7, 33, 40, -81, 88, -108, -17, -36, 67, -16, -144, -175, 150, -87, -111, 110, -102, 7, 5, -56, 28, 23, -105, -21, 141, -48, 13, 59, -54, 29, 86, -149, 11, 41, 107, 29, 105, 177, -86, -79, 28, 117, 36, -71, -48, 122, 27, -90, -9, 32, -83, -4, 16, -180, 80, 189, -3, 17, 33, 14, 123, 91, -34, 84, -20, 67, -31, -104, -175, 52]
5649E2j29M8O2J1QjPk76J71o6O4Jk10K81o1J93m6j52o6J21j54J70J67k73J01k7
5675dJ30p9k9j71R8J34q1J47j03rR9j15K7l1p7r9J07n6N7J54r9oj3N9l4O6j46
5702g4J24k2J91j90R8j89o1K05O5l8k25jQ1Q4k3M0j73J84q3J60l5k79o3K93k49
5727a80K43k9o1k07J07M6J35l1j3J3P7p6K2j30J14j28L8J27O1M9n9L3j71O0r9
5752e9M0Kk7j63K56q4R5j89K33j30J02j22l1R3M2q8n0nL4J52r8M1k0Pj15R2J9
5779B7n5J49k62K03J2J1j27q5J52q6M1j7L1N9J36j71p3Q8o0rO7l7j00R4J04j03
5805a1mJ3lk0J27k17J19J40j75M0p1M0J13o1P6j19M7R1k22J21q9J03k7qm0j2J26
5832G7n6j31J67N1j57j95K34J7M8k04J26K03j62j02J10j91Q4J97o7l9j1P9j66
$$ y = [52, -77, -29, 33, 44, 52, 51, 58, -218, -47, -113, -49, -48, -258, 23, -38, 155, 109, -43, -109, 12, -142, 28, 195, -78, 23, -4, 126, 47, 18, -153, -55, 79, -2, 145, 42, 33, 132, 17, 44, 13, -64, -163, -56, -112, -55, 99, 0, -6, -19, 40, 6, 72, -74, 50, 28, 219, 29, 127, -62, -123, 82, 147, 109, -116, -117, -36, 48, 25, 65, -108, 76, -7, 153, 118, -161, -224, 69, -180, 63, 34, -27, -234, -127, -81, 54, 23, 10, 23, 100, 24, 46, -84, 30, -98, -60, 67, 128, 177, 118, 151, -20, 40, -59, -19, -17, -44, -207, 49, -35, 60, -129, 104, -26, 76, -46, -77, 16, 58, -30, -80, -85, -51, 101, 3, 44, 24, 31, -84, 8, 27, -28, 121, -141, 62, 74, 85, -42, -127, 25, -61, -20, -37, -6, 53, 189, 18, -55, 33, -27, -36, 31, -6, -106, -12, 92, -11, -15, -2, -5, -25, 102, -115, 4, 144, -31, 9, -62, -22, 91, 30, 106, -13, 34, 125, -97, 24, -65, 38, 11, 3, -37, -49, 77, 21, -110, 57, 108, -49, -244, -10, 7, 55, -149, -23, 180, 18, -84, 26, -165, -81, 116, 49, 10, -1, 78, -88]
5855h8n5P9JN5M7qk7k24J61l6K08j22l4P2J46j14j62K99o6j72k8J28O3n4K6q3
5881A2r3R4j87Q9o7j27K65n1L0J59k89J66o6J65q2J7k8L9k2L0N5l13K36L3o9J54
5907A50j66p2j00RK78j44K2j4l6J39j40j03N1J01p9PJ76j07Ojp1N0K29j25j85
5932a25m1Q2k1L9K43r4j65M0m7n8J37J7q3l3K43o2j40q3J96j08p7J07m6Q0K8n4
5958b5qP5m9O3r2j4m7J42l70K25N6k7J77k05K07j35K08k22RN5j98K67J3r6R2j51
5984e0J96j41j46J61j8k1j5K8K1Jk2l7mN7Lo8R9R5j81j59Q1Q7j02J53m5Ql1n7
6012a07J39j29QQ0M8J78k50K5R2l3r6j0J0M6l3K31p2j80J2J14j50J68Q1j73K11
6037B10k19j8J66k10J51p1j27J36L4j12o0K00o8j8nJ68j25j51J50J70j37n3j24
$$ y = [-88, -143, -64, -63, -8, 39, 31, 4, -220, -59, -95, 113, -9, -43, 29, 175, 61, -101, 198, 132, -40, -68, 60, 123, 69, 95, 12, -81, 13, -174, -85, -152, -279, -14, -65, -35, 124, -165, 1, -65, 100, 18, 35, 7, 46, 24, 54, 109, -204, 32, 65, -4, 150, -16, -88, -188, -179, 99, -45, -23, -37, -73, 66, -74, -177, -126, -25, -104, -97, 79, -28, -22, -23, -94, -44, 185, 60, -125, -166, -84, -105, -66, 177, 83, -82, -42, -89, -147, -10, 7, -76, -109, 134, 72, -68, -151, 45, -63, -140, -33, -79, 1, 29, -25, -33, 42, -7, 56, -36, -50, -97, 45, -325, -100, -44, -71, 106, -99, 108, -27, 181, -41, -32, 23, -175, 92, 105, 9, 101, -50, 146, 5, -141, 20, 2, -19, -34, -6, 15, 16, -6, -43, -47, 10, 13, -55, 44, 139, -42, -201, -120, -33, -135, 18, -27, -19, -50, -107, 32, -97, -89, -9, 39, 217, -33, -8, 84, 51, -45, -55, -45, 1, -32, 199, 127, -53, -41, 73, -77, 91, 172, -1, 210, -9, -27, 139, -71, 80, 9, -118, 18, 52, -60, -120, 80, 12, -6, -11, 157, 32, -119, 31, 201, 64, 11, -113]
6060a13M2N1j56K18l2j45J30R0n5j5j82J08J95j7k3L8k22J24m3J03j94K8J33j44
6084h1J44L6o1J5j38L5J9MJ40o1j01J91n6j05o1K29k02K86j6k13J04n3q8J68j44
6109iK1j55n6J27P9P1kp5j1Nn8j14J03O6J54k42l5K10q8Q2k5n5N8qr1J14Pj66
6137i3J30P9j51Q7J9j67N1P7o1m1K95j96k8l2J00k9j30N2Q8R4r0j39J86k16M9
6162f6qL8r9J39J34l47J84j16K4J03J37k34J60q0Q8j73Q6J12p1L9J48q4p9k2N3
6187F6j62M0J43j61Km1N4K13j64j7qO2j72J79l2M6m0k8n2J49r7J11j55P2L0k89
6213b51L75o4m7m2O0l1K7j96O5N7j3J70oq6l5N4j51q3K04n6P5l0J58j61L8m1n3
6240f3p8O4K05m9q0mmkK2m8O4j32J90j63N5o3K21k30J38L2j65J31k3j15J93q1
$$ y = [-113, -71, -20, -176, 42, 10, -135, -5, 85, 30, 15, -167, -59, 136, 119, 96, 134, -88, 36, -7, 96, -98, -70, 63, -81, 63, 99, 38, 53, -85, -50, -31, -27, 113, 52, -49, 142, 86, -19, -80, 149, -53, 233, 217, 4, 108, 55, -33, 135, -9, 12, -143, -199, -72, 7, 78, 76, 1, -10, -5, -63, -177, -74, -8, 146, -96, -131, 79, -9, 73, 48, -7, 51, 43, -48, 66, 73, -93, 37, 116, -35, 52, 71, -96, -45, 32, -29, -70, 225, 29, 1, -31, 69, 40, -90, -38, 50, 144, 54, -85, 101, -115, -66, -74, -36, -135, 4, 138, -209, -25, -141, -117, -14, 123, -111, 49, -31, 57, -116, -30, 82, 11, 50, 198, 114, 35, 13, 66, -96, -56, 87, -74, -72, -113, -59, 154, -10, -27, -35, 27, -145, 34, 2, 48, 8, -20, -72, 77, -20, 91, -64, 8, 38, -251, 124, 60, 13, -29, 31, 0, 27, -169, -104, -47, -60, 110, 104, 18, -17, 37, -114, -197, 7, -49, 26, -4, 154, -7, 31, -10, -63, -141, -77, 128, 79, -1, -5, -9, -11, 11, -37, 27, -105, 85, -78, -23, -86, 135, -95, 43, 75, -90, 41, 18, -97, 96, 15]
6266A5j42Q4J71j48J27n0rj37N9O6o6r2J73P5j06R8j22rJ17o5j64J12P2n5L6j4
6292B6j21M0L29k35k9m1o2m1J69j44J19n1K5Qr4J22%J63j57m6J83k21J78j05J5
6317C0l1k8P7j34M0ok9PJ90k31N4Q5mj03n3J82o4P3pj22M3q5Q7K13l04J94j17
6344d3Kl8k2N0J8J44j01P6j09J15n7j37K57k61O0Q0J6j56K07r1J49j37j02J09
6368B9n4q1J04N7j70J14j97K27JjL9j09l9j05J9K95k34Q0n5K6j0J15j9mo5Q9q9
6395c7P3k9k0J70l03J72L5j18J29j25J45j93KJ29O8r4nk6j5J41k16J9O3qJ09M4
6421A10l4j12K6j29k4M9J02m0L38l38l8J85k20J01j30O8J43o6j28K65j87J97j43
6444eJ35o0l9Mj49L9J04j92K20j74J79j51J68r4J11j91J48J3r4k8j08J79O2o1
$$ y = [15, -127, -43, 128, -20, 107, 57, 48, -89, -30, 36, -30, -122, 51, 126, 20, 118, -4, -13, 104, 39, -125, -13, 59, 4, 40, 26, -95, -55, 274, 39, 10, -31, -93, -134, 35, -109, 10, -41, -16, -8, -102, 20, 20, 183, 26, -20, 163, -58, 120, 15, 30, -1, -29, 48, -86, -46, -52, -81, -74, 116, -115, -61, 24, 20, -83, -136, 46, -18, 55, 48, -74, -31, -116, -29, 184, -120, 74, -43, -41, -79, -101, -51, -33, 111, 10, 86, -23, 92, 35, -102, 155, -106, -46, 34, 50, -106, 101, 10, 159, 22, -80, 29, -25, -106, -2, 55, -115, -1, -198, 29, 30, 29, 68, -41, -80, -185, -166, 129, -105, -25, -80, -54, -64, 51, 32, 28, -37, 52, -37, 36, 7, -13, 157, -146, 26, 61, -57, 72, -53, 92, -101, -99, 30, 98, 4, -1, -27, -42, 99, -117, -98, -35, -43, 66, 110, 76, -36, -10, -139, -163, -114, -12, -52, 286, -52, -90, 95, -125, -24, -154, -86, 57, -9, -137, 128, -59, 138, -5, 130, 70, 31, 35, -114, -75, 29, -163, 57, -117, 62, -89, 79, -15, 96, -95, 53, 66, -28, -56, -164, 15, 77, 16]
6468A6Or3p1R5r4O5N8O7M5j02L0m8J21J0j38M2m7n1J29j41J87j31k9J22q0O2j59
6495a29K10j55M5O2j9o5L6O0j06J26k72Q6J98j92J80O2p0P5j42m5O9K0j18Q7l4
6520c1M8Jk33K65j34P2n3J07P3m5m4m3j23P5J52j4k44jK30m1Q5j73J4J19n2L9
6546D9m0o0J3M5lj95K37P6j42l0PO7j5L9j66K18j19j3M0RN5lp7j1J20j61J28o4
6574Dj37J60j85K53p3j43J48l2rR8r8q2K05k10L8O7M0r5P4J9n0J04j44q3J87j44
6600h8J59K34k41j70J26O9M0o1m5P9k56J42O1K5j00Q1N2lo5J3k53K45p3J22o0
6625C3j8L6r4q6j7K55M9k45Q1k8K2K8j23J96L3q7k9O4rL2l08J29R8J02N3l46Q3
6652i6j27K51l5J33P7j35kj35K21j59j26K51k85J42O2Oj44N5O1k5j20J60q7P3
$$ y = [16, 22, -71, -142, -47, -141, -76, -18, 49, 94, -8, 22, -26, 95, 105, -33, 9, -38, -89, 40, -101, 86, -45, -74, 48, -32, 30, -129, 81, -74, -29, 33, 14, -51, -15, 45, -61, 65, -207, -121, 77, -115, 65, 127, 57, 132, -10, -55, 14, 34, -84, 3, -31, 17, 18, -215, 50, -84, -12, -65, 42, 115, 70, 26, -17, -140, -65, 87, 73, -171, -172, 58, 17, 102, -71, -57, 62, 10, 49, 9, -51, -38, 7, 4, -191, 46, 122, -20, -50, -43, 24, 9, 48, -118, 100, -19, -32, 8, 17, 72, 69, -8, -19, 101, -60, 68, 4, -133, 27, -158, 95, 22, -121, 27, -5, -14, 84, -14, -96, 109, -101, -63, 4, 44, -51, 23, 42, -8, 96, -48, -131, 56, -88, 71, 305, 64, -106, 20, 89, 129, 68, 23, 102, -154, -12, 49, 74, -26, 55, 107, 104, 39, 52, -201, 44, -29, 93, 33, 15, 51, -43, -129, -146, 109, 158, -87, -6, -34, -12, 16, -107, 89, 122, 35, 6, 70, 61, 93, -215, -86, 12, 114, 167, -179, -96, -223, 28, -7, 126, 203, 68, 66, -69, 152, -7, -133, 118, -167, -25, 37, 43, -101, -46, 15, -10, -130, 30, -57, 16]
6676A6J45k01P6L2j32j27J08P9n3P1N3o7n2q0k2K83j96P3l8R4k41J47L4r8L01
6701B05m04K54J4j31j4K46p2k20J16j28K13n2O4O4j33rJ8j83J08J85L6k8j50L4
6725C3k41OR2J10k2Q3r8Nj37K80j48Kj3RQ3j23n6jrK30j41O3o6l8J7oK06k26K52
6754A46k00R6M1n0q3J05n6M6k2j24L1MQ3p9K04k08j58N3J86n3K8J86q8q0M7j52
6780i7O0j4J65Qj47r2L8j41L93j24J0q9p5J53j54K55k88L36j92M8K05l87QP5N1
6805Ep2K01j82LJ3N8Q2j97q4K17J1j24J88k51J77LM4q7J25k32J77k3pM9j2j91
6831a09J88q2JJ2K5o7r5J31nK16l11P3%j48J00j30Q4K27k68J81j9k3o8J8K19k45
6857i5Q7j4k7m2K4rO7L5j76M2r1J55O4K02Kk24J7j37J89j74n5K52j8j46q2K8j0
$$ y = [16, 161, -40, 36, 68, -64, -191, -83, -4, -57, 14, 67, 0, -52, -132, -154, 129, -67, 6, -32, 62, -179, -32, 2, -96, 205, -199, 55, 69, -62, -76, 170, 98, -122, -6, -134, 79, 27, 91, 155, 22, 13, 31, -152, -44, 141, 177, 149, -1, 33, -208, -202, -110, 0, -22, 61, -37, -32, -169, 111, -37, -35, -48, -39, 44, -79, -135, -136, -145, 85, -56, 7, -59, -97, -80, -86, 120, -106, 146, -54, 42, 83, 33, -50, 55, -1, 45, 23, -101, -70, -66, 17, -62, 142, -66, -224, -171, 15, -38, -10, 176, 88, 8, 55, -97, -37, -51, 114, 122, -25, -117, -79, -220, 173, 49, 59, -30, -105, 48, -106, 149, -139, 197, 5, 53, 258, -129, -121, -46, 5, -67, 134, -48, -45, -32, 26, 108, -89, -173, 44, 55, -69, 119, -132, 45, 48, 92, 5, 130, -102, 75, 52, 45, 94, 82, -109, 79, -3, -2, 10, 35, -32, -127, 4, -1, 215, -96, -23, -23, -171, -71, -201, -117, 110, -158, 23, 4, -19, -87, -69, 150, -95, -8, -22, -49, -91, -67, -76, -9, 26, -150, -108, -199, -44, 20, 222, 224, 0, 17, -120, 69, -105, -160, 92, 74, -72, -154, -126, -136]
6884a36O9J15n8K2j44M9J36q4K4J04k9j25N8M8K5r7k6j13j5Q7K57l01J19l0J50
6909A05m6j41K33j52K6R3j41j51L08j27Q7j23R8m8N4Po9J34j29m4n3Q3M0q0mn6
6935i6Q8j87K20Q4j50j0j9J33k8J67k34q2J24P8j22j9J24k34J08J74k22J0OO9
6959a8j56K16q6O2J21j28%J2k3q6j0LJ37j61J77P4j45j32K59J3j31j41P4p3J94
6984E2L5r0K6p8J6J07j48o4K49j28K3j16O5Q8qL1j09j85J95MJ35p0J05j45Q8m1
7010C7RK2r7PK9ro1K50ml12P3M6K3j25N7J4J06p8J31r1q5J37k71l0L46j87J17
7037E4j50J39lk71L19k08J45J65j04q7L1J2j99Q3N5or3O3Q6J0M5j51J13j26J62
7062H4j53k8J47j28R5J0M0n2J43k80L7J67j26N3j51K06p4Q5j00j12K38j64j48
$$ y = [-136, -67, 48, -10, 12, -132, -83, 53, -31, -7, 97, 68, -57, 1, 49, 74, -23, -49, -162, -177, -90, 167, -134, -15, -45, 105, 59, -82, 151, -1, 25, 118, -23, -174, 134, 7, 94, -29, 69, 21, 75, 82, 13, 147, 18, -26, -79, 4, 44, -36, -40, -96, -8, -195, 25, 109, -41, -51, -70, 63, 35, 202, -32, -114, 10, 88, -34, -53, 71, -163, -55, 119, -103, -93, -87, -18, -174, 42, -44, 18, 139, 11, 11, 23, 0, -86, -96, -93, 44, -117, 60, 134, -11, -143, 116, 129, -2, -143, -69, -142, 52, 87, -3, 23, -55, -39, 68, -80, -144, 105, -23, 0, -116, -51, 37, 29, 60, -49, -234, -39, -35, 100, 30, 135, -10, 78, 37, 46, 68, -29, -22, 7, -2, -63, 187, 183, -129, -56, -10, 13, -112, -55, -41, 65, -13, 118, 27, -58, 79, -192, -222, 124, -63, 54, -96, 43, 40, -231, 88, -120, 25, 190, 86, -1, 30, 42, -157, -74, -19, -25, -118, -55, 31, 41, 86, -65, 48, -78, 84, -69, -97, 50, -78, 17, 27, 67, 15, 158, -122, -85, 82, -44, 9, -142, 64, -10, 75, -25, -137, 101, -63, -211]
7085b11L84l83L52j89J71k51J2J50j5M0N1l2j55o2J1p3J66J6J2K08k67lm4K05
7109I3N1j79K7N6q5P3L2nr0k3N2L4Lj70L7J36L3j86K17r5M4j00R1n4r1R2M1Ln9
7138b2K3J6K09k41M1%J41k04j20Q0J54o2ml4O4J3j00M0O9n1o2J98j12P3j20j58
7164a69J64O0J1m4j05jJ34r9P0R1r5M4k4k9K7J0m2lN7J4q6PK0j06R8j8L5m9l6
7193f4q4J38J38k13R3R5J0r8lj75J7K59J4k47J13l9Q5n9J08k5j32J83j42PJ41
7218A20j36Q9l7N8k3k05JM6p2K5J33K52l19J3J56j21j91L08N6j80K7l4J10J01
7242A77k92J36L8k4l5O3l1j82K15P8n2j7j81J86L1k10M7M8j17p0K30QJ03l10K20
7267E9p4K9k87K92N9p1L4n7O6NK6n9k3p4L6J10j31K10j70PJ44j47p5J65j10m3
$$ y = [-211, 173, -210, 142, -47, 124, -127, -115, 35, 20, 60, 111, 79, -76, -138, -127, -200, -34, -18, -6, 202, -65, -68, -112, 93, 144, -35, -8, 48, -37, 36, 68, 63, -27, -50, 2, 36, 39, -131, -94, 42, 75, -111, 106, 11, 55, -45, 46, -8, -99, -7, 34, 37, -22, 1, 17, 226, -15, 26, 26, 167, -37, -157, -77, 77, 15, 11, -23, 41, 54, -46, -6, 63, 12, -50, 148, 36, 109, -11, -169, -5, 55, 66, 22, -83, -84, 50, -49, 21, 112, 17, 61, 37, 8, 35, 45, 3, 0, 57, 71, -15, -8, 12, -94, 4, -14, 21, -28, -64, -148, -10, 128, -85, 8, 103, 113, 15, 12, -163, -146, 113, 127, -120, -7, -46, 39, -20, 88, 63, -69, 114, -28, -21, 120, -16, 73, 36, 94, 71, -134, -133, -87, -159, -134, -1, 251, -68, -55, 101, -20, -211, 97, 153, -27, 0, -34, 76, 177, -115, 21, 59, 35, 0, 63, 32, -150, 65, 143, 91, 74, -107, 79, 110, -100, -53, -5, -122, -192, 38, 46, 149, -161, 59, -15, 14, -273, 19, 78, 7, 41, -16, 50, 55, 81, 22, -1, -75, -39, 71, -60, 150, -20, -13, 131, -16, -91, 74, -36, -79]
7293g9O3pr0M0J60j05NK17j43p4L0j34K56j27j18O2q3J33j9k03J50k5N3P3k23
7318a88J26Q2N3Kk27K64r2J0n9L5O3k59J8J26k5J63j8O8rj30j2j1m8o5p5J64j8
7345f2P9J44k46K9N2Q3k27J80k8Q5k06J77N6j8o3n6j31J55P0j3k00J02or1Q1J38
7371H4p8l0J08Rj43J22j6q8R5j00r3L30l6m17J90J17J18j09k91K70j17mN6n2J75
7396A00p8n5O4o9j43J89L8k2K1o4K5j8j16k1Q8J9k2j93J65J39j2j20mK5O4j8m5
7423f3K42k88KJ72j4j9j2M4q3J2M8n9j6KJ8J63j85J11k50K67j21o1J26l5M3r4
7449e0N7J7O5m4j57J68m3n6N5pn7j05K6P2j3j5NO6O9q6m9P1Q4nk05J40J27k6r2
7478A2N8o8j56O7j0M1L23k09k36J37O2P9Q4n9j96P1J12j29j53J71M7n5J97l28
$$ y = [-79, -16, -23, -113, -73, 87, -18, -13, 204, 61, -13, 17, -117, 139, 12, -106, -44, -127, 6, -13, -216, -66, -91, -38, 35, -188, -62, 20, 73, 75, -152, 112, 20, 30, -29, 6, 69, -190, -172, -46, -71, 92, 74, 142, 133, 3, -9, -20, -68, -133, -208, -44, -62, 17, 161, -85, -56, -4, 79, -148, 32, 4, 89, -117, 60, 116, 98, 35, -21, -152, 3, 73, 60, -140, -38, -44, -135, -54, 84, 6, -24, 84, 93, -50, 72, 56, -32, 63, -37, -130, 200, 164, -253, -63, 54, 172, 63, -228, 42, -75, -79, -23, -75, 100, 22, -33, 31, -38, -181, 8, 46, 24, 45, -19, 6, -12, -128, -149, -61, -42, -64, -257, -92, 47, 35, -85, -89, -64, 0, -18, -63, 179, -109, -107, 65, 51, 32, 20, 64, -19, -7, 41, -18, -34, -32, -14, 149, -36, 75, -175, 92, -29, -90, 36, 1, 44, -50, 7, 24, 89, 45, -112, 56, 13, -43, 12, 5, -52, -157, -131, -59, -72, -87, -82, -16, 53, -33, -82, -11, 73, 68, -137, 3, 130, 104, 12, 70, 2, -154, -87, -97, -56, 267, 58, -178, -41, 21, 100, 184, 125, -71, 0, 112, -17, -170, 1, 48, -7, 190, -138]
7502a38L45k61L0P1n9o9J5M5j49K91r6j25N7M9J67o4j23j91J15J66J18k6k90M3
7526g9r5J87J4Q8k14J0J05l8J1J10p2J27j16o0%J07l4j91K29j13K4n4J0J34k38
7551a48J95j12J54j66J57j43R1j25J13J50k89L19k92l3R4pj33O7M8K19j81J0J01
7574H9j18M6j88J27N9j39J03J8Q0M6k17K34j23j04N7O2q0q3R7Q3p1J07j35n0J90
7599I0j33m2J31j60J9L7p5K18j26o8j04J51N4j51N6q4K51O4j24n4K2o9J16RJ3
7624D1j42Q9J16k49K48k5j46M1R6j94P3K4N3r3qJ37k40J07k9n6J81j00J25j31
7648h2K06p1j52P4P5j27o5K42j21q6PJ01n2P1j35J06o8m8J05J70n2j74L3lM9j8
7674a5p5J24J9q3j07J36l2Q5j1J18j56K7p7j1m1O9J1P7j72R9r9J33R8J3n7n9p
$$ y = [-138, 207, -54, -24, 47, -12, -81, -66, -21, -170, 121, 25, -100, -43, 6, 173, 109, -14, -205, -90, 76, 194, 168, -122, -79, -174, 13, 27, 115, -99, -89, 16, -22, -11, 99, 27, 154, 38, -22, -22, 85, 51, -140, 89, -24, 0, -54, -44, 90, -148, 47, -65, 89, -77, 80, -63, 28, -97, 16, 166, -123, 196, -96, -129, -35, -42, -175, -108, -60, 159, -22, -12, 89, -29, 17, -171, -44, 15, -124, -21, -3, 77, 123, -94, 140, 17, -87, -30, 32, -48, -131, -34, 49, -22, 85, -50, -100, 90, -43, -85, 46, -114, -95, -58, -133, 85, -41, -109, -213, -62, -8, -159, -103, -187, 64, 128, 4, -50, -28, -97, 19, 28, 41, -101, -12, 104, -145, 103, 78, -68, -27, 69, -125, -52, -28, 25, -68, -76, 61, -179, -72, -101, -157, 24, -76, 49, -82, 124, 53, -99, -25, 50, -77, -142, 100, -21, -107, -100, 1, -51, 20, -115, -9, -77, -125, -20, 150, 98, -76, -43, -46, 3, -15, -90, 34, 53, -30, -137, -1, -33, 52, 41, 159, 3, 30, -47, -58, -99, -30, -19, 58, -114, -15, -114, 19, 117, 130, 73, 14, 7]
7701GJ4M9j83K15m7k3j37N1Mj84K11J05o3J2l0o0n3Q6M6L9j56L45l15M0J31j99
7727i5R2L4J30l33K15j48P5J72j78K4M7j14J13j00J14m9O2j31jJ01j0N8L3k3j68
7752h0J27k3l9P6J4o8P8j34j59R0J45l9NL3O4J4K2k05K01K3l60L18j37K9P3k23
7778a55J23L8M5p5j39K34j79l3K31q4J44p5k7o9j12K3K10j61K3N6j9L8j55P1J2
7803c5r3m3K15p8O0L4N5j13p0P9Nj56K17j64K66k20jr2J39M1j9Oj44J51J12r8
7829E4q0J93k49j4J0J16j22K24k61K13r5p1r6K00o4M9R4k01J51j09J68o4j43R5
7853bj15J09J03q2j9q2K48k74l0L0j09K87l7r2L21l58L9j4O7j15J33j28J59j00
7877f1j4qJ2K06j33Q5j21J33j70m8J24p0R9N8j68J56o7j24J32J13j59kK6N3O1
$$ y = [7, 21, 70, -113, 102, 55, 32, -105, -54, -50, -234, -23, 82, 19, 31, 1, -59, -112, -26, 20, 59, -97, 248, -67, -27, 104, -95, -3, 31, 161, -172, 43, -105, -30, 142, -36, -12, 35, -79, 34, -66, 48, -1, 61, -70, -71, 30, 20, 78, 111, 88, -80, 47, 24, -15, 61, 75, 7, 85, -49, -208, -118, 27, -12, -7, 26, 90, 104, 126, -79, 122, 145, -215, 103, -34, -5, 68, -155, -32, 6, 51, -24, -163, 71, -108, -141, 90, 6, 150, 75, 48, -21, -133, -110, 100, -61, -38, 18, -1, 37, -118, -47, -35, -128, -171, 44, -34, 26, 60, 115, 2, -68, 11, 16, -140, 77, -87, 179, -41, -42, -134, 5, 46, 27, 33, -111, 40, 152, 54, -26, 167, -82, -96, -86, 30, -92, 132, -129, 84, -11, -82, -178, 22, -42, 7, 101, -100, 51, -58, 110, 46, -97, -2, -117, -8, 95, 13, -6, -88, 160, -114, -144, -114, -223, 64, 27, -65, 256, -102, -63, -77, -10, -125, 8, -120, 39, -61, -75, -83, -71, 135, 2, 87, -34, 99, -71, -119, 5, -65, 34, 92, -76, 80, 13, -111, 21, 134, -25, -27, -1, 52, 113]
7902A13k48K78j24L6j3J03j59J00q3k65J77M6P4p1M5qJ6o7K0j41K44m3j14N6K
7927b6P8j93j3J72q0K5Q8j6j46K19j83n1J97j03m4P8o0J34j37Q0K7j95J28K00
7951A79k81J66o3K3L3j00rP5k25K62m4mN5n4P2j27M2q1P8j35L32m0j27O1j07j06
7977a25P7J42p5m0r9K57j90K77l29J23k5M5n6qJ4j2O3j11Q0q5K23l13K02k16K73
8002I2j64K30l54J97r0R3j10K6J76m7O3k28J13j30K32k20P0q3J80k66K67p0j9
8025d2L5j22J90k1q4L9p8J77k10Q9J12N0j84K4q5J52K4m8M2j08R7j64Q3j96J24
8050a04J74j7o2k0j1j9J55r7J4K5L4n0j14J44j89J52J21j54j7K3m8J34l49J73
8074a02K30q8J2j30K19j86n2O8J13j91K00k44J17MR3j01M3J14r0j56R8l0P5m2
$$ y = [113, -135, 143, 19, 55, 42, 145, -14, 86, 3, -262, -85, -39, 35, -36, 9, 1, 17, -50, -30, -171, 73, 30, -84, -28, -26, 52, -141, -154, 18, -62, -37, 51, 35, -111, 108, -75, -126, 71, -32, -76, 2, -58, 76, -61, 19, 46, -149, -21, 179, -102, 64, 1, 24, 57, -43, -52, 23, -202, 60, 16, 12, 67, 13, 85, -42, 0, -81, -3, -138, 194, 154, 27, 88, -19, -125, -48, 94, 19, -21, -120, 137, -53, 224, -105, 18, -7, 38, -18, -26, -12, -24, 39, -72, 8, -77, 146, -167, 35, -181, 92, -72, 158, -196, 1, -89, 4, -106, -80, 96, 49, 112, -116, -3, -133, 99, -121, -51, -134, 46, -220, 47, -23, -42, -7, -129, 61, 40, -44, -5, -83, 94, -116, -27, 85, 135, -49, -25, -110, 42, 66, 18, 60, -48, 49, -115, -32, -228, -104, 70, 53, -9, -29, -40, -59, 96, -1, 13, 38, 72, 22, -92, 52, -137, 15, 136, -18, -35, -12, -60, 74, -275, -102, 128, 40, 52, -78, 141, -45, -97, -29, 84, -107, 93, -151, -34, -30, 63, -38, 5, 119, 29, -127, -29, -59, 16, -26]
8098b6J02O5j47l3p8N1J07J00j60J48n5j91J02NP8j84K72k32L8m0J97j02n6mJ18
8123G5q0J62k42J22P7J0j48r8J68j87M50j80j48J45j92J64o3O5j60l7j1L4l1R0
8147a5J20Lkp1M7j55J00m0kO5O9l04K15j4O8j8P6j16M2j40J82j38r9J92p3j30
8173a38J72M2o5l2O0j57j8K05Q7o7l8j2L0O2j9q8m0j3
$$ y = [-26, 76, 141, -6, -39, -117, -66, 41, 141, -19, 129, 74, -117, -15, -10, 68, -116, 156, -76, -38, -78, 119, 17, -39, -43, 75, -5, 157, -85, 37, 114, 124, -24, -122, 46, -141, 309, 129, -19, 126, -66, 98, 35, 100, -60, -97, -108, -74, -105, -15, 105, 108, 106, 35, 82, -73, 27, -13, -15, 50, 119, -185, 30, 16, 84, 66, 142, 26, 68, -72, 110, -28, -127, 65, -8, -138, 34, 76, 11, -21, 39, -118, -136, 69, 156, 89, 51, 39, 69, 131, 112, 24, -16, -29]
8191b9
$$ Imaginary data points
##PAGE= N=2
##DATA TABLE= (X++(I..I)), XYDATA
0@%%%%%%%%%%%%J4k8K8k8K8m2N6p0Q4r8J14j28J54j82K12k54K94l36L87m38M99
33B66n63O33p15Q05r00J003j123J250j388J542j706J889k087K303k540K798l084
50a617L399l744M127m554N028n564O178o884P698q653R802j1209J2978j5281J8411
65A0115k2947L0141m3330P5357k93810m40475M78743M60574J48192j97916k60530
76e5886k15857O9489K81141K07426j38101k56515o2547J64143J35121M4635m3228
87A29821j36988j48931K9006J46335J02623K1735l8195j35921j19701N0208J65474
98F5466O5242q0431q7962m870K0237L3369P3955O620j50723r9243J28337J51392
110A21389m6858j14614j7959K1135n800J9981M1578k3444p3033Q361R3474J6926
$$ y = [0, 0, 0, 0, 0, 0, 0, 0, 0, 0, 0, 0, 0, 14, -14, 14, -14, 14, -28, 28, -42, 42, -56, 58, -70, 84, -98, 114, -140, 154, -182, 205, -233, 266, -297, 336, -379, 426, -474, 529, -594, 656, -732, 810, -896, 993, -1094, 1209, -1331, 1467, -1617, 1782, -1962, 2165, -2389, 2639, -2925, 3253, -3631, 4067, -4586, 5216, -5993, 6985, -8296, 10115, -12832, 17309, -26021, 49336, -244474, -684949, -206206, 254368, 402560, 204644, -55886, -271743, -202254, 78887, 286313, 148212, -108303, -170850, -6707, 128414, 173049, 129821, -7167, -156098, -127092, 19243, 121866, 143601, 105406, -30515, -150216, -100008, 65466, 130708, 50277, -37685, -42555, -22318, 11051, 85006, 91626, -59097, -158340, -30003, 121389, 74531, -40083, -58042, -36907, -42707, -22726, 18852, -4592, -77625, -69264, 24210, 41136]
122D1136q9936l6116N5397L2101l484J1098p619k3570K1347K9340k7632k7731
134b5669L5835M2244j8097m1099L91K1314j57J0749K4973m6225p9610M4730J22789
147I2168n560j12730l5242M9925K7663O666K0980p581n7670k5443O0196N3580
159F6952l9525n1635K1643K3802k4837o217K3902l621j5540J40j6386k3980K0741
172b4561M2205l124m3704k3068J6804J9023P028J6728J4m7687j7542O4328L9604
185D6048m8692l2251L5803J9071k2855j726K2263l446k0793J0405K4908j9933
197H802l8855K1518N0746j1087m3080k792J3574L506J9563J3949k9762k8487J8950
210c455L0470K70j5657l585J101q958J791K0238n513l0474Q647L0295k3609m0371
$$ y = [41136, -48800, -84916, -29519, 2582, -902, 10196, 2577, -20993, 354, 29694, 2062, -25669, 10166, 52410, 34313, -6786, -6395, 14919, 14762, 25511, 50484, 4259, -75351, -30621, 92168, 86608, -26122, -61364, -11439, 16224, 22890, 43870, 36289, -21381, -46824, 13372, 66952, 27427, -24208, -2565, 21237, -3600, -9817, 14085, 10464, -5076, -4936, -21322, -45302, -24561, 17644, 14520, -29184, -52252, -35448, -16425, -9397, 7331, 7345, -40342, -57884, 6444, 46048, -2644, -34895, 908, 19979, -2876, -4602, 17661, 14215, -6578, 3827, 28735, 8802, -30053, -8535, 42211, 31124, -11956, -14748, -1174, 2332, 21895, 35844, 6082, -22405, -3455, 27015, 27285, 11628, 8043, 9144, 186, 1977, 22215, 16702, -13772, -5125, 25170, 1561, -38810]
224c8810K1234L6124j5943k8104K664O500o995N850K3124k531l5543q246L9131
237a545J7655k4891n191J8242n751j0245J6804P618j4260P87J5345m355j8313
250h100L34J9520O233j5328o420N718p004j995K6757O798l4996j2195K8464J1313
264A9099j3521J619Q374j0058j1630J1708J6907r460j9990Q363J6818j5407j6931
277a4109J5313Q860j6750l162Q864j0260r553J5183J2255j2491j6309L376J4038
290d745K856m175N370N3j3965M781K1355m418j8196Q824J4079j0853q767R721
304A920N140o696l302M659n34r044J215J6936L93k0081j360J6551l13o027R171
319H628K300j2200O57J2367K007p051k164N027J496p167j230P947l029j1375M568
$$ y = [-38810, -17576, 18548, 2605, -25499, -22835, -16335, -23330, -17480, 5644, 3113, -32430, -40676, -1545, 16110, -8781, -13972, 4270, -1481, -11726, 5078, 12696, -1564, -777, 14568, 10213, -8100, -7766, 11754, 17987, 2659, -3761, 1957, -5047, -7042, 19715, 26513, -8483, -20678, 7786, 19099, 5578, 7197, 15571, 5513, -6117, 5591, 22498, 13038, -6952, 1411, 18229, 2822, -14109, 1204, 10064, -6686, -9848, -984, -11244, -20797, -5614, 6641, -5850, -22159, -18783, -4745, -1889, -6064, -694, -641, -14606, -9825, 11530, 7112, -11084, -2260, 11819, 966, -7801, 1920, 7060, 364, -2938, 1721, 1187, -7857, -6642, 10294, 10687, -9394, -10754, 5797, 5484, -543, 8628, 10928, -1272, -615, 11752, 13759, 6708, 4544, 9571, 11067, 3900, 2670, 10617, 7588, -3787, 781]
334G81N648j1558m789J1293N93j0651j258L370j617m34L804L216l691p051L360
349h984J1458k360q243M913M218o158J826P416m965n616M760L116l481k237J131
364c206L905R50m565l79M551j564K6P815j191p857M399P363k129j747K290p79
380G882k35J300p96k19q53l758N69J960n267k987M188k295m872J629j39l715J299
397f309J736k089M68L78j454K469J964k203R94K504k447O13L971j914k050K334
413a035k74p62K298j646k447L225K11k534K105J092k768K289L389k014k66K558
429C421J38J174J267j605J139K524k341n79L113k601l281L879m01n019N85J486
445B899l287q87N48j027m26j112j723K745Q69l988J482L288l556l08N511j412
$$ y = [781, 6429, -5129, -9918, 1375, 1968, -8683, -9941, -6571, -8188, -8622, -4818, -1602, -5293, -12344, -8984, 2474, 114, -8129, -3216, 1002, -5156, -3330, 4086, -879, -6495, -1735, 1381, -2100, -4337, -3206, 699, 1649, -2916, -3295, 1256, -308, -282, 7533, 6342, -1515, 2884, 10247, 8118, 6371, 8661, 7882, 7647, 8947, 8151, 7932, 7079, 3321, 3890, 5850, 583, -2404, 1784, -511, -5383, -3754, -3893, -7608, -6309, -4573, -6662, -6194, -5816, -7270, -4801, -2837, -5040, -4046, -1542, -3989, -3376, 595, -1319, -3369, -1035, -1309, -2071, 227, -1419, -3866, -641, -430, -2964, -859, 233, -2535, -246, 3143, 1129, 863, 3421, 3559, 4733, 6000, 4395, 5534, 8058, 5717, 5138, 8251, 5650, 2369, 6248, 5847, 828, 1413, 2899, -388, -1275, -727, -1754, -2180, -3292, -5015, -2270, -1401, -5389, -3907, -619, -4175, -4483, 1028, -384]
461c84m420K985K716k276p56N85j49K64p75o57J297j917k408M831J129o406P72
478e569O293j552k533L548O68k075K462L445k62j690o30L488L044l946k102M494
494G083j30m410K916J819o515j318N895j363n473m28K492j1j755q63J220k8l527
511d396K652M706m894n041O756L090o033k36L609k691k118L773J173l829l042
526f521K319M394k070n154K511M117l708m79O084k268n380O058O032m973l530
541b568M717L765j389j559J050J262k355J88N544j866q901J940Q076l650o318
556b064L506J123m985Q71M636k727m941J513O021p72p460J02Q362j21o680K775
572h41L211o396M00Q996j582r659K75O727M20l786p38J764j438k696M106L680
$$ y = [-384, -4804, -1819, 897, -1379, -2135, -1550, -1699, -1435, -2210, -2867, -1570, -3487, -5895, -1064, 65, -6341, -5569, 724, -828, -3361, 187, 855, -1220, 1242, 4687, 4425, 2735, 2105, 5593, 8637, 4691, 2589, 7083, 6953, 2543, 5459, 7278, 763, -555, 5340, 3977, -1496, -1924, 568, 557, -1198, -2061, -841, -869, -4396, -1744, 2962, -1932, -6973, -217, 2873, -3160, -3396, 213, -2478, -4596, -823, 350, -3479, -6521, -4202, 192, -1878, -7032, -4521, -404, -4112, -4591, 1493, -775, -6155, -97, 5935, 962, -2568, 2149, 5914, 4525, 2966, 4016, 5278, 2923, 3111, 8655, 6789, -2112, -172, 7904, 4254, -2064, 1442, 2565, -2420, -1549, 3087, 360, -4581, -3068, 2953, 2181, -5279, -5177, 3185, 3064, -3616, -841, 2370, -4026, -3626, 5370, 3788, -5871, -5596, 1131, 1551, -2235, -2973, -1209, -2647, -5343, -1237, 2443]
588B443o537l430R056K635r060J72P869j220l515M059J383n569j074P538L992
603H742p407o350O004N344n964j946O478l075p908N163P343o456n113O066L604
618D525n244l379M592L949l116k048L271j141n698N547Q296o987r111N693N266
633D415m972o19M058l313o004L140O497k877p726K689Q146l630q538N045P195
648C506n677k501P846j406r320L439J1115q19q683j911N344J854k704K190K814
663E087o363m425P728L802p275j46O064l772n647N245M852m197k325M059M74n916
679b755l60R205K376j0653l403R390L99p917L880O493p449o571O899M734o346
694b078l645N731L181o463m422N822M370l718m95L468m913m116Q418O138o300
$$ y = [2443, -4094, -7524, 1532, 4167, -4893, -4721, 3148, 1928, -1587, 2472, 3855, -1714, -2788, 4750, 8742, 1335, -5015, 989, 6333, 369, -1577, 4901, 1826, -6082, -919, 6424, -32, -5145, 921, 4525, -719, -4098, 494, 4443, 1327, -721, 2550, 1409, -4289, 1258, 9554, 2567, -6544, -851, 4415, -557, -1176, 2882, -431, -6435, -3295, 3202, 325, -7401, -4712, 3434, -196, -8734, -3689, 3506, -2171, -4672, 3174, 1768, -7552, -4113, 7002, 6183, -2500, -4411, 933, 2787, 83, 2273, 5087, -1276, -5701, 2027, 5829, -1446, -1592, 4472, 700, -4947, 298, 5150, 953, -1372, 2687, 3161, -2755, -3115, 6090, 8466, -2187, -5590, 3800, 4199, -3718, 162, 6655, -794, -7365, -466, 4268, -2078, -5723, 8, 3189, -3274, -7696, -1874, 2496, -1222, -1717, 1751, -3162, -7278, 1140, 7278, 978]
709I78m382L073l49j140M889L380n670o922L872P202k802o153N141M419r089l859
725g412J0163K807q053l07O314k455o221L668P608j537p356K67N899j499l939
740b053M371L039o314j765M892j207l485M355K560n506l611L286K250j077J116
755H51K193l712p312L538J1405j201j0331O45O043l822k285Q122J976r108l959
770f957O747M074m518k712M525J607o601j328O707N76m076K313J761m898p21N876
786B375J223k803KM18j990m89M198L022m039m113L485K328n704J93Q460j075j0440
803d949l05P605k37l773K539J885n561m465N619P547l352p182J519L439k654O31
819a694N191j733n595J479L140j550l13K770k53l106p97K067O26j532J598L697
$$ y = [978, -3404, -331, -680, -1820, 3069, 6449, 779, -6143, -2271, 4931, 2129, -4024, 1117, 5536, -3553, -7412, 2751, 5558, -2495, -2802, 3512, 1057, -5164, -1496, 6112, 4575, -2781, -2514, 3385, 1886, -2053, 2318, 5357, -957, -2722, 2170, 963, -2522, 1833, 4393, -1113, -4724, -1438, 812, -265, 851, 3044, -668, -7980, -4442, 6963, 5762, -4569, -3924, 2119, -1703, -3988, 4134, 6110, -2998, -6957, -210, 3864, -654, -3366, 1159, 2766, -3835, -5163, 1544, 2120, -1956, 357, 2118, -2780, -3501, 2375, 3598, 795, 797, 1215, -775, -1264, 2934, 5956, 1917, -2196, 1289, 3617, -2087, -1894, 6566, 5491, -4949, -5254, 2351, 2114, -1659, 880, 2765, -2796, -7261, -1642, 5905, 2553, -4629, -3110, 329, -2325, -1694, 3497, 1764, -3831, -2352, 788, -762, -1075, 1695, 1442, -1664, -2461, -394, 232, -1300, 298, 3995]
835C995m012o029M623O771l723l638M313K67n952P05P396J048n988k494L704J107
851B093l409J469N095k817o914J864M772j300j061K257k148m118J483M137N68
866A971j952q03K0j171m55L822J793m220k024M409m44m614K924N360l376n148
882c908K284K873j693j084K851J639m847l520M916M385l475k361K812q74l526
897c528K803M386j591k899K86N07p07J108K304J34l244j419K282R13j532J914
913A717J941m659k827M636K286k907o20K200j697k647J247L752o6l438o09K528
929H37p46k934K935L239l545l278K402P20j094J302J372j766k284K5K281J062
945E28p29j52L54k298l75L768J396l046k04J976j607j097L105J727k211j731Q63
$$ y = [3995, -17, -6046, -1423, 5348, 1625, -2013, 2300, 2567, -3385, -2680, 4716, 5764, -224, -2718, 986, 2093, -1316, 153, 5248, 2431, -4483, -2619, 2153, 853, -208, 2049, -99, -4217, -2734, 1403, 1971, 19, -784, -764, -1935, -2390, 1432, 3225, -995, -3019, 1390, 946, -3668, -744, 4616, 1240, -3908, -1624, 1249, -444, -1528, 1323, 2962, -1885, -5405, -489, 3896, 421, -1940, 872, -2, -3528, -725, 3661, 2070, -829, -543, -36, -743, 365, 2669, 2803, -441, -1860, 422, 1335, -197, 1717, 3658, -1001, -3828, 808, 3094, 187, -433, 1767, 70, -2577, -1330, 2422, 2356, -1082, -1691, 837, 91, -2843, 92, 3331, -214, -3492, -1090, -370, -1464, -162, 1210, -556, -2840, -2815, -534, 528, -201, -353, 1, -2297, -2672, 1096, 2492, -554, -758, 1218, -389, -1486, 1619, 3346, 1135, -596, 267]
962B67R01l32l67J738M60l305j400L356P66k188J131Q39k585j180K210J382q91
979H02r86k66l51k17K08J670J56k356m71J505o32n43K292J18k806l75J763ql11
998h08R09N7q27j245M62K227M71j706l06J115j470K52K373K36k138L5O94k44K43
1017C30O10K84n47q58l28J316O4p11J004Lj994J57J932j34q56N15m23j104N83
1036a57Q90K97m23j088o2P13l53k73J323l42j764M11R47o39r3J018n20j171K01
1055a085L37M19K53m41k53J51o71K94J532m68j266P33J39n60P89Q51p08m21M61
1074H6j85L43N21k13J92L18j055K35R64k79l84Q13n78q83Q93M39n46r0j03p09
1094b21L54M08j59J9n9q85N6N30m53M8L12m82n96M68j25o9L87J14r34O25p1k91
$$ y = [267, 1168, 836, 469, 2207, 2667, -638, -2038, 1318, 2084, -104, 1027, 1866, -719, -1899, 311, 1693, 802, -184, -450, -801, -1018, -810, 860, 1016, -1340, -1811, -306, -938, -1481, 811, 929, -1877, -2252, -489, -497, -808, 101, 158, -669, -1914, -1452, 775, 1246, -460, -766, 349, -1121, -869, 1504, 1740, -398, -363, 331, 87, 330, 940, 1224, 677, -181, -509, 807, 871, 160, 1164, 1167, -827, -670, 1262, 1128, 272, 787, 364, -740, -157, 733, 1030, 607, -481, -543, 170, -183, -456, 867, 525, -1239, -828, 119, -520, -613, 405, -115, -1286, -1085, -748, -329, -76, -517, -770, -619, -1290, -996, 536, 68, -1198, -465, -326, -886, -97, 754, 46, -375, 86, -99, 244, 765, 552, 744, 1062, 7, 242, 1206, 927, 543, 1356, 778, -105, 788, 1227, 681, 591, 488, -221, 133, 541, 382, 401, 342, -543, -487, 43, -410, -362, -50, -532, -1128, -660, -785, -854, -467, -353, -1287, -662, -733, -1024]
1116a024N89L03n64N2M36k84O8P17m94O1L54n14K11R17l71l06M64r1l84O22k4
1137G38k41%J14k55Q1L38n69M05n1p79M87K46n88MN78n94n31Q29J0n14M0K37k75
1160b90J16k4j55K48l32J48L30k2p67M88N70q00j91Q26l63k78L91J3k61n5K19
1181a89K16km61J86O56m14n53R47J83j047M60Q28o71l99O27l9j85n0Q7K62k46
1202A96m29M23Q37r16m44J068n5q73L67M88o30j30N82j53m94o2K78J69k16l46
1222c40K91L30q83m0R14n47j082J243M80j174q1O50k2l80L10K31j47k92Q4J000
1242E45l48r12P79R30q93m10J095k57p73M20P34p12l69M40M00j14n66n0R59m72
1262D26p16R06J40j239R9J263n86j008N93M12m00j69K94J27n07m25O77N48j062
$$ y = [-1024, -435, -132, -696, -644, -208, -492, -424, 293, -201, -140, 214, -300, -89, 828, 457, 151, 615, 524, 140, 762, 738, 497, 497, 611, 356, 437, 775, 206, 611, 560, -219, 268, 514, -74, -70, 508, -86, -617, 212, 222, -292, -252, -15, -290, -174, -198, -353, -105, -437, -289, 41, 19, -748, -260, 310, -490, -681, 145, -218, -496, -105, -92, -353, -408, -189, 27, 25, -436, -250, 406, -8, -561, 386, 569, -478, -18, 810, 139, -260, 367, 328, 143, 93, 180, 442, 196, -233, 190, 1027, 111, -333, 735, 680, -193, 174, 662, 32, -98, 484, 331, -163, -225, 53, 222, 6, -340, -49, 281, -602, -642, 272, -275, -1357, -114, 366, -808, -889, -239, -261, -641, -331, -100, -247, -539, -455, 545, 197, -715, 64, 994, 101, -309, 786, 529, -244, 176, 910, 198, -171, 269, 669, 555, -11, -61, 898, 426, -290, 616, 756, -483, -384, 879, 293, -715, -122, 290, -110, -279, 15, 142, -365, -790, -113, 435, -627]
1281f27m73J443O1j262K34Q92p86k60R09J69q95%P98K58n64l71N81L96p38J32
1301a03R61o05j060J295M13j213k67J121o7p35K38L27j58l94J52P26m54j085P38
1320a70J208q52p39Q15K56p89K91P24n73q25P23O14n14n73J41O13k24n62L03K40
1340A07j036M44J105m92j378N72J107k97l79K75p9m46M1O79M50r52l95R94K93
1359F13j069O2J151p68m85Q23N4q03J89O65R3p24m72R32M20p39kN81m29n70J095
1380F17L67j017n10J073j5o84K1N10j50n28O9L36k83n08L90J048r13r52Q05K93
1400c1l86K34N58r96l54R15O92m11p85L14M76j77j83M14K10r23J12J159l62q43
1420c67L30Q95n85m70K97M04l76k69N91K4o17k54Q93L71j141J98O01l82n10N94
$$ y = [-627, -1100, 343, 404, -858, -624, 268, -518, -778, 131, 300, -595, -595, 203, 461, -103, -474, 107, 503, -235, -103, 858, 253, -807, 488, 901, -312, -579, 542, 475, -260, -22, 305, 147, -247, -95, 631, 177, -908, -170, 1038, 186, -553, 262, 518, -271, 20, 744, 171, -654, 69, 683, 169, -404, -263, 350, 126, -436, -133, 107, -929, -485, 620, 128, -1250, -678, 429, 132, -247, 28, -51, -497, -456, 223, 673, -279, -674, 320, 613, -456, -394, 757, -11, -496, 327, 381, -422, -233, 432, 525, -199, -671, 261, 681, -58, -60, 521, 92, -478, 617, 984, -33, -543, 530, 515, -169, -148, 362, 212, -316, -247, 89, -194, -702, -312, 736, -177, -1129, -324, -31, -417, -183, 375, -621, -975, -60, 632, 221, -564, -250, 226, 49, -134, 280, 490, -433, -321, 838, 476, -367, -37, 858, 273, -197, 100, 504, 128, -141, 450, 474, -143, -397, 496, 867, -274, -76, 525, 143, -367, 227]
1440B27K08p34J06M74l64m22K23M94n0o11k65N43K1k52O65K10j283K4J094M14
1460G22r44o4K96j02j8K24M01k58p11L24P81o52o57P67N17q30j19M80l53k26O62
1481B40K73p07l29K83N76J04n67J86K03p78N80P68k47r93L64O80o72l19M96K21
1501C62l90l24M01o1l41J58O70k09r40J27P37J20o27M3K22n04L73N56j19m76J2
1522b10K53J50l00j51N77k43m33L53J72o13L2J078k52p41k71N23L56k02M18k81
1542B15l00m18P37N38l50o83K40L93m67P2M36k40k74j1J80j12k29L09L00l52m73
1563d89lM78N4J8K62l99o86N55Q15n81l07K90M6k39O8L65o8j13k16K46K19o53
1585c38K77O16k73n59j5K88K0J40K53l09n08J23N65J43k15l88J20J16r3J15K04
$$ y = [227, 435, -299, -193, 281, -83, -505, -282, 212, 162, -449, -714, -171, -150, -402, 263, 473, -810, -786, 308, 722, -222, -286, 10, -92, -110, 114, 515, 257, -454, -130, 651, -1, -658, 109, 626, -204, -323, 157, -196, -422, 240, 513, -194, -523, -240, 336, 440, -127, 59, 262, -516, 64, 832, 585, -408, -44, 636, -36, -355, 141, 362, -28, -352, 49, -12, -353, -195, 475, 266, -674, -547, 190, 310, -317, -274, -52, -556, -183, 373, 254, -222, -210, 43, 193, -107, -258, 319, 76, -357, -4, 168, -445, -413, 665, 413, -328, -599, -76, 280, 78, 496, 215, -85, -503, 234, 772, 422, -261, -21, 372, -95, -23, 413, 173, -101, -112, 68, -44, -273, 36, 336, -16, -489, -492, -14, 40, 58, 320, -79, -765, -210, 605, 24, -283, 7, 53, -186, -118, 247, 179, 66, -150, 96, 315, -338, -61, 555, 282, -277, -292, -4, 16, 156, 409, 100, -408, -285, 280, 423, 208, -180, -60, 56, -37, 78, 282]
1606B82l90l48N65J48n58O4M34K3l18m7J00j09K10P0K45l98n34N74N71m56j70
1627d2J38j60N8J48L2r0j74Q5N1r6R9k41M06j24l78n7K89k03L54L9m17k10K69
1650b24M60l16J46lk53L6J58J12J04j76m6J65j02k58J88M37l66j27k6M6m3N7J61
1673A30q9j15j35J92J92j0j59K72l61j25L71O5k93o6J72j35k6J73l5n4J88j39
1695A3k12k4j88N70R1m11r2J54J60j23J44J02l54j61K59Q8R9J0o6m3%M2j3P0j90
1720g5NJ90k49jK52k47M9J1p2N6J77J57k91O6k5j47J59J29p6O0j20%KJ10j0k26
1746a16M15l44q2J35M4q8n1M7j75K57n2r9K14J16l34O8K36j64k20K5J33qj24N2
1770a15O0j0k02J53J26o2o8K16K5j14r5J18r9J55K01j88L9k53J79N0Mn1l6O1j08
$$ y = [282, -108, -456, 109, 257, -301, -237, 197, 220, -98, -145, -45, -154, 56, 126, 371, -27, -561, 13, 584, 128, -42, 96, -64, -6, 142, 174, 84, -90, -5, 46, -50, 49, -192, 214, 90, -288, -345, -56, -259, 95, 134, -283, -493, -224, 236, -80, 66, 63, -190, -154, 4, 116, 220, 44, -2, 163, 61, -197, -9, 428, 62, -65, -91, -45, -88, -31, 130, 41, -74, -209, -17, 175, 165, 6, 278, -83, -208, 163, 228, -65, -131, 41, -94, -120, 53, 18, -36, 152, 13, -199, -223, -411, 159, 250, -161, -253, -99, 61, -62, 82, 184, -170, -331, -72, 16, 115, 125, 59, 16, 16, 58, 45, 115, -75, -70, 120, -129, -130, 122, -125, -76, -65, -137, -81, 96, 253, -38, 28, 3, -144, 15, 144, 68, 128, 8, 8, 10, 120, 110, -116, 299, -45, -127, 8, 52, -36, -87, -40, -215, 42, -10, -109, 105, 221, -113, -45, 191, 27, -193, -168, -35, -43, -167, -115, -55, -65, -267, -114, 12, -50, -118, 98, 123, 9, -86, 32, -67, 88, 289, 101, 140, -113, 66, 116, 120, 69, 33, 94, -14]
1795a4K8J57k21R7J47m8j64j68j8J27J6l6j09J48K5O1k23K03L3j34J61j83J14
1818aJ81r6l16K01J89j26O3n2j33Q6M9j01K01J5j12q4j8J92o9k8O8l0j67J76K6
1843A14j90OJ32O1O8k98Q2K18r3r2O6j61J69j17K3o9K23j59o3J49q8Q4J3o9n7
1868d8N6J6j38j3L01j95j0p6J29n0R2o5j20J32p5J7j08J31q4J40L9j79L0p7J31
1893b4K9n0J18J5p7m1Q1m2n9j1O7j7n0Q4n0J26r1n5K02k37P5L5l9l1NQ3j0k28
1921a92K10k8r2L9p7K97k93J44j45J91j19QK7R8r2m5J09J01k26r5J76n8q9K08
1945E7j9N7j00RK17K7k37r4K63j12K6L36j80k26J27j52L3r6J65j6m5j73R9M4N8
1970F8j28Q6Q8k76K11j3Jj96n0J08O5N0j29m2J32o6M7l6J9O5J23j22j45KK81j65
$$ y = [-14, 14, 171, -50, 47, 194, 146, -18, -186, -204, -77, -61, -97, -206, -58, -33, 28, -195, 8, 41, -93, 68, -115, -1, 180, 84, -232, -31, 158, 32, 95, 43, -90, -4, 45, -56, 145, 160, 48, -36, -54, 138, 69, 41, 109, 79, -88, 88, 114, -76, -70, 62, 123, 191, -107, -25, 193, 100, 8, 74, -87, 82, -35, -12, -81, 142, -17, -80, 69, -19, 65, 78, 9, -48, 8, 24, -114, -127, 174, -21, -31, -107, 22, -28, 64, -1, -121, 11, -64, -47, -155, -24, -108, 32, 71, -108, -78, -155, -24, 5, -45, 73, 88, 11, -30, 51, 9, -50, -61, 6, -11, -61, 23, -27, 99, 8, -47, 155, -82, -7, 28, -11, -42, -37, 46, 36, -192, 18, -10, -102, -63, -140, 157, -136, 8, -137, 54, -65, -57, -30, 68, -24, -69, 40, 141, -85, -180, -4, -62, -151, 57, 38, 95, -5, 4, 221, 248, 11, -83, 180, 68, 94, 430, 250, 24, 151, -1, 32, -64, 101, 85, 40, -133, -34, 10, 68, -60, 26, 114, -162, 49, 36, 37, -159, -209, -101, -36, 14, -115, -157, -25, -91, -44, -80, -61, 4, 127, 5, -140, -138, 143, -22]
1996b2j49K38jj81J48R0n3J6J30j49N1N4k16J3K43k26K61n2k65J03Q0l48Q8J00
2020d7j44R9J03n9P1j57n2K00K2j21k6K12J0k47J12J22j52j36J30O7k19J19J26
2043C3l0j22R0Nk40K62R0o7j45L7P1P0K0r5N7P8n1n7m8k7N4K9K75o6k14m4L7R2
2071I4k29J90K4j64PK78l05j4K14k75L06j96j77K71m8k07J84R5p6k8J38j55j15
2094a88K9L71j24l06J82nL0N1J8m6p2M4M3J61l70R0J01J52k21L03j05j97J81J44
2118B66Jl2j53L8O2o3j08Q6Kk77K49m7L5l08J87N2j17P1q1k0J24O3m4j72k4K25
2144A5J6l2k41K65P1l26J49J39O9j47R6M1k70P7m1L10ok68N9J09n8M4J7J06k78
2169h4P8J29N9k91J1K24k00J68k03J81o8j25N5K20Ml23P9J43j15J50j07q8j67
$$ y = [-22, -171, 67, 66, -115, 33, 123, 70, 86, 216, 67, 118, 172, -44, -31, 212, -14, 247, 195, -70, 33, 113, -235, -147, -47, -191, -92, 11, -48, 23, -134, -186, 14, 36, -85, -111, 101, 111, -136, -24, 98, -54, -190, -60, 7, -212, -93, 33, 3, -119, -29, -24, -264, -2, 88, 21, -124, -87, -16, 54, 74, -21, 36, 114, 63, 6, -42, -69, -15, 14, 289, 223, 9, -35, 2, 94, -135, 55, 79, -85, -78, 200, -105, -119, 95, -180, 126, -70, -247, 24, -24, -231, -47, 48, -28, -56, 82, -73, -188, -159, 212, 88, -218, -36, -41, -11, 40, 58, 12, -60, -16, 27, 188, -182, -92, 9, 161, -60, 243, 138, -59, 122, 266, 267, 235, 82, 120, 182, 119, 11, 97, 99, -178, 71, 24, 59, -249, -62, -10, -127, -56, -137, -157, -33, 30, -14, -186, -210, 15, 31, -1, -242, 23, 94, -232, -83, 56, 125, -22, 74, 115, -155, -78, -119, 191, 185, -83, -24, 85, 27, 71, 88, 194, -84, -6, 123, 182, -109, -98, 126, -74, 94, -109, 72, 4, -121, -66, 154, 158, -165, -86, 57, -58, 92, -15, -103, -270]
2192b70J35J27m7n8J06K6l9k7j03J83K5r8M0J7j14K19J04o0l12J83k4p1J25k05
2216a38R1R9L8rJ21n03M07%k22N7J96j76K36j56p6K7j44J79M5L1k02J04L0j25
2240i0J56J05j13j30n0J71J23l02K89j31m2j1K2J7Q1k9j22J15k51K13j87K65l43
2263b44J9K30k36Q2K51k13m4j05K72m9p0J54K3M2l19K38K08j60n2J45R2l48O1
2286b3K12J1q8k7o5O7L7m5J24l0k52J02j9MN3qk1j85QjJ10j22K66k41K3p8L3J13
2314d2j4j25J48l2L9M7R7P7k60O5J37J9k35K25r0l1R8k49K01p6N0L23m23P9k8
2339@J19o7j10J44j1k85K11J25j81Q1j01NJ0r9J78jr7j37L40j44q0r6L66l35J20
2364d5j08L9L26k34j4n7J48k36N5K52p0j69M8N8j42J42J78r7L6j55j15K90m5j42
$$ y = [-270, -135, -8, -55, -113, -7, 19, -20, -47, -150, 33, 58, -40, 0, 17, -97, 122, 226, 166, -146, 37, 13, -58, 67, -138, -47, 52, 90, 81, 202, -301, 106, 106, -116, -59, 137, -39, 197, 41, -35, -8, -152, 27, 72, 103, -99, 5, 35, -90, 66, 171, 58, -72, -122, 49, 172, -130, 159, 28, -14, -25, -3, 14, 95, 66, -56, 59, -192, 21, -166, 99, -244, -225, 5, -231, -149, 102, -111, -155, -260, 12, -37, -107, 47, 70, 112, -207, 31, 239, 79, 27, 172, 264, -84, -23, 189, 200, 112, 85, 20, 87, 124, 79, 203, 173, -79, 23, 4, 8, 61, 53, 32, -153, -145, -146, -36, -158, 108, -133, -110, -188, -155, -42, -56, -181, -33, -65, -26, 21, 118, 195, -65, 0, 137, 156, -79, 146, 56, 25, 123, -126, 75, -1, 49, 372, -51, 28, 0, 119, 52, -58, 86, 75, -210, 1, 126, -55, 26, -75, -70, -60, -159, 19, 18, -79, -216, 124, -20, -100, -196, 170, -165, -45, -153, -114, 212, -22, -36, -93, 55, -181, -126, 126, 56, -113, -65, -7, -149, -7, 171, 74, 110, -45, -160, 130, 85, -57]
2388e7k2Q7j12Q7J82j94r2M9p5J07J36p6J05k35J90knl17L26o4Mk9Q0J6j48Q9
2414C0J71k17j01K39j51J10p4J07n5r3P8o7J45o5k70J47p2J25J58m3j35q9jM9
2438g4J1Q3Q5j37K2j4MJ42j10p5K3q3J10J26j91J52q2j6k6j48K44q3l5N8J20j12
2464fJ15l9r3K99l9k36K4j9Q8q5Q5j62J9O5Jo4P6n7j23K2MP2R5j38Q5K9j08M0
2492e0K50k23k01J71J07l0N6O9j76pl3O9mj25N7Q1o4K5p8J46Oo3M6j2P2j17J15
2519H7k27J96q0oJ21j01J57j65J67l13J55J01j79M5Q8l5r5Q1L8n3P6j27J4J2j1
2544e4p6o6J88j29N7NMjR3q8j3o1N3J09r2p7L5K2J83j49M2RP2p2L3J32j24mrN7
2574G9n4mk1Q2o1j85K57Pj15P2j71J01RN4p7R5j27m7J17j95Q5P3l0j15J43J10
$$ y = [-57, -79, 8, -104, -17, 165, -29, -121, -72, -147, -40, 96, 20, 125, -110, 80, 78, 73, -244, 82, 18, 22, -7, 73, 89, -59, 30, 201, -16, -117, 122, -29, 81, 7, 114, 59, -34, 44, -23, 122, 57, -213, -66, -138, -13, 145, 102, -33, -122, -123, -74, -63, 20, 105, -32, -10, -24, -20, 122, 12, -63, -40, -123, -13, 113, -78, 74, -8, -24, -50, -198, 46, -37, -72, -14, 106, -6, 109, 70, -23, 276, 237, 1, 25, 6, 94, 9, 94, -68, -49, 16, 17, -47, 29, -28, -151, -129, -125, -53, 42, -96, -11, 18, -90, -50, 200, -23, -224, -53, 54, 24, 80, 149, -27, -34, -67, 2, -2, -127, -70, 11, -53, -28, -106, 40, 46, -17, 29, 17, 89, -28, 87, -140, 56, -24, -30, 91, -10, 147, -18, 149, -164, -9, 92, -87, -42, 46, 11, -84, -3, 35, -18, 58, -69, -55, -43, -54, -130, -196, -8, -137, -80, -75, -71, -72, 21, -67, -80, -141, -88, 21, -71, -148, -113, -91, 92, -57, -15, -6, 66, -6, 27, 159, 35, 31, 22, 79, 25, 21, 0, 82, 21, -164, 93, 100, -15, 57, -114, -13, -4, 50, -27, 68, -59, -106, 11, -184, -99, -26, -56, -171, -28, 82]
2600H2l20J49J47k28J78p2nK4j6M0m9J24j8j30J69P8j94n6J47L1n3oJ25j11P8
2625A14L5j6j5j02P7N0j88m0Q3M6j39J23J0J57j88j49J8N0j65J68O6P3j15n2J50
2650E1q1j53K29M9j76k7Q4K68l04M3K4K8Rj18J89n4j05L4J12k16J26J75k01l1
2674d5Q7P3j71p2k3Q8J0J44j65k9J20k3M5Lj07J78j51J36k54K17Om1Q8j57P4N9
2700I0j74N7o2n6J79o7m6m2K1J66j49m0N7n9J15J29o6Pq1q7M8J09j32J70kj04
2726a9j4K29j86k1j9R5j17K6K2J5M1o6j76P0L36j36k6o0L1j6l0L7j15JJ84j66
2752h0p6J67L5j79J54O1p2J9r5QJ60k31r9K75q1J2k4L5n8L4J6lK4j44K50j21j42
2779a55J0L23j25k12l2L04j04J21k49J07n3K54j82N3Mp0J8M3n4j14K15l4q9O4
$$ y = [82, -238, -89, 58, -170, 8, -64, -69, -45, -61, -21, -70, 54, 36, -94, 75, 153, -41, -97, 50, 81, 28, 22, 147, 36, 114, 149, 133, 118, 16, 93, 143, -45, -85, -2, 44, -95, 28, 38, 195, 7, -142, -124, -74, -239, -71, -5, 68, -47, -99, 51, -30, -183, 46, 95, -81, -108, -24, 244, -60, -17, 7, 35, 44, -74, 115, 61, -44, -10, 102, -114, 12, 187, -14, -45, 42, 115, -56, -128, -151, -63, -53, 91, -74, -103, 17, -6, 39, 42, -65, 113, -38, 98, -156, 61, 67, 26, 114, -43, 31, 90, -84, -27, -89, -145, 34, -33, -79, -121, -100, 66, -83, -123, -66, -125, -10, 119, 53, 60, -21, -108, -60, 49, -83, 87, 85, -19, -33, 196, 10, -11, -30, 65, -52, -26, -4, 11, 52, -14, -190, -120, 216, 80, 54, -6, 25, 9, -21, 16, -99, -98, 86, -80, -156, 11, 46, -133, 21, 82, 10, 29, -66, -58, 102, -129, -228, 47, -34, -22, -46, -11, -69, -35, -19, -22, 2, -142, 108, -13, -155, -145, 178, 53, -159, -191, 113, 9, 130, -119, -12, -65, 189, 7, 60, 64, -6, 12, 55, 1, -113, 102, 68, -21, 43]
2803D3p5K2j64J72O2l35K46L6l8m7K4M3K0k95M06j73j80K63Q1Nj15M5j64J97k5
2828E4j56L5R3m3L3o2K01j19o1J16n1k33J54k6j28K01m8J38k63K04m4J96j12j6
2852F3j05J02jJ5j42Rj01K30r3J20j76K4M5P4J15k26m1Q6J63j39j02k29K78oQ6
2877D9k2p5op5K17n7q2J6N3k7q2q2K04o9OJ05r3L0j72L00k62J00r1K57k26p5J6
2904a43J83j38N1n1K33q1l2oQ2k4k13L60l53mJ56K6r8L2M3j84J40P2j58L09k72
2929g0r4J03J34p4k4O1n7j73K16j7j5M6j88J56N5l2m2J11Qk13K64k14J3o9J99
2954H4mj1O0j20l5k4jJ01j79K29j04m4j31Q9P2l1k2nj22J30l8P8P9n6j38K2P6
2981d5K7J31j19P1m2M2j4k1k22M09j57l7Rj69J86J42R3k21j57pK15n6L7k95L18
$$ y = [43, -32, -10, -174, -2, 60, -275, -29, 7, -31, -78, -54, -11, 9, -286, 120, -53, -233, 30, 111, 116, 1, 46, -118, 79, 54, -102, -67, 26, -17, 16, -46, 155, 36, -25, 91, 40, -193, -39, -65, -193, 8, -40, 98, -165, 39, -5, 191, 79, 63, -42, 60, 59, 74, -68, -59, -160, 70, -23, 97, -79, -55, -10, 64, 179, -47, -88, -2, 161, 22, -80, -309, -31, -37, 49, 27, -48, -54, -129, 88, 31, -51, -35, 18, -9, -91, -173, 31, -38, -32, 73, -20, 10, -162, 138, -124, -24, -115, 142, -84, -159, -143, 40, -98, -47, -98, 135, 54, 22, 16, 98, 74, -139, 221, -132, -136, 20, 46, -52, -20, 23, -161, -21, 51, -107, 202, -70, -164, -61, 73, -1, -25, 36, -21, -194, 22, 5, -10, 36, -152, 4, 59, 27, -15, 96, 104, -109, 155, -59, -46, -115, 84, 80, 69, 129, 9, -26, -50, -51, 50, -129, 100, -4, -48, -179, -90, -18, -49, -71, -76, -198, -68, -106, -28, 51, -5, -143, -121, -45, -18, 113, -6, 65, 23, 65, 51, 30, -192, 217, 60, 23, 32, -137, 49, 191, 284, 63, -94, -101, 114, 58, 95, -200, 118]
3006A18p6k4j18J26p0J07j47J39l5j54J32j37J01n3M3m3n5l5K55j56M7q4j2K37
3030A06k89J80p1J67k9J02j18p8J68o1q0O3p6nJ26r0j26K36k05R9p9O6m2J09j99
3055a26J97j86J96k17P1K29j62K25m15P0J01l1J3J08j14p9OL1J60j3kk49L1J53
3079cp3j4K25k6j2r6j79J43P9Q1n9r5n0J9K4j3R6J00q2j50J85j33J5j08K3KQ8
3106a3n7L2Q9j40N6k6J8R0K9q4Q1j07M6m3P7r2R4r1r4L05k74J48jJ9j70j12O7
3133a53K09j27Jm9J36j25J39N9p7q6m8J35j42P8P3Q0j47K06j86J05J74j47q9K8
3157D7J2p9J16O0j44J81r0k17K77j53o0J7k0J1J08p0j27O1J04J0j31q3L1J18j2
3182c3j47J17l9J08n5j02K29q8R2%o7j0%Q1L2q2p4k4K8RJ1O0j02k6P0P3p9j42
$$ y = [118, 42, 18, -100, 26, -44, 63, -84, 55, 20, -134, -2, -139, -38, -91, -48, -91, -146, -181, 74, -82, -35, -119, -131, 106, -183, -3, -74, 93, 64, 166, 48, -30, 138, 77, -3, 60, -16, -21, 105, 15, -111, 125, -80, 19, -60, 6, -36, 73, -126, 71, -115, 81, -136, -65, 164, 2, 227, -188, -118, -17, -48, -35, 73, -41, -120, -114, -83, 77, 64, 62, -187, -156, -3, -76, -90, 135, 109, 97, 1, -178, -35, 44, 125, 66, -29, -79, -60, -36, -49, 47, 147, 65, -85, 100, -33, -18, -126, -103, -101, -13, -70, -38, 51, -89, -33, -59, -41, 49, 78, -6, 75, -32, 14, -29, 48, -44, 50, -41, -135, 170, -104, 44, 43, 62, -108, -220, -153, 56, -71, -70, -119, 17, -108, 31, 90, 13, -73, -121, 14, -128, -50, 23, 103, -44, 162, -24, 81, 255, 108, 19, 47, 59, -20, 96, 156, 12, 193, 103, -114, 163, 10, -50, -33, -53, -42, 66, -4, -131, -70, 34, 44, -87, -170, -139, -21, -33, -180, -63, -102, 6, -49, -151, 78, -10, 82, 82, 15, 5, 5, 86, 118, 36, -38, -62, -34, -25, -14, 46, -56, -82, -12, 61, -18, -160]
3210a60Q9OK11l4j11k36K09L4j15J48p5K9Q5j21J01j23J45j96pJ28l1o0m1O4K6
3235c5J27j99K52j58O4l4j6m3K6n0R9L9N5p2m4J16k10O5o2l7J86Nk03J92k15J32
3261b0q1N5N3Q6k3O1j40l4J20%j33Q1K0m8N1q4J50m9j95K18j73K16O8l21J71j11
3287f2L4m6l0J85O1j25o1J6k8rJ39j69J83l2j08j03J39P1j42L6R4j69P9J75k21
3312i3J00r9O5O9q0j01J0J11O3j86Q7J5N5j13J51N8o7q2K6M2O2K6j02O1J1j10
3338b1l9j50K99k10M9P1k1o5LO5l5J00N8p2j52J89j29K0Q0N2rr2n7oR9p9J41j4
3366G5j91M7K14j99J30p5L4q2R5Qm9J64M2j45p6j73K85n7o7mR3m8J0M0j09M6J4
3393B2j45J58m5J56j62km6k03K53n2J09N2o7J0J2p3J07o1n1J34j15OjOo5J19j05
$$ y = [-160, -71, -65, 146, 112, 1, -235, -26, 8, -107, 41, -34, -5, 80, -41, 60, -63, 82, -114, -121, 7, -24, -84, -125, -61, -35, 92, -107, 145, -13, 51, 17, 1, -42, -16, -66, 33, 72, 127, 55, 11, 127, -83, -18, -80, -117, 69, 74, -129, 63, -152, -20, -101, -46, 7, 93, 70, 131, -9, -43, 77, 77, -56, 25, 45, -3, 48, -36, 114, 65, -130, 88, -85, 131, 199, -122, 49, -62, -28, -74, -104, 81, 142, 17, -44, -28, -56, -65, 74, -95, 88, 56, -52, -155, -16, 55, -87, -51, 43, -126, -47, 128, -93, 7, -92, -27, 42, -38, -139, -129, -18, 45, -141, -54, -39, 16, -97, 54, 112, 45, -37, -11, 31, 93, 119, 17, 78, 89, -21, -60, -210, 89, -121, -72, -1, -22, -87, -84, -19, -54, 46, 104, 32, -120, 69, -60, -40, 40, 92, 83, -9, -66, -72, 27, -52, 89, 75, -116, -69, 145, -54, 76, 1, 35, -47, 48, 56, 7, 171, 213, 68, -8, -181, 104, 47, -20, -24, 69, 21, 31, 71, -38, 8, 22, -123, 35, -10, 146, -16, -18, -64, -267, -14, -66, 43, 95, 28, 38, 50, -23, 84, 23, -28, 106, -9, -3, -4, 2, -63, 56, -49]
3420d9n2J33m2k9j01R0j33K43J20k75P9q4O8oK5j7r6L4M4K15p3j55J74q7j76J46
3446dJ9j27J70j42L0o0R7m5N0N1j19R7o6J55l4j01o7Q6J1j29J57q5P6o4ML5lL2
3474B4j00O2j89K63j99L3J40j25N7k6K29l09K52k46R4p0K45j36l3n4J22J4j31
3497h3M0j8J0J20m3N0l0o2j15J17l7R1mj14m7J68J5O9k66L43j40q8P1j43O1J08
3523G3j23J74j28oO8j59J76j30r7J79J27j96q5P0n8J81n3M3n8K8J7o7M7P2j3j54
3549g2K35k32l5J17m7j78L50k48M1l8J64qn5L3J23j52N3j06K23j29O8J1Q6k60
3573e6K0P2q2J08k89L43j28L2L3o2J21k28J69L3j97j0J29k13J90k1o1J17n6K9
3597gp3L4J17k47K98m0l0L5k3j53J66j6N3j12j7n4J39R7j33k5L8K5K2Q3j80r3
$$ y = [-49, -101, 32, -10, -39, -140, -50, -183, 60, 180, -95, -16, -100, -32, -38, -13, -30, -126, -92, -48, 167, 94, -61, 113, 26, -150, -4, 15, -112, 58, -84, -54, -114, -17, -62, -12, 39, -80, 17, -49, 106, 72, -29, -96, -10, 1, -128, 29, -56, 20, -44, -40, -5, -8, 24, -76, -14, -203, 60, -139, -106, 34, -91, -34, -60, 169, -140, 112, -134, -40, -110, 135, -1, -34, -88, 34, 48, -83, -43, -61, -51, 69, 26, 76, 46, -16, -131, -14, -51, 40, 36, -78, -125, 43, 58, 127, -139, 204, 64, -24, 47, -96, -35, 73, -50, 124, -4, -10, 58, -101, 75, -55, -152, 27, 154, -42, -127, -57, -115, 66, 13, 56, -2, 26, 43, -24, 23, 95, 82, -72, 163, -69, -104, 13, -34, -212, 138, -110, -69, -107, 57, 49, -6, 27, 150, -2, 51, -55, 168, 39, 107, 118, 204, -56, -36, 36, -46, 62, -227, 116, -12, 20, 53, -9, 112, -116, 53, 86, -111, -121, 8, -205, -15, -36, -97, 20, -36, -7, -80, -46, 71, -176, 122, 82, 52, 87, 64, -89, 77, 61, 114, 2, -15, -69, 70, 167, 34, 9, 47, 72, 94, 177, -3, -96]
3623i6K96m03K96k16J24o8M6N9p4P4k11J92j15L3Q0n2L7j21J26jo7o5J0J94Kj47
3649f7J8J6J32J3p5j72K27q5J9k08K73P3j55j23J06o7l7J38j9J44j20J8J9N2m7
3674G3j18L3L4j56n2J29o1J16Q2j82P2M6J0p1K5j09j1P1O3m5J6n9O2L8J77p9k36
3701a32M1J24m2J84k58J01r2J7R2k27J66J06q6K9N1Kk11J83j40qJ95k07J35n4
3725c1q9R3Jj56J06J77j46j23n2K04P7O2r8p8Q9l8o3J02q7K2J85k27k5J21Q4r0
3751B0J37k59j1K20o1m8L8j5j59J70r9o7j45J88rN1m7Q6J7l7J33j28m6M8J12k9
3777F0J77j34k0j45l6K30k5j99K91k07N6k1nj23O0K8J14j34k1m7k3J77n9p8O9
3802a5p8Q0J7Jj31j10J03J72l7o9J45j52J23K3O6r3j69O5l9K07Mj00R5l09J41
$$ y = [-96, 200, -203, 93, -123, 1, -67, -21, 38, -36, 38, -173, 19, -96, -63, 17, -35, 2, -119, 7, 6, -61, -126, -116, 78, 80, -67, -49, -33, 99, 112, 37, -135, 92, 7, 26, -182, 91, 164, 9, -114, -8, -75, -112, 26, 7, 151, 31, 49, 68, 120, 73, -45, -12, 22, -134, -186, -57, -118, -2, 80, -102, -30, 16, 26, -45, -20, -129, -140, -69, -6, -51, -35, -94, -32, 6, 183, 104, -132, -91, 33, -9, 175, -83, 18, -74, -57, 35, -192, -26, 80, -6, 23, 74, 76, -135, 48, -92, -100, 95, -112, 23, -31, -120, -27, -26, -182, -76, 101, -45, -168, -220, -16, 61, 123, 25, -53, 36, -2, -65, 37, -50, -28, 157, -70, -95, 26, 110, 20, 157, -102, -113, 107, 46, -2, 36, 21, -138, 32, -67, -134, -279, -91, -100, -49, -96, -10, 7, -30, 103, -25, -71, -23, 89, 60, 237, 103, 83, -62, -98, 132, 107, -92, 199, -8, 48, 27, 22, -101, -41, -13, 101, -33, -54, -101, -124, 53, -6, -84, -15, -93, -13, 4, 5, -126, -236, -133, 39, 2, -67, 78, -74, 49, 72, 138, 45, -124, -59, -98, 109, 113, 13, 108, -201, -60]
3827f0R1M8L5J24l36K43k17Q4N1mn7o4N5n0j45J66KN6j73J77L4j37mm2J40j54
3853a37J35k7n2K6J17j52PJ62Qn8Mr3L41k52J64Ok97K00M5k16R6n0J76j68P1k57
3879b01K18j8j24l8K32o1M1j91J01Q6L7j98j71L78J2k54J27J01k5k5q4R8j42J6
3903h5J55q4j28jJ47Mj0j1N5p4L7m9R2n7N8q0J40j10J70j36j45J62k71K17ON1
3929E3L5j31J38k0Q2PK7j49R2j63J16J4j45O2J7k6J1o9K26k83QJ50n0N5j15j12
3955a70K59n2Q1j16l7j10K10kM9j46l9J69j85j35J47j7m7J31RJ25p3J32k83Q8
3979a2%%J20o7N4J4k1r3J38j16o2J33M0j64%R5j56J18l6j30K74l1j39qJ7J03j79
4006a08K5K77k66j59K15q3K3j3L2j26P4L9Q5n9N5o5K5Q4J09o5j28K32j92J81n6
$$ y = [-60, 31, 79, 114, 238, -98, 145, -72, 12, 63, 59, 2, -62, -7, -57, -202, -36, -34, 22, -151, 26, 60, -77, -81, -123, 17, -137, -2, -29, -81, -55, 62, -90, -83, 79, 87, 29, 33, -60, 281, 29, 193, 199, -98, 102, 147, -69, 27, -23, 153, -15, 56, -201, 17, -1, -125, -163, 69, 8, 49, -142, -41, 45, 82, -116, -287, 91, 103, -151, -24, 77, 52, 27, -57, 41, -101, -85, 70, -14, -142, -143, 4, 8, -2, -13, 42, -32, 5, -44, 48, -9, 49, -31, 109, -1, 169, 33, -112, 50, -221, -4, 2, 53, 88, -43, 95, 75, 157, 164, 191, 42, 134, -29, 87, 101, -44, 18, 35, 9, 20, -49, 177, -106, -98, 52, 2, 57, -58, -170, 89, 37, 118, 2, -35, -145, 65, 63, 112, -34, -73, 96, -89, -224, -77, -94, -141, -10, -1, 124, 51, 183, -100, -12, -12, -12, 108, 41, 95, 109, 88, -5, 133, 17, -45, 88, 128, -36, -36, 59, -97, 21, -15, -145, 129, 98, -41, -49, -32, 71, -108, -83, 194, -72, -231, -16, -99, -76, -89, -57, -183, -109, -70, 15, -44, 11, -54, -29, 55, 164, 99, -29, 203, 11, 192, 136]
4031A36k17K62k60K13mm1k5Q6n8j08k3OjN8mP7k4n7M0j75J18p2K5O7m9J17l39
4058b52K12J61j57j43J09P9l3Q7j33J59k4j32J3r1N7J8k8Q0o7P5Q9P4n2j93K41
4083A49k30J39j27J11l2l4J44k01J28P7m5J2j12KM9J1J62k93K58q4j58J22o1l4
4107d7L8N4KP1k17P1j00J36r7L9K46j68J46l78J78L0m4K51j73J6j91J12k5M4k5
4132c1j1j06N8O3M5qp4L41j64k78N7J80j27l4J44n0l9K57j11j11oo9J39q3p3J6
4158g5J16R1j23R1J31Jk44Q5J37j54n9O1j11R1j6j20J3K74j84p9K16j47P1l0K1
4183E7L4j03j08j4J70j8RK52j65Q5k66J71Lk3k6J00j1k54J90m7M0m8Nl4J77k51
4209g5N2j17J18K51l48R2j5q0J76j04K6n9q2J29J3q2L4k4J25Rj59j00J31K85q5
$$ y = [136, -81, 181, -79, 134, 130, 89, 64, 150, 92, -16, -39, -33, -34, 24, 20, 97, 73, 16, 56, -119, -1, -73, -48, 19, -30, 87, -252, -40, 121, -36, -179, -70, 9, -24, 63, -70, 89, 65, -67, -54, -145, -88, -70, -98, -18, -85, -10, 79, 153, 101, -92, 149, -81, 58, -69, 42, 10, -24, 120, -81, 47, 124, 79, 91, -21, -19, 30, 41, 203, -90, 168, 84, -74, 48, -13, -47, -9, 45, 47, 118, -99, -28, -128, 8, -89, -50, 196, 28, 174, -204, -26, 4, -40, 211, 38, 54, -137, -25, -50, -6, -31, -42, -148, -90, -27, 18, 10, -64, 277, 113, -165, -108, 72, -55, -89, 55, 5, -34, 223, 112, 1, -5, -74, 65, -18, -91, -75, 41, 132, 9, 100, 231, 232, -12, 73, 210, 56, -3, 58, -53, 38, 22, -98, -85, 189, 5, -74, 142, -5, 66, 36, 57, 91, -12, -120, -134, 36, 18, 27, 279, 114, 199, -67, 104, 107, 84, 58, 158, 147, -107, 83, 36, 76, 28, 33, -1, 176, -75, -23, -140, -22, 229, -119, -27, -42, -122, 54, -50, -24, -83, -165, -36, -23, -105, -71, -95, 30, 39, -120, -220, -89, 196, 111]
4234A11j12O0m8L8J05j91lPJ22J12k16J9k4J24j00J28j8j07o9J04Qr6K9k23J93
4259d7N8L4j32J87q7q3J05m6j9L7N2r4j02J03r5J69r5R6l3j15K74j64K1J16j09
4284C1P0J98l14J45j08m8L4K6j5R3q2j04J19J4j75J95k03J32r8J44j55J56K0K1
4308I6j02n6J1M5q8J15J0L5r6o6R1J28o8k09J53oK9%j1j7jJo6J03L6m4N8m8j34
$$ y = [111, -1, 59, 11, 49, 154, -37, -40, -33, 89, 201, -15, 4, -20, 104, 4, 132, 114, 7, -62, 42, 50, -46, -17, -240, -47, 11, 45, -87, 100, 13, -70, 35, -11, -30, 7, 59, -35, -137, -34, -129, 40, -55, 41, 8, -107, 167, 3, 24, 140, 31, 101, 299, -15, 130, 22, -26, 8, 34, 19, 112, 30, -74, 45, 59, -116, 79, -124, 8, -90, 54, -101, 55, 75, 96, -6, -62, -51, -6, -94, 21, 31, 66, -30, -96, -5, 123, 55, -154, -1, -7, 22, 22, 11, -6, -7, -6, -72, 31, 67, 23, 81, 33, -101]
$$ [...]
8191C
##END NTUPLES=NMR FID
##END=
