##TITLE=c13 ikalashn
DE-77Fk_TFA2
12.12.2024
##JCAMPDX= 6.0         $$ Bruker NMR JCAMP-DX V2.0
##DATA TYPE= NMR SPECTRUM
##DATA CLASS= NTUPLES
##ORIGIN= UXNMR, Bruker Analytische Messtechnik GmbH
##OWNER= root
$$ TOPSPIN		Version 1.3
$$ 2024-12-12 13:36:15.828 +0400  Irina@DPX200
$$ Compression mode = diff/dup
##.OBSERVE FREQUENCY= 50.3282639994
##.OBSERVE NUCLEUS= ^13C
##.ACQUISITION MODE= SIMULTANEOUS
##.ACQUISITION SCHEME= undefined
##.AVERAGES= 22610
##.DIGITISER RES= 17
##SPECTROMETER/DATA SYSTEM= spect
##.PULSE SEQUENCE= zgpg
##.SOLVENT NAME= CDCl3
##.SHIFT REFERENCE= INTERNAL, CDCl3, 1, 234.9338
##AUDIT TRAIL= $$ (NUMBER, WHEN, WHO, WHERE, WHAT)
$$ ##TITLE= Audit trail, TOPSPIN		Version 1.3
$$ ##JCAMPDX= 5.01
$$ ##ORIGIN= Bruker BioSpin GmbH
$$ ##OWNER= Irina
$$ $$ F:/spectra/data/iren/nmr/c13zvl/1/pdata/1/auditp.txt
$$ ##AUDIT TRAIL=  $$ (NUMBER, WHEN, WHO, WHERE, VERSION, WHAT)
(   1,<2024-12-12 13:34:57.000 +0400>,<Irina>,<DPX200>,<TOPSPIN 1.3>,
      <created by zg
	started at 2024-12-11 16:25:53.093 +0400,
	POWCHK disabled, PULCHK disabled
       terminated by command 'halt'
       configuration hash MD5:
       BE 6D 3F 07 2A EA 11 49 91 17 2B D3 AF B3 58 0D
       data hash MD5: 32K
       AE 56 18 0B 1E 3B DB 41 2C 18 04 2D 67 C6 9D 21>)
(   2,<2024-12-12 13:35:01.453 +0400>,<Irina>,<DPX200>,<TOPSPIN 1.3>,
      <Start of raw data processing
       efp BC_mod = 2 LB = 2 FT_mod = 6 PKNL = 1 PHC0 = 151.3536 PHC1 = 9.814398 SI = 32K 
       data hash MD5: 32K
       16 B6 C1 4A A1 73 5E D8 C9 E3 CE C1 E8 6E C3 22>)
(   3,<2024-12-12 13:35:04.109 +0400>,<Irina>,<DPX200>,<TOPSPIN 1.3>,
      <apk 
       data hash MD5: 32K
       64 5D 9E C0 0A BF 82 20 A2 0B 98 AE EF 58 B9 4E>)
(   4,<2024-12-12 13:35:06.312 +0400>,<Irina>,<DPX200>,<TOPSPIN 1.3>,
      <abs n ABSG = 5 
       data hash MD5: 32K
       AA 2D 46 DE CB 0E 57 D9 87 00 0F D0 ED 1E 16 3F>)
$$ ##END=
$$ 
$$ $$ hash MD5
$$ $$ 2C 70 CB 1A 98 57 18 56 1C 16 A6 CC AB 61 7E 07
##$RELAX= 
##$RELAX= 
##$RELAX= 
##$RELAX= 
##$RELAX= 
##$RELAX= 
##$RELAX= 
##$RELAX= 
##$RELAX= 
$$ Bruker specific parameters
$$ --------------------------
##$DU= <F:/spectra>
##$EXPNO= 1
##$NAME= <c13zvl>
##$PROCNO= 1
##$TYPE= <nmr>
##$USER= <iren>
##$AMP= (0..31)
100 100 100 100 100 100 100 100 100 100 100 100 100 100 100 100 100 100 
100 100 100 100 100 100 100 100 100 100 100 100 100 100 
##$ANAVPT= -1
##$AQSEQ= 0
##$AQ_mod= 1
##$AUNM= <au_zg>
##$AUTOPOS= <>
##$BF1= 50.322709
##$BF2= 200.13
##$BF3= 200.13
##$BF4= 200.13
##$BF5= 200.13
##$BF6= 200.13
##$BF7= 200.13
##$BF8= 200.13
##$BYTORDA= 1
##$CFDGTYP= 0
##$CFRGTYP= 5
##$CHEMSTR= <none>
##$CNST= (0..63)
1 1 145 1 1 1 1 1 1 1 1 1 1 1 1 1 1 1 1 1 1 1 1 1 1 1 1 1 1 1 1 1 1 1 
1 1 1 1 1 1 1 1 1 1 1 1 1 1 1 1 1 1 1 1 1 1 1 1 1 1 1 1 1 1 
##$CPDPRG= <waltz16>
##$CPDPRG1= <>
##$CPDPRG2= <waltz16>
##$CPDPRG3= <>
##$CPDPRG4= <mlev>
##$CPDPRG5= <mlev>
##$CPDPRG6= <mlev>
##$CPDPRG7= <mlev>
##$CPDPRG8= <mlev>
##$CPDPRGB= <>
##$CPDPRGT= <>
##$D= (0..63)
$$ [...]
##$SW= 249.617472808154
##$SWIBOX= (0..15)
0 1 3 0 0 0 0 0 0 0 0 0 0 0 0 0 
##$SW_h= 12562.8140703518
##$TD= 32768
##$TD0= 1
##$TE= 300
##$TE2= 300
##$TE3= 300
##$TEG= 300
##$TL= (0..7)
120 120 120 120 120 120 120 120 
##$TP= (0..7)
150 150 150 150 150 150 150 150 
##$TP07= 0
##$TPNAME0= <>
##$TPNAME1= <>
##$TPNAME2= <>
##$TPNAME3= <>
##$TPNAME4= <>
##$TPNAME5= <>
##$TPNAME6= <>
##$TPNAME7= <>
##$TPOAL= (0..7)
0.5 0.5 0.5 0.5 0.5 0.5 0.5 0.5 
##$TPOFFS= (0..7)
0 0 0 0 0 0 0 0 
##$TUNHIN= 0
##$TUNHOUT= 0
##$TUNXOUT= 0
##$USERA1= <user>
##$USERA2= <user>
##$USERA3= <user>
##$USERA4= <user>
##$USERA5= <user>
##$V9= 5
##$VALIST= <valist>
##$VCLIST= <CCCCCCCCCCCCCCC>
##$VD= 0
##$VDLIST= <DDDDDDDDDDDDDDD>
##$VPLIST= <PPPPPPPPPPPPPPP>
##$VTLIST= <TTTTTTTTTTTTTTT>
##$WBST= 1024
##$WBSW= 4
##$XGAIN= (0..3)
0 0 0 0 
##$XL= 0
##$YL= 0
##$YMAX_a= 27615104
##$YMIN_a= -5026767
##$ZGOPTNS= <>
##$ZL1= 120
##$ZL2= 120
##$ZL3= 120
##$ZL4= 120
##$ABSF1= 234.9338
##$ABSF2= -14.71115
##$ABSG= 5
##$ABSL= 3
##$ALPHA= 0
##$AQORDER= 0
##$ASSFAC= 0
##$ASSFACI= 0
##$ASSFACX= 0
##$ASSWID= 0
##$AUNMP= <proc_1d>
##$AXLEFT= 0
##$AXRIGHT= 0
##$AXTYPE= 0
##$AXUNIT= <>
##$AZFE= 0.1
##$AZFW= 0.5
##$BCFW= 0
##$BC_mod= 2
##$BYTORDP= 0
##$COROFFS= 0
##$CY= -3
##$DATMOD= 1
##$DC= 0
##$DFILT= <>
##$DTYPP= 0
##$F1P= 0
##$F2P= 0
##$FCOR= 0.5
##$FTSIZE= 32768
##$FT_mod= 6
##$GAMMA= 0
##$GB= 0
##$INTBC= 1
##$INTSCL= 4.98009e-010
##$ISEN= 30
##$LB= 2
##$LEV0= 0
##$LPBIN= 0
##$MAXI= 7.640843
##$MC2= 0
##$MEAN= 0
##$ME_mod= 0
##$MI= 1.154659
##$NCOEF= 0
##$NC_proc= -4
##$NLEV= 6
##$NOISF1= 0
##$NOISF2= 0
##$NSP= 0
##$NTH_PI= 0
##$NZP= 0
##$OFFSET= 234.9338
##$PC= 1.4
##$PHC0= 156.9156
##$PHC1= 14.62488
##$PH_mod= 1
##$PKNL= yes
##$PPARMOD= 0
##$PPDIAG= 0
##$PPIPTYP= 0
##$PPMPNUM= 100
##$PPRESOL= 1
##$PSCAL= 0
##$PSIGN= 0
##$REVERSE= no
##$SF= 50.3227228988183
##$SI= 32768
##$SIGF1= 0
##$SIGF2= 0
##$SINO= 80
##$SIOLD= 32768
##$SREGLST= <13C.CDCl3>
##$SSB= 0
##$STSI= 32768
##$STSR= 0
##$SW_p= 12562.8140703518
##$SYMM= 0
##$S_DEV= 0
##$TDeff= 32768
##$TDoff= 0
##$TI= <>
##$TILT= no
##$TM1= 0
##$TM2= 0
##$TOPLEV= 0
##$USERP1= <user>
##$USERP2= <user>
##$USERP3= <user>
##$USERP4= <user>
##$USERP5= <user>
##$WDW= 1
##$XDIM= 32768
##$YMAX_p= 85537252
##$YMIN_p= -2064442
$$ End of Bruker specific parameters
$$ ---------------------------------
##NTUPLES= NMR SPECTRUM
##VAR_NAME=  FREQUENCY,     SPECTRUM/REAL,   SPECTRUM/IMAG
##SYMBOL=    X,             R,               I
##VAR_TYPE=  INDEPENDENT,   DEPENDENT,       DEPENDENT
##VAR_FORM=  AFFN,          ASDF,            ASDF
##VAR_DIM=   32768,         32768,           32768
##UNITS=     HZ,            ARBITRARY UNITS, ARBITRARY UNITS
##FACTOR=    0.383398360251222, 1,           1
##FIRST=     12562.8140703518, -312404,      -42433841
##LAST=      0,             1073053,         -75621302
##MIN=       0,             -2064442,        0
##MAX=       12562.8140703518, 85537252,     0
$$ Real data points
##PAGE= N=1
##DATA TABLE= (X++(R..R)), XYDATA
$$ [...]
##PAGE= N=2
##DATA TABLE= (X++(I..I)), XYDATA
15634 -243983647 -243730801 -243551927 -243611745 -243895539 -244232737 -244451790 -244548645 -244617224 -244647609 -244548271
15624 -244548271 -244358816 -244179679 -244066453 -244006843 -244014502 -244135794 -244335464 -244524001 -244599151 -244540427
15614 -244540427 -244441977 -244441190 -244531818 -244587969 -244602357 -244681585 -244827376 -244926915 -244901225 -244717192 -244444954
15603 -244444954 -244186230 -243988672 -243789228 -243571617 -243536550 -243781649 -244106611 -244281328 -244264692
15594 -244264692 -244161876 -244037517 -243975201 -244088670 -244330425 -244564723 -244710180 -244731795 -244694794 -244648908
15584 -244648908 -244586036 -244508918 -244497425 -244609997 -244792454 -244949685 -244936923 -244708675 -244376431 -244079483
15574 -244079483 -243924841 -243912020 -243949570 -243905101 -243721536 -243472072 -243264580 -243194059 -243264124 -243399980
15564 -243399980 -243561304 -243721176 -243832919 -243835993 -243670769 -243442072 -243313862 -243289142 -243341943 -243422057
15554 -243422057 -243485137 -243522579 -243498577 -243448564 -243435794 -243444882 -243386730 -243231051 -243076578 -243011541 -243076623
15543 -243076623 -243199075 -243281328 -243335391 -243371111 -243381007 -243361977 -243328544 -243285167 -243198599 -243069164 -243026414
15532 -243026414 -243161752 -243395321 -243633689 -243820245 -243968667 -244124789 -244219054 -244169802 -244039450
15523 -244039450 -243927361 -243853215 -243806513 -243759517 -243676702 -243594471 -243524039 -243446434 -243378640 -243389145 -243494962
15512 -243494962 -243685752 -243918556 -244106494 -244218989 -244237659 -244125706 -243931169 -243810256 -243792312
15503 -243792312 -243810969 -243843088 -243828137 -243676919 -243411286 -243197967 -243148366 -243240878 -243324767 -243274303
15493 -243274303 -243119785 -242933852 -242794844 -242741359 -242728576 -242722786 -242766861 -242849370 -242908741 -242893739
15483 -242893739 -242860434 -242930648 -243092838 -243253327 -243379188 -243448816 -243505627 -243669416 -243943537 -244175222
15473 -244175222 -244229936 -244161571 -244062966 -243968378 -243894801 -243848754 -243836487 -243871002 -243949691 -244027075 -244050634
15462 -244050634 -244087633 -244262249 -244468380 -244577168 -244638848 -244745131 -244925768 -245085673 -245098256 -244968645
15452 -244968645 -244809994 -244728775 -244752258 -244834610 -244885924 -244804885 -244584866 -244306589 -244049630 -243892073
15442 -243892073 -243839163 -243798939 -243662342 -243388483 -243109195 -242989494 -243000315 -243073855 -243232744 -243488376
15432 -243488376 -243735550 -243885746 -243925074 -243861209 -243724804 -243505868 -243252429 -243042222 -242866034
15423 -242866034 -242789125 -242887494 -243088958 -243321138 -243581927 -243857906 -244154169 -244451959 -244638649
15414 -244638649 -244644304 -244567656 -244493698 -244395918 -244267799 -244122285 -244031980 -244013793 -243985326 -243904428 -243818045
15403 -243818045 -243777212 -243794542 -243873226 -243960803 -244032910 -244143148 -244249837 -244231050 -244085996 -243937736
15393 -243937736 -243831477 -243738555 -243717664 -243765016 -243855770 -244037485 -244269791 -244450872 -244531080 -244539707
15383 -244539707 -244489157 -244365067 -244256627 -244280497 -244371081 -244404545 -244312921 -244136950 -244037921 -244044034
15373 -244044034 -244061927 -244068683 -244081856 -244077517 -244043909 -243980853 -243840331 -243652324 -243439423 -243185970
15363 -243185970 -242989862 -242951951 -243031281 -243159680 -243283023 -243276157 -243143026 -243033511 -243010643 -243013495
15353 -243013495 -242964198 -242837230 -242695762 -242636181 -242680350 -242760066 -242806466 -242770929 -242640137 -242448147
15343 -242448147 -242290498 -242265776 -242386095 -242518299 -242584257 -242571447 -242474022 -242400360 -242430463 -242533885
15333 -242533885 -242608836 -242617267 -242648511 -242742251 -242852704 -242933768 -242986132 -243062564 -243175734 -243301459
15323 -243301459 -243404345 -243465996 -243511674 -243552784 -243565951 -243512304 -243414492 -243378330 -243437911 -243565012
15313 -243565012 -243690245 -243705343 -243548386 -243283873 -243079998 -243038744 -243104227 -243129639 -243033789 -242870959
15303 -242870959 -242730868 -242655387 -242664998 -242706847 -242714693 -242718927 -242798647 -242974064 -243181725 -243345613 -243506334
15292 -243506334 -243680123 -243699567 -243537404 -243409716 -243391332 -243419824 -243477850 -243504266 -243431453 -243298256
15282 -243298256 -243229525 -243221223 -243211471 -243180987 -243094602 -243001203 -242973556 -243035981 -243176647 -243284977 -243286638
15271 -243286638 -243217595 -243086473 -242921241 -242852185 -242972112 -243242218 -243567382 -243865743 -244009504
15262 -244009504 -243930137 -243734563 -243569902 -243526386 -243593430 -243662413 -243648143 -243537766 -243412876 -243345576
15252 -243345576 -243406846 -243617703 -243795692 -243846630 -243876933 -243976186 -244179332 -244451051 -244701131 -244831322
15242 -244831322 -244822081 -244735743 -244612212 -244412337 -244116213 -243833859 -243704396 -243754719 -243886059 -243995449
15232 -243995449 -244014718 -243889214 -243688307 -243533701 -243406365 -243229261 -242931084 -242600598 -242405469
15223 -242405469 -242399242 -242462462 -242436895 -242273573 -242094904 -242022099 -242104500 -242302264 -242495994 -242678787
15213 -242678787 -242843473 -242968003 -243096055 -243266711 -243436499 -243620803 -243866444 -244111066 -244281200
15204 -244281200 -244292198 -244124806 -243869170 -243601736 -243383403 -243271401 -243246650 -243287349 -243376420 -243490565
15194 -243490565 -243558603 -243509642 -243363273 -243154362 -242948858 -242799605 -242681508 -242649674 -242720563 -242741680
15184 -242741680 -242627966 -242514188 -242554773 -242751928 -243000784 -243122816 -243057961 -242871711 -242669260
15175 -242669260 -242546187 -242480951 -242387044 -242255302 -242126085 -242048370 -242095101 -242214636 -242268928 -242228753
15165 -242228753 -242148194 -242169222 -242411623 -242772766 -243057306 -243207735 -243266314 -243289786 -243332832 -243417318
15155 -243417318 -243523930 -243583644 -243509643 -243364283 -243275211 -243298710 -243371106 -243429252 -243488677 -243549907
15145 -243549907 -243620128 -243707905 -243743386 -243727055 -243708148 -243644366 -243531578 -243407560 -243308680 -243238576
15135 -243238576 -243157884 -243085182 -243101895 -243206844 -243337161 -243399145 -243391707 -243438211 -243540116 -243615495
15125 -243615495 -243656227 -243676606 -243667197 -243627722 -243554381 -243375269 -243015068 -242553952 -242153142 -241883245
15115 -241883245 -241802328 -241853523 -241874428 -241887130 -242020404 -242275672 -242547412 -242760273 -242878586 -242916879
15105 -242916879 -242958316 -243064363 -243163546 -243163251 -243053443 -242823466 -242528042 -242288840 -242163648 -242198356
15095 -242198356 -242336391 -242450686 -242517362 -242627705 -242717292 -242653567 -242481518 -242363491 -242349373 -242388004
15085 -242388004 -242487015 -242630104 -242719489 -242711905 -242682966 -242733394 -242873157 -242980667 -242922952 -242762581
15075 -242762581 -242659765 -242602298 -242439949 -242170847 -241923312 -241784600 -241817803 -241986468 -242180208
15066 -242180208 -242341303 -242487874 -242696964 -242990506 -243283477 -243494587 -243582664 -243558743 -243440178
15057 -243440178 -243249428 -243065578 -242998035 -243032935 -243055217 -243036802 -243003035 -242948822 -242884135 -242898341
15047 -242898341 -242899141 -242736875 -242543866 -242456927 -242396646 -242304812 -242241979 -242272463 -242379066 -242487230
15037 -242487230 -242549947 -242604339 -242704390 -242839923 -242997307 -243127276 -243111080 -242977805 -242925555 -243034462
15027 -243034462 -243195402 -243281617 -243257122 -243185975 -243200606 -243341150 -243536866 -243689690 -243757872 -243732806
15017 -243732806 -243627730 -243490242 -243392710 -243373014 -243379985 -243283771 -243052910 -242845813 -242772700 -242818822
15007 -242818822 -242939737 -243053039 -243099057 -243127996 -243211846 -243280980 -243225827 -243100703 -243049828 -243102755
14997 -243102755 -243260561 -243516927 -243804476 -244074629 -244231213 -244132677 -243842066 -243599212 -243516770
14988 -243516770 -243571756 -243709661 -243846892 -243917235 -243896929 -243849274 -243814001 -243780507 -243792215 -243866498
14978 -243866498 -243938901 -243925936 -243811657 -243647712 -243480439 -243374904 -243333902 -243292261 -243253670 -243260559
14968 -243260559 -243272439 -243256336 -243273521 -243386552 -243568744 -243688642 -243638675 -243489503 -243387017 -243311824
14958 -243311824 -243178183 -243050705 -243024151 -243069875 -243136162 -243245667 -243368570 -243423354 -243387892 -243298414
14948 -243298414 -243212600 -243193323 -243272288 -243418017 -243525014 -243558300 -243568106 -243514288 -243343961 -243182997
14938 -243182997 -243088741 -243047078 -243054005 -243119396 -243265083 -243438590 -243534677 -243551829 -243525478 -243427382 -243293574
14927 -243293574 -243216199 -243222806 -243240574 -243187630 -243139318 -243192985 -243241446 -243162501 -243005175 -242839719 -242741455
14916 -242741455 -242759608 -242789272 -242805156 -242835287 -242874262 -242960654 -243103475 -243247899 -243293514 -243216656
14906 -243216656 -243113645 -243052409 -243068934 -243168812 -243301747 -243346504 -243249545 -243084799 -242937667 -242849163
14896 -242849163 -242819047 -242830687 -242874408 -242917770 -242979564 -243065856 -243168060 -243280587 -243360099 -243341933
14886 -243341933 -243272892 -243293731 -243444396 -243625332 -243758671 -243795942 -243686492 -243487296 -243307570 -243129287
14876 -243129287 -242915439 -242741534 -242687206 -242740714 -242851466 -242995179 -243139249 -243249654 -243335704 -243401174
14866 -243401174 -243478172 -243582436 -243692747 -243745781 -243631309 -243387593 -243107159 -242820548 -242607621
14857 -242607621 -242567764 -242656972 -242755139 -242775082 -242670875 -242555469 -242535524 -242570936 -242583413 -242590869 -242681068
14846 -242681068 -242842644 -242951436 -242975660 -243013569 -243131289 -243321003 -243509255 -243616517 -243595970 -243448166
14836 -243448166 -243217453 -243022793 -242917163 -242816292 -242640058 -242413620 -242294571 -242331421 -242412029
14827 -242412029 -242478824 -242567459 -242710407 -242873359 -243027714 -243157581 -243248130 -243273986 -243215242 -243122253
14817 -243122253 -243045106 -243044002 -243091150 -243083018 -242996003 -242934751 -242999405 -243121949 -243265540 -243436046 -243572050
14806 -243572050 -243565774 -243418114 -243259027 -243172491 -243111781 -243022118 -242921732 -242821602 -242756419 -242801737
14796 -242801737 -242890282 -242892349 -242799041 -242651783 -242507876 -242403133 -242306532 -242241339 -242275042 -242370126
14786 -242370126 -242465466 -242521512 -242531940 -242494171 -242397364 -242285138 -242272484 -242395826 -242567304 -242727423
14776 -242727423 -242883404 -243089942 -243310442 -243492151 -243574160 -243473983 -243246182 -243043445 -242922235
14767 -242922235 -242835913 -242793667 -242835777 -242965142 -243107631 -243172587 -243160156 -243094488 -242941039 -242748845
14757 -242748845 -242674359 -242698933 -242689158 -242645336 -242612714 -242616988 -242661505 -242739347 -242819738 -242849162 -242832833
14746 -242832833 -242832493 -242883259 -242952275 -243001036 -243017186 -242991568 -242954753 -242981195 -243034968 -242995776 -242872505
14735 -242872505 -242797254 -242781074 -242734021 -242639889 -242573052 -242592405 -242669296 -242741437 -242752935 -242649997 -242463677
14724 -242463677 -242309230 -242252682 -242339733 -242485280 -242553821 -242528924 -242454978 -242421060 -242508080 -242701004
14714 -242701004 -242983735 -243297350 -243492262 -243531900 -243478545 -243417826 -243406519 -243404030 -243316752 -243114472
14704 -243114472 -242904496 -242813476 -242826969 -242900807 -243013489 -243071565 -243001863 -242879032 -242859731 -243015237
14694 -243015237 -243255201 -243443110 -243535645 -243506250 -243348961 -243107752 -242895029 -242790652 -242781683 -242834541
14684 -242834541 -242864072 -242823905 -242777914 -242734629 -242618816 -242428126 -242262889 -242243255 -242342452 -242430464
14674 -242430464 -242427069 -242402110 -242468255 -242610367 -242785888 -242964525 -243051801 -242984188 -242865404 -242857625
14664 -242857625 -242950036 -243032331 -243055164 -243062906 -243186028 -243440936 -243597436 -243544775 -243417027 -243311198
14654 -243311198 -243220861 -243147784 -243139132 -243187967 -243247384 -243257179 -243114274 -242816139 -242455566 -242143826
14644 -242143826 -241983863 -242029882 -242224336 -242442465 -242637704 -242821820 -242999560 -243139925 -243184460
14635 -243184460 -243126718 -243075616 -243128160 -243245711 -243313769 -243287424 -243240351 -243284845 -243387985 -243494835
14625 -243494835 -243572476 -243541702 -243453587 -243423730 -243430985 -243379021 -243208567 -242914147 -242565571 -242316532
14615 -242316532 -242282215 -242398990 -242444204 -242362446 -242263920 -242218271 -242289062 -242463216 -242592487 -242597554
14605 -242597554 -242543940 -242501245 -242434549 -242318201 -242258171 -242300006 -242323769 -242311096 -242381212 -242536578
14595 -242536578 -242679613 -242740782 -242726537 -242720732 -242750502 -242757039 -242717973 -242623694 -242515579 -242446093 -242420611
14584 -242420611 -242424278 -242426219 -242410764 -242374048 -242315558 -242274365 -242303905 -242374621 -242419029 -242435144 -242441904
14573 -242441904 -242444350 -242450441 -242513153 -242649738 -242758541 -242772130 -242720945 -242694551 -242794071 -243028742 -243253445
14562 -243253445 -243370094 -243398887 -243336287 -243173819 -242939394 -242726072 -242603234 -242534362 -242447069 -242351523
14552 -242351523 -242267241 -242163109 -242020992 -241905671 -241882979 -241965101 -242091365 -242150521 -242153811 -242184401
14542 -242184401 -242281567 -242481051 -242714140 -242876926 -242971488 -243041176 -243093686 -243108746 -243095838 -243072477
14532 -243072477 -243011139 -242903964 -242800385 -242684603 -242550373 -242467698 -242479871 -242505483 -242463504 -242415370
14522 -242415370 -242410099 -242447337 -242496094 -242495821 -242453822 -242417615 -242388951 -242402824 -242490047 -242588983 -242690720
14511 -242690720 -242809664 -242876859 -242837471 -242667009 -242411907 -242193259 -242128745 -242269919 -242571888 -242949563
14501 -242949563 -243247427 -243385073 -243380910 -243266169 -243106271 -242974753 -242910083 -242906434 -242952592 -243007819
14491 -243007819 -243021468 -242972314 -242869559 -242716831 -242574432 -242508837 -242509842 -242488347 -242403655 -242281850
14481 -242281850 -242147651 -242050383 -242042685 -242097625 -242144879 -242230785 -242447706 -242733679 -242933758 -243005176
14471 -243005176 -243053789 -243128150 -243115545 -242925453 -242603397 -242265478 -241980989 -241799362 -241751586 -241784387
14461 -241784387 -241847620 -241972569 -242125286 -242289068 -242518462 -242772763 -242926538 -242938977 -242825523
14452 -242825523 -242617968 -242438459 -242441140 -242638362 -242922636 -243202384 -243403912 -243430604 -243260898 -243021101
14442 -243021101 -242829934 -242761279 -242770512 -242691554 -242493751 -242340888 -242377599 -242521665 -242609495 -242625952
14432 -242625952 -242686327 -242832258 -243008515 -243115123 -243164936 -243217892 -243182967 -243035981 -242900617 -242858450
14422 -242858450 -242879978 -242923950 -242990329 -243111775 -243260108 -243334004 -243337467 -243378735 -243489313 -243644146
14412 -243644146 -243749822 -243752730 -243661292 -243506430 -243329503 -243170166 -243072026 -243061816 -243137993 -243239208
14402 -243239208 -243276375 -243204877 -243024391 -242813955 -242619403 -242424950 -242263129 -242174959 -242146056 -242149086
14392 -242149086 -242200703 -242339176 -242523994 -242661273 -242729084 -242773726 -242808732 -242765398 -242700943 -242735459
14382 -242735459 -242788554 -242705282 -242541305 -242397517 -242306184 -242290341 -242301103 -242325406 -242421396 -242578125
14372 -242578125 -242701073 -242712364 -242625128 -242513279 -242410303 -242246515 -242002255 -241797250 -241740475 -241783198
14362 -241783198 -241861174 -241985578 -242136179 -242279230 -242395779 -242457336 -242479314 -242472385 -242414917 -242308551
14352 -242308551 -242196491 -242124547 -242083647 -242044663 -242055211 -242131437 -242208190 -242271979 -242350395 -242424619 -242472502
14341 -242472502 -242474798 -242428976 -242385936 -242365749 -242396933 -242521240 -242682036 -242808941 -242858437 -242816211
14331 -242816211 -242731403 -242591140 -242365097 -242153983 -242109605 -242231226 -242385094 -242499615 -242534259 -242523685
14321 -242523685 -242584324 -242731317 -242858045 -242888682 -242850364 -242788475 -242757567 -242788985 -242844211 -242880993
14311 -242880993 -242924079 -242942219 -242889306 -242841192 -242828482 -242803193 -242764624 -242704750 -242635862 -242606053 -242624928
14300 -242624928 -242650869 -242633559 -242569427 -242542176 -242557454 -242573578 -242554096 -242499606 -242485417 -242550542 -242643117
14289 -242643117 -242704824 -242780097 -242895297 -243061515 -243284406 -243523983 -243701625 -243743974 -243667053 -243461669
14279 -243461669 -243189768 -243034524 -243065791 -243121767 -243095931 -243080794 -243126568 -243176625 -243219966 -243273050
14269 -243273050 -243317930 -243353902 -243414462 -243515114 -243565910 -243450957 -243212901 -242967957 -242769453 -242645404
14259 -242645404 -242667395 -242781296 -242848421 -242888540 -242972188 -243106270 -243201218 -243170145 -243080630 -242987147
14249 -242987147 -242883446 -242791542 -242715372 -242632030 -242534116 -242419628 -242303034 -242269048 -242320644 -242360852
14239 -242360852 -242326480 -242201672 -241994307 -241800033 -241709570 -241714610 -241761539 -241822239 -241935676 -242113230
14229 -242113230 -242297169 -242426970 -242481531 -242453164 -242322985 -242085274 -241814363 -241644873 -241622587 -241680501
14219 -241680501 -241730074 -241761547 -241875208 -242072325 -242250264 -242376416 -242515690 -242617793 -242586302 -242470296
14209 -242470296 -242349801 -242176445 -241979152 -241857891 -241835179 -241881294 -241894718 -241876828 -241875382 -241918840
14199 -241918840 -242052933 -242276976 -242486824 -242590076 -242620625 -242646967 -242660356 -242692779 -242761121 -242814637
14189 -242814637 -242827960 -242813033 -242749572 -242622038 -242545242 -242554767 -242552742 -242541241 -242579523 -242639007 -242660398
14178 -242660398 -242650994 -242643803 -242710583 -242869048 -243066684 -243237118 -243299686 -243219656 -243033369 -242804473
14168 -242804473 -242597396 -242485773 -242506052 -242500526 -242346334 -242139164 -242050998 -242109375 -242200790 -242239710
14158 -242239710 -242163087 -242000236 -241868781 -241838044 -241910360 -241999806 -242026128 -242039736 -242096682 -242208217
14148 -242208217 -242343920 -242491445 -242616107 -242637550 -242580715 -242555175 -242646471 -242816419 -242969763 -243043135
14138 -243043135 -243043015 -243049470 -243109451 -243205335 -243256614 -243218173 -243093092 -242905858 -242762097 -242757932 -242826995
14127 -242826995 -242800095 -242588324 -242288891 -242040549 -241949482 -242022018 -242114668 -242117173 -242117308 -242207531 -242376842
14116 -242376842 -242590053 -242814085 -243025453 -243181291 -243238394 -243189106 -243094605 -242962573 -242763578 -242535017
14106 -242535017 -242301323 -242108029 -242021602 -242036851 -242113547 -242183542 -242226335 -242252791 -242318997 -242390027
14096 -242390027 -242422863 -242466549 -242564349 -242729816 -242844166 -242750251 -242403331 -241896158 -241481689 -241328796
14086 -241328796 -241404322 -241601432 -241783040 -241790079 -241606593 -241394490 -241279620 -241240836 -241213649 -241180988
14076 -241180988 -241199460 -241342385 -241596576 -241847537 -241999080 -241961048 -241763457 -241564025 -241469274 -241518811
14066 -241518811 -241616774 -241604399 -241500694 -241412092 -241348333 -241294975 -241302366 -241316600 -241230365 -241068969 -240921068
14055 -240921068 -240882544 -240998300 -241178956 -241321437 -241531865 -241906033 -242309116 -242564355 -242591550
14046 -242591550 -242412703 -242154000 -241878908 -241650920 -241556278 -241630643 -241827783 -242057759 -242202175
14037 -242202175 -242185250 -242018386 -241775024 -241572196 -241451831 -241395706 -241378479 -241324469 -241224747 -241145539
14027 -241145539 -241150709 -241247911 -241296350 -241252054 -241251100 -241310612 -241413361 -241597988 -241803912 -241879532 -241781340
14016 -241781340 -241659834 -241708369 -241896418 -242054958 -242130391 -242152607 -242123996 -242052930 -241981898 -241954898
14006 -241954898 -241968926 -241997004 -242093033 -242248826 -242434959 -242658286 -242795475 -242721460 -242468561 -242235265
13996 -242235265 -242121726 -242089963 -242117041 -242169333 -242223468 -242282389 -242358748 -242433372 -242479104 -242457640 -242327856
13985 -242327856 -242110057 -241852429 -241616110 -241477342 -241466114 -241548090 -241601884 -241543388 -241400032 -241221485
13975 -241221485 -241090298 -241076410 -241191505 -241411329 -241693981 -241923262 -241962259 -241813117 -241621599
13966 -241621599 -241503330 -241479455 -241566322 -241749170 -241899147 -241931711 -241946810 -242008126 -242061108 -242134001
13956 -242134001 -242292928 -242503039 -242662650 -242648599 -242445375 -242184634 -241993269 -241925756 -241964170 -242054919
13946 -242054919 -242138923 -242215934 -242324960 -242469361 -242642792 -242853439 -243076530 -243207076 -243139011 -242909837
13936 -242909837 -242636842 -242360985 -242114839 -241931493 -241801687 -241715576 -241744466 -241907785 -242057984
13927 -242057984 -242058421 -241883738 -241628214 -241447827 -241458906 -241664263 -241982846 -242288538 -242464430 -242425932
13917 -242425932 -242205233 -241957050 -241817202 -241803878 -241895694 -242029761 -242120825 -242150279 -242125160 -242086606
13907 -242086606 -242079614 -242050521 -241903735 -241658107 -241394739 -241184482 -241073086 -241140015 -241354661 -241586238
13897 -241586238 -241741117 -241760248 -241713466 -241746552 -241838654 -241901301 -241923807 -241906721 -241845872 -241718064
13887 -241718064 -241557058 -241480541 -241482684 -241498990 -241569311 -241667164 -241708072 -241713614 -241735952 -241782199 -241850350
13876 -241850350 -241963884 -242172861 -242466771 -242668603 -242622621 -242506623 -242485882 -242513619 -242509007 -242428867
13866 -242428867 -242297339 -242157650 -241986809 -241751691 -241548228 -241420675 -241351998 -241356202 -241448327 -241623597
13856 -241623597 -241845014 -242063442 -242262840 -242393984 -242321616 -242077256 -241862068 -241855307 -242072302 -242437733
13846 -242437733 -242817626 -242992305 -242887968 -242623614 -242303569 -241981977 -241738993 -241593566 -241535044
13837 -241535044 -241625709 -241817588 -242012552 -242180915 -242315124 -242406540 -242405101 -242284283 -242043726 -241727070
13827 -241727070 -241453961 -241304102 -241313364 -241459286 -241651147 -241851928 -242103196 -242360452 -242484350
13818 -242484350 -242438064 -242361111 -242412234 -242590406 -242753602 -242720530 -242456972 -242110672 -241872704 -241781854
13808 -241781854 -241748614 -241738344 -241779044 -241889160 -242025450 -242078184 -242005484 -241873190 -241706002 -241489570
13798 -241489570 -241325758 -241263460 -241270975 -241324647 -241434704 -241659459 -242056948 -242584878 -243053078 -243243992
13788 -243243992 -243169470 -243037634 -242974923 -242899928 -242740552 -242494604 -242190481 -241868232 -241592000 -241471198
13778 -241471198 -241514618 -241576931 -241550145 -241475759 -241388163 -241292109 -241201275 -241168409 -241204767 -241263167 -241278108
13767 -241278108 -241191191 -241079492 -241038547 -241052536 -241122262 -241228328 -241350207 -241473337 -241606127 -241823219
13757 -241823219 -242107123 -242282049 -242285115 -242235778 -242224606 -242203709 -242125186 -242010840 -241909017 -241826903
13747 -241826903 -241730057 -241601197 -241454007 -241305253 -241158683 -241038301 -240983492 -240962649 -240945011 -240921209
13737 -240921209 -240910811 -240974410 -241142662 -241371621 -241631630 -241853628 -241966852 -242013442 -242098983 -242243771
13727 -242243771 -242340735 -242316568 -242207783 -242107295 -242057951 -241983997 -241793978 -241545480 -241326944 -241144118
13717 -241144118 -240974302 -240832082 -240772965 -240800831 -240896995 -241078719 -241295515 -241467019 -241559556 -241598139
13707 -241598139 -241646927 -241796718 -242040160 -242274744 -242412253 -242442871 -242349094 -242119899 -241817833 -241552621
13697 -241552621 -241388820 -241308897 -241302010 -241366650 -241439101 -241453675 -241410692 -241426665 -241577533 -241797240
13687 -241797240 -241920247 -241895112 -241779927 -241604614 -241422582 -241322309 -241305153 -241302523 -241242980 -241118139
13677 -241118139 -240995083 -240918771 -240884221 -240886266 -240909365 -240962642 -241074373 -241232999 -241341845 -241345533
13667 -241345533 -241325319 -241339620 -241354314 -241353574 -241361243 -241398044 -241491383 -241606382 -241641366 -241625706 -241696529
13656 -241696529 -241865033 -242048793 -242127715 -242017977 -241788365 -241589805 -241475889 -241417248 -241413177 -241484561
13646 -241484561 -241545673 -241543087 -241465448 -241321458 -241185532 -241081992 -241009462 -240962345 -240947413 -240983914
13636 -240983914 -241060759 -241215486 -241455471 -241724205 -241948768 -242072716 -242073515 -241942696 -241766400 -241733790
13626 -241733790 -241942670 -242311277 -242666232 -242893031 -242964662 -242906240 -242770636 -242639232 -242504217
13617 -242504217 -242322440 -242126916 -241980929 -241969655 -242076107 -242191861 -242282784 -242318032 -242283371 -242263789
13607 -242263789 -242261211 -242139899 -241895006 -241695214 -241572773 -241442501 -241247706 -241064538 -240985620 -240965705
13597 -240965705 -240941956 -240889747 -240854649 -240864398 -240869675 -240861912 -240846324 -240785662 -240681170 -240611943 -240670224
13586 -240670224 -240847324 -241059073 -241235423 -241354184 -241442450 -241542741 -241667784 -241728251 -241680261 -241617713
13576 -241617713 -241622858 -241677692 -241687618 -241582584 -241451770 -241464281 -241602796 -241723477 -241793726 -241846631
13566 -241846631 -241913462 -241950975 -241818660 -241540663 -241314068 -241202452 -241150159 -241068912 -240952008 -240949321
13556 -240949321 -241143519 -241471427 -241775180 -241869572 -241752302 -241584750 -241429802 -241275434 -241173782
13547 -241173782 -241208491 -241353597 -241518176 -241692554 -241867433 -241968174 -241956531 -241895045 -241895076 -241967243
13537 -241967243 -242001051 -241945060 -241838264 -241672429 -241498633 -241375209 -241289628 -241238474 -241177152 -241069358
13527 -241069358 -240977009 -240965735 -241025970 -241154881 -241331673 -241498654 -241610965 -241689219 -241711004 -241609035
13517 -241609035 -241443945 -241312274 -241188508 -241041629 -240902995 -240784216 -240691293 -240692165 -240839600 -241073242
13507 -241073242 -241314653 -241518534 -241604273 -241616821 -241694984 -241826464 -241934750 -241978670 -241922973 -241725274
13497 -241725274 -241388610 -241010007 -240714401 -240522308 -240383183 -240286463 -240288114 -240380763 -240556149 -240817648
13487 -240817648 -241074845 -241268936 -241382273 -241380680 -241259956 -241034624 -240787443 -240606572 -240510963 -240492563
13477 -240492563 -240502278 -240562380 -240674302 -240726263 -240741520 -240792492 -240856143 -240866035 -240843328 -240884097 -241024253
13466 -241024253 -241221230 -241403666 -241550724 -241628490 -241613333 -241615232 -241651677 -241650730 -241662307 -241650327 -241548908
13455 -241548908 -241418726 -241316517 -241263610 -241318947 -241461612 -241529851 -241482636 -241428524 -241389097 -241271233
13445 -241271233 -241108906 -241005659 -240985798 -240976087 -240904989 -240835388 -240840772 -240912578 -240967320 -240923001 -240813160
13434 -240813160 -240732144 -240766473 -240905437 -241079493 -241191542 -241217295 -241289440 -241432645 -241526800 -241516401
13424 -241516401 -241477625 -241484572 -241462096 -241404374 -241453582 -241620844 -241771176 -241845640 -241853474 -241769592 -241570862
13413 -241570862 -241317195 -241118265 -241041256 -241117501 -241358330 -241653151 -241818616 -241785998 -241635725 -241462110
13403 -241462110 -241289780 -241177337 -241196236 -241324230 -241424559 -241401368 -241308021 -241203304 -241055651 -240899110
13393 -240899110 -240772200 -240650935 -240599113 -240607862 -240598539 -240584915 -240643436 -240758003 -240836784 -240838442 -240768598
13382 -240768598 -240679816 -240629115 -240623003 -240604783 -240539987 -240470107 -240461887 -240523104 -240604768 -240642148 -240622664
13371 -240622664 -240557535 -240418542 -240267220 -240240026 -240292331 -240322035 -240337807 -240367523 -240390520 -240428479
13361 -240428479 -240585163 -240863248 -241104558 -241175766 -241137752 -241127550 -241178219 -241237644 -241241169 -241230788
13351 -241230788 -241304428 -241418014 -241439913 -241380215 -241281795 -241187962 -241143710 -241111353 -241049047 -240956451 -240851575
13340 -240851575 -240768437 -240728362 -240795226 -241039591 -241401117 -241712273 -241877559 -241953811 -242044241 -242125524
13330 -242125524 -242095936 -241947979 -241708270 -241412006 -241141417 -240941577 -240795381 -240717906 -240674802 -240579210
13320 -240579210 -240420423 -240234960 -240051532 -239897760 -239866672 -240057739 -240366232 -240551275 -240562146
13311 -240562146 -240498097 -240419131 -240404913 -240497620 -240551319 -240494126 -240414485 -240342906 -240234124 -240122051
13301 -240122051 -240038474 -239921266 -239748796 -239630949 -239607146 -239637521 -239697919 -239802793 -240018559 -240348708
13291 -240348708 -240728629 -241015637 -241150866 -241217917 -241289072 -241410860 -241605148 -241759653 -241790299 -241769628
13281 -241769628 -241750632 -241758435 -241766956 -241692270 -241499234 -241270376 -241106094 -240981121 -240876833 -240822509
13271 -240822509 -240851511 -240923527 -240993045 -241091178 -241254543 -241426071 -241466884 -241322712 -241101574 -240975753
13261 -240975753 -240950674 -240932241 -240896994 -240910013 -241056951 -241275292 -241453173 -241583665 -241648450 -241605001
13251 -241605001 -241469243 -241277121 -241059067 -240880323 -240778080 -240691804 -240595215 -240493312 -240411177 -240405135
13241 -240405135 -240513468 -240687443 -240800049 -240766284 -240632362 -240529926 -240514146 -240541416 -240527872 -240556202
13231 -240556202 -240704417 -240894605 -241030555 -241051013 -240960606 -240870887 -240831412 -240778873 -240716349 -240683347
13221 -240683347 -240671688 -240640941 -240594874 -240581143 -240663130 -240820278 -240981044 -241064769 -240981592 -240795149
13211 -240795149 -240591120 -240382463 -240203743 -240096874 -240040474 -239981916 -239930365 -239935777 -239982778 -239995034
13201 -239995034 -239944770 -239868346 -239779779 -239713657 -239724934 -239784937 -239877773 -239982141 -240010113 -239952910 -239868349
13190 -239868349 -239775283 -239703638 -239663937 -239663098 -239727110 -239849612 -240026983 -240244177 -240394428 -240412799
13180 -240412799 -240377727 -240369787 -240389490 -240465640 -240602558 -240733275 -240833161 -240887993 -240867822 -240876243 -240950767
13169 -240950767 -240989644 -240951001 -240873347 -240760461 -240625253 -240536021 -240525660 -240534059 -240489117 -240440399 -240470074
13158 -240470074 -240572297 -240642728 -240599731 -240539303 -240573257 -240627242 -240596209 -240415303 -240133292 -239991989
13148 -239991989 -240109073 -240336705 -240522043 -240586281 -240521555 -240490207 -240591038 -240782706 -240965814 -240959683
13138 -240959683 -240738250 -240488016 -240385792 -240477009 -240632765 -240689517 -240662093 -240648901 -240598713 -240492227
13128 -240492227 -240335954 -240157352 -240071358 -240089119 -240148097 -240199225 -240263400 -240384725 -240539938 -240631161
13118 -240631161 -240566242 -240381491 -240211894 -240154513 -240158398 -240138873 -240085419 -239994405 -239798470 -239498000
13108 -239498000 -239195801 -238992776 -238887981 -238855051 -238912639 -239011412 -239113097 -239214764 -239320845 -239378426
13098 -239378426 -239332216 -239193908 -238991473 -238809621 -238767031 -238848865 -238918124 -238880394 -238760775 -238646890
13088 -238646890 -238618839 -238725301 -238940444 -239161191 -239366743 -239569453 -239714683 -239738001 -239722588 -239797126
13078 -239797126 -240006206 -240257933 -240396588 -240388220 -240326586 -240352726 -240483175 -240611927 -240650443 -240622670
13068 -240622670 -240587621 -240573469 -240559829 -240516226 -240419276 -240287126 -240192965 -240183070 -240227824 -240241349 -240131241
13057 -240131241 -239911503 -239762007 -239768706 -239894250 -240099780 -240252675 -240271794 -240236273 -240203076 -240198093
13047 -240198093 -240204181 -240152344 -240028005 -239919681 -239931126 -240042678 -240176101 -240228432 -240110045 -239904416
13037 -239904416 -239732328 -239595416 -239440612 -239254767 -239112435 -239080636 -239143305 -239260061 -239453912
13028 -239453912 -239694512 -239876728 -239919214 -239835533 -239751402 -239756518 -239794255 -239838440 -239910788 -239987211 -239972502
13017 -239972502 -239875964 -239825963 -239869447 -239922778 -239874249 -239717143 -239520580 -239387034 -239402870 -239563465
13007 -239563465 -239732069 -239816552 -239842798 -239843788 -239835453 -239854679 -239933674 -240036610 -240107068 -240152087 -240178610
12996 -240178610 -240123152 -239965588 -239760688 -239547582 -239305452 -239087727 -238983530 -238938243 -238889863 -238896821
12986 -238896821 -238987171 -239090407 -239124957 -239034951 -238890551 -238840256 -238901518 -238957052 -238928830 -238842574
12976 -238842574 -238735979 -238585460 -238375685 -238153824 -238004395 -238090254 -238405034 -238731343 -238930777
12967 -238930777 -239015765 -239082388 -239175609 -239249059 -239305401 -239415295 -239550779 -239622152 -239533299 -239298862
12957 -239298862 -239087871 -239023209 -239049948 -239130241 -239240494 -239287792 -239230422 -239145845 -239083193 -238958500
12947 -238958500 -238795916 -238702343 -238720021 -238816929 -238926117 -239026887 -239116005 -239188561 -239220542 -239162747
12937 -239162747 -238997873 -238806847 -238713953 -238772838 -238944110 -239107715 -239117205 -239003665 -238941141 -238993842
12927 -238993842 -239038868 -239007213 -238971498 -238947451 -238942796 -238983899 -239043530 -239043964 -238949377 -238833377 -238796815
12916 -238796815 -238860827 -238936900 -238928848 -238837990 -238729997 -238603359 -238438620 -238283469 -238223494 -238264910
12906 -238264910 -238322619 -238355973 -238384183 -238363644 -238236149 -238045081 -237908131 -237868007 -237872950 -237923829
12896 -237923829 -238034611 -238176983 -238337823 -238498616 -238601382 -238630429 -238601949 -238558990 -238521590 -238467655
12886 -238467655 -238403951 -238318893 -238271134 -238317823 -238388389 -238433784 -238442833 -238368103 -238178311 -237965134 -237887943
12875 -237887943 -238036087 -238313569 -238554839 -238717504 -238786154 -238749956 -238667088 -238575272 -238460339 -238297287
12865 -238297287 -238161504 -238137747 -238165651 -238208203 -238277121 -238365563 -238490144 -238636946 -238766311 -238852787
12855 -238852787 -238860415 -238796978 -238671464 -238484553 -238294243 -238133634 -238046439 -238060472 -238101652 -238113195
12845 -238113195 -238078013 -237975481 -237807776 -237651589 -237546274 -237535532 -237643423 -237792471 -237940385
12836 -237940385 -238089590 -238217765 -238296008 -238387104 -238525311 -238610748 -238555341 -238452933 -238435413 -238467573
12826 -238467573 -238465770 -238382357 -238269286 -238182021 -238124120 -238114552 -238152134 -238159263 -238090273 -238034285 -238056597
12815 -238056597 -238171117 -238322506 -238394085 -238403833 -238371886 -238335679 -238381152 -238461685 -238513436 -238506347 -238468528
12804 -238468528 -238447518 -238393943 -238267123 -238127739 -238018763 -237964623 -238002693 -238113425 -238220589 -238263640
12794 -238263640 -238204543 -238084828 -237978412 -237935535 -237948464 -238047678 -238248246 -238447569 -238537408 -238496893
12784 -238496893 -238405713 -238360097 -238330100 -238249016 -238137437 -238028054 -237915239 -237816304 -237785190 -237797922
12774 -237797922 -237722511 -237476319 -237182030 -237005817 -236963323 -237026842 -237155672 -237289465 -237483383 -237765694
12764 -237765694 -238015755 -238150743 -238156782 -238025351 -237829732 -237639565 -237489581 -237469706 -237561907 -237584345
12754 -237584345 -237445809 -237159627 -236848983 -236694545 -236755207 -236958240 -237193488 -237357837 -237451213
12745 -237451213 -237490825 -237545777 -237739955 -238037469 -238240436 -238250923 -238196595 -238180584 -238108858 -237913308
12735 -237913308 -237712577 -237639052 -237660487 -237656816 -237597542 -237531587 -237464286 -237398604 -237430659 -237570886 -237752360
12724 -237752360 -237912413 -238023149 -238033179 -237920164 -237807236 -237753805 -237652224 -237419583 -237136994
12715 -237136994 -236919657 -236733491 -236595606 -236629170 -236821436 -237045662 -237153890 -237077187 -236877306
12706 -236877306 -236730604 -236742867 -236801198 -236791638 -236730507 -236642197 -236549507 -236464379 -236362426 -236331135 -236451422
12695 -236451422 -236604846 -236717088 -236823702 -236909923 -236962263 -236966080 -236929208 -236870546 -236778345 -236674668
12685 -236674668 -236609839 -236630137 -236734525 -236817533 -236769708 -236598610 -236383760 -236241944 -236228395 -236253338
12675 -236253338 -236269805 -236347696 -236479848 -236617914 -236761978 -236813295 -236672982 -236459329 -236374380 -236445671
12665 -236445671 -236548490 -236613948 -236665813 -236686872 -236663885 -236631123 -236599138 -236549346 -236505542 -236547481 -236576752
12654 -236576752 -236430963 -236156946 -235969700 -235981587 -236137181 -236372636 -236577792 -236614323 -236518106 -236451876
12644 -236451876 -236439508 -236419695 -236377071 -236265869 -236122338 -236084442 -236172884 -236246388 -236200534 -236134322
12634 -236134322 -236112057 -236105288 -236094789 -236069914 -236042031 -236032437 -236021945 -236021536 -236062434 -236109694 -236109346 -236044115
12622 -236044115 -235948096 -235889510 -235901078 -235924723 -235890115 -235780741 -235660744 -235624924 -235641753 -235734264
12612 -235734264 -235939403 -236121578 -236149317 -236022747 -235812941 -235588998 -235432659 -235368409 -235330286 -235280171
12602 -235280171 -235182584 -235016427 -234893221 -234861495 -234842181 -234849703 -234914572 -234974997 -235005956 -235028153 -235060121
12591 -235060121 -235129997 -235183631 -235178199 -235183607 -235285829 -235533777 -235844212 -236024703 -235981036 -235825024
12581 -235825024 -235719649 -235732859 -235811157 -235802363 -235652915 -235454139 -235337781 -235391268 -235513503 -235532234
12571 -235532234 -235430239 -235281017 -235112570 -234918375 -234723161 -234587799 -234561957 -234594680 -234524057 -234357540
12561 -234357540 -234212978 -234110104 -234031559 -233939340 -233831660 -233768181 -233746853 -233779350 -233902295 -234027694
12551 -234027694 -234099716 -234135637 -234145616 -234153464 -234189838 -234206758 -234194743 -234239675 -234318583 -234373121 -234421322
12540 -234421322 -234470686 -234459028 -234340297 -234211256 -234123517 -234022101 -233947847 -233981868 -234032800 -233979362
12530 -233979362 -233894061 -233908109 -234024425 -234100862 -234087845 -234055150 -234004603 -233904450 -233725871 -233535914
12520 -233535914 -233424491 -233356298 -233288029 -233235113 -233284363 -233443718 -233575563 -233628158 -233705823 -233895949
12510 -233895949 -234153688 -234377688 -234548004 -234643140 -234644129 -234580711 -234434185 -234248036 -234153982 -234197048
12500 -234197048 -234266139 -234250722 -234171354 -234089047 -234061821 -234135359 -234174003 -234024762 -233753186 -233478516
12490 -233478516 -233264593 -233058388 -232788413 -232523937 -232390929 -232418987 -232497352 -232519949 -232555592 -232712438
12480 -232712438 -232911351 -233080180 -233214836 -233312221 -233371213 -233396488 -233349470 -233194617 -233014565 -232951141
12470 -232951141 -232984324 -233016573 -233040401 -233046842 -233069569 -233115817 -233142430 -233107383 -233035785 -233069514 -233252717
12459 -233252717 -233467255 -233654259 -233749702 -233664011 -233437483 -233208392 -233033976 -232889656 -232766188
12450 -232766188 -232650408 -232489026 -232306682 -232176721 -232101741 -232047090 -231977680 -231903412 -231889066 -231961112
12440 -231961112 -232167556 -232507099 -232867260 -233102803 -233133240 -233040612 -232895421 -232720647 -232583826
12431 -232583826 -232485263 -232426798 -232393167 -232275161 -232051070 -231882910 -231888581 -232025466 -232177986 -232275729
12421 -232275729 -232305884 -232269518 -232219337 -232184315 -232149374 -232117057 -232070108 -231991209 -231901462 -231807279 -231712005
12410 -231712005 -231588159 -231456763 -231430468 -231522641 -231609712 -231616196 -231645666 -231776085 -231935607 -231993684
12400 -231993684 -231948599 -231954596 -232028376 -232055497 -231934451 -231685124 -231429575 -231244465 -231154197 -231103279
12390 -231103279 -231027405 -230927100 -230812400 -230670344 -230474271 -230246241 -230095501 -230126481 -230279667
12381 -230279667 -230447423 -230652244 -230866112 -231012615 -231080707 -231150273 -231272728 -231363125 -231339860 -231209601
12371 -231209601 -231049249 -230901304 -230769759 -230670287 -230637217 -230659364 -230654076 -230623489 -230691821 -230837394
12361 -230837394 -230913206 -230880920 -230795914 -230709290 -230632159 -230522279 -230366877 -230202063 -230035091 -229852402
12351 -229852402 -229650528 -229450216 -229324708 -229356386 -229465776 -229518543 -229508869 -229481675 -229481875 -229505438 -229533822
12340 -229533822 -229533529 -229487037 -229433378 -229412127 -229390749 -229262101 -229028156 -228766855 -228550102 -228401456
12330 -228401456 -228281777 -228242889 -228366071 -228603698 -228835641 -229028697 -229114991 -228977007 -228698085
12321 -228698085 -228426674 -228204739 -228062552 -228070560 -228287729 -228644741 -228879347 -228857020 -228712212 -228563386
12311 -228563386 -228419260 -228325576 -228285259 -228177137 -227992250 -227763140 -227566290 -227452387 -227333339
12302 -227333339 -227186407 -227058798 -227003047 -227021132 -227006192 -226922432 -226846397 -226808064 -226730465 -226531715
12292 -226531715 -226254637 -225981629 -225773220 -225632578 -225558248 -225555676 -225647171 -225814949 -225962774 -226014558
12282 -226014558 -225976443 -225891445 -225706401 -225371008 -224983424 -224607834 -224257604 -223999663 -223851485
12273 -223851485 -223793586 -223766886 -223740100 -223710293 -223650841 -223632866 -223684294 -223721029 -223685631 -223591525 -223441295
12262 -223441295 -223209013 -222991413 -222873049 -222853401 -222862073 -222798478 -222658627 -222478801 -222293826 -222135170
12252 -222135170 -222012257 -221922658 -221856060 -221817150 -221775536 -221618829 -221387601 -221174220 -220946898 -220688007
12242 -220688007 -220425127 -220163918 -219907860 -219691711 -219586857 -219598771 -219608115 -219530130 -219406730 -219274717
12232 -219274717 -219144945 -219036707 -218903007 -218731053 -218522245 -218299663 -218092777 -217883305 -217620358
12223 -217620358 -217355509 -217195486 -217113694 -216960162 -216650934 -216216232 -215704801 -215209756 -214838783
12214 -214838783 -214627658 -214504073 -214294582 -213936691 -213575647 -213304343 -213118580 -213028096 -213032338 -213042038
12204 -213042038 -212935077 -212684792 -212335753 -211967098 -211615207 -211278018 -210976477 -210676149 -210354205
12195 -210354205 -210085236 -209865616 -209558207 -209100243 -208571021 -208108644 -207757928 -207406225 -206979468
12186 -206979468 -206501458 -205999410 -205474274 -204963663 -204448390 -203859573 -203165891 -202414954 -201659095
12177 -201659095 -200930136 -200298072 -199764900 -199270582 -198808844 -198487521 -198350677 -198336760 -198428779
12168 -198428779 -198629364 -198940702 -199335881 -199811464 -200393842 -201040300 -201715114 -202385699 -202995917
12159 -202995917 -203517824 -203977105 -204442000 -204891943 -205242470 -205538490 -205827137 -206010337 -206057740
12150 -206057740 -206149029 -206502881 -207205053 -208283232 -209831098 -211976149 -214942787 -219077369
12142 -219077369 -224612545 -231431633 -239011269 -246502987 -252993156 -257962689 -261357287 -263432509
12134 -263432509 -264592147 -265104872 -265109608 -264751874 -264071905 -263022448 -261706076 -260348954 -259064133
12125 -259064133 -257835106 -256649604 -255524498 -254449936 -253380053 -252281606 -251163820 -250061428
12117 -250061428 -248999178 -247916736 -246748041 -245600961 -244617410 -243740060 -242836535 -241918058
12109 -241918058 -241045677 -240169806 -239258871 -238370597 -237525013 -236685667 -235780212 -234775015 -233743991
12100 -233743991 -232737059 -231734124 -230679540 -229571202 -228450043 -227378522 -226409683 -225472362
12092 -225472362 -224506775 -223616488 -222889844 -222327021 -221975467 -221859829 -221973677 -222241860 -222582587
12083 -222582587 -222990135 -223482631 -224091019 -224824985 -225583991 -226269689 -226829752 -227230887 -227535647
12074 -227535647 -227833559 -228143357 -228414087 -228607474 -228711857 -228736112 -228776473 -228900687 -229153278
12065 -229153278 -229592926 -230279160 -231368602 -233091465 -235651646 -239306214 -244352738 -250847068
12057 -250847068 -258390280 -266131664 -273115697 -278669790 -282571323 -284991241 -286280170 -286743096
12049 -286743096 -286570538 -285911974 -284936890 -283769813 -282429840 -280999239 -279601483 -278258601
12041 -278258601 -276932253 -275569230 -274206828 -272948724 -271836802 -270861323 -269905931 -268923318
12033 -268923318 -267981166 -267121741 -266265885 -265318892 -264317325 -263340602 -262399018 -261454689 -260531712
12024 -260531712 -259694285 -258826366 -257799612 -256725696 -255709911 -254743608 -253755399 -252681701
12016 -252681701 -251526265 -250310910 -249099196 -247956793 -246879689 -245913844 -245060062 -244270754
12008 -244270754 -243568979 -242927931 -242311013 -241751170 -241320984 -241134196 -241165685 -241259003 -241426706
11999 -241426706 -241795714 -242350937 -243046807 -243770614 -244372601 -244840163 -245266643 -245785664 -246363954
11990 -246363954 -246780648 -246944156 -246949155 -246837076 -246684935 -246637468 -246782273 -247162215 -247727585 -248460178
11980 -248460178 -249473420 -250992440 -253276266 -256541850 -261050076 -267006228 -274251231 -282067817
11972 -282067817 -289500130 -295752037 -300443967 -303660508 -305699980 -306773930 -307021381 -306663308
11964 -306663308 -305937751 -305000252 -303991150 -303022221 -302068994 -301044228 -299941830 -298838231
11956 -298838231 -297815558 -296912189 -296095194 -295313793 -294535745 -293765264 -293033128 -292315641 -291536008
11947 -291536008 -290679059 -289771745 -288859229 -288063892 -287456159 -286917981 -286289016 -285574222 -284894259
11938 -284894259 -284275742 -283677355 -283047867 -282387855 -281705855 -281056735 -280525369 -280077733 -279599764
11929 -279599764 -279020404 -278416011 -277833305 -277212091 -276562131 -275979990 -275462594 -274974166 -274552038
11920 -274552038 -274233543 -274002413 -273810966 -273574359 -273221239 -272810595 -272510692 -272359504 -272244080
11911 -272244080 -272107555 -271898554 -271604271 -271283018 -270967269 -270666088 -270391795 -270134588 -269848574
11902 -269848574 -269589272 -269423894 -269330666 -269270337 -269157424 -268965435 -268762371 -268638668 -268552245 -268388635
11892 -268388635 -268116290 -267739025 -267312600 -266960744 -266718585 -266457667 -266179897 -266015058 -265920082
11883 -265920082 -265837886 -265763649 -265604911 -265340813 -265063272 -264852346 -264675943 -264498336 -264375553
11874 -264375553 -264347985 -264310920 -264186375 -264008906 -263826103 -263622079 -263378519 -263149885 -262944598
11865 -262944598 -262688573 -262426546 -262234902 -262114486 -262029272 -262009860 -262070117 -262168841 -262161779 -262027971
11855 -262027971 -261955484 -261949174 -262017305 -262113519 -262165878 -262145865 -262085136 -262052917 -262041761 -262031361 -262063959
11844 -262063959 -262131223 -262163069 -262062552 -261790845 -261396060 -260994560 -260680411 -260407387 -260104782
11835 -260104782 -259782264 -259410511 -259026870 -258763715 -258687947 -258750966 -258843711 -258908313 -258982619 -259119756
11825 -259119756 -259269794 -259379599 -259464494 -259513658 -259512108 -259420890 -259239660 -259023491 -258777362 -258486332
11815 -258486332 -258209137 -257968828 -257723174 -257534297 -257520059 -257659741 -257829991 -257955080 -257985149
11806 -257985149 -257879974 -257681587 -257473924 -257277339 -257087166 -256957821 -256910597 -256902927 -256946925 -257007260
11796 -257007260 -256964109 -256793486 -256580871 -256431417 -256396593 -256372643 -256244585 -256083095 -256052819 -256237991
11786 -256237991 -256567285 -256865794 -257019796 -257044847 -256999846 -256960265 -256987530 -257054005 -257107280 -257098426
11776 -257098426 -256998579 -256862312 -256771289 -256694942 -256536342 -256263071 -255980950 -255877164 -256021296 -256268357
11766 -256268357 -256402248 -256370662 -256238477 -256102737 -256017384 -255968160 -255949235 -255927105 -255860250 -255756433
11756 -255756433 -255667307 -255629317 -255576778 -255402728 -255141207 -254896256 -254748705 -254726381 -254717404 -254633240
11746 -254633240 -254506981 -254378775 -254237334 -254100421 -253999365 -253934844 -253878834 -253832123 -253826776 -253816186
11736 -253816186 -253790365 -253795841 -253847763 -253960961 -254074467 -254103745 -254092817 -254094247 -254111709 -254124499 -254135887
11725 -254135887 -254176913 -254275928 -254359367 -254310413 -254140391 -253932469 -253724264 -253506788 -253336217 -253253147
11715 -253253147 -253237093 -253262865 -253255041 -253152476 -252967847 -252836691 -252853296 -252895435 -252796734 -252630773
11705 -252630773 -252571953 -252636681 -252737198 -252810608 -252823620 -252769833 -252698855 -252721381 -252877334 -253091043
11695 -253091043 -253296113 -253511379 -253732736 -253879359 -253914584 -253813615 -253585193 -253279714 -252869084
11686 -252869084 -252395546 -252011001 -251774197 -251634603 -251534221 -251506769 -251562718 -251618910 -251647033 -251649030
11676 -251649030 -251652149 -251695446 -251814404 -252046230 -252322685 -252569627 -252800370 -252964583 -253073843 -253139046
11666 -253139046 -253035320 -252779036 -252523019 -252323768 -252178675 -252105590 -252128790 -252160966 -252111609 -252013086
11656 -252013086 -251972945 -252047034 -252122378 -252033897 -251764996 -251456753 -251203607 -251036930 -250915901 -250892392
11646 -250892392 -251081098 -251361103 -251527702 -251542926 -251532902 -251580942 -251654010 -251734015 -251815631 -251853814
11636 -251853814 -251831342 -251789055 -251731179 -251640865 -251533110 -251477928 -251513840 -251655559 -251911166 -252226066
11626 -252226066 -252484791 -252620247 -252677631 -252653192 -252525061 -252365584 -252198395 -252038514 -251902860
11617 -251902860 -251777538 -251602330 -251328896 -251024374 -250783780 -250652491 -250647322 -250787465 -251021413
11608 -251021413 -251176973 -251115016 -250893207 -250694173 -250569275 -250416186 -250214022 -250051233 -250026203
11599 -250026203 -250132109 -250266770 -250357186 -250414467 -250534664 -250705982 -250792477 -250785755 -250772380 -250743288
11589 -250743288 -250694994 -250683060 -250677990 -250600117 -250507501 -250472770 -250461052 -250472940 -250593367 -250797190 -250954218
11578 -250954218 -250957837 -250836611 -250799598 -250936763 -251071810 -251069161 -250985603 -250868841 -250744985 -250634444
11568 -250634444 -250567942 -250596262 -250661204 -250736358 -250804416 -250809386 -250729302 -250589837 -250495611 -250482974 -250456239
11557 -250456239 -250355056 -250247614 -250158655 -250013938 -249849042 -249758332 -249710396 -249657289 -249633493 -249691199
11547 -249691199 -249817733 -249985835 -250087677 -250039129 -249910541 -249822343 -249782282 -249726373 -249652003 -249633880
11537 -249633880 -249686154 -249755964 -249823229 -249856938 -249868072 -249868966 -249809150 -249690536 -249655551 -249747597 -249846227
11526 -249846227 -249869621 -249779267 -249607154 -249452103 -249322285 -249184816 -249090766 -249087662 -249147366 -249228313
11516 -249228313 -249341780 -249498579 -249669491 -249827739 -249947438 -249962712 -249782463 -249383682 -248934026
11507 -248934026 -248655381 -248634069 -248796290 -249027586 -249239737 -249372652 -249401581 -249374191 -249353501 -249309005
11497 -249309005 -249246987 -249152701 -249015563 -248898465 -248834306 -248838132 -248905158 -248994258 -249039935 -249055086 -249064452
11486 -249064452 -248973527 -248780521 -248627332 -248581771 -248684027 -248962007 -249332980 -249656969 -249811095
11477 -249811095 -249806663 -249761842 -249738916 -249742269 -249771738 -249804138 -249771954 -249635491 -249444924 -249304544 -249256077
11466 -249256077 -249214311 -249131585 -249096818 -249158448 -249219544 -249208582 -249156915 -249071908 -248916772 -248765341
11456 -248765341 -248700731 -248692199 -248738734 -248837507 -248868874 -248748172 -248608771 -248556868 -248552174 -248568332 -248610261
11445 -248610261 -248661687 -248679090 -248647208 -248579231 -248479426 -248321553 -248090853 -247910431 -247868023 -247897773
11435 -247897773 -247963337 -248065120 -248135183 -248145425 -248100592 -248002659 -247940097 -247941821 -247983091 -248061388 -248086405
11424 -248086405 -248065604 -248102397 -248177732 -248227280 -248174343 -248011865 -247843467 -247723308 -247668127 -247721235
11414 -247721235 -247889722 -248063438 -248109534 -248057858 -248008095 -247937534 -247838409 -247750809 -247636126 -247458076
11404 -247458076 -247304244 -247300912 -247385760 -247452842 -247528594 -247663784 -247797697 -247811104 -247691096 -247571308
11394 -247571308 -247557966 -247618618 -247670878 -247723461 -247795240 -247842159 -247897066 -247962777 -247907965 -247707620 -247479838
11383 -247479838 -247325199 -247261445 -247280068 -247361126 -247489157 -247685431 -247910033 -248058333 -248078363 -248061042
11373 -248061042 -248047141 -247952118 -247797590 -247668859 -247590048 -247602933 -247715069 -247811644 -247891600 -248056255
11363 -248056255 -248282616 -248461360 -248517500 -248481007 -248448242 -248467444 -248508376 -248542534 -248583399 -248638966
11353 -248638966 -248677571 -248673582 -248631698 -248528689 -248348603 -248132181 -247886253 -247639091 -247467809 -247412419
11343 -247412419 -247473650 -247631900 -247759500 -247689176 -247488778 -247368507 -247332297 -247263249 -247223942 -247318098
11333 -247318098 -247468805 -247574910 -247654062 -247759642 -247851119 -247914611 -247975023 -247997825 -247972219 -247963921
11323 -247963921 -247991931 -247987642 -247944297 -247904371 -247879234 -247880879 -247846690 -247740430 -247678200 -247687937 -247709946
11312 -247709946 -247771823 -247867677 -247875305 -247736279 -247487510 -247217786 -247060042 -247043853 -247135591 -247259690
11302 -247259690 -247298437 -247206571 -247015568 -246777006 -246555999 -246364467 -246178093 -246074626 -246125204 -246273670
11292 -246273670 -246441841 -246630263 -246839752 -247003765 -247072665 -247075863 -247049514 -247059242 -247100097 -247097824 -247051573
11281 -247051573 -246977191 -246867862 -246708338 -246489139 -246293129 -246215831 -246283740 -246461983 -246622335 -246673721
11271 -246673721 -246662818 -246710977 -246835060 -246953969 -247029534 -247056492 -247053051 -247078274 -247175965 -247341267
11261 -247341267 -247526693 -247660706 -247709377 -247658781 -247525486 -247380440 -247272632 -247137712 -246922265
11252 -246922265 -246698691 -246532601 -246448988 -246455483 -246501521 -246500442 -246341184 -246076179 -245821834 -245617678
11242 -245617678 -245500141 -245511440 -245686245 -246001221 -246338613 -246619484 -246836117 -246981601 -247036674
11233 -247036674 -247035342 -247038462 -247104676 -247210635 -247258457 -247247951 -247244548 -247285340 -247363755 -247419321 -247372779
11222 -247372779 -247201373 -246957120 -246710051 -246535803 -246426520 -246324666 -246211138 -246096951 -246064687
11213 -246064687 -246074786 -245991351 -245808156 -245639095 -245550834 -245539391 -245574474 -245586256 -245572543 -245570714 -245588175
11202 -245588175 -245680791 -245917720 -246251836 -246580493 -246823338 -246940890 -246925446 -246830792 -246767827 -246718317
11192 -246718317 -246634365 -246572318 -246468884 -246240591 -246014000 -245842566 -245667638 -245508239 -245464487 -245573635
11182 -245573635 -245766315 -245964594 -246170886 -246351157 -246405062 -246293988 -246132182 -246028130 -245931640
11173 -245931640 -245778699 -245665827 -245642871 -245672520 -245751587 -245847040 -245955392 -246128481 -246326395 -246462219
11163 -246462219 -246515211 -246485348 -246331638 -246103191 -245866136 -245668682 -245567949 -245522537 -245516748 -245610689
11153 -245610689 -245764649 -245885001 -245994940 -246064836 -246020726 -245882327 -245751439 -245697495 -245678825 -245647017
11143 -245647017 -245588966 -245485100 -245386864 -245406420 -245582127 -245766073 -245841143 -245846625 -245860806 -245902270
11133 -245902270 -245848214 -245644299 -245390920 -245207752 -245161967 -245296229 -245524484 -245681191 -245688654 -245553467
11123 -245553467 -245328539 -245122476 -244967458 -244774350 -244524307 -244338848 -244389730 -244673039 -245044122
11114 -245044122 -245359101 -245551147 -245637132 -245677434 -245725440 -245777249 -245786467 -245798726 -245880051 -246010394
11104 -246010394 -246150794 -246270244 -246316378 -246273182 -246146354 -245982166 -245855202 -245811344 -245806251 -245759675
11094 -245759675 -245721120 -245724588 -245756314 -245782948 -245789240 -245763190 -245741123 -245778844 -245859944 -245923146 -245964446
11083 -245964446 -245986346 -246004030 -246100478 -246191562 -246147264 -246012616 -245886467 -245802215 -245772247 -245832103
11073 -245832103 -246019212 -246210553 -246271170 -246231790 -246171335 -246160062 -246204901 -246208964 -246162782 -246194513 -246363856
11062 -246363856 -246611031 -246812932 -246824292 -246623161 -246368984 -246252539 -246242866 -246171103 -246078079 -246069301
11052 -246069301 -246059585 -245974931 -245875832 -245831878 -245852228 -245946761 -246109688 -246231918 -246164052 -245902663
11042 -245902663 -245643432 -245570947 -245731367 -246010568 -246206570 -246162410 -245909669 -245687092 -245651782 -245749081
11032 -245749081 -245819441 -245763278 -245646820 -245586777 -245590912 -245628718 -245709571 -245787145 -245793159 -245657639 -245402108
11021 -245402108 -245202733 -245184320 -245274483 -245354148 -245444323 -245596154 -245767933 -245926068 -246035512 -246022327
11011 -246022327 -245871614 -245737646 -245810707 -246054236 -246244281 -246257653 -246171952 -246071874 -245940384 -245779971
11001 -245779971 -245643418 -245561875 -245500793 -245425120 -245348482 -245289825 -245214408 -245071516 -244874857 -244727152
10991 -244727152 -244716946 -244800772 -244811373 -244658862 -244497159 -244522860 -244690137 -244830781 -244862856 -244882043
10981 -244882043 -244962188 -245104030 -245255688 -245312693 -245280113 -245204581 -245140726 -245129197 -245199531 -245336262
10971 -245336262 -245478329 -245598667 -245683327 -245736972 -245807190 -245871051 -245856173 -245738067 -245583021 -245481656
10961 -245481656 -245476387 -245516471 -245495782 -245386055 -245230980 -245111905 -245090780 -245131505 -245181316 -245247442
10951 -245247442 -245324753 -245379909 -245446374 -245611051 -245804732 -245859589 -245728291 -245505361 -245401750 -245516157
10941 -245516157 -245742068 -245962838 -246071968 -246036515 -245929788 -245798308 -245664854 -245516801 -245364734
10932 -245364734 -245268385 -245277790 -245375447 -245511566 -245618506 -245592008 -245395264 -245150238 -245018678 -245004040
10922 -245004040 -245007476 -244972282 -244941508 -244987830 -245088103 -245132240 -245103738 -245138554 -245261658 -245295161 -245170205
10911 -245170205 -245026633 -244964488 -244891770 -244775314 -244704095 -244669074 -244563867 -244350115 -244124107 -243978293
10901 -243978293 -243991123 -244141955 -244297483 -244413135 -244472085 -244495328 -244464289 -244337833 -244213453 -244185636
10891 -244185636 -244197248 -244211564 -244287777 -244451002 -244669938 -244817472 -244772020 -244605459 -244456981 -244389257
10881 -244389257 -244396496 -244486818 -244668111 -244925016 -245143803 -245135941 -245002640 -244978565 -245095481 -245178519
10871 -245178519 -245096498 -244919387 -244780523 -244630466 -244406994 -244235382 -244246118 -244430421 -244649413
10862 -244649413 -244763953 -244730018 -244543784 -244273286 -244046649 -243960100 -244057584 -244256616 -244432599 -244501080
10852 -244501080 -244427547 -244288291 -244207419 -244243494 -244358224 -244435951 -244422432 -244352129 -244263688 -244219569
10842 -244219569 -244229908 -244225924 -244190711 -244145606 -244083911 -244068864 -244108561 -244131402 -244114673 -244110223 -244135878
10831 -244135878 -244127888 -244121657 -244162416 -244186280 -244153337 -244143280 -244263440 -244493374 -244732650 -244875181
10821 -244875181 -244846092 -244636854 -244270163 -243889250 -243718614 -243757167 -243836859 -243900853 -243955663 -244015750
10811 -244015750 -244132274 -244295825 -244418876 -244437047 -244407880 -244439601 -244546091 -244654084 -244722030 -244789278
10801 -244789278 -244908543 -245046924 -245164145 -245239935 -245252489 -245221239 -245190639 -245146164 -245042419 -244869142
10791 -244869142 -244616703 -244340570 -244105732 -243905313 -243758682 -243684119 -243661516 -243660488 -243703102 -243800408
10781 -243800408 -243883622 -243936138 -244035836 -244209007 -244365090 -244476054 -244526256 -244469986 -244359761 -244296039
10771 -244296039 -244313354 -244353884 -244280048 -244055048 -243746580 -243423401 -243239458 -243312868 -243548251 -243798174
10761 -243798174 -243918506 -243835245 -243631487 -243446798 -243331789 -243212229 -243098447 -243107436 -243266326 -243389836
10751 -243389836 -243345872 -243275417 -243298156 -243387418 -243487499 -243636197 -243875615 -244148188 -244425045 -244692224
10741 -244692224 -244869985 -244882509 -244750116 -244579037 -244436880 -244285766 -244112616 -243964003 -243834141
10732 -243834141 -243705887 -243603215 -243524899 -243469018 -243471938 -243541378 -243668225 -243804479 -243810474 -243591958
10722 -243591958 -243211934 -242810287 -242522402 -242453851 -242598457 -242841557 -243123002 -243400468 -243568162
10713 -243568162 -243603773 -243553114 -243448814 -243341533 -243315278 -243357863 -243334859 -243208893 -243084539 -243083870
10703 -243083870 -243180018 -243257458 -243281985 -243239316 -243140830 -243092415 -243150151 -243235193 -243284652 -243317965 -243335752
10692 -243335752 -243360482 -243376632 -243352878 -243272637 -243111899 -242876460 -242614617 -242354187 -242158721 -242159662
10682 -242159662 -242358646 -242592951 -242760600 -242889752 -242963827 -242955272 -242892172 -242813133 -242778643 -242866694
10672 -242866694 -243041933 -243203309 -243318774 -243362105 -243313515 -243161618 -242912659 -242628062 -242349790
10663 -242349790 -242180125 -242197315 -242315500 -242443035 -242580389 -242720255 -242873120 -242965323 -242953044 -242882708
10653 -242882708 -242752507 -242599000 -242534415 -242669555 -242992735 -243336053 -243588595 -243758148 -243856296
10644 -243856296 -243896895 -243901290 -243844971 -243742776 -243651086 -243537353 -243395935 -243247462 -243079849 -242959137
10634 -242959137 -242952794 -242968492 -242919532 -242807332 -242656711 -242491319 -242307626 -242155101 -242139697 -242250830
10624 -242250830 -242356413 -242445654 -242528595 -242577127 -242615355 -242681177 -242670585 -242428270 -242040362 -241762364
10614 -241762364 -241727744 -241840384 -241967674 -242042225 -242083653 -242122747 -242101054 -242013009 -241909941 -241867284
10604 -241867284 -241913364 -241996051 -242134869 -242328448 -242501917 -242621403 -242726802 -242767011 -242684946 -242501992
10594 -242501992 -242307046 -242185274 -242123121 -242039877 -241956186 -241960967 -242045353 -242137491 -242216883 -242264850 -242324412
10583 -242324412 -242435020 -242545490 -242615829 -242672918 -242694250 -242591052 -242365012 -242094693 -241888463 -241769671
10573 -241769671 -241647183 -241494933 -241362980 -241269083 -241208536 -241221891 -241295726 -241373552 -241403538 -241371002
10563 -241371002 -241351599 -241419519 -241563501 -241759639 -241982379 -242176914 -242309012 -242360756 -242259833 -241974014
10553 -241974014 -241587460 -241217638 -240986415 -240841126 -240693648 -240633329 -240742183 -241007117 -241331346
10544 -241331346 -241618108 -241877034 -242114254 -242297018 -242504961 -242786138 -243059608 -243258112 -243363604
10535 -243363604 -243360958 -243223836 -242976902 -242722649 -242551794 -242472666 -242471432 -242487701 -242435487 -242308874
10525 -242308874 -242215677 -242252578 -242395511 -242511426 -242495292 -242367807 -242237318 -242189263 -242192366 -242128663
10515 -242128663 -241978639 -241777060 -241532579 -241304744 -241181871 -241235247 -241498832 -241862498 -242171869
10506 -242171869 -242334643 -242379520 -242338859 -242133765 -241768428 -241393836 -241129541 -241034670 -241158111 -241473025
10496 -241473025 -241806958 -242005912 -242029665 -241920239 -241805110 -241767674 -241766641 -241760134 -241761151 -241742193 -241692959
10485 -241692959 -241673702 -241686778 -241676212 -241560451 -241379476 -241274294 -241230427 -241149864 -241034889 -240940344
10475 -240940344 -240920335 -241013114 -241202760 -241379273 -241478081 -241586251 -241729546 -241774666 -241616330 -241309836
10465 -241309836 -240996978 -240756414 -240616860 -240555756 -240470544 -240293745 -239982004 -239585727 -239307375
10456 -239307375 -239258039 -239398276 -239587218 -239640627 -239519717 -239315631 -239149263 -239038532 -238908829
10447 -238908829 -238764338 -238648404 -238583152 -238569766 -238532724 -238463319 -238450269 -238557200 -238787992 -239092131
10437 -239092131 -239369660 -239603991 -239838653 -240083176 -240287473 -240419505 -240556700 -240755743 -241004436
10428 -241004436 -241256783 -241466138 -241584700 -241600780 -241614044 -241663712 -241662662 -241659803 -241694691 -241723399 -241769358
10417 -241769358 -241819471 -241815900 -241740195 -241626840 -241499198 -241437097 -241467836 -241521234 -241563642 -241561906 -241505743
10406 -241505743 -241459811 -241450181 -241422102 -241290619 -241034510 -240824768 -240762282 -240760630 -240784378 -240850818 -240938434
10395 -240938434 -240994316 -240937900 -240728594 -240448798 -240190964 -239993462 -239889792 -239850241 -239901112 -240108228
10385 -240108228 -240448462 -240834688 -241141240 -241283301 -241294606 -241281452 -241243135 -241157082 -241110509 -241116981
10375 -241116981 -241145706 -241165416 -241137424 -241035916 -240827737 -240594248 -240466342 -240395748 -240286511 -240110671
10365 -240110671 -239920845 -239783719 -239724985 -239727161 -239725331 -239745297 -239819404 -239939606 -240114632 -240326331
10355 -240326331 -240451391 -240393448 -240188777 -239961433 -239809388 -239686512 -239590806 -239603874 -239718951 -239868362
10345 -239868362 -239955538 -239930239 -239813316 -239664676 -239503338 -239299348 -239106636 -238980671 -238914966 -238901856
10335 -238901856 -239024767 -239348140 -239843518 -240513673 -241370236 -242314227 -243194150 -243918962 -244478209
10326 -244478209 -244951801 -245403147 -245798006 -246060335 -246178259 -246216149 -246292637 -246425144 -246479451 -246427792
10316 -246427792 -246391284 -246430052 -246475014 -246438290 -246316007 -246180406 -246092226 -246057526 -246070273 -246080144 -246024122
10305 -246024122 -245908679 -245756525 -245616638 -245506335 -245390462 -245277783 -245235723 -245311052 -245447259
10296 -245447259 -245559656 -245590889 -245528114 -245416797 -245258003 -245015607 -244731452 -244516123 -244474556 -244628778
10286 -244628778 -244855984 -245010342 -245047084 -245012374 -245040359 -245180962 -245396384 -245627514 -245816917 -245967022
10276 -245967022 -246052372 -246029871 -245999627 -246091653 -246234723 -246289160 -246229993 -246094676 -245971142 -245886810
10266 -245886810 -245852047 -245880720 -245952128 -246066456 -246141197 -246115191 -246077934 -246069752 -246057414 -245988628 -245793328
10255 -245793328 -245541608 -245370659 -245278914 -245184051 -245157888 -245285218 -245467311 -245597325 -245672250 -245692393
10245 -245692393 -245668774 -245600911 -245581643 -245707979 -245904048 -246003782 -245947656 -245806558 -245667893 -245580427
10235 -245580427 -245499499 -245384720 -245257916 -245181498 -245171857 -245153089 -245065419 -244958768 -244919637 -244956203
10225 -244956203 -244976592 -244928923 -244832483 -244732911 -244654436 -244553792 -244420623 -244326813 -244311878 -244374653
10215 -244374653 -244444032 -244498390 -244558520 -244590355 -244617429 -244688236 -244739324 -244682938 -244553337 -244493800 -244687094
10204 -244687094 -245146918 -245675879 -246099491 -246392344 -246606154 -246701645 -246662711 -246616532 -246643778 -246744804
10194 -246744804 -246952294 -247293481 -247691352 -247984627 -248139499 -248288017 -248500658 -248756388 -249025753
10185 -249025753 -249288648 -249529210 -249719278 -249850933 -249943379 -250032735 -250087229 -250082302 -250083254 -250163675 -250286483
10174 -250286483 -250377181 -250503262 -250692686 -250861548 -250975633 -251010491 -250958568 -250874221 -250843231 -250904302
10164 -250904302 -250967670 -250933561 -250793957 -250560632 -250282410 -249993290 -249704166 -249466708 -249276470
10155 -249276470 -249073917 -248874269 -248730555 -248662066 -248651654 -248651191 -248593307 -248455167 -248341542 -248344073
10145 -248344073 -248464872 -248646929 -248800110 -248826278 -248713220 -248580399 -248518961 -248492117 -248463738 -248467243
10135 -248467243 -248459037 -248362695 -248202524 -248023925 -247901900 -247910126 -247985002 -248034583 -248060391 -248057444 -247975808
10124 -247975808 -247833327 -247712438 -247643765 -247610114 -247559387 -247442833 -247248578 -247089094 -247074562 -247216534
10114 -247216534 -247457803 -247727889 -247993185 -248192920 -248270890 -248217098 -248073324 -247993147 -248035052 -248121140
10104 -248121140 -248149252 -248035322 -247791569 -247547967 -247392432 -247249169 -247041033 -246762367 -246441194
10095 -246441194 -246156993 -245982708 -245924047 -245944643 -246028979 -246128308 -246150685 -246064113 -245945694 -245858097
10085 -245858097 -245746327 -245625699 -245577407 -245590023 -245624902 -245680324 -245795237 -246012525 -246247674 -246356963
10075 -246356963 -246355704 -246381517 -246511165 -246704100 -246883837 -246941326 -246825251 -246607685 -246378319 -246256920
10065 -246256920 -246248662 -246214106 -246094080 -245961248 -245883561 -245865528 -245888592 -245922139 -245967311 -246016784 -246032789
10054 -246032789 -246025754 -246010001 -245985139 -245899169 -245721465 -245572988 -245554822 -245604618 -245674148 -245719161 -245691337
10043 -245691337 -245621838 -245581301 -245542275 -245462299 -245402310 -245441705 -245540102 -245627739 -245688868 -245678942 -245611921
10032 -245611921 -245551600 -245508731 -245480371 -245522376 -245655950 -245750644 -245714500 -245549471 -245281921 -244957019
10022 -244957019 -244676135 -244527844 -244502588 -244566284 -244675629 -244795416 -244929336 -245105001 -245297538
10013 -245297538 -245485870 -245628420 -245699772 -245771576 -245897379 -246022267 -246088656 -246126244 -246126730 -246062999
10003 -246062999 -246000099 -245975442 -245940136 -245905075 -245910078 -245886842 -245812483 -245687980 -245518500 -245367885
9993 -245367885 -245273210 -245198785 -245138897 -245160103 -245289050 -245422243 -245480040 -245467114 -245449550 -245477190 -245498407
9982 -245498407 -245441582 -245307031 -245171097 -245119526 -245152940 -245203106 -245256529 -245300683 -245348902 -245384976 -245355929
9971 -245355929 -245290939 -245211045 -245155197 -245185026 -245250044 -245261691 -245220753 -245208435 -245201910 -245139699 -245019725
9960 -245019725 -244842833 -244652556 -244569130 -244645576 -244805372 -244968969 -245061881 -245102013 -245154311 -245244393
9950 -245244393 -245302812 -245262083 -245092892 -244863417 -244704462 -244734793 -244917546 -245145181 -245355178 -245475409
9940 -245475409 -245480641 -245509771 -245637753 -245711771 -245619063 -245432742 -245263384 -245147298 -245093368 -245112965
9930 -245112965 -245183587 -245158131 -244998910 -244832974 -244784773 -244857549 -244898879 -244795321 -244592188 -244458968
9920 -244458968 -244472729 -244559545 -244649108 -244705784 -244736956 -244822848 -244940757 -245000507 -244986231 -244861582 -244602637
9909 -244602637 -244320063 -244201380 -244284124 -244496618 -244780838 -245070379 -245265050 -245299688 -245183818 -244975642
9899 -244975642 -244725431 -244477598 -244324975 -244327518 -244400350 -244444922 -244505869 -244637320 -244744303 -244758702
9889 -244758702 -244701678 -244647080 -244676978 -244791904 -244872410 -244873228 -244787160 -244595912 -244395256 -244282846 -244257340
9878 -244257340 -244252700 -244270484 -244413057 -244619240 -244758225 -244790788 -244721118 -244585999 -244464798 -244436569
9868 -244436569 -244476040 -244463610 -244400113 -244394992 -244491706 -244599122 -244601486 -244535840 -244479515 -244402716 -244294117
9857 -244294117 -244238002 -244227635 -244102214 -243905662 -243789512 -243743518 -243692752 -243579881 -243400081 -243296978
9847 -243296978 -243434389 -243707093 -243919701 -244049347 -244093491 -244031534 -243979959 -244070082 -244296319 -244542780
9837 -244542780 -244718340 -244768176 -244648079 -244409994 -244190822 -244081843 -244055249 -244063650 -244106198 -244204089
9827 -244204089 -244349077 -244497904 -244612160 -244564908 -244288195 -243923292 -243608611 -243474905 -243658487
9818 -243658487 -244068621 -244444700 -244679460 -244781404 -244789365 -244721003 -244525146 -244261241 -244055963 -243956529
9808 -243956529 -243931461 -243866388 -243722321 -243595769 -243530634 -243517231 -243548542 -243580700 -243526478 -243394831
9798 -243394831 -243373910 -243561432 -243808564 -243991174 -244139659 -244257182 -244252212 -244108511 -243916179 -243759419
9788 -243759419 -243733725 -243860900 -244050563 -244189851 -244184922 -244080946 -243971452 -243867632 -243719013 -243519951
9778 -243519951 -243371940 -243330347 -243368307 -243463042 -243620753 -243868835 -244153280 -244371696 -244444469 -244327125
9768 -244327125 -244053334 -243714015 -243401801 -243213976 -243199957 -243314497 -243445154 -243522344 -243579733 -243658857
9758 -243658857 -243776256 -243879037 -243851850 -243649597 -243380210 -243169625 -243067652 -243049213 -243074073 -243135824
9748 -243135824 -243251467 -243381921 -243531730 -243705356 -243845079 -243954230 -244046173 -244143448 -244220237 -244293969
9738 -244293969 -244375312 -244412807 -244385380 -244348679 -244370474 -244409847 -244374108 -244273418 -244166770 -244107944 -244088516
9727 -244088516 -244087742 -244110893 -244129305 -244162289 -244203923 -244140659 -243957184 -243770580 -243646046 -243588345 -243570155
9716 -243570155 -243532066 -243445266 -243375032 -243345457 -243334060 -243354166 -243385304 -243351141 -243285145 -243278477 -243300969
9705 -243300969 -243297826 -243321497 -243430877 -243490919 -243405748 -243270603 -243155351 -243052078 -242992395 -242977776
9695 -242977776 -242983361 -243068184 -243275707 -243503169 -243621267 -243666185 -243721181 -243789237 -243834148 -243842579 -243809725
9684 -243809725 -243769987 -243795379 -243844629 -243884092 -243899931 -243843043 -243754879 -243679608 -243610960 -243534681 -243456774
9673 -243456774 -243390338 -243360153 -243389818 -243448228 -243550857 -243733834 -243895930 -243905327 -243840897 -243823872 -243851044
9662 -243851044 -243828726 -243741546 -243668940 -243571203 -243379889 -243069658 -242723416 -242510077 -242478740 -242569039
9652 -242569039 -242674307 -242727330 -242706164 -242666502 -242711131 -242864574 -242969011 -242915085 -242800461 -242722023
9642 -242722023 -242742744 -242855246 -242937847 -242932434 -242985826 -243180494 -243363701 -243389216 -243310965 -243207136
9632 -243207136 -243061117 -242904082 -242735299 -242502913 -242277967 -242150437 -242079451 -242052602 -242142539 -242295055
9622 -242295055 -242448223 -242547620 -242515113 -242447376 -242396406 -242324624 -242272321 -242246085 -242236376 -242337840 -242558559
9611 -242558559 -242762072 -242904334 -243031699 -243157258 -243271423 -243405057 -243599912 -243811031 -243902152
9602 -243902152 -243792266 -243553188 -243350751 -243242399 -243189106 -243191436 -243220582 -243224474 -243162239 -243040905
9592 -243040905 -242889734 -242762404 -242695002 -242666913 -242658137 -242698172 -242727400 -242668188 -242556972 -242449715
9582 -242449715 -242374388 -242316805 -242303721 -242352769 -242437695 -242502221 -242528675 -242602543 -242794645 -243013469 -243200122
9571 -243200122 -243397324 -243566295 -243652473 -243629494 -243563119 -243514645 -243449760 -243313666 -243075670 -242770616
9561 -242770616 -242509555 -242407169 -242497671 -242677977 -242847602 -243011187 -243133793 -243157381 -243079564 -242947682
9551 -242947682 -242795433 -242693626 -242707641 -242842376 -243049370 -243213365 -243234940 -243094439 -242961518 -242992052
9541 -242992052 -243155720 -243329033 -243411233 -243385515 -243235847 -243023009 -242836281 -242735909 -242728125 -242750122
9531 -242750122 -242782882 -242780353 -242703824 -242620426 -242570289 -242509617 -242406347 -242312227 -242297192 -242400916 -242538771
9520 -242538771 -242673310 -242809681 -242876647 -242772459 -242520981 -242272482 -242150125 -242127857 -242075949 -241948778
9510 -241948778 -241852877 -241884190 -241943394 -241966112 -242055559 -242239875 -242428535 -242564156 -242627471 -242653156
9500 -242653156 -242690609 -242686791 -242682848 -242741765 -242820383 -242878817 -242873899 -242789699 -242689036 -242657276 -242684747
9489 -242684747 -242677605 -242543176 -242311318 -242075538 -241880669 -241738829 -241650897 -241644434 -241779906 -242000336
9479 -242000336 -242166221 -242273861 -242370751 -242442347 -242488584 -242521285 -242567597 -242668450 -242861237 -243061752
9469 -243061752 -243134285 -243046972 -242814090 -242538895 -242284491 -242055484 -241881130 -241790163 -241772438 -241779265
9459 -241779265 -241781443 -241779702 -241784392 -241790407 -241744159 -241614939 -241427937 -241204644 -240980248 -240825505 -240812347
9448 -240812347 -240853842 -240762668 -240570109 -240418955 -240322897 -240271591 -240306112 -240490607 -240768078 -240992969
9438 -240992969 -241105933 -241167404 -241278042 -241407934 -241461016 -241423099 -241332279 -241270548 -241271164 -241264143 -241225945
9427 -241225945 -241161046 -241085520 -241013199 -240909007 -240795393 -240756721 -240778541 -240744150 -240585626 -240337820
9417 -240337820 -240123605 -240070921 -240177209 -240252609 -240153148 -239971377 -239869076 -239917815 -240107585 -240424205
9407 -240424205 -240848791 -241362974 -241958602 -242555299 -243063098 -243485387 -243887134 -244324493 -244758111
9398 -244758111 -245111644 -245369115 -245535357 -245683512 -245855793 -245994346 -246020086 -245951298 -245815910 -245665727
9388 -245665727 -245562856 -245562644 -245682745 -245801217 -245840340 -245780265 -245580646 -245243000 -244824650 -244440211
9378 -244440211 -244281804 -244351951 -244445160 -244446245 -244397359 -244302876 -244202562 -244189604 -244279846 -244465379 -244656708
9367 -244656708 -244759105 -244776755 -244760696 -244693998 -244557059 -244395949 -244283896 -244288627 -244387994 -244549216
9357 -244549216 -244746851 -244896967 -244946045 -244946375 -244930803 -244865955 -244796319 -244703373 -244476214 -244120431 -243792980
9346 -243792980 -243616301 -243617735 -243736904 -243881498 -244014152 -244147807 -244256292 -244340185 -244397853 -244362749
9336 -244362749 -244227301 -244045658 -243850354 -243652368 -243511026 -243434208 -243366392 -243259552 -243118130 -243056986
9326 -243056986 -243143598 -243255646 -243257132 -243145276 -243014480 -242945321 -242949174 -242925894 -242821657 -242711371
9316 -242711371 -242645442 -242668637 -242757115 -242821017 -242876079 -242962279 -243055461 -243166714 -243325754 -243456994
9306 -243456994 -243488752 -243428979 -243303516 -243110754 -242915557 -242824377 -242786957 -242692023 -242520084 -242365716
9296 -242365716 -242274831 -242203561 -242111136 -242062400 -242045009 -241984986 -241925009 -241908208 -241910587 -241854739 -241725834
9285 -241725834 -241668109 -241787504 -241953862 -242042728 -242058727 -241990165 -241871785 -241730273 -241543038 -241349922
9275 -241349922 -241215910 -241153934 -241213053 -241459918 -241824263 -242224445 -242569611 -242771677 -242842159 -242822629
9265 -242822629 -242724952 -242557002 -242366457 -242206768 -242081498 -241983439 -241998278 -242206589 -242532559 -242794542
9255 -242794542 -242862147 -242739661 -242496931 -242200290 -241971733 -241843614 -241780525 -241735325 -241598221 -241409083
9245 -241409083 -241324768 -241400933 -241557777 -241694002 -241775734 -241808860 -241763106 -241626436 -241439935 -241282053
9235 -241282053 -241236206 -241290723 -241328574 -241309855 -241314555 -241384713 -241443502 -241437617 -241397884 -241376616 -241439052
9224 -241439052 -241545857 -241647618 -241830574 -242083788 -242311214 -242464290 -242570101 -242648064 -242656556 -242623315
9214 -242623315 -242626226 -242617178 -242468365 -242185386 -241882545 -241641733 -241500977 -241492484 -241624421 -241845802
9204 -241845802 -241996710 -242040807 -242133283 -242337803 -242580703 -242768259 -242848577 -242886484 -242987357 -243153405
9194 -243153405 -243289981 -243295824 -243256540 -243238334 -243161310 -243011208 -242846584 -242702720 -242615013 -242596853
9184 -242596853 -242665271 -242792873 -242884621 -242883653 -242802129 -242707747 -242645777 -242636938 -242651522 -242624025 -242575360
9173 -242575360 -242558378 -242572212 -242619322 -242685850 -242645990 -242457800 -242246083 -242049353 -241832471 -241676861
9163 -241676861 -241670648 -241757081 -241910986 -242111904 -242308554 -242483272 -242589690 -242596146 -242487468 -242285242
9153 -242285242 -242074306 -241885702 -241777830 -241757294 -241747012 -241746740 -241751695 -241722033 -241669359 -241687076 -241783856
9142 -241783856 -241850394 -241859691 -241879388 -241944770 -242041006 -242092889 -242086820 -242062765 -242111673 -242266665 -242423139
9131 -242423139 -242544016 -242645195 -242689281 -242594452 -242405202 -242242696 -242165356 -242173459 -242263303 -242425752
9121 -242425752 -242581304 -242638461 -242619172 -242633628 -242706580 -242768131 -242766703 -242701422 -242663673 -242710669 -242751049
9110 -242751049 -242677969 -242500546 -242278693 -242090864 -241964700 -241851814 -241732549 -241650362 -241662865 -241794089
9100 -241794089 -242002054 -242207583 -242324199 -242335984 -242282952 -242199408 -242100442 -241978018 -241804041 -241600806
9090 -241600806 -241470335 -241486798 -241612889 -241768690 -241897741 -241988847 -242067154 -242168692 -242273118 -242314839
9080 -242314839 -242249969 -242106222 -241990431 -241960239 -242001651 -242080486 -242196110 -242304191 -242380294 -242543754
9070 -242543754 -242872449 -243218772 -243398853 -243427422 -243370813 -243204296 -242950094 -242800490 -242894311 -243065810
9060 -243065810 -243113348 -243044715 -242956501 -242916917 -243005954 -243223274 -243381032 -243360305 -243270807 -243224285 -243145053
9049 -243145053 -242993474 -242858053 -242805219 -242863310 -242980280 -243142998 -243367805 -243558300 -243621537 -243605002
9039 -243605002 -243566006 -243484430 -243352752 -243253803 -243273106 -243298929 -243153328 -242917690 -242739573 -242616269
9029 -242616269 -242543829 -242561722 -242697042 -242901484 -243071161 -243133760 -243109462 -243093508 -243117125 -243164347
9019 -243164347 -243194935 -243156390 -243100089 -243124576 -243235942 -243376886 -243499375 -243571632 -243558373 -243504857
9009 -243504857 -243501268 -243571245 -243655237 -243680392 -243660284 -243622101 -243588336 -243611314 -243694033 -243777379 -243816834
8998 -243816834 -243834053 -243840957 -243822944 -243782659 -243747847 -243688087 -243563385 -243388999 -243166660 -242948145
8988 -242948145 -242871007 -242987799 -243152084 -243192570 -243082834 -242947619 -242839753 -242711807 -242629252 -242616688
8978 -242616688 -242492587 -242158406 -241812807 -241652804 -241723464 -241983100 -242347485 -242708720 -242974669
8969 -242974669 -243109897 -243098417 -243002801 -242938374 -242997626 -243143275 -243222980 -243161572 -243032791 -242929726
8959 -242929726 -242860823 -242821080 -242826070 -242805407 -242682644 -242521921 -242376228 -242220048 -242085901 -241950982
8949 -241950982 -241822204 -241796518 -241846926 -241919135 -242010137 -242056166 -241963984 -241785854 -241672481 -241660995
8939 -241660995 -241650167 -241569164 -241442558 -241297953 -241180568 -241155705 -241224945 -241360712 -241579827 -241904544
8929 -241904544 -242248222 -242433923 -242361436 -242127597 -241927174 -241837928 -241898106 -242104202 -242333568 -242465941
8919 -242465941 -242485294 -242437431 -242435013 -242486153 -242462656 -242375897 -242333890 -242374320 -242464825 -242560842 -242618421
8908 -242618421 -242588358 -242447539 -242309039 -242305629 -242360610 -242291446 -242053327 -241731642 -241515900 -241519659
8898 -241519659 -241626419 -241701510 -241757214 -241818502 -241831636 -241818780 -241848841 -241901277 -241933179 -241937626 -241925139
8887 -241925139 -241936464 -241981454 -242055543 -242139518 -242201861 -242223163 -242240872 -242274976 -242311293 -242350738 -242435921
8876 -242435921 -242590215 -242740304 -242759140 -242675636 -242615147 -242594547 -242573258 -242520155 -242416654 -242299456
8866 -242299456 -242263523 -242363915 -242531328 -242699590 -242814739 -242850629 -242843601 -242765410 -242581483 -242300942
8856 -242300942 -242023743 -241908795 -241969872 -242046346 -242066089 -242098052 -242153822 -242214534 -242252707 -242233259 -242185076
8845 -242185076 -242146798 -242120992 -242075447 -242006771 -241946569 -241922186 -241926241 -241938777 -241934588 -241944885 -241996160
8834 -241996160 -242030281 -242028442 -242013135 -241989781 -242008936 -242128439 -242325168 -242486974 -242532838 -242546099 -242606758
8823 -242606758 -242656884 -242646610 -242541893 -242338635 -242152788 -242103894 -242191872 -242350075 -242471638 -242516234
8813 -242516234 -242516839 -242464568 -242329489 -242172180 -242106493 -242115216 -242093077 -242042368 -242027292 -242002057 -241858280
8802 -241858280 -241656709 -241562762 -241591803 -241675695 -241757216 -241820070 -241872301 -241884472 -241848463 -241762730 -241651702
8791 -241651702 -241579340 -241566130 -241580065 -241656236 -241869171 -242140009 -242300805 -242295864 -242209439 -242145800 -242096165
8780 -242096165 -242045843 -242044295 -242044231 -241998703 -241906202 -241761772 -241600590 -241469339 -241383637 -241328397 -241343644
8769 -241343644 -241437206 -241546369 -241637688 -241706416 -241798937 -241943380 -242037470 -241997833 -241872344 -241725531
8759 -241725531 -241607445 -241546047 -241445818 -241249325 -241062833 -240980214 -241047011 -241224398 -241403230 -241481317
8749 -241481317 -241460214 -241413355 -241404106 -241389991 -241323276 -241233760 -241152198 -241079336 -241012663 -241030118 -241103058
8738 -241103058 -241104799 -241019182 -240904181 -240815148 -240804559 -240891673 -241044032 -241197499 -241308269 -241352203
8728 -241352203 -241279638 -241141474 -241005822 -240830001 -240625900 -240495673 -240447756 -240459442 -240523599 -240612214
8718 -240612214 -240727761 -240806400 -240805877 -240835892 -240985824 -241166199 -241263989 -241246137 -241194861 -241236335 -241352541
8707 -241352541 -241478051 -241581751 -241562914 -241384689 -241176485 -241030100 -240959334 -241010818 -241187223 -241389236
8697 -241389236 -241531308 -241593689 -241601499 -241593365 -241497757 -241236188 -240916888 -240682798 -240578133 -240606676
8687 -240606676 -240638949 -240544008 -240309222 -240012949 -239757114 -239586977 -239524795 -239548312 -239603287 -239723697
8677 -239723697 -239932312 -240136500 -240247585 -240275983 -240243669 -240200357 -240238528 -240400056 -240655449 -240898408
8667 -240898408 -240966699 -240848692 -240670072 -240482023 -240324079 -240300421 -240432591 -240614733 -240767607 -240919061
8657 -240919061 -241093440 -241245345 -241363628 -241480356 -241575733 -241637481 -241759767 -241934402 -241958971 -241818910
8647 -241818910 -241723088 -241743485 -241813411 -241938962 -242183462 -242472151 -242650388 -242681937 -242618975 -242528840
8637 -242528840 -242504202 -242518280 -242504004 -242488021 -242440964 -242303226 -242110101 -241930206 -241793202 -241653757
8627 -241653757 -241509113 -241488307 -241626782 -241836537 -242048681 -242229419 -242359669 -242424337 -242414285 -242324942
8617 -242324942 -242146755 -241833522 -241466487 -241250482 -241163954 -241089949 -241051911 -241084792 -241214205 -241453620
8607 -241453620 -241733786 -241935281 -242008825 -241983892 -241899921 -241803397 -241717110 -241558559 -241318945 -241104689
8597 -241104689 -240944232 -240848104 -240864654 -240941935 -241020132 -241113886 -241281389 -241479747 -241568921 -241514026
8587 -241514026 -241388382 -241293218 -241311274 -241457560 -241666715 -241845821 -241923419 -241828726 -241567918 -241283409
8577 -241283409 -241073625 -240950767 -240889151 -240859375 -240832240 -240797983 -240745037 -240657457 -240577153 -240555123 -240591538
8566 -240591538 -240667845 -240761212 -240824379 -240793454 -240647072 -240481551 -240473489 -240648186 -240896937 -241173249
8556 -241173249 -241473632 -241776667 -242053281 -242231165 -242254069 -242195412 -242130921 -242126030 -242095002 -241941557
8546 -241941557 -241778519 -241689897 -241598984 -241449210 -241248760 -241040571 -240882044 -240775439 -240692575 -240628177
8536 -240628177 -240621686 -240705164 -240818016 -240882459 -240913579 -240927499 -240879332 -240795709 -240734529 -240701867 -240656676
8525 -240656676 -240585511 -240585063 -240710211 -240909003 -241131130 -241349371 -241569676 -241752053 -241824064 -241786370
8515 -241786370 -241697751 -241571358 -241373977 -241199365 -241198835 -241335791 -241414336 -241377661 -241317941 -241307561 -241318432
8504 -241318432 -241300982 -241334358 -241397140 -241376743 -241281896 -241261901 -241363911 -241462232 -241499542 -241512097 -241504215
8493 -241504215 -241405943 -241200546 -240984888 -240846663 -240797190 -240801282 -240795119 -240726898 -240669614 -240745304 -240901137
8482 -240901137 -241023994 -241141921 -241237751 -241253656 -241303283 -241458836 -241587255 -241578849 -241489430 -241361408
8472 -241361408 -241184482 -240964829 -240741647 -240593257 -240589098 -240755020 -241037685 -241330476 -241531165 -241574313
8462 -241574313 -241488613 -241334654 -241190124 -241087838 -240949814 -240751906 -240626596 -240597658 -240545130 -240440552
8452 -240440552 -240365760 -240364130 -240380974 -240387051 -240369756 -240316331 -240301782 -240385853 -240508429 -240615401 -240658562
8441 -240658562 -240569528 -240368054 -240181104 -240096993 -240108984 -240155608 -240201465 -240239592 -240223098 -240128183 -239978477
8430 -239978477 -239862154 -239868910 -239930838 -239900500 -239825303 -239803953 -239828351 -239855706 -239871344 -239929378 -240027203
8419 -240027203 -240086310 -240073847 -240043809 -240051685 -240085570 -240174111 -240287849 -240320980 -240245820 -240185979 -240256962
8408 -240256962 -240375029 -240408310 -240349141 -240250638 -240208778 -240264373 -240391439 -240510469 -240579384 -240613406
8398 -240613406 -240617118 -240577902 -240477420 -240311288 -240106545 -239885500 -239677507 -239511382 -239466570 -239620895
8388 -239620895 -239850551 -239934515 -239836337 -239742215 -239787902 -239912462 -239971763 -239895896 -239710283 -239522015
8378 -239522015 -239437822 -239505582 -239677168 -239852451 -239957493 -240035080 -240168875 -240299471 -240354270 -240399108
8368 -240399108 -240499799 -240583920 -240575796 -240465210 -240299877 -240195483 -240224213 -240395495 -240578746 -240615673
8358 -240615673 -240499226 -240346138 -240242420 -240186308 -240134696 -240061594 -239980418 -239885328 -239753628 -239614197
8348 -239614197 -239518833 -239524634 -239650587 -239790526 -239850016 -239878602 -239936139 -239940688 -239853172 -239759523 -239686201
8337 -239686201 -239611682 -239529156 -239450356 -239399423 -239424919 -239483153 -239480480 -239424454 -239293152 -239112501 -239066021
8326 -239066021 -239216984 -239465364 -239687190 -239705119 -239513946 -239251467 -239065807 -238969732 -238906394 -238908105
8316 -238908105 -239012491 -239124664 -239125123 -239058453 -239039126 -239081987 -239172845 -239306161 -239396963 -239406788 -239377759
8305 -239377759 -239393683 -239467779 -239544743 -239643926 -239722102 -239621544 -239349556 -239103228 -238973175 -238999949
8295 -238999949 -239214858 -239475764 -239610054 -239596165 -239508936 -239379238 -239210842 -239031421 -238901456 -238913353
8285 -238913353 -239037181 -239132671 -239180403 -239253311 -239354555 -239427744 -239421549 -239318916 -239199730 -239114986
8275 -239114986 -239076833 -239075269 -239069164 -239043681 -239004239 -239006032 -239054365 -239076605 -239079413 -239066898 -239047154 -239055838
8263 -239055838 -239083755 -239088261 -239069333 -239075789 -239151532 -239237182 -239276972 -239317071 -239415343 -239533419 -239622718
8252 -239622718 -239811628 -240078598 -240245542 -240281078 -240244773 -240219937 -240274361 -240370329 -240406549 -240475746
8242 -240475746 -240699233 -240934999 -241109853 -241301617 -241453872 -241519853 -241571035 -241644386 -241725930 -241845611
8232 -241845611 -241980130 -242116773 -242237682 -242261008 -242187440 -242084365 -242042597 -242065188 -242067905 -242062836 -242176239
8221 -242176239 -242438632 -242694240 -242816197 -242783284 -242657661 -242563684 -242629048 -242885038 -243221552 -243471569
$$ [...]
##END NTUPLES=NMR SPECTRUM
##END=
