##TITLE=c13 ikalashn
DE-76H-2
20.12.2024
##JCAMPDX= 6.0         $$ Bruker NMR JCAMP-DX V2.0
##DATA TYPE= NMR SPECTRUM
##DATA CLASS= NTUPLES
##ORIGIN= UXNMR, Bruker Analytische Messtechnik GmbH
##OWNER= root
$$ TOPSPIN		Version 1.3
$$ 2024-12-20 13:38:06.015 +0400  Irina@DPX200
$$ Compression mode = diff/dup
##.OBSERVE FREQUENCY= 50.3282639994
##.OBSERVE NUCLEUS= ^13C
##.ACQUISITION MODE= SIMULTANEOUS
##.ACQUISITION SCHEME= undefined
##.AVERAGES= 23090
##.DIGITISER RES= 17
##SPECTROMETER/DATA SYSTEM= spect
##.PULSE SEQUENCE= zgpg
##.SOLVENT NAME= DMSO
##.SHIFT REFERENCE= INTERNAL, DMSO, 1, 234.9338
##AUDIT TRAIL= $$ (NUMBER, WHEN, WHO, WHERE, WHAT)
$$ ##TITLE= Audit trail, TOPSPIN		Version 1.3
$$ ##JCAMPDX= 5.01
$$ ##ORIGIN= Bruker BioSpin GmbH
$$ ##OWNER= Irina
$$ $$ F:/spectra/data/iren/nmr/c13zvl/1/pdata/1/auditp.txt
$$ ##AUDIT TRAIL=  $$ (NUMBER, WHEN, WHO, WHERE, VERSION, WHAT)
(   1,<2024-12-20 13:37:16.234 +0400>,<Irina>,<DPX200>,<TOPSPIN 1.3>,
      <created by zg
	started at 2024-12-19 16:01:16.828 +0400,
	POWCHK disabled, PULCHK disabled
       terminated by command 'halt'
       configuration hash MD5:
       BE 6D 3F 07 2A EA 11 49 91 17 2B D3 AF B3 58 0D
       data hash MD5: 32K
       99 97 49 DA 64 62 CA 52 6C D5 DC DC 35 AD 0F 47>)
(   2,<2024-12-20 13:37:32.906 +0400>,<Irina>,<DPX200>,<TOPSPIN 1.3>,
      <Start of raw data processing
       efp BC_mod = 2 LB = 2.5 FT_mod = 6 PKNL = 1 PHC0 = 282.196 PHC1 = 21.60377 SI = 32K 
       data hash MD5: 32K
       21 D7 82 EA 3A 69 95 53 E1 06 08 50 E1 41 2E 2B>)
(   3,<2024-12-20 13:37:37.500 +0400>,<Irina>,<DPX200>,<TOPSPIN 1.3>,
      <apk 
       data hash MD5: 32K
       DD 9E 20 30 54 FB D6 61 3D 6E 78 E8 3E B8 4F AE>)
(   4,<2024-12-20 13:37:39.453 +0400>,<Irina>,<DPX200>,<TOPSPIN 1.3>,
      <abs n ABSG = 5 
       data hash MD5: 32K
       C8 E1 BE 4B 61 A8 0F 54 EC A5 58 68 7C 9E A0 AB>)
$$ ##END=
$$ 
$$ $$ hash MD5
$$ $$ 06 DE EE 14 B9 D0 F8 A3 30 24 51 8E AD A8 C6 47
##$RELAX= 
##$RELAX= 
##$RELAX= 
##$RELAX= 
##$RELAX= 
##$RELAX= 
##$RELAX= 
##$RELAX= 
##$RELAX= 
$$ Bruker specific parameters
$$ --------------------------
##$DU= <F:/spectra>
##$EXPNO= 1
##$NAME= <c13zvl>
##$PROCNO= 1
##$TYPE= <nmr>
##$USER= <iren>
##$AMP= (0..31)
100 100 100 100 100 100 100 100 100 100 100 100 100 100 100 100 100 100 
100 100 100 100 100 100 100 100 100 100 100 100 100 100 
##$ANAVPT= -1
##$AQSEQ= 0
##$AQ_mod= 1
##$AUNM= <au_zg>
##$AUTOPOS= <>
##$BF1= 50.322709
##$BF2= 200.13
##$BF3= 200.13
##$BF4= 200.13
##$BF5= 200.13
##$BF6= 200.13
##$BF7= 200.13
##$BF8= 200.13
##$BYTORDA= 1
##$CFDGTYP= 0
##$CFRGTYP= 5
##$CHEMSTR= <none>
##$CNST= (0..63)
1 1 145 1 1 1 1 1 1 1 1 1 1 1 1 1 1 1 1 1 1 1 1 1 1 1 1 1 1 1 1 1 1 1 
1 1 1 1 1 1 1 1 1 1 1 1 1 1 1 1 1 1 1 1 1 1 1 1 1 1 1 1 1 1 
##$CPDPRG= <waltz16>
##$CPDPRG1= <>
##$CPDPRG2= <waltz16>
##$CPDPRG3= <>
##$CPDPRG4= <mlev>
##$CPDPRG5= <mlev>
##$CPDPRG6= <mlev>
##$CPDPRG7= <mlev>
##$CPDPRG8= <mlev>
##$CPDPRGB= <>
##$CPDPRGT= <>
##$D= (0..63)
$$ [...]
##$SW= 249.617472808154
##$SWIBOX= (0..15)
0 1 3 0 0 0 0 0 0 0 0 0 0 0 0 0 
##$SW_h= 12562.8140703518
##$TD= 32768
##$TD0= 1
##$TE= 300
##$TE2= 300
##$TE3= 300
##$TEG= 300
##$TL= (0..7)
120 120 120 120 120 120 120 120 
##$TP= (0..7)
150 150 150 150 150 150 150 150 
##$TP07= 0
##$TPNAME0= <>
##$TPNAME1= <>
##$TPNAME2= <>
##$TPNAME3= <>
##$TPNAME4= <>
##$TPNAME5= <>
##$TPNAME6= <>
##$TPNAME7= <>
##$TPOAL= (0..7)
0.5 0.5 0.5 0.5 0.5 0.5 0.5 0.5 
##$TPOFFS= (0..7)
0 0 0 0 0 0 0 0 
##$TUNHIN= 0
##$TUNHOUT= 0
##$TUNXOUT= 0
##$USERA1= <user>
##$USERA2= <user>
##$USERA3= <user>
##$USERA4= <user>
##$USERA5= <user>
##$V9= 5
##$VALIST= <valist>
##$VCLIST= <CCCCCCCCCCCCCCC>
##$VD= 0
##$VDLIST= <DDDDDDDDDDDDDDD>
##$VPLIST= <PPPPPPPPPPPPPPP>
##$VTLIST= <TTTTTTTTTTTTTTT>
##$WBST= 1024
##$WBSW= 4
##$XGAIN= (0..3)
0 0 0 0 
##$XL= 0
##$YL= 0
##$YMAX_a= 26801726
##$YMIN_a= -4883830
##$ZGOPTNS= <>
##$ZL1= 120
##$ZL2= 120
##$ZL3= 120
##$ZL4= 120
##$ABSF1= 234.9338
##$ABSF2= -14.71115
##$ABSG= 5
##$ABSL= 3
##$ALPHA= 0
##$AQORDER= 0
##$ASSFAC= 0
##$ASSFACI= 0
##$ASSFACX= 0
##$ASSWID= 0
##$AUNMP= <proc_1d>
##$AXLEFT= 0
##$AXRIGHT= 0
##$AXTYPE= 0
##$AXUNIT= <>
##$AZFE= 0.1
##$AZFW= 0.5
##$BCFW= 0
##$BC_mod= 2
##$BYTORDP= 0
##$COROFFS= 0
##$CY= -3
##$DATMOD= 1
##$DC= 0
##$DFILT= <>
##$DTYPP= 0
##$F1P= 0
##$F2P= 0
##$FCOR= 0.5
##$FTSIZE= 32768
##$FT_mod= 6
##$GAMMA= 0
##$GB= 0
##$INTBC= 1
##$INTSCL= 4.98009e-010
##$ISEN= 30
##$LB= 2.5
##$LEV0= 0
##$LPBIN= 0
##$MAXI= 7.640843
##$MC2= 0
##$MEAN= 0
##$ME_mod= 0
##$MI= 1.154659
##$NCOEF= 0
##$NC_proc= -5
##$NLEV= 6
##$NOISF1= 0
##$NOISF2= 0
##$NSP= 0
##$NTH_PI= 0
##$NZP= 0
##$OFFSET= 234.9338
##$PC= 1.4
##$PHC0= 279.9976
##$PHC1= 25.064
##$PH_mod= 1
##$PKNL= yes
##$PPARMOD= 0
##$PPDIAG= 0
##$PPIPTYP= 0
##$PPMPNUM= 100
##$PPRESOL= 1
##$PSCAL= 0
##$PSIGN= 0
##$REVERSE= no
##$SF= 50.3227228988183
##$SI= 32768
##$SIGF1= 0
##$SIGF2= 0
##$SINO= 80
##$SIOLD= 32768
##$SREGLST= <13C.CDCl3>
##$SSB= 0
##$STSI= 32768
##$STSR= 0
##$SW_p= 12562.8140703518
##$SYMM= 0
##$S_DEV= 0
##$TDeff= 32768
##$TDoff= 0
##$TI= <>
##$TILT= no
##$TM1= 0
##$TM2= 0
##$TOPLEV= 0
##$USERP1= <user>
##$USERP2= <user>
##$USERP3= <user>
##$USERP4= <user>
##$USERP5= <user>
##$WDW= 1
##$XDIM= 32768
##$YMAX_p= 77128091
##$YMIN_p= -3339808
$$ End of Bruker specific parameters
$$ ---------------------------------
##NTUPLES= NMR SPECTRUM
##VAR_NAME=  FREQUENCY,     SPECTRUM/REAL,   SPECTRUM/IMAG
##SYMBOL=    X,             R,               I
##VAR_TYPE=  INDEPENDENT,   DEPENDENT,       DEPENDENT
##VAR_FORM=  AFFN,          ASDF,            ASDF
##VAR_DIM=   32768,         32768,           32768
##UNITS=     HZ,            ARBITRARY UNITS, ARBITRARY UNITS
##FACTOR=    0.383398360251222, 1,           1
##FIRST=     12562.8140703518, 1859947,      189642840
##LAST=      0,             -66442,          -369542318
##MIN=       0,             -3339808,        0
##MAX=       12562.8140703518, 77128091,     0
$$ Real data points
##PAGE= N=1
##DATA TABLE= (X++(R..R)), XYDATA
$$ [...]
##PAGE= N=2
##DATA TABLE= (X++(I..I)), XYDATA
5905c83986819K79681K56101R6402j12243k38259k61041k88097l06035j87535
$$ -383986819 -383707138 -383451037 -383354635 -383466878 -383705137 -383966178 -384254275 -384560310 -384747845
5896c84747845P3304L51931M48741K83974J3628j89215k60658j75226L2416K08622
$$ -384747845 -384674541 -384322610 -383873869 -383589895 -383576267 -383765482 -384026140 -384201366 -384168950 -383960328
5886c83960328K65190K51872J95424J23319P1532K8454K0504P5190J38387J19852
$$ -383960328 -383695138 -383443266 -383247842 -383124523 -383052991 -383024537 -383004033 -382928843 -382790456 -382670604
5876c82670604j6412j52244j68569j51194j95622j99694l1252K30043L48751K54967
$$ -382670604 -382687016 -382839260 -383007829 -383159023 -383354645 -383554339 -383585591 -383355548 -383006797 -382751830
5866c82751830R2815j2912n4373p8593j02864q6567j1403J10502K61061L48804
$$ -382751830 -382659015 -382671927 -382726300 -382804893 -382907757 -382994324 -383005727 -382895225 -382634164 -382285360
5856c82285360L08553K01133J20083J10944J60719K67850L93063M52407M48433
$$ -382285360 -381976807 -381775674 -381655591 -381544647 -381383928 -381116078 -380723015 -380270608 -379822175
5847c79822175M30373L83923L34578L33425L79909M21122M12248L78843L40694
$$ -379822175 -379391802 -379007879 -378673301 -378339876 -377959967 -377538845 -377126597 -376747754 -376407060
5838c76407060K91988K79695L59448N00588N79551N14970L81205K74024K00996
$$ -376407060 -376115072 -375835377 -375475929 -374975341 -374395790 -373880820 -373499615 -373225591 -373024595
5829c73024595J63232J67177J96497K24150K34570J77571L3736j04629j79474
$$ -373024595 -372861363 -372694186 -372497689 -372273539 -372038969 -371861398 -371827662 -371932291 -372111765
5820c72111765k90862n47974q52527j062577j237281j468256j691826j816818
$$ -372111765 -372402627 -372950601 -373803128 -374865705 -376102986 -377571242 -379263068 -381079886
5812c81079886j838270j812984j766405j663636j478586j215257r33390o93042
$$ -381079886 -382918156 -384731140 -386497545 -388161181 -389639767 -390855024 -391788414 -392481456
5804c92481456m86103k96357j41823k7679M5297Q4821J20536J50497J23574J4758
$$ -392481456 -392967559 -393263916 -393405739 -393433418 -393388121 -393303300 -393182764 -393032267 -392908693 -392893935
5794c92893935j51698l73192o68128j019485j363075j623645j804992j966330
$$ -392893935 -393045633 -393418825 -394086953 -395106438 -396469513 -398093158 -399898150 -401864480
5786d01864480k100443k103684j883065j493871j079135p61881n51148l57043
$$ -401864480 -403964923 -406068607 -407951672 -409445543 -410524678 -411286559 -411837707 -412194750
5778d12194750j80718j01104j12321j12684k6876J03100K32007L21815L08488
$$ -412194750 -412375468 -412476572 -412588893 -412701577 -412728453 -412625353 -412393346 -412071531 -411763043
5769d11763043K43990K42950K88286L23987L88013M98331N95429N95886M43234
$$ -411763043 -411519053 -411276103 -410987817 -410663830 -410275817 -409777486 -409182057 -408586171 -408142937
5760d08142937K37503J77299K88922L78548L47660L07494L55686M22427L99087
$$ -408142937 -407905434 -407728135 -407439213 -407060665 -406713005 -406405511 -406049825 -405627398 -405228311
5751d05228311L20066L18597M07466M15555K78967J24120K9349L6841J26933J63891
$$ -405228311 -404908245 -404589648 -404182182 -403766627 -403487660 -403363540 -403334191 -403297350 -403170417 -403006526
5741d03006526J25237R5992P0960P960k2964N9306J62810K07749K22058K31670
$$ -403006526 -402881289 -402785297 -402714337 -402706377 -402729341 -402670035 -402507225 -402299476 -402077418 -401845748
5731d01845748K24084J56005M0723n510J12480L24592M73820M89579M13211K89578
$$ -401845748 -401621664 -401465659 -401424936 -401430446 -401317966 -400993374 -400519554 -400029975 -399616764 -399327186
5721c99327186J23363p5114k47502l18517k78581j64836l2878Q7346K20766L63777
$$ -399327186 -399203823 -399278937 -399526439 -399844956 -400123537 -400288373 -400321251 -400233905 -400013139 -399649362
5711c99649362M66523N08095M68683K99529R2341j1528j4884L7792O7466J217
$$ -399649362 -399182839 -398674744 -398206061 -397906532 -397814191 -397825719 -397840603 -397802811 -397735345 -397734128
5701c97734128q7525j39963j31877n9027L3081J37905K28274K28140J28839J3511
$$ -397734128 -397821653 -397961616 -398093493 -398152520 -398119439 -397981534 -397753260 -397525120 -397396281 -397382770
5691c97382770m9286l1811M7425J18660J46486J22334L4969k0540L2741J14441
$$ -397382770 -397432056 -397463867 -397416442 -397297782 -397151296 -397028962 -396993993 -397014533 -396981792 -396867351
5681c96867351J83453K55731L01273K86784K12206J11886M9416R1433K37290M09085
$$ -396867351 -396683898 -396428167 -396126894 -395840110 -395627904 -395516018 -395466602 -395375169 -395137879 -394728794
5671c94728794M90355M25831K87924J88607J76156J32904m0810k33619l28094
$$ -394728794 -394238439 -393812608 -393524684 -393336077 -393159921 -393027017 -393067827 -393301446 -393629540
5662c93629540l51646l32231k42981j03444J0354M5500J2259k7681J8649J59409
$$ -393629540 -393981186 -394313417 -394556398 -394659842 -394649488 -394603988 -394591729 -394619410 -394600761 -394441352
5652c94441352L04237L79506L57451K70240J99132J95137K44399K83768K56915
$$ -394441352 -394137115 -393757609 -393400158 -393129918 -392930786 -392735649 -392491250 -392207482 -391950567
5643c91950567J91528J22440L3027o0965p5107j0680L5171M3749P5870J31293
$$ -391950567 -391759039 -391636599 -391603572 -391664537 -391739644 -391750324 -391715153 -391671404 -391595534 -391464241
5633c91464241J82024K51497L23483L59652L82419L75166L16531K56053J89756
$$ -391464241 -391282217 -391030720 -390707237 -390347585 -389965166 -389590000 -389273469 -389017416 -388827660
5624c88827660P8723k7300o6212o5370m6324R838J18007K69345M08958M66583
$$ -388827660 -388748937 -388776237 -388842449 -388907819 -388954143 -388944305 -388826298 -388556953 -388147995 -387681412
5614c87681412M42283M01103L92802M05122M06438L41545K26351J27082M6060
$$ -387681412 -387239129 -386838026 -386445224 -386040102 -385633664 -385292119 -385065768 -384938686 -384892626
5605c84892626J5449J17153K87332L25819K09299J59477K81282M07890L71010
$$ -384892626 -384877177 -384760024 -384472692 -384146873 -383937574 -383778097 -383496815 -383088925 -382717915
5596c82717915K49533J88338K05507K49152K68881K61637K48926K39547J97509
$$ -382717915 -382468382 -382280044 -382074537 -381825385 -381556504 -381294867 -381045941 -380806394 -380608885
5587c80608885L6977k60321n36033p08093q71356j011491j045817r89480r46302
$$ -380608885 -380571908 -380832229 -381368262 -382076355 -382947711 -383959202 -385005019 -385994499 -386940801
5578c86940801j047276j317413j591441j646923j474225j250216j062764q63612
$$ -386940801 -387988077 -389305490 -390896931 -392543854 -394018079 -395268295 -396331059 -397194671
5570c97194671n98627l03624o9581O8766J31131J42743J04987p070j67268l23610
$$ -397194671 -397793298 -398096922 -398166503 -398097737 -397966606 -397823863 -397718876 -397725946 -397893214 -398216824
5560c98216824m70609n85012o38042o91154q11747r81055j120680j229013j400830
$$ -398216824 -398687433 -399272445 -399910487 -400601641 -401413388 -402394443 -403515123 -404744136 -406144966
5551d06144966j657066j851435j880728j840639j774786j572479j239464q98663
$$ -406144966 -407802032 -409653467 -411534195 -413374834 -415149620 -416722099 -417961563 -418860226
5543d18860226o03653l68683j69718M5906L07377N55964O17135M27458J70251
$$ -418860226 -419463879 -419832562 -420002280 -419956374 -419648997 -419093033 -418475898 -418048440 -417878189
5534d17878189P1973J63302K71221K78402K03063J06541O9691J15577J97969K66066
$$ -417878189 -417806216 -417642914 -417371693 -417093291 -416890228 -416783687 -416713996 -416598419 -416400450 -416134384
5524d16134384L09158L57341M22162M41222L89967L50337L68449M21917M39079
$$ -416134384 -415825226 -415467885 -415045723 -414604501 -414214534 -413864197 -413495748 -413073831 -412634752
5515d12634752L36519J17568o9375q0028M2646J89015K88492K97420K61973K43574
$$ -412634752 -412298233 -412180665 -412250040 -412330068 -412287422 -412098407 -411809915 -411512495 -411250522 -411006948
5505d11006948K13374J82056K19655K91023L27721L43122L20423K01457K0111
$$ -411006948 -410793574 -410611518 -410391863 -410100840 -409773119 -409429997 -409109574 -408908117 -408888006
5496d08888006q8568o6587K4119J24403J44805Q8613O4735Q9892Q0963L566o3157
$$ -408888006 -408976574 -409043161 -409019042 -408894639 -408749834 -408661221 -408596486 -408506594 -408425631 -408422065 -408485222
5485d08485222o734J89725L50928L20582J39156l5569p7992l7137q14j4052n5012
$$ -408485222 -408491956 -408302231 -407951303 -407630721 -407491565 -407527134 -407605126 -407642263 -407643077 -407657129 -407712141
5474d07712141j2368R6466J44193J21423J20078J79927K16832J45947L9063l797
$$ -407712141 -407724509 -407628043 -407483850 -407362427 -407242349 -407062422 -406845590 -406699643 -406660580 -406664377
5464d06664377J2004P201l8394o7379r8188j15826j4928J62468K64336K55283
$$ -406664377 -406652373 -406645172 -406683566 -406750945 -406849133 -406964959 -406979887 -406817419 -406553083 -406297800
5454d06297800J47980j6553j33839j12228j3945N0266P5255Q3987J25599K32546
$$ -406297800 -406149820 -406166373 -406300212 -406412440 -406426385 -406376119 -406300864 -406216877 -406091278 -405858732
5444d05858732L38914K98121J27100J5162K6239N9121J5960n5624q9117j13040
$$ -405858732 -405519818 -405221697 -405094597 -405079435 -405053196 -404994075 -404978115 -405033739 -405122856 -405235896
5434d05235896j18500m2703M8559P7509N1306j4201o6141q5619r1346n3150p415
$$ -405235896 -405354396 -405397099 -405348540 -405271031 -405219725 -405233926 -405300067 -405385686 -405477032 -405530182 -405537597
5423d05537597r637j6830Q921M6110N6448M4927Q9811K08249K59394J67182L8041
$$ -405537597 -405547234 -405564064 -405555143 -405509033 -405452585 -405407658 -405317847 -405109598 -404850204 -404683022 -404644981
5412d04644981M534N4358P5843L5999l0314q4504q3393k1072N5575J15313J73110
$$ -404644981 -404640447 -404586089 -404510246 -404474247 -404504561 -404589065 -404672458 -404693530 -404637955 -404522642 -404349532
5401d04349532K12275J51259j3706j68431j77860n6479O9751J61525J79425J14456
$$ -404349532 -404137257 -403985998 -403999704 -404168135 -404345995 -404402474 -404332723 -404171198 -403991773 -403877317
5391d03877317N8198L1796K9373R9789K25119K70114J71063L6359k6231j1156
$$ -403877317 -403819119 -403787323 -403757950 -403658161 -403433042 -403162928 -402991865 -402955506 -402981737 -402992893
5381d02992893j8812p3005r5982j12455j70207j94958j25181k4178M4620J12070
$$ -402992893 -403011705 -403084710 -403180692 -403293147 -403463354 -403658312 -403783493 -403807671 -403763051 -403650981
5371d03650981J62709J38132P5989P694q2361j82764k16668j53846n3443M1747
$$ -403650981 -403488272 -403350140 -403274151 -403266457 -403348818 -403531582 -403748250 -403902096 -403955539 -403913792
5361d03913792P9874M7653J9045O056n6044j45684j22215L2076J63844K30038
$$ -403913792 -403833918 -403786265 -403767220 -403761164 -403817208 -403962892 -404085107 -404053031 -403889187 -403659149
5351d03659149K70754K83237K85765K89714K56246J77424Q4450L0721K3895l8328
$$ -403659149 -403388395 -403105158 -402819393 -402529679 -402273433 -402096009 -402011559 -401980838 -401956943 -401995271
5341d01995271j79784k68316k38487j58803j00790p6684q1170j13569j56346j46787
$$ -401995271 -402175055 -402443371 -402681858 -402840661 -402941451 -403018135 -403099305 -403212874 -403369220 -403516007
5331d03516007n3571J4479j5279n4254k8089N4194J33015J59291J50574J31200
$$ -403516007 -403569578 -403555099 -403570378 -403624632 -403652721 -403598527 -403465512 -403306221 -403155647 -403024447
5321d03024447R2922P804j31709k59717k93149k22558q2660O8646J84316K67495
$$ -403024447 -402931525 -402923721 -403055430 -403315147 -403608296 -403830854 -403913514 -403844868 -403660552 -403393057
5311d03393057K85501K44445J86742J12716L0299l1124m4070k8281k5425p6444
$$ -403393057 -403107556 -402863111 -402676369 -402563653 -402533354 -402564478 -402608548 -402636829 -402662254 -402738698
5301d02738698j62070j94858j51887r8261r8262j08076p5225q4434j88789k40749
$$ -402738698 -402900768 -403095626 -403247513 -403345774 -403444036 -403552112 -403627337 -403711771 -403900560 -404141309
5291d04141309j09709J53304M04287N07960M14359J64014j22273l17678l35947
$$ -404141309 -404251018 -404097714 -403693427 -403185467 -402771108 -402607094 -402729367 -403047045 -403382992
5282d03382992j56108P4986J70762J14243K3410j5202p323j9914k8668N2652J82588
$$ -403382992 -403539100 -403464114 -403293352 -403179109 -403155699 -403170901 -403178224 -403198138 -403226806 -403174154 -402991566
5271d02991566K77326L24666K87558J60089P3926J05687J55102J25700M4652j7366
$$ -402991566 -402714240 -402389574 -402102016 -401941927 -401868001 -401762314 -401607212 -401481512 -401436860 -401454226
5261d01454226n0261l6755N6081J69085K17771K08604J56861K1101j54422k59552
$$ -401454226 -401504487 -401541242 -401485161 -401316076 -401098305 -400889701 -400732840 -400711739 -400866161 -401125713
5251d01125713k98427l78280m81938m95846m32068l44555k13041m4849J13416
$$ -401125713 -401424140 -401802420 -402284358 -402780204 -403212272 -403556827 -403769868 -403814717 -403701301
5242d03701301K50146L32505L25947K70267J59677m6594k88386m84191n74962
$$ -403701301 -403451155 -403118650 -402792703 -402522436 -402362759 -402409353 -402697739 -403181930 -403756892
5233d03756892m78023k13595N7277K23274L14655L56261L31519K77341K32250
$$ -403756892 -404234915 -404448510 -404391233 -404167959 -403853304 -403497043 -403165524 -402888183 -402655933
5224d02655933J99825J38562J8196n3962j295N3923K9084j1351k3727l0616l8141
$$ -402655933 -402456108 -402317546 -402299350 -402353312 -402354607 -402300684 -402271600 -402282951 -402306678 -402337294 -402375435
5213d02375435l6445n6806q3481m4063N8040J43378J30063N695j31035j48569
$$ -402375435 -402411880 -402468686 -402552167 -402596230 -402538190 -402394812 -402264749 -402259054 -402390089 -402538658
5203d02538658o4944j6394o2906j75035k94841l74287m19756m50616m11781k99101
$$ -402538658 -402603602 -402619996 -402682902 -402857937 -403152778 -403527065 -403946821 -404397437 -404809218 -405108319
5193d05108319j98153j59148j46486o5121J25479L11076L83327L88261M18692
$$ -405108319 -405306472 -405465620 -405612106 -405677227 -405551748 -405240672 -404857345 -404469084 -404050392
5184d04050392M46992L77733K30147J12223K7098q6268j99206k56684k27697p1099
$$ -404050392 -403603400 -403225667 -402995520 -402883297 -402856199 -402942467 -403141673 -403398357 -403626054 -403697153
5174d03697153J57615K75534K43959J80771J10079N536j11153k16790k70318k03358
$$ -403697153 -403539538 -403264004 -403020045 -402839274 -402729195 -402723659 -402834812 -403051602 -403321920 -403525278
5164d03525278k0986J40228K01246K06639J73409J00345N8281R2402J36413J34416
$$ -403525278 -403546264 -403406036 -403204790 -402998151 -402824742 -402724397 -402666116 -402573714 -402437301 -402302885
5154d02302885Q5946p493p2110m6874l6633j63075l62765m58554l62714j50774
$$ -402302885 -402216939 -402224432 -402296542 -402343416 -402380049 -402543124 -402905889 -403364443 -403727157 -403877931
5144d03877931M0326J55607K00442J56959N6770m751L7992J35991J95500K03448
$$ -403877931 -403837605 -403681998 -403481556 -403324597 -403267827 -403272578 -403234586 -403098595 -402903095 -402699647
5134d02699647K11624K83167L74070L75897K47149M2223j40789k14068j55496
$$ -402699647 -402488023 -402204856 -401830786 -401454889 -401207740 -401165517 -401306306 -401520374 -401675870
5125d01675870m6145M9028J35681J60995R9322M5590O4047Q4995L3605m6776o9830
$$ -401675870 -401722015 -401672987 -401537306 -401376311 -401276989 -401231399 -401167352 -401082357 -401048752 -401095528 -401165358
5114d01165358p4097j39763k43566l03461k64858j43431L1329J60213J45670Q3206
$$ -401165358 -401239455 -401379218 -401622784 -401926245 -402191103 -402334534 -402303205 -402142992 -401997322 -401914116
5104d01914116M8765l2288j69860k49896k33778j76686j04823p485Q9401J20045
$$ -401914116 -401865351 -401897639 -402067499 -402317395 -402551173 -402727859 -402832682 -402840167 -402750766 -402630721
5094d02630721Q2196K1541N814O5872J62823K12387J39396l3297j62015j52501
$$ -402630721 -402548525 -402526984 -402521170 -402455298 -402292475 -402080088 -401940692 -401973989 -402136004 -402288505
5084d02288505l8133J15196K41792L01922K80128K06399J12758M827r1115j68244
$$ -402288505 -402326638 -402211442 -401969650 -401667728 -401387600 -401181201 -401068443 -401063616 -401154731 -401322975
5074d01322975k31350k32356j50385n7297n0090j61284k67371k02104J2162K17372
$$ -401322975 -401554325 -401786681 -401937066 -401994363 -402044453 -402205737 -402473108 -402675212 -402663050 -402445678
5064d02445678L01776K06429j9365k24236l08622k69647j94775j10735O7855K65089
$$ -402445678 -402143902 -401937473 -401956838 -402181074 -402489696 -402759343 -402954118 -403064853 -402996998 -402731909
5054d02731909K87170J44031j4012r8836j13758r6787l0567Q4549J35685J12590
$$ -402731909 -402444739 -402300708 -402314720 -402413556 -402527314 -402624101 -402654668 -402570119 -402434434 -402321844
5044d02321844J12392J34709R6440j2255j08059j55248j29947k5903J01610K37797
$$ -402321844 -402209452 -402074743 -401978303 -401990558 -402098617 -402253865 -402383812 -402409715 -402308105 -402070308
5034d02070308L04641K39120J15956j0223j03087j24177q4485m2705o4657j11377
$$ -402070308 -401765667 -401526547 -401410591 -401420814 -401523901 -401648078 -401732563 -401775268 -401839925 -401951302
5024d01951302q4428j0445L2291N2196P7839J01332O8553p8127k66645l51078
$$ -401951302 -402035730 -402046175 -402013884 -401961688 -401883849 -401782517 -401713964 -401792091 -402058736 -402409814
5014d02409814k72422j10262J8851Q8785J51665K60505L70244L35439J22056j05480
$$ -402409814 -402682236 -402792498 -402773647 -402684862 -402533197 -402272692 -401902448 -401567009 -401444953 -401550433
5004d01550433k07270k26854k52966k89549k77634j43001P6458K41723K71696
$$ -401550433 -401757703 -401984557 -402237523 -402527072 -402804706 -402947707 -402871249 -402629526 -402357830
4995d02357830K05467J46768J35611J42289Q3310p1493k63228l75237k94175r2902
$$ -402357830 -402152363 -402005595 -401869984 -401727695 -401644385 -401715878 -401979106 -402354343 -402648518 -402741420
4985d02741420P4224J76791K26149J94116O8596j05893k38748k62728j99268j29350
$$ -402741420 -402667196 -402490405 -402264256 -402070140 -402001544 -402107437 -402346185 -402608913 -402808181 -402937531
4975d02937531r3433j05415j52237j89515j75446r3718J1643R0401J12377K5741
$$ -402937531 -403030964 -403136379 -403288616 -403478131 -403653577 -403747295 -403735652 -403645251 -403532874 -403507133
4965d03507133j42965k31425j66629k3857J18480K01740J62978N7115k174M7425
$$ -403507133 -403650098 -403881523 -404048152 -404072009 -403953529 -403751789 -403588811 -403531696 -403533870 -403486445
4955d03486445J63490K63274K96451K50154J41024M2179M5409J28765K04642K27092
$$ -403486445 -403322955 -403059681 -402763230 -402513076 -402372052 -402329873 -402284464 -402155699 -401951057 -401723965
4945d01723965K45304K63105K34084J80149Q1214r6229k62670l13823j94996O5144
$$ -401723965 -401478661 -401215556 -400981472 -400801323 -400720109 -400816338 -401079008 -401392831 -401587827 -401522683
4935d01522683K66308K48418O4345j49692k67410k70151k53269k42036j84614
$$ -401522683 -401256375 -401007957 -400943612 -401093304 -401360714 -401630865 -401884134 -402126170 -402310784
4926d02310784j07263p6690j06340j10651n3909l1127m5017n1012o7938r7971
$$ -402310784 -402418047 -402494737 -402601077 -402711728 -402765637 -402796764 -402841781 -402892793 -402960731 -403058702
4916d03058702j60991k35844k89921l11837k52157j30641j7160K9424j3844p4174
$$ -403058702 -403219693 -403455537 -403745458 -404057295 -404309452 -404440093 -404457253 -404427829 -404441673 -404515847
4906d04515847o9225k8112m183o964m8561j35581k20532k14934j05558J5009J00771
$$ -404515847 -404585072 -404613184 -404617367 -404624331 -404672892 -404808473 -405029005 -405243939 -405349497 -405334488 -405233717
4895d05233717J90042K91294L33111K85025K10829J90549K55265L64954M56044
$$ -405233717 -405043675 -404752381 -404419270 -404134245 -403923416 -403732867 -403477602 -403112648 -402656604
4886d02656604M59284L42749J59923l000j25595k17813k42620j88705j38952j43914
$$ -402656604 -402197320 -401854571 -401694648 -401697648 -401823243 -402041056 -402283676 -402472381 -402611333 -402755247
4876d02755247j58270j39164j04218r0002j10909j63868k29320k34417j03736
$$ -402755247 -402913517 -403052681 -403156899 -403246901 -403357810 -403521678 -403750998 -403985415 -404089151
4867d04089151J08161K82112L78690L66474J95703p7424l17460m24179l76009
$$ -404089151 -403980990 -403698878 -403320188 -402953714 -402758011 -402835435 -403152895 -403577074 -403953083
4858d03953083k12537j5796Q8927R1512R1175R6440Q9926J07901J66105K01987
$$ -403953083 -404165620 -404181416 -404092489 -404000977 -403909802 -403813362 -403723436 -403615535 -403449430 -403247443
4848d03247443J44594K5831m6036n1783k8900M3216J53026K40021K48324J85850
$$ -403247443 -403102849 -403077018 -403123054 -403174837 -403203737 -403160521 -403007495 -402767474 -402519150 -402333300
4838d02333300J35237J47257J66148J29489N2611m19j5564r2686k83843m25003
$$ -402333300 -402198063 -402050806 -401884658 -401755169 -401702558 -401702977 -401718541 -401811227 -402095070 -402520073
4828d02520073l82538k21506o0151M982p7081k62530m22692m98653m86637l38522
$$ -402520073 -402902611 -403124117 -403184268 -403179286 -403256367 -403518897 -403941589 -404440242 -404926879 -405265401
4818d05265401q7752J27285K55965L50290M13157L90307K95815J70993J6645j05227
$$ -405265401 -405353153 -405225868 -404969903 -404619613 -404206456 -403816149 -403520334 -403349341 -403332696 -403437923
4808d03437923j33126q7766l5642m1192o8886o6909o7421j20297k15534k56629
$$ -403437923 -403571049 -403658815 -403694457 -403735649 -403804535 -403871444 -403938865 -404059162 -404274696 -404531325
4798d04531325k10349j70444j25239J9995K18326L60746L97700L13870J87339
$$ -404531325 -404741674 -404912118 -405037357 -405017362 -404799036 -404438290 -404040590 -403726720 -403539381
4789d03539381J51632J70243J08290p787j02164j71611j98949j53576j41530k31538
$$ -403539381 -403387749 -403217506 -403109216 -403117003 -403219167 -403390778 -403589727 -403743303 -403884833 -404116371
4779d04116371l09861l08868k83363k90781k74835k12555j79572j91672j34938
$$ -404116371 -404426232 -404735100 -405018463 -405309244 -405584079 -405796634 -405976206 -406167878 -406302816
4770d06302816P1773L08282L99185L18792J50279j0249q0899l3671P9919K06516
$$ -406302816 -406231043 -405922761 -405523576 -405204784 -405054505 -405064754 -405145653 -405179324 -405099405 -404892889
4760d04892889L69327N36564N64414L94551J13514j68307l43402l60922k28310
$$ -404892889 -404523562 -403986998 -403422584 -403028033 -402914519 -403082826 -403426228 -403787150 -404015460
4751d04015460k2590J03059J03091O6093Q4432K00191L53916M07840L32252K10524
$$ -404015460 -404038050 -403934991 -403831900 -403765807 -403681375 -403481184 -403127268 -402719428 -402387176 -402176652
4741d02176652J06965J6781r1876j74153j47583o6190l8722q5312r2639J8175
$$ -402176652 -402069687 -402052906 -402144782 -402318935 -402466518 -402532708 -402571430 -402656742 -402749381 -402731206
4731d02731206J57811K08212J64168J28273J58632J93169J63787Q4800L091l9210
$$ -402731206 -402573395 -402365183 -402201015 -402072742 -401914110 -401720941 -401557154 -401472354 -401469263 -401508473
4721d01508473n3636j10346k05116k26411j34831p3727j66955l14478l83161l41927
$$ -401508473 -401562109 -401672455 -401877571 -402103982 -402238813 -402312540 -402479495 -402793973 -403177134 -403519061
4711d03519061k22078n9515J26658K62735K78961K15711J50012J06097R2738N4641
$$ -403519061 -403741139 -403800654 -403673996 -403411261 -403132300 -402916589 -402766577 -402660480 -402567742 -402513101
4701d02513101l6744j35448k38783l52615m48408m89806m64439l40628j17413
$$ -402513101 -402549845 -402685293 -402924076 -403276691 -403725099 -404214905 -404679344 -405019972 -405137385
4692d05137385O7822J30261J21310M6835j00329k21167k17451j19813j6086Q8542
$$ -405137385 -405069563 -404939302 -404817992 -404771157 -404871486 -405092653 -405310104 -405429917 -405446003 -405357461
4682d05357461J92766K35593J91468J11800K9519o2285j51939k23130k44406k11400
$$ -405357461 -405164695 -404929102 -404737634 -404625834 -404596315 -404658600 -404810539 -405033669 -405278075 -405489475
4672d05489475j64917j48706j96557k64965k15195J3791L14070N14684M74324
$$ -405489475 -405654392 -405803098 -405999655 -406264620 -406479815 -406466024 -406151954 -405637270 -405162946
4663d05162946K30211L7494L8307J11900Q3067n5953j63021j37467o3208q2282
$$ -405162946 -404932735 -404895241 -404856934 -404745034 -404661967 -404717920 -404880941 -405018408 -405081616 -405163898
4653d05163898j81406k26577j43603J7445J75825K74086K54822J51112N440j66292
$$ -405163898 -405345304 -405571881 -405715484 -405698039 -405522214 -405248128 -404993306 -404842194 -404836754 -405003046
4643d05003046k81621k66013j75635p1006Q9179K82959L79930L36739K42666J55022
$$ -405003046 -405284667 -405550680 -405726315 -405797321 -405708142 -405425183 -405045253 -404708514 -404465848 -404310826
4633d04310826P6358j5986j18624j63134j33800j06902j04406j10720j59787k30664
$$ -404310826 -404234468 -404250454 -404369078 -404532212 -404666012 -404772914 -404877320 -404988040 -405147827 -405378491
4623d05378491k30416j24145L8510J81688K49087K23998J40946Q3894J15017J86051
$$ -405378491 -405608907 -405733052 -405694542 -405512854 -405263767 -405039769 -404898823 -404814929 -404699912 -404513861
4613d04513861J80186L2982j59644k48700k59157l13090l64951l01075j12779
$$ -404513861 -404333675 -404300693 -404460337 -404709037 -404968194 -405281284 -405646235 -405947310 -406060089
4604d06060089P7231J44582J04448K6076k8442n3398q5353j00210m6868P3469
$$ -406060089 -405982858 -405838276 -405733828 -405707752 -405736194 -405789592 -405874945 -405975155 -406022023 -405948554
4594d05948554J94830K35497J76863P8570M4751J00225J93687L02688L85451L79397
$$ -405948554 -405753724 -405518227 -405341364 -405262794 -405218043 -405117818 -404924131 -404621443 -404235992 -403856595
4584d03856595K84908J62053J05293J14281J25062J04018Q4711Q9720N4952k9196
$$ -403856595 -403571687 -403409634 -403304341 -403190060 -403064998 -402960980 -402876269 -402786549 -402731597 -402760793
4574d02760793j42289k76446l45922k79021j25843l5713o9626j30058j33493m7208
$$ -402760793 -402903082 -403179528 -403525450 -403804471 -403930314 -403966027 -404035653 -404165711 -404299204 -404346412
4564d04346412Q2615J58838J59767J08667L0589q1681k35613l57755m11429l99308
$$ -404346412 -404263797 -404104959 -403945192 -403836525 -403805936 -403887617 -404123230 -404480985 -404892414 -405291722
4554d05291722k59939J1932K92417M65629N04141M34270L01852J73281R1307J3929
$$ -405291722 -405551661 -405539729 -405247312 -404781683 -404277542 -403843272 -403541420 -403368139 -403276832 -403262903
4544d03262903o6945r6543n6759N843J9841l4048j59283l14718m09158l92587
$$ -403262903 -403329848 -403426391 -403483150 -403477307 -403457466 -403491514 -403650797 -403965515 -404374673 -404767260
4534d04767260k68136p6906R7423K08173K31263J55916M1750K274P1521J76677
$$ -404767260 -405035396 -405112302 -405014879 -404806706 -404575443 -404419527 -404377777 -404375503 -404303982 -404127305
4524d04127305K15083J33486K1445m5016r4859j58154k14966k53872k81781k60589
$$ -404127305 -403912222 -403778736 -403757291 -403802307 -403897166 -404055320 -404270286 -404524158 -404805939 -405066528
4514d05066528j66245o2058k4482m8905p0838l890R8949J30972J15402J24343
$$ -405066528 -405232773 -405294831 -405319313 -405368218 -405439056 -405442946 -405343997 -405213025 -405097623 -404973280
4504d04973280J82623K56354L10012L35520L33975K83995J77520P408j92185l32108
$$ -404973280 -404790657 -404534303 -404224291 -403888771 -403554796 -403270801 -403093281 -403085873 -403278058 -403610166
4494d03610166l58356k95218k11291j37179q6121j25470k38328k75994j43221
$$ -403610166 -403968522 -404263740 -404475031 -404612210 -404698331 -404823801 -405062129 -405338123 -405481344
4485d05481344P3843K13007K13797J27382M5034N8881J65030K53037K34153J08546
$$ -405481344 -405407501 -405194494 -404980697 -404853315 -404808281 -404749400 -404584370 -404331333 -404097180 -403988634
4475d03988634p5914k51632l39357k69989m2896J90596K59854J75003M3938o3307
$$ -403988634 -404064548 -404316180 -404655537 -404925526 -404968422 -404777826 -404517972 -404342969 -404299031 -404362338
4465d04362338j25122j42380j24208q2972k0438N890n1330j14598r9252k4551
$$ -404362338 -404487460 -404629840 -404754048 -404837020 -404857458 -404851568 -404902898 -405017496 -405116748 -405141299
4455d05141299O4784J46356J91770J71878Q1882n2285j11229j9645J11758J75257
$$ -405141299 -405076515 -404930159 -404738389 -404566511 -404484629 -404536914 -404648143 -404667788 -404556030 -404380773
4445d04380773J68368J15293M3379q325l9188r6682j54852j49988q6321k4823
$$ -404380773 -404212405 -404097112 -404053733 -404062058 -404101246 -404197928 -404352780 -404502768 -404589089 -404613912
4435d04613912P486J4956K9017J00147K19118K97737K64444J55437M6378O236
$$ -404613912 -404606426 -404591470 -404562453 -404462306 -404243188 -403945451 -403681007 -403525570 -403479192 -403472956
4425d03472956K5295K7584k8137q0589m7195J408n5226j55141j64787o9816P7489
$$ -403472956 -403447661 -403420077 -403448214 -403528803 -403575998 -403574590 -403629816 -403784957 -403949744 -404019560 -403942071
4414d03942071K01829K11004R2320r6530k87962l95041l63411k75420k74144l52934
$$ -403942071 -403740242 -403529238 -403436918 -403533448 -403821410 -404216451 -404579862 -404855282 -405129426 -405482360
4404d05482360l74680k37237N009J89153K55700K67728K70611K30871J06255p4017
$$ -405482360 -405857040 -406094277 -406089268 -405900115 -405644415 -405376687 -405106076 -404875205 -404768950 -404842967
4394d04842967j75400j45770j19825j78458k35363j74229o066J45646K00055J77965
$$ -404842967 -405018367 -405164137 -405283962 -405462420 -405697783 -405872012 -405878078 -405732432 -405532377 -405354412
4384d05354412J13361O871j28485k54978l16346k88697j82002l932J63652K15387
$$ -405354412 -405241051 -405234180 -405362665 -405617643 -405933989 -406222686 -406404688 -406408620 -406244968 -406029581
4374d06029581J36908o246j15920j17374j8048P9047J12316J52654K94276M65555
$$ -406029581 -405892673 -405898919 -406014839 -406132213 -406150261 -406071214 -405958898 -405806244 -405511968 -405046413
4364d05046413M68487K66196R899j45946j69315j73191k09915j86883k7113K05331
$$ -405046413 -404577926 -404311730 -404301831 -404447777 -404617092 -404790283 -405000198 -405187081 -405214194 -405008863
4354d05008863L82280M50255L54359J33195o2571j56419j80008j94105j98153
$$ -405008863 -404626583 -404176328 -403821969 -403688774 -403751345 -403907764 -404087772 -404281877 -404480030
4345d04480030j92296k17124k45867k47303k44493j86411n2544M7387R2520J40336
$$ -404480030 -404672326 -404889450 -405135317 -405382620 -405627113 -405813524 -405866068 -405818681 -405726161 -405585825
4335d05585825J88023J69532O9312l7148p6312n0101m728O7112J39442J63174
$$ -405585825 -405397802 -405228270 -405158958 -405196106 -405272418 -405322519 -405327247 -405260135 -405120693 -404957519
4325d04957519J66165J33624P0132M5820M2293r295j19819k03732k19951k50991
$$ -404957519 -404791354 -404657730 -404587598 -404541778 -404499485 -404508780 -404628599 -404832331 -405052282 -405303273
4315d05303273k64564k05133j41583r0093j6422N6846P5200O6175R3658J17680
$$ -405303273 -405567837 -405772970 -405914553 -406004646 -406021068 -405964222 -405889022 -405822847 -405729189 -405611509
4305d05611509Q9159L4837o569L4403J52302K39266K45933K07602J42191M2129
$$ -405611509 -405522350 -405487513 -405494082 -405459679 -405307377 -405068111 -404822178 -404614576 -404472385 -404430256
4295d04430256n5895r3400n2412K811M5449P1550J03j58477k40121j95763j49021
$$ -404430256 -404486151 -404579551 -404631963 -404629152 -404583703 -404512153 -404512050 -404670527 -404910648 -405106411 -405255432
4284d05255432j51434j55837j17215q124J09346J34143R0136L7547J023j3370
$$ -405255432 -405406866 -405562703 -405679918 -405688042 -405578696 -405444553 -405354417 -405316870 -405315847 -405329217
4274d05329217n0704j50430k24507j73095j4047J47335K01211J21256k0397j02961
$$ -405329217 -405379921 -405530351 -405754858 -405927953 -405942000 -405794665 -405593454 -405472198 -405492595 -405595556
4264d05595556q6452k4150L8417R9073J39385J43904J22464O5462n2187k40477
$$ -405595556 -405682008 -405706158 -405667741 -405568668 -405429283 -405285379 -405162915 -405097453 -405149640 -405390117
4254d05390117m02399m00838k92107k12450j56859p2280K0032Q9955J52631J84171
$$ -405390117 -405792516 -406193354 -406485461 -406697911 -406854770 -406927050 -406907018 -406817063 -406664432 -406480261
4244d06480261J31509k267j60891k55723k13792m9094J43982K36090J65525N752
$$ -406480261 -406348752 -406351019 -406511910 -406767633 -406981425 -407030519 -406886537 -406650447 -406484922 -406479170
4234d06479170j37002j87153j65829j62651j55060o4292N9532J07718P9249O4267
$$ -406479170 -406616172 -406803325 -406969154 -407131805 -407286865 -407351157 -407291625 -407183907 -407104658 -407040391
4224d07040391J23700K27728K96849L08763K89036K48734K20363K24269K40982
$$ -407040391 -406916691 -406688963 -406392114 -406083351 -405794315 -405545581 -405325218 -405100949 -404859967
4215d04859967K58735K21291R3611l5354j09163j36184j23556p7714j4539j4300
$$ -404859967 -404601232 -404379941 -404286330 -404321684 -404430847 -404567031 -404690587 -404768301 -404782840 -404797140
4205d04797140j12968j99928j95318j57140j35761j13032o2582k4170j2576L243
$$ -404797140 -404910108 -405110036 -405305354 -405462494 -405598255 -405711287 -405773869 -405798039 -405810615 -405807372
4195d05807372M9126J26638J89531J95696J54981Q8903R831k9039q839p279q8169
$$ -405807372 -405758246 -405631608 -405442077 -405246381 -405091400 -405002497 -404992666 -405021705 -405030544 -405037823 -405125992
4184d05125992k08980k72802j67940N8927J68435M7840j62795k68308k34198j51015
$$ -405125992 -405334972 -405607774 -405775714 -405716787 -405548352 -405500512 -405663307 -405931615 -406165813 -406316828
4174d06316828q7867p2280o8629k289J18735K12558K17993J43835P8901N8750
$$ -406316828 -406404695 -406476975 -406545604 -406547893 -406429158 -406216600 -405998607 -405854772 -405775871 -405717121
4164d05717121J5843l6716M015J15786J64361J12323M7898J938p2886k12793l44421
$$ -405717121 -405701278 -405737994 -405733979 -405618193 -405453832 -405341509 -405293611 -405291673 -405364559 -405577352 -405921773
4153d05921773l65214k77740j39061j0587O2959J16865J69439J60662O4649p0342
$$ -405921773 -406286987 -406564727 -406703788 -406714375 -406651416 -406534551 -406365112 -406204450 -406139801 -406210143
4143d06210143j52799j28040o3165l1161l3615m7658m3727j5877P504L1392L6162
$$ -406210143 -406362942 -406490982 -406554147 -406585308 -406618923 -406666581 -406710308 -406726185 -406718681 -406687289 -406651127
4132d06651127m8406j36159j15516k8485P2406J54905J44205M0702j9621R937
$$ -406651127 -406699533 -406835692 -406951208 -406979693 -406907287 -406752382 -406608177 -406567475 -406587096 -406577159
4122d06577159P1841J35335J93066K31105K33168J72274L4232j33012k46306k24808
$$ -406577159 -406505318 -406369983 -406176917 -405945812 -405712644 -405540370 -405506138 -405639150 -405885456 -406110264
4112d06110264p2117P7667R1070j7082r4933m9832P8885K18973L20550L96621
$$ -406110264 -406182381 -406104714 -406013644 -406030726 -406125659 -406175491 -406096606 -405877633 -405557083 -405160462
4102d05160462M36064L88657K54109M2803k24506m15214m02838k51212j27316
$$ -405160462 -404724398 -404335741 -404081632 -404038829 -404263335 -404678549 -405081387 -405332599 -405459915
4093d05459915j10534j35791j00591n154N6697Q7590J81095L31836M24435M00908
$$ -405459915 -405570449 -405706240 -405806831 -405811985 -405755288 -405667698 -405486603 -405154767 -404730332 -404329424
4083d04329424K76353R7961n9582j66921k71218l19189k13926k4936J10100J27295
$$ -404329424 -404053071 -403955110 -404014692 -404181613 -404452831 -404772020 -404985946 -405010882 -404900782 -404773487
4073d04773487N1723o9606j47725q1271Q3123J94361K16784J99319J39512M1679
$$ -404773487 -404721764 -404791370 -404939095 -405020366 -404937243 -404742882 -404526098 -404326779 -404187267 -404145588
4063d04145588l7649o8601r0066j30936j52939j51158j60264j64707j31461o8524
$$ -404145588 -404183237 -404251838 -404341904 -404472840 -404625779 -404776937 -404937201 -405101908 -405233369 -405301893
4053d05301893J54N5378J25679K09066K10594J25065M1188J2875P1634J62477
$$ -405301893 -405301739 -405246361 -405120682 -404911616 -404701022 -404575957 -404534769 -404521894 -404450260 -404287783
4043d04287783J77717J32673P2085M979l5737m7173m8284p5339j12891j39172
$$ -404287783 -404110066 -403977393 -403905308 -403900329 -403936066 -403983239 -404031523 -404106862 -404219753 -404358925
4033d04358925k10227l09851l79038l76119k42470l641K29284L38247K92319J70545
$$ -404358925 -404569152 -404879003 -405258041 -405634160 -405876630 -405880271 -405650987 -405312740 -405020421 -404849876
4023d04849876P6840Q4422J75707K47055J97194L9831j32654k50120k64832k06050
$$ -404849876 -404773036 -404688614 -404512907 -404265852 -404068658 -404028827 -404161481 -404411601 -404676433 -404882483
4013d04882483j55312j16440m8386L2377M6009j6844p4345p2512n1530j10977
$$ -404882483 -405037795 -405154235 -405202621 -405170244 -405124235 -405141079 -405215424 -405287936 -405339466 -405450443
4003d05450443k22293k92303k65035j69267p7827k1299J0657N2164J14200J83089
$$ -405450443 -405672736 -405965039 -406230074 -406399341 -406477168 -406498467 -406487810 -406435646 -406321446 -406138357
3993d06138357K65068L60820M15617L79354K99130K30429J37506m1689k61657
$$ -406138357 -405873289 -405512469 -405096852 -404717498 -404418368 -404187939 -404050433 -404092122 -404353779
3984d04353779m07043m26357l60190k44888j17640l8863m0295q1738j06419j06875
$$ -404353779 -404760822 -405187179 -405547369 -405792257 -405909897 -405948760 -405989055 -406070793 -406177212 -406284087
3974d06284087o0899N8721K33530L40035L14587K01687N0395o3160j02307q6788
$$ -406284087 -406344986 -406286265 -406052735 -405712700 -405398113 -405196426 -405146031 -405209191 -405311498 -405398286
3964d05398286j6322O4799L8370p6035j37823j36829j44742j82507k13246j57425
$$ -405398286 -405414608 -405349809 -405311439 -405387474 -405525297 -405662126 -405806868 -405989375 -406202621 -406360046
3954d06360046j8716N4030j7555j12801j31561q1664l671N5497K1008j10934j87490
$$ -406360046 -406378762 -406324732 -406342287 -406455088 -406586649 -406668313 -406671984 -406616487 -406595479 -406706413 -406893903
3943d06893903p4779J19752K16783J92287J17892O1189M7578M7562j1489j35105
$$ -406893903 -406968682 -406848930 -406632147 -406439860 -406321968 -406260779 -406213201 -406165639 -406177128 -406312233
3933d06312233k09218j49043J756J43479K14547K11472J77148J29919R3727J60310
$$ -406312233 -406521451 -406670494 -406668738 -406525259 -406310712 -406099240 -405922092 -405792173 -405698446 -405538136
3923d05538136L09848M04938L59801K10931K1896j36498j66527q4885K4152P2158
$$ -405538136 -405228288 -404823350 -404463549 -404252618 -404230722 -404367220 -404533747 -404618632 -404594480 -404522322
3913d04522322M3390N9581J43398J70051P1814j18659k93981l52167k72901j14617
$$ -404522322 -404478932 -404419351 -404275953 -404105902 -404034088 -404152747 -404446728 -404798895 -405071796 -405186413
3903d05186413L7351J57345K46306K97752L11968K67690J34913k9770j35664j55936
$$ -405186413 -405149062 -404991717 -404745411 -404447659 -404135691 -403868001 -403733088 -403762858 -403898522 -404054458
3893d04054458j53349j74017j40491p778J37676K03294J80639J27302Q3440Q2891
$$ -404054458 -404207807 -404381824 -404522315 -404530093 -404392417 -404189123 -404008484 -403881182 -403797742 -403714851
3883d03714851J26213J19130J3083o5045n5966q9405k17578l11148k80463j51580
$$ -403714851 -403588638 -403469508 -403456425 -403521470 -403577436 -403666841 -403884419 -404195567 -404476030 -404627610
3873d04627610j1296M9894M2785K8859M1416J01020J52044J06777N687m0184k3009
$$ -404627610 -404638906 -404589012 -404546227 -404517368 -404475952 -404374932 -404222888 -404116111 -404110424 -404150608 -404173617
3862d04173617M0533J16348J58180J81875K24534K59224K08566P5691q4296k00315
$$ -404173617 -404133084 -404016736 -403858556 -403676681 -403452147 -403192923 -402984357 -402908666 -402992962 -403193277
3852d03193277j89729m1315J19322J58875R0602K0959J3933L7513J6289k7053
$$ -403193277 -403383006 -403424321 -403304999 -403146124 -403055522 -403034563 -403020630 -402983117 -402966828 -402993881
3842d02993881o09P5058J03064M6236o0514j11251n9842L7917J51002J97336P6563
$$ -402993881 -402994490 -402919432 -402816368 -402770132 -402830646 -402941897 -403001739 -402963822 -402812820 -402615484 -402538921
3831d02538921j14308j95934j40014r7131j70877k68209k75984k09190j22421
$$ -402538921 -402653229 -402849163 -402989177 -403086308 -403257185 -403525394 -403801378 -404010568 -404132989
3822d04132989k1583P9375J49284J49895J10786R7279R9744Q0360P322j12405
$$ -404132989 -404154572 -404075197 -403925913 -403776018 -403665232 -403567953 -403468209 -403387849 -403380527 -403492932
3812d03492932k15977j98916j8184J69237K58242L19597L56450L13927K39038
$$ -403492932 -403708909 -403907825 -403926009 -403756772 -403498530 -403178933 -402822483 -402508556 -402269518
3803d02269518J90470J25626M7791O5824J71362K49153K85623L03816K74488J47432
$$ -402269518 -402079048 -401953422 -401905631 -401839807 -401668445 -401419292 -401133669 -400829853 -400555365 -400407933
3793d00407933l2186j26632j00579K851J19971J69236R5220p7574k30503k68325
$$ -400407933 -400440119 -400566751 -400667330 -400664479 -400544508 -400375272 -400280052 -400357626 -400588129 -400856454
3783d00856454j57721M9529K39883L10778K54257K26196L16866L99345L51807
$$ -400856454 -401014175 -400964646 -400724763 -400413985 -400159728 -399933532 -399616666 -399217321 -398865514
3774c98865514J83620k8834j72844j70922n9744L8417P2723Q9460P5098j0639
$$ -398865514 -398681894 -398710728 -398883572 -399054494 -399114238 -399075821 -399003098 -398913638 -398838540 -398849179
3764c98849179j41748k20792j87280o9421Q2563K55684M11492M92678M61755L32115
$$ -398849179 -398990927 -399211719 -399398999 -399468420 -399385857 -399130173 -398718681 -398226003 -397764248 -397432133
3754c97432133J67177M4366M4501J29006J81442J66146J62241K26995K87953K37600
$$ -397432133 -397264956 -397220590 -397176089 -397047083 -396865641 -396699495 -396537254 -396310259 -396022306 -395784706
3744c95784706J20689O5956J25672K46459L08315K85195K78659L80243N54105
$$ -395784706 -395664017 -395598061 -395472389 -395225930 -394917615 -394632420 -394353761 -393973518 -393419413
3735c93419413P18165Q40092Q76633P97023O77732N84019M71506K46520l8705
$$ -393419413 -392701248 -391861156 -390984523 -390187500 -389509768 -388925749 -388454243 -388207723 -388246428
3726c88246428k38518l22743k96713k37064l21357n80470q92901j147648j313542
$$ -388246428 -388484946 -388807689 -389104402 -389341466 -389662823 -390243293 -391136194 -392283842 -393597384
3717c93597384j455196j597420j699040j740387j729518j667744j542905j400150
$$ -393597384 -395052580 -396650000 -398349040 -400089427 -401818945 -403486689 -405029594 -406429744
3709d06429744j310942j207899j001287p63310n95476n17369m75713l67899j65975
$$ -406429744 -407740686 -408948585 -409949872 -410713182 -411308658 -411826027 -412301740 -412669639 -412835614
3700d12835614K4997J40872K31460L31100M62284N89531N96601M76795L97935
$$ -412835614 -412810617 -412669745 -412438285 -412107185 -411644901 -411055370 -410458769 -409981974 -409584039
3691d09584039M74849N87131O36685O70446O76853O29123N61122N13410M41219
$$ -409584039 -409109190 -408522059 -407885374 -407214928 -406538075 -405908952 -405347830 -404834420 -404393201
3682d04393201L24548K44346K47105K90620K94190K42883K18446K88958M18145
$$ -404393201 -404068653 -403824307 -403577202 -403286582 -402992392 -402749509 -402531063 -402242105 -401823960
3673d01823960M99902M84482M03109L13677K45758K41958L26006M65603O11265
$$ -401823960 -401324058 -400839576 -400436467 -400122790 -399877032 -399635074 -399309068 -398843465 -398232200
3664c98232200O70486N72068M01774L13369L01754L26090L71176L81459L95730
$$ -398232200 -397561714 -396989646 -396587872 -396274503 -395972749 -395646659 -395275483 -394894024 -394498294
3655c94498294M60022N44562O04080N75738M60275L50798L01906K92404K75647
$$ -394498294 -394038272 -393493710 -392889630 -392313892 -391853617 -391502819 -391200913 -390908509 -390632862
3646c90632862K58523K99396L40412K70189J18214k9017j48501k35038k82569
$$ -390632862 -390374339 -390074943 -389734531 -389464342 -389346128 -389375145 -389523646 -389758684 -390041253
3637c90041253l20372l59231l90811m23183m33826m54489n40630n91552m84850
$$ -390041253 -390361625 -390720856 -391111667 -391534850 -391968676 -392423165 -392963795 -393555347 -394040197
3628c94040197k43333M8264K96274M12346M09299M23795M90425N05334M74731
$$ -394040197 -394283530 -394235266 -393938992 -393526646 -393117347 -392693552 -392203127 -391697793 -391223062
3619c91223062M85930N43532N91993N67716M58716L34414K83858L01615L65966
$$ -391223062 -390737132 -390193600 -389601607 -389033891 -388575175 -388240761 -387956903 -387655288 -387289322
3610c87289322N12995P35648R77365J218703J414620J473761J369641J174039
$$ -387289322 -386776327 -386040679 -385063314 -383844611 -382429991 -380956230 -379586589 -378412550
3602c78412550J029947J050360J136269J158620J132004J042118Q55727O15456
$$ -378412550 -377382603 -376332243 -375195974 -374037354 -372905350 -371863232 -371007505 -370392049
3594c70392049L79712R2351l17882q25006j416641k118289k900133l676560m355234
$$ -370392049 -370012337 -369919986 -370237868 -371062874 -372479515 -374597804 -377497937 -381174497 -385529731
3585c85529731m823249m999058m898386m540414l954203l231901k471046j708893
$$ -385529731 -390352980 -395352038 -400250424 -404790838 -408745041 -411976942 -414447988 -416156881
3577d16156881j012375m88906j84189j61495m32118q57796j336817j899383k613729
$$ -416156881 -417169256 -417658162 -417842351 -418003846 -418435964 -419293760 -420630577 -422529960 -425143689
3568d25143689l480694m324623m935576n209107n107444m685320m097390l467373
$$ -425143689 -428624383 -432949006 -437884582 -443093689 -448201133 -452886453 -456983843 -460451216
3560d60451216k778966k011685j272287o52835j30754L59856Q63604J303442J564745
$$ -460451216 -463230182 -465241867 -466514154 -467166989 -467297743 -466937887 -466074283 -464770841 -463206096
3551d63206096J616783J491531J299028J133616J037383J029551J089617J148081
$$ -463206096 -461589313 -460097782 -458798754 -457665138 -456627755 -455598204 -454508587 -453360506
3543d53360506J146566J072686R62728Q34397O87062N77732N13685M50534M07088
$$ -453360506 -452213940 -451141254 -450178526 -449344129 -448657067 -448079335 -447565650 -447115116 -446708028
3534d46708028M01559L81260L40494L60016M76212N97658O18960N93760O96071
$$ -446708028 -446306469 -445925209 -445584715 -445224699 -444748487 -444150829 -443531869 -442938109 -442242038
3525d42242038R14809J041484R27266O06961K73060Q8827O4260J37871K72374
$$ -442242038 -441327229 -440285745 -439358479 -438751518 -438478458 -438389631 -438325371 -438187500 -437915126
3516d37915126M15820M89080M26751K61934Q9173l7208q7825n7036K8575J53552
$$ -437915126 -437499306 -437010226 -436583475 -436321541 -436232368 -436269576 -436357401 -436414437 -436385862 -436232310
3506d36232310K85739L80790L92227L05855K00720J48419J35997J20040Q2766
$$ -436232310 -435946571 -435565781 -435173554 -434867699 -434666979 -434518560 -434382563 -434262523 -434179757
3497d34179757N2053M1172L9003Q0621K12676L94444M88676M20349K34583J0181
$$ -434179757 -434127704 -434086532 -434047529 -433966908 -433754232 -433359788 -432871112 -432450763 -432216180 -432205999
3487d32205999j61799k23742j88669j19178n9666L3589K00561L22043K78025J41732
$$ -432205999 -432367798 -432591540 -432780209 -432899387 -432959053 -432925464 -432724903 -432402860 -432124835 -431983103
3477d31983103L9561L4419Q4856J43503K18122K59520K48287K24363K18645K32868
$$ -431983103 -431943542 -431909123 -431824267 -431680764 -431462642 -431203122 -430954835 -430730472 -430511827 -430278959
3467d30278959K42766K72775L44704L95100L42704K31510J51765P9546j6239q7329
$$ -430278959 -430036193 -429763418 -429418714 -429023614 -428680910 -428449400 -428297635 -428218089 -428234328 -428321657
3457d28321657n9362K5145j864j44786j71271p649J37869J30644N8777M4243J10106
$$ -428321657 -428381019 -428355874 -428357738 -428502524 -428673795 -428681444 -428543575 -428412931 -428354154 -428309911 -428199805
3446d28199805J89961J65859J04668J35623K26922L36779M13057L86419K66861
$$ -428199805 -428009844 -427843985 -427739317 -427603694 -427376772 -427039993 -426626936 -426240517 -425973656
3437d25973656J34740K2916q2435j72984k35984k39667j43662M4767K34207L31215
$$ -425973656 -425838916 -425816000 -425898435 -426071419 -426307403 -426547070 -426690732 -426645965 -426411758 -426080543
3427d26080543L42865L73574M25936L81327K28602P6411j9590p1014n8065M542
$$ -426080543 -425737678 -425364104 -424938168 -424556841 -424328239 -424251828 -424271418 -424342432 -424400497 -424395955
3417d24395955M3384L6880K7965K8556n267r4128j50710p9990Q9888K45727L07863
$$ -424395955 -424352571 -424315691 -424287726 -424259170 -424264437 -424358565 -424509275 -424589265 -424499377 -424253650 -423945787
3406d23945787L04984K76133K51252K40959K13165J45226L3848p3809j05793o5671
$$ -423945787 -423640803 -423364670 -423113418 -422872459 -422659294 -422514068 -422480220 -422554029 -422659822 -422725493
3396d22725493m6861q7209q9721j5333P9438J12611Q3744J02392J58896J74782
$$ -422725493 -422772354 -422859563 -422949284 -422964617 -422885179 -422772568 -422688824 -422586432 -422427536 -422252754
3386d22252754J10502p2967l20501m75222m50051k61556l0832J44744K51099K65147
$$ -422252754 -422142252 -422215219 -422535720 -423010942 -423460993 -423722549 -423753381 -423608637 -423357538 -423092391
3376d23092391J90143N8836j06942k84265l80690l15250j59612j7900R1508J72349
$$ -423092391 -422902248 -422843412 -422950354 -423234619 -423615309 -423930559 -424090171 -424108071 -424016563 -423844214
3366d23844214K14154K53031L07541L14797K35870J29437L1412q0410j46552j12823
$$ -423844214 -423630060 -423377029 -423069488 -422754691 -422518821 -422389384 -422357972 -422438382 -422584934 -422697757
3356d22697757j5971Q5845J16612O0374M9673J45262K42239K30542J19616j2797
$$ -422697757 -422713728 -422627883 -422511271 -422450897 -422401224 -422255962 -422013723 -421783181 -421663565 -421676362
3346d21676362j24323j83709j11206J03247K59073J93254l370j70787k38405j60805
$$ -421676362 -421800685 -421984394 -422095600 -421992353 -421733280 -421540026 -421543396 -421714183 -421952588 -422113393
3336d22113393L0871J88560J67139j6547j78885k13307j60249p1866l4092n3691
$$ -422113393 -422082522 -421893962 -421726823 -421743370 -421922255 -422135562 -422295811 -422367677 -422401769 -422455460
3326d22455460k1110J02917K64724M03984M45989L50245J41463r7404k62853l64031
$$ -422455460 -422476570 -422373653 -422108929 -421704945 -421258956 -420908711 -420767248 -420864652 -421127505 -421491536
3316d21491536m04813l36451j79739m0741J9881N2490R6190P5555n2087j72517
$$ -421491536 -421896349 -422232800 -422412539 -422453280 -422433399 -422380909 -422284719 -422209164 -422261251 -422433768
3306d22433768j07778J29698L14217L35330K80740J99149Q6956K949q191M8463
$$ -422433768 -422541546 -422411848 -422097631 -421762301 -421481561 -421282412 -421195456 -421192507 -421200698 -421152235
3296d21152235J35874J66472J06782N4171O0212M6078j3630l9307n431K8267R475
$$ -421152235 -421016361 -420849889 -420743107 -420688936 -420628724 -420582646 -420596276 -420635583 -420641014 -420612747 -420603272
3285d20603272l5986n3308l6657k15J9528j2017p6839j11753q6815m9803n3800
$$ -420603272 -420639258 -420692566 -420729223 -420729438 -420709910 -420721927 -420798766 -420910519 -420997334 -421047137 -421100937
3274d21100937r1465r2086j3209O6008J09787J53374J77663J22748M220j27818
$$ -421100937 -421192402 -421284488 -421297697 -421231689 -421121902 -420968528 -420790865 -420668117 -420663897 -420791715
3264d20791715k65361l39815k51624l5402J54903K20423J93604J93077K14239
$$ -420791715 -421057076 -421396891 -421648515 -421683917 -421529014 -421308591 -421114987 -420921910 -420707671
3255d20707671J91767J19838P076r9544r0274K5103J11345J56771K27593K72247
$$ -420707671 -420515904 -420396066 -420388990 -420488534 -420578808 -420553705 -420442360 -420285589 -420057996 -419785749
3245d19785749J99179L0181j25144j91484j98477j73437j20048o5206l9363k3174
$$ -419785749 -419586570 -419556389 -419681533 -419873017 -420071494 -420244931 -420364979 -420430185 -420469548 -420492722
3235d20492722K5169N6945L0853k9045r9516j41053j23708l4035Q7251J45802
$$ -420492722 -420467553 -420410608 -420379755 -420408800 -420508316 -420649369 -420773077 -420807112 -420719861 -420574059
3225d20574059J55400J32561P8822N5497M5786q981l5511r681j7630q5057j84051
$$ -420574059 -420418659 -420286098 -420207276 -420151779 -420105993 -420114974 -420150485 -420160166 -420177796 -420262853 -420446904
3214d20446904k42379k06330j00783M661Q7593J65551K08591K17867K46185K51454
$$ -420446904 -420689283 -420895613 -420996396 -420991735 -420904142 -420738591 -420530000 -420312133 -420065948 -419814494
3204d19814494J45204k685o7016o6726l6273K7233J04447J64186J67861J34271
$$ -419814494 -419669290 -419671975 -419738991 -419805717 -419841990 -419814757 -419710310 -419546124 -419378263 -419243992
3194d19243992R2192J8233l0137J1356J34133K74834L15992K26930Q3751n5039
$$ -419243992 -419151800 -419133567 -419163704 -419152348 -419018215 -418743381 -418427389 -418200459 -418116708 -418171747
3184d18171747j61241j84816j16106k9117P53n0719j59004k58538k93569k47082
$$ -418171747 -418332988 -418517804 -418633910 -418663027 -418662274 -418712993 -418871997 -419130535 -419424104 -419671186
3174d19671186j49179k4262J07006K08467K52648K20324J07635n2013j97595k59823
$$ -419671186 -419820365 -419844627 -419737621 -419529154 -419276506 -419056182 -418948547 -419000560 -419198155 -419457978
3164d19457978k27745j82445j91787k25062j71599j2024J32935J49569Q0430M1717
$$ -419457978 -419685723 -419868168 -420059955 -420285017 -420456616 -420468640 -420335705 -420186136 -420105706 -420063989
3154d20063989N2696N4094J0657m4868l4546N9865J36504J23346J10654J85255
$$ -420063989 -420011293 -419957199 -419946542 -419991410 -420025956 -419966091 -419829587 -419706241 -419595587 -419410332
3144d19410332K61983K07967M2388j30075k11490j55710m0994J639m1400n2927
$$ -419410332 -419148349 -418940382 -418897994 -419028069 -419239559 -419395269 -419436263 -419434624 -419476024 -419528951
3134d19528951M4912J75180K02531R3867l8366j13694j75777k45768k87635k99793
$$ -419528951 -419484039 -419308859 -419106328 -419012461 -419050827 -419164521 -419340298 -419586066 -419873701 -420173494
3124d20173494l33459l39140k36492q0738k4785j04034j72902j55025r3415l1325
$$ -420173494 -420506953 -420846093 -421082585 -421163323 -421188108 -421292142 -421465044 -421620069 -421713484 -421744809
3114d21744809K5907Q8288J92638L26962M09436L78325K61755J58671Q4034M2474
$$ -421744809 -421718902 -421630614 -421437976 -421111014 -420701578 -420323253 -420061498 -419902827 -419818793 -419776319
3104d19776319K9028k1143j47940l35458n12950o05786n60689l82821j81370l3785
$$ -419776319 -419747291 -419768434 -419916374 -420251832 -420764782 -421370568 -421931257 -422314078 -422495448 -422529233
3094d22529233J02288K26718K38243P7283r5641q6754K6939P4795O6585R2483
$$ -422529233 -422426945 -422200227 -421961984 -421884701 -421980342 -422067096 -422040157 -421965362 -421898777 -421806294
3084d21806294J07715N6484R577N5595J50608K05611J91858R2635m9230j56474
$$ -421806294 -421698579 -421642095 -421632518 -421576923 -421426315 -421220704 -421028846 -420936211 -420985441 -421141915
3074d21141915k08785k10660j50190n6868J3651K9476K4605Q2565J82297K10767
$$ -421141915 -421350700 -421561360 -421711550 -421768418 -421754767 -421725291 -421700686 -421618121 -421435824 -421225057
3064d21225057J77486J87505K47882K85631L15445L11516J84357j6680j61909
$$ -421225057 -421047571 -420860066 -420612184 -420326553 -420011108 -419699592 -419515235 -419531915 -419693824
3055d19693824k08772k30004k46924k51239k66744k56554k18079j85627j21985
$$ -419693824 -419902596 -420132600 -420379524 -420630763 -420897507 -421154061 -421372140 -421557767 -421679752
3046d21679752J012J34443K48650L38696L61790L09795K22426J42513J19515J68642
$$ -421679752 -421678740 -421544297 -421295647 -420956951 -420595161 -420285366 -420062940 -419920427 -419800912 -419632270
3036d19632270J94729J65196J50570J36630L5112j40067k98832m21116m70678
$$ -419632270 -419437541 -419272345 -419121775 -418985145 -418950033 -419090100 -419388932 -419810048 -420280726
3027d20280726l96201k72545j63992k7806J44530L08921M32752M81669L85559
$$ -420280726 -420676927 -420949472 -421113464 -421141270 -420996740 -420687819 -420255067 -419773398 -419387839
3018d19387839J15150j81638l06081k52299j40987n2025J8149L0248m1873p8608
$$ -419387839 -419272689 -419454327 -419760408 -420012707 -420153694 -420205719 -420187570 -420157322 -420199195 -420277803
3008d20277803P978J09285J75838K67181K93025J71166M4277L2942K7719p6880
$$ -420277803 -420269825 -420160540 -419984702 -419717521 -419424496 -419253330 -419209053 -419176111 -419148392 -419225272
2998d19225272j92017j85228q2247J0948O9104R3785R6347J10974J39689J53493
$$ -419225272 -419417289 -419602517 -419684764 -419673816 -419604712 -419510927 -419414580 -419303606 -419163917 -419010424
2988d19010424J47624J13300P016j79041l20665l33646k48590j05993j0199o9904
$$ -419010424 -418862800 -418749500 -418742484 -418921525 -419242190 -419575836 -419824426 -419930419 -419940618 -420010522
2978d20010522k00277k24591r7034Q3367J46751P6004k0573j14166k27344l09104
$$ -420010522 -420210799 -420435390 -420532424 -420449057 -420302306 -420226302 -420246875 -420361041 -420588385 -420897489
2968d20897489k81749j64707p9713r6060j12956L64K04902L58844L37866J94411
$$ -420897489 -421179238 -421343945 -421423658 -421519718 -421632674 -421632310 -421427408 -421068564 -420730698 -420536287
2958d20536287P9300J9684j5672j7145m9898j60833k26498j74839j03676n7058
$$ -420536287 -420456987 -420437303 -420452975 -420470120 -420520018 -420680851 -420907349 -421082188 -421185864 -421242922
2948d21242922q551M053k8798n4081m2875q279K6750L0331L9295Q6934J11663
$$ -421242922 -421251473 -421247420 -421276218 -421330299 -421373174 -421381453 -421354703 -421324372 -421285077 -421198143 -421086480
2937d21086480J09831J29452J35353Q4736K7427K7447R5124J51652J09077k9083
$$ -421086480 -420976649 -420847197 -420711844 -420627108 -420599681 -420572234 -420477110 -420325458 -420216381 -420245464
2927d20245464j68668k48274l04638l50921l43078k41821r6673K0581R4184J67646
$$ -420245464 -420414132 -420662406 -420967044 -421317965 -421661043 -421902864 -421999537 -421978956 -421884772 -421717126
2917d21717126K36383K10854J67098K15741K63153K23117J06554o1874k32536
$$ -421717126 -421480743 -421269889 -421102791 -420887050 -420623897 -420400780 -420294226 -420356100 -420588636
2908d20588636l25964k99788j46863N7530J86330J98407J33831P9211Q5216J05848
$$ -420588636 -420914600 -421214388 -421361251 -421303721 -421117391 -420918984 -420785153 -420705942 -420620726 -420514878
2898d20514878J01468P9074L9301J0119N383k7669m7376l1666n4076r5043q7820
$$ -420514878 -420413410 -420334336 -420295035 -420284916 -420279533 -420307202 -420354578 -420386244 -420440320 -420535363 -420623183
2887d20623183n531J16312K21576K50033J85159Q2538L6751O7183R3809P4799
$$ -420623183 -420628714 -420512402 -420290826 -420040793 -419855634 -419773096 -419736345 -419669162 -419575353 -419500554
2877d19500554N742o4902p5443j3234O0239O8798J1906p4019j39271j41604p3915
$$ -419500554 -419494812 -419559714 -419635157 -419648391 -419588152 -419519354 -419507448 -419581467 -419720738 -419862342 -419936257
2866d19936257J7284N8954J9251p8675j83781k55270k79043k28083j38531o0778
$$ -419936257 -419918973 -419860019 -419840768 -419919443 -420103224 -420358494 -420637537 -420865620 -421004151 -421064929
2856d21064929l671R442j9720m8587o8279o9684k0308J1929m0346j30871k01055
$$ -421064929 -421068600 -421059158 -421078878 -421127465 -421195744 -421265428 -421285736 -421273807 -421314153 -421445024 -421646079
2845d21646079k45639k64028k23723j10783K4085J03859J02163J01919J94903
$$ -421646079 -421891718 -422155746 -422379469 -422490252 -422466167 -422362308 -422260145 -422158226 -421963323
2836d21963323L16030L42962K73564J73244M8810n9362n1444M0639R5826P0417
$$ -421963323 -421647293 -421304331 -421030767 -420857523 -420808713 -420868075 -420919519 -420878880 -420783054 -420712637
2826d20712637m0132k16009l79921m57659m35164k95903o3130J45783K74578L35287
$$ -420712637 -420752769 -420968778 -421348699 -421806358 -422241522 -422537425 -422600555 -422454772 -422180194 -421844907
2816d21844907L13500K04620L2182j39809j89262p5048R5791J79293J08012m3386
$$ -421844907 -421531407 -421326787 -421294605 -421434414 -421623676 -421698724 -421602933 -421423640 -421315628 -421359014
2806d21359014j48640k04747k28456j50927j0385N9935L5406L1601J25821K37176
$$ -421359014 -421507654 -421712401 -421940857 -422091784 -422102169 -422042234 -422006828 -421975227 -421849406 -421612230
2796d21612230K24797N8453j30342k08848j59898n1875L4016L9564o2609j73801
$$ -421612230 -421387433 -421328980 -421459322 -421668170 -421828068 -421879943 -421845927 -421806363 -421868972 -422042773
2786d22042773j84216j19574l8622O5016J89156K86724K86537J98228J03626N8808
$$ -422042773 -422226989 -422346563 -422385185 -422320169 -422131013 -421844289 -421557752 -421359524 -421255898 -421197090
2776d21197090O4548Q4666J07729J44363J52038L2646k17925m36071m67892l62535
$$ -421197090 -421132542 -421047876 -420940147 -420795784 -420643746 -420611100 -420829025 -421265096 -421732988 -422095523
2766d22095523k22631j14291j02883j96158k73523j89988M4524K57264L09704
$$ -422095523 -422318154 -422432445 -422535328 -422731486 -423005009 -423194997 -423150473 -422893209 -422583505
2757d22583505K11180O4304k7083J9326J72423L10294L79238L85694L10018J60436
$$ -422583505 -422372325 -422308021 -422335104 -422315778 -422143355 -421833061 -421453823 -421068129 -420758111 -420597675
2747d20597675j4214j63330k42428k51160k05697j36381r1385j27475k40332l49874
$$ -420597675 -420611889 -420775219 -421017647 -421268807 -421474504 -421610885 -421702270 -421829745 -422070077 -422419951
2737d22419951l70716l05793k17278j20399L6630K48695L85433L81001L05366
$$ -422419951 -422790667 -423096460 -423313738 -423434137 -423397507 -423148812 -422763379 -422382378 -422077012
2728d22077012J95355N2172m6265k2127J02093K00399J87288J28422J13168J03577
$$ -422077012 -421881657 -421829485 -421875750 -421897877 -421795784 -421595385 -421408097 -421279675 -421166507 -421062930
2718d21062930J8973j34621k63084k93966k25285r8917O3406K01797K37364J75362
$$ -421062930 -421043957 -421178578 -421441662 -421735628 -421960913 -422059830 -421996424 -421794627 -421557263 -421381901
2708d21381901P1212N391K6552N7949J8857l5686m9369k6087L7900J31829J80410
$$ -421381901 -421310689 -421305298 -421278746 -421220797 -421201940 -421237626 -421286995 -421313082 -421275182 -421143353 -420962943
2697d20962943J01857p4836k10794j85583r5498j14762k11429k69811k60618j76979
$$ -420962943 -420861086 -420935922 -421146716 -421332299 -421427797 -421542559 -421753988 -422023799 -422284417 -422461396
2687d22461396j7531J27338J68864J24872M3595l5702m2263j1116n6371j65798
$$ -422461396 -422478927 -422351589 -422182725 -422057853 -422014258 -422049960 -422092223 -422103339 -422159710 -422325508
2677d22325508k31222j92919q6481L0965J13253J34656J44603J95141K38044K51506
$$ -422325508 -422556730 -422749649 -422836130 -422805165 -422691912 -422557256 -422412653 -422217512 -421979468 -421727962
2667d21727962K74879K72897K00917J07860O626j36659k93001l70659l04590j00618
$$ -421727962 -421453083 -421180186 -420979269 -420871409 -420864783 -421001442 -421294443 -421665102 -421969692 -422070310
2657d22070310J29062K02988J13911N3208R8757J71758K33842K95654L70684M73503
$$ -422070310 -421941248 -421738260 -421624349 -421571141 -421472384 -421300626 -421066784 -420771130 -420400446 -419926943
2647d19926943M97044L07705J0591j71935j89052j25893o2793m9662o8216r6456
$$ -419926943 -419429899 -419122194 -419111603 -419283538 -419472590 -419598483 -419661276 -419710938 -419779154 -419875610
2637d19875610j61437k62415l10582k97648l12298l11433k05036l5997Q5776J09487
$$ -419875610 -420037047 -420299462 -420610044 -420907692 -421219990 -421531423 -421736459 -421772456 -421686680 -421577193
2627d21577193Q2960N3749N4388J23069K29364L23695L40198K45631Q5973o9183
$$ -421577193 -421494233 -421440484 -421386096 -421263027 -421033663 -420709968 -420369770 -420124139 -420038166 -420107349
2617d20107349j64664j81546j44385j01438p9499n3096n62P6283J53008J44031
$$ -420107349 -420272013 -420453559 -420597944 -420699382 -420778881 -420831977 -420832539 -420756256 -420603248 -420459217
2607d20459217M1084q1618j31541o4367Q4455J83505J19746j7462q8509p4854
$$ -420459217 -420418133 -420499751 -420631292 -420695659 -420611204 -420427699 -420307953 -420325415 -420413924 -420488778
2597d20488778k9029l9851j61999l52867n22768n80686m80935k70698k5141K06227
$$ -420488778 -420517807 -420557658 -420719657 -421072524 -421595292 -422175978 -422656913 -422927611 -422952752 -422746525
2587d22746525L22516K28393K8035j12592j38313k9889J12858J22474k4071k01874
$$ -422746525 -422424009 -422195616 -422167581 -422280173 -422418486 -422448375 -422335517 -422213043 -422237114 -422438988
2577d22438988k59569j43411L2091J17755J31512J73664J88378J37982R3836P0037
$$ -422438988 -422698557 -422841968 -422809877 -422692122 -422560610 -422386946 -422198568 -422060586 -421966750 -421896713
2567d21896713J04475K07622K62297J92715N6476p0047j61076k29453k90898l28663
$$ -421896713 -421792238 -421584616 -421322319 -421129604 -421073128 -421143175 -421304251 -421533704 -421824602 -422153265
2557d22153265l22358k64129j40070k361O9590Q1590P3026M9496M7878Q3078Q7492
$$ -422153265 -422475623 -422739752 -422879822 -422882183 -422812593 -422731003 -422657977 -422608481 -422560603 -422477525 -422390033
2546d22390033J4225p4570j11337q3309k0450K5888J8374k8862o7054q0947q5179
$$ -422390033 -422375808 -422450378 -422561715 -422645024 -422665474 -422639586 -422621212 -422650074 -422717128 -422798075 -422883254
2535d22883254r4006o8012O0052K23048K58485J71743J15308J35278J77251J67340
$$ -422883254 -422977260 -423045272 -422985220 -422762172 -422503687 -422331944 -422216636 -422081358 -421904107 -421736767
2525d21736767J38069J67102J76498M2316k15371m38861n24424m26499j90633
$$ -421736767 -421598698 -421431596 -421255098 -421212782 -421428153 -421867014 -422391438 -422817937 -423008570
2516d23008570k0940l6046j17615j42383j13870m0412O0687J29292J55130J33347
$$ -423008570 -423029510 -423065556 -423183171 -423325554 -423439424 -423479836 -423419149 -423289857 -423134727 -423001380
2506d23001380N2874k4225p6129j39134j70132j49090j06163o8483q1271j27854
$$ -423001380 -422948506 -422972731 -423048860 -423187994 -423358126 -423507216 -423613379 -423681862 -423763133 -423890987
2496d23890987j42501n0603J19396K44039K46736K07802J94710J20801n8004k51692
$$ -423890987 -424033488 -424084091 -423964695 -423720656 -423473920 -423266118 -423071408 -422950607 -423008611 -423260303
2486d23260303l15281k02857l591K01504L75917M46138L22174L1289k51105l52069
$$ -423260303 -423575584 -423778441 -423782032 -423580528 -423204611 -422758473 -422436299 -422405010 -422656115 -423008184
2476d23008184k34114m6430R6239K07616L03334L71487L37915J92643N5364K3271
$$ -423008184 -423242298 -423288728 -423192489 -422984873 -422681539 -422310052 -421972137 -421779494 -421724130 -421700859
2466d21700859P6726J27506J39597Q2918r9744l34744m63908l94887j71293P2575
$$ -421700859 -421624133 -421496627 -421357030 -421274112 -421373856 -421708600 -422172508 -422567395 -422738688 -422666113
2456d22666113K08059J82222Q7020N5367O4682L2406k2392l7801j511M4836M5848
$$ -422666113 -422458054 -422275832 -422188812 -422133445 -422068763 -422036357 -422058749 -422096550 -422098061 -422053225 -422007377
2445d22007377K7769L5985O1451R3063J00187R1985J18916J85478K13527J11202
$$ -422007377 -421979608 -421943623 -421882172 -421789109 -421688922 -421596937 -421478021 -421292543 -421079016 -420967814
2435d20967814j05644l10964m03577l53923j62384Q4915K46851K88820K64314
$$ -420967814 -421073458 -421384422 -421787999 -422141922 -422304306 -422219391 -421972540 -421683720 -421419406
2426d21419406J76944N4303l9196r4954r7733l4541J3047j9403r6615j84664k62896
$$ -421419406 -421242462 -421188159 -421227355 -421322309 -421420042 -421454583 -421441536 -421460939 -421557554 -421742218 -422005114
2415d22005114l16255l21464k44961j33766l4494P4183J41897J33708J16904J30211
$$ -422005114 -422321369 -422642833 -422887794 -423021560 -423056054 -422981871 -422839974 -422706266 -422589362 -422459151
2405d22459151J46618J47624J05496K595j17549k03512k40903k43958k37895j96186
$$ -422459151 -422312533 -422164909 -422059413 -422056818 -422174367 -422377879 -422618782 -422862740 -423100635 -423296821
2395d23296821l7982K31307M37449M39205K83569J14050J1706r31M8629N6126
$$ -423296821 -423334803 -423103496 -422666047 -422226842 -421943273 -421829223 -421817517 -421818448 -421769819 -421713693
2385d21713693l5147j34901j20927n1897m5179l5546N7821J25310P4270K989j7748
$$ -421713693 -421748840 -421883741 -422004668 -422056565 -422101744 -422137290 -422079469 -421954159 -421879889 -421876900 -421894648
2374d21894648m2939p9457o9685l3501l9880p3285n9793j8636n8127j73260k89658
$$ -421894648 -421937587 -422017044 -422086729 -422120230 -422160110 -422233395 -422293188 -422311824 -422369951 -422543211 -422832869
2363d22832869l96744m55175l89678k13898k0737J21941J68701Q9047m2642q6172
$$ -422832869 -423229613 -423684788 -424074466 -424288364 -424309101 -424187160 -424018459 -423929412 -423972054 -424058226
2353d24058226j9084M4093L8339J7887K7846N5244O7891N8942j0745j27870j79386
$$ -424058226 -424077310 -424033217 -423994878 -423976991 -423949145 -423893901 -423826010 -423767068 -423777813 -423905683 -424085069
2342d24085069j29071k5210J03113K11062K85534L17617K43945K1966k29753l24066
$$ -424085069 -424214140 -424239350 -424136237 -423925175 -423639641 -423322024 -423078079 -423056113 -423285866 -423609932
2332d23609932k20338l8349J21157K60300L63367L81224L08436J89881Q7691N3391
$$ -423609932 -423830270 -423868619 -423747462 -423487162 -423123795 -422742571 -422434135 -422244254 -422156563 -422103172
2322d22103172M2522k1732j16317j78999k06860j85590j24647q2945p7216m6619
$$ -422103172 -422060650 -422082382 -422198699 -422377698 -422584558 -422770148 -422894795 -422977740 -423054956 -423101575
2312d23101575J5939L3927k8958j19040j97067k97204m10970m55471l04848Q187
$$ -423101575 -423085636 -423051709 -423080667 -423199707 -423396774 -423693978 -424104948 -424560419 -424865267 -424857080
2302d24857080K67987L96473M35076L92945K99776J94664O8127r0771k41725k73732
$$ -424857080 -424589093 -424192620 -423757544 -423364599 -423064823 -422870159 -422802032 -422892803 -423134528 -423408260
2292d23408260j24775Q5331J62063Q5842j541j8264k6450q5443j47367j88646
$$ -423408260 -423533035 -423447704 -423285641 -423199799 -423201340 -423219604 -423246054 -423331497 -423478864 -423667510
2282d23667510k10113j71062j04058q4561p7086j4867Q3060J70305K15558K16865
$$ -423667510 -423877623 -424048685 -424152743 -424237304 -424314390 -424329257 -424246197 -424075892 -423860334 -423643469
2272d23643469J74277P5259j2168j1234M7285N3104k8455r4627p1799K1258J23668
$$ -423643469 -423469192 -423393933 -423406101 -423417335 -423370050 -423316946 -423345401 -423440028 -423511827 -423490569 -423366901
2261d23366901J46660P7146N305l5309j1905J15809K65557L11035K26240N7834
$$ -423366901 -423220241 -423143095 -423137790 -423173099 -423185004 -423069195 -422803638 -422492603 -422266363 -422208529
2251d22208529j33980k64251k66811j60956q2373j20737j62327q5589N6915J67486
$$ -422208529 -422342509 -422606760 -422873571 -423034527 -423116900 -423237637 -423399964 -423485553 -423428638 -423261152
2241d23261152J78527R5861K3587M3982J19839J15389k5070j95954l13392l71720
$$ -423261152 -423082625 -422986764 -422963177 -422919195 -422799356 -422683967 -422709037 -422904991 -423218383 -423590103
2231d23590103l72129k61135m8589J33060K37578K89635K81433J98363O7462n0904
$$ -423590103 -423962232 -424223367 -424271956 -424138896 -423901318 -423611683 -423330250 -423131887 -423064425 -423115329
2221d23115329j18889j39812j45433j85162k89932l82468k95480m6348J94398
$$ -423115329 -423234218 -423374030 -423519463 -423704625 -423994557 -424377025 -424672505 -424718853 -424524455
2212d24524455L52363M13260L70293K29506L9547q9607r3258O673J28699J70636
$$ -424524455 -424172092 -423758832 -423388539 -423159033 -423119486 -423209093 -423302351 -423295678 -423166979 -422996343
2202d22996343R6301m052n489P1414J32731J52580J73752K11394J88358Q8163
$$ -422996343 -422900042 -422904094 -422909583 -422838169 -422705438 -422552858 -422379106 -422167712 -421979354 -421891191
2192d21891191M0127Q0229R2576L1243o1374k12093m23988n62742n30918m13713
$$ -421891191 -421851064 -421770835 -421678259 -421647016 -421708390 -421920483 -422344471 -422907213 -423438131 -423851844
2182d23851844l22031k77807k39426j51363k2106N2314L6913l427k5116r025N4408
$$ -423851844 -424173875 -424451682 -424691108 -424842471 -424864577 -424812263 -424775350 -424778777 -424803893 -424812918 -424758510
2171d24758510J26283J56204J17455k491j27024j28646l3110j6109r8370j48343
$$ -424758510 -424632227 -424476023 -424358568 -424361059 -424488083 -424616729 -424649839 -424665948 -424764318 -424912661
2161d24912661j26908p1601k8987J058R1939K15979K39257J54067N6405M1768
$$ -424912661 -425039569 -425111170 -425140157 -425139099 -425047160 -424831181 -424591924 -424437857 -424381452 -424339684
2151d24339684J45303K89520L63327L34013K01932k2750k49729l42237k75147
$$ -424339684 -424194381 -423904861 -423541534 -423207521 -423005589 -423028339 -423278068 -423620305 -423895452
2142d23895452j93823k14705k51470j97225j01684l7730j6522k471R121J0717
$$ -423895452 -424089275 -424303980 -424555450 -424752675 -424854359 -424892089 -424908611 -424911082 -424901961 -424891244
2132d24891244o703n9991j41989k19974k62925k92962l37658l47265k96344k30755
$$ -424891244 -424897947 -424957938 -425099927 -425319901 -425582826 -425875788 -426213446 -426560711 -426857055 -427087810
2122d27087810j71994j00901j6132O4543R3494M7374j1782k9016N5427K45813
$$ -427087810 -427259804 -427360705 -427376837 -427312294 -427218800 -427171426 -427183208 -427212224 -427156797 -426910984
2112d26910984M17798M52415L30192J43002K4871o307n3792j26595j39219o9367
$$ -426910984 -426493186 -426040771 -425710579 -425567577 -425542706 -425549013 -425602805 -425729400 -425868619 -425937986
2102d25937986j5995k9899o5823r7550r7746o0695j9370M2259J28721J85293J92942
$$ -425937986 -425953981 -425983880 -426049703 -426147253 -426244999 -426305694 -426325064 -426282805 -426154084 -425968791 -425775849
2091d25775849J70731J35679O9435n0365j69255k04321j23767M5927K17653K94857
$$ -425775849 -425605118 -425469439 -425400004 -425450369 -425619624 -425823945 -425947712 -425901785 -425684132 -425389275
2081d25389275K56473J48323L4321m6486j05053j50076j69121j43476n3066O9688
$$ -425389275 -425132802 -424984479 -424950158 -424996644 -425101697 -425251773 -425420894 -425564370 -425617436 -425547748
2071d25547748J73930K41263K33941R5573j28194l01419l74448l78121k80727
$$ -425547748 -425373818 -425132555 -424898614 -424803041 -424931235 -425232654 -425607102 -425985223 -426265950
2062d26265950r2179Q9778K08104K34470J43712K0654k3886m0730p9541p0180
$$ -426265950 -426358129 -426268351 -426060247 -425825777 -425682065 -425661411 -425685297 -425726027 -425805568 -425875748
2052d25875748J2135J07494J78236K42680K94926L01530K64751K02527J17310
$$ -425875748 -425863613 -425756119 -425577883 -425335203 -425040277 -424738747 -424473996 -424271469 -424154159
2043d24154159L3765K1218J14535K03138J63570M2443q1449j81199k37952k35841
$$ -424154159 -424120394 -424099176 -423984641 -423781503 -423617933 -423575490 -423656939 -423838138 -424076090 -424311931
2033d24311931j89721j34128o6043L1580J27918J40627O7831L8905R8248J62727
$$ -424311931 -424501652 -424635780 -424701823 -424670243 -424542325 -424401698 -424333867 -424294962 -424196714 -424033987
2023d24033987J52716M6565m5415k732R6451J00560k7646k06735k85261k25543
$$ -424033987 -423881271 -423834706 -423880121 -423882853 -423786402 -423685842 -423713488 -423920223 -424205484 -424431027
2013d24431027j38479j15403j52698j40018n0848J4486j1216j41900l27311m54009
$$ -424431027 -424569506 -424684909 -424837607 -424977625 -425028473 -425013987 -425025203 -425167103 -425494414 -425948423
2003d25948423m79477m20040k55644j9658J73620K56034K44062J64060J03863
$$ -425948423 -426427900 -426847940 -427103584 -427123242 -426949622 -426693588 -426449526 -426285466 -426181603
1994d26181603J67098K70631K92666K73475K85212L11069K67529J24278l3848
$$ -426181603 -426014505 -425743874 -425451208 -425177733 -424892521 -424581452 -424313923 -424189645 -424223493
1985d24223493j54498k51146l49714m15335l77560k64341j77876j51606j54228
$$ -424223493 -424377991 -424629137 -424978851 -425394186 -425771746 -426036087 -426213963 -426365569 -426519797
1976d26519797j46875j20631r0245k8890R5384K23043K05305L5868j26404j75571
$$ -426519797 -426666672 -426787303 -426877548 -426906438 -426811054 -426588011 -426382706 -426346838 -426473242 -426648813
1966d26648813j16865j5122N2798R9823J75142K04283J37940J22321K09446K17651
$$ -426648813 -426765678 -426780800 -426728002 -426628179 -426453037 -426248754 -426110814 -425988493 -425779047 -425561396
1956d25561396O9403r9486j69033j47210j07009r4684r9524q7672q0746m2488
$$ -425561396 -425491993 -425591479 -425760512 -425907722 -426014731 -426109415 -426208939 -426296611 -426377357 -426419845
1946d26419845Q2207J93282J46552n4233k30906j96407K5320K14699K49657J82502
$$ -426419845 -426337638 -426144356 -425997804 -426052037 -426282943 -426479350 -426454030 -426239331 -425989674 -425807172
1936d25807172J04314O5170Q0436Q3161K1736m5593p9456p5515Q223J75634L14598
$$ -425807172 -425702858 -425637688 -425557252 -425474091 -425452355 -425497948 -425577404 -425652919 -425644696 -425469062 -425154464
1925d25154464L11684K17731J25251L4688p6735k03614l31037m16152m03730l17364
$$ -425154464 -424842780 -424625049 -424499798 -424465110 -424541845 -424745459 -425076496 -425492648 -425896378 -426213742
1915d26213742k32449j99731k66907l71247l37523j18269J09327J47235K2843
$$ -426213742 -426446191 -426645922 -426912829 -427284076 -427621599 -427739868 -427630541 -427483306 -427460463
1906d27460463o0992L5125J95578K27198J60032J27251J35600J31079L3013j67685
$$ -427460463 -427521455 -427486330 -427290752 -427063554 -426903522 -426776271 -426640671 -426509592 -426476579 -426644264
1896d26644264k81698j86015j9415M3823L610j3148L6751M6322j3264n2776k9559
$$ -426644264 -426925962 -427111977 -427131392 -427087569 -427083959 -427097107 -427060356 -427014034 -427027298 -427080074 -427109633
1885d27109633O2304J66937J85293J30226M0686o0236q4753J8758J54886K04829
$$ -427109633 -427047329 -426880392 -426695099 -426564873 -426524187 -426584423 -426669176 -426650418 -426495532 -426290703
1875d26290703J65297O2601q9841k80125m16351l53383q9125K41782N04516N67045
$$ -426290703 -426125406 -426062805 -426152646 -426432771 -426849122 -427202505 -427291630 -427049848 -426545332 -425978287
1865d25978287L87699Q3182j89600l17215l12400k50925j64836m1106J25716K63480
$$ -425978287 -425590588 -425507406 -425697006 -426014221 -426326621 -426577546 -426742382 -426783488 -426657772 -426394292
1855d26394292K73818J57214J292r5190o3723N2821J45994J83131J65885M5474
$$ -426394292 -426120474 -425963260 -425961968 -426057158 -426120881 -426068060 -425922066 -425738935 -425573050 -425527576
1845d25527576j48358k64879k86831k72535k07541j07148j4114M1953O3590N4589
$$ -425527576 -425675934 -425940813 -426227644 -426500179 -426707720 -426814868 -426828982 -426787029 -426723439 -426668850
1835d26668850J4191j4863o249k1278p1152l6645J00851K26543K54337J91615
$$ -426668850 -426654659 -426669522 -426675771 -426697049 -426768201 -426804846 -426703995 -426477452 -426223115 -426031500
1825d26031500Q9483n417n4409l8577L4324J26164J33288O3106N7990R1294P7287
$$ -426031500 -425942017 -425947434 -426001843 -426040420 -426006096 -425879932 -425746644 -425683538 -425625548 -425534254 -425456967
1814d25456967O7962Q7534P3917j269q9376j39250j60177j93502k38420k72637
$$ -425456967 -425389005 -425301471 -425227554 -425228823 -425318199 -425457449 -425617626 -425811128 -426049548 -426322185
1804d26322185k49036j40263J4145J54558K12548J34532l8131j27557m3476P6509
$$ -426322185 -426571221 -426711484 -426697339 -426542781 -426330233 -426195701 -426233832 -426361389 -426404865 -426328356
1794d26328356Q7002j1784j48126k58818l15796k82319j41344K5425P9644o569
$$ -426328356 -426241354 -426253138 -426401264 -426660082 -426975878 -427258197 -427399541 -427374116 -427294472 -427301041
1784d27301041p1803m8J33352K45024K90595K62742K21172J60339L5739o3895
$$ -427301041 -427372844 -427372892 -427239540 -426994516 -426703921 -426441179 -426220007 -426059668 -426023929 -426087824
1774d26087824M629J84220K62318J28415j03064k73415l82468m49887m11970k38992
$$ -426087824 -426083195 -425898975 -425636657 -425508242 -425611306 -425884721 -426267189 -426717076 -427129046 -427368038
1764d27368038K5418K84983M49313N02866M34557K33456j3085j87598k60471k59643
$$ -427368038 -427342620 -427057637 -426608324 -426105458 -425670901 -425437445 -425450530 -425638128 -425898599 -426158242
1754d26158242k26690j83428j15741l5204J0058k397k4536K3626J28225J95444
$$ -426158242 -426384932 -426568360 -426684101 -426719305 -426709247 -426711644 -426736180 -426712554 -426584329 -426388885
1744d26388885J30056m108q6115j09025j06394q6185n3778o6418r5845o3323j0632
$$ -426388885 -426258829 -426262937 -426349052 -426458077 -426564471 -426650656 -426704434 -426770852 -426866697 -426930020 -426940652
1733d26940652j0841l5805j2928P9593J64659J09151q8284l12924m44984l75775
$$ -426940652 -426951493 -426987298 -427000226 -426920633 -426755974 -426646823 -426735107 -427048031 -427493015 -427868790
1723d27868790j17272J54810L03086L27316L18056K80432J24227j13274k82676
$$ -427868790 -427986062 -427831252 -427528166 -427200850 -426882794 -426602362 -426478135 -426591409 -426874085
1714d26874085l24533k64272j54577o5282l2172n4660n5015M4414J70324J91742
$$ -426874085 -427198618 -427462890 -427617467 -427682749 -427714921 -427769581 -427824596 -427780182 -427609858 -427418116
1704d27418116J25181N9560n049j08148k34053k98373k41309j20884l0141L4092
$$ -427418116 -427292935 -427233375 -427238424 -427346572 -427580625 -427878998 -428120307 -428241191 -428271332 -428237240
1694d28237240J31939K44067K61903J84300R4071J4859m6823l2259Q3094K07963
$$ -428237240 -428105301 -427861234 -427599331 -427415031 -427320960 -427306101 -427352924 -427385183 -427302089 -427094126
1684d27094126K23640R6572p8113j58246p7028R8144J85927J18089M2034O6916
$$ -427094126 -426870486 -426773914 -426852027 -427010273 -427087301 -426989157 -426803230 -426685141 -426643107 -426576191
1674d26576191J08724O5333o0601k20511l25026l28707k54509j24634q01K6343
$$ -426576191 -426467467 -426402134 -426462735 -426683246 -427008272 -427336979 -427591488 -427716122 -427716923 -427690580
1664d27690580m1133j17253j83995k47109k69805k22719j16205J1028J18579J80552
$$ -427690580 -427731713 -427848966 -428032961 -428280070 -428549875 -428772594 -428888799 -428877771 -428759192 -428578640
1654d28578640K04674K22233K77999L68678M15230L37637J32715j05356k53001
$$ -428578640 -428373966 -428151733 -427873734 -427505056 -427089826 -426752189 -426619474 -426724830 -426977831
1645d26977831k74149k38344j83489j25812m3133N1688O2937K0731P137J1554
$$ -426977831 -427251980 -427490324 -427673813 -427799625 -427842758 -427791070 -427728133 -427707402 -427700265 -427688711
1635d27688711j5391q4069j83402k43056j50026N8183K22844K33269J35116Q1077
$$ -427688711 -427704102 -427788171 -427971573 -428214629 -428364655 -428306472 -428083628 -427850359 -427715243 -427634166
1625d27634166J22329J47321O7002k6801k4426K8373O0954P4182J22165J68813
$$ -427634166 -427511837 -427364516 -427297514 -427324315 -427348741 -427320368 -427259414 -427185232 -427063067 -426894254
1615d26894254J29580M4979m0567j42677k32935k25123j27913l8715J7215J23058
$$ -426894254 -426764674 -426719695 -426760262 -426902939 -427135874 -427360997 -427488910 -427527625 -427510410 -427387352
1605d27387352K71765L59381L16100J89203J04117J02861J37922J84866K13104
$$ -427387352 -427115587 -426756206 -426440106 -426250903 -426146786 -426043925 -425906003 -425721137 -425508033
1596d25508033J55394J9277j12941k11009k95837l80465m17190l35173j52732
$$ -425508033 -425352639 -425333362 -425446303 -425657312 -425953149 -426333614 -426750804 -427085977 -427238709
1587d27238709j2575j6205p0967q0875p3802p5000q2667r1992m1978R0932K21708
$$ -427238709 -427251284 -427267489 -427338456 -427419331 -427493133 -427568133 -427650800 -427742792 -427784770 -427693838 -427472130
1576d27472130L07817L48642L06732J85645N8911p4670k56814l82766l40115k03357
$$ -427472130 -427164313 -426815671 -426508939 -426323294 -426264383 -426339053 -426595867 -426978633 -427318748 -427522105
1566d27522105j54113k52727l34967k22278j0832J09294J08322Q2745J34326K15925
$$ -427522105 -427676218 -427928945 -428263912 -428486190 -428497022 -428387728 -428279406 -428196661 -428062335 -427846410
1556d27846410K38552K13990J68078N8133j15585k47979k92382k68874k08103
$$ -427846410 -427607858 -427393868 -427225790 -427167657 -427283242 -427531221 -427823603 -428092477 -428300580
1547d28300580j92048k22139j84113k6539J62786K58799K15059J37655J74496
$$ -428300580 -428492628 -428714767 -428898880 -428925419 -428762633 -428503834 -428288775 -428151120 -427976624
1538d27976624K62018K64126J90424J18371P2532M7602J6895n2557j22159j55270
$$ -427976624 -427714606 -427450480 -427260056 -427141685 -427069153 -427021551 -427004656 -427057213 -427179372 -427334642
1528d27334642j37862o8595Q4n139o6817j30673j74590j75876j66145j46208j00618
$$ -427334642 -427472504 -427541099 -427541015 -427546154 -427612971 -427743644 -427918234 -428094110 -428260255 -428406463 -428507081
1517d28507081n3853K8901R9998N5668n4015q5353J6989J28205J05590L2058N7184
$$ -428507081 -428560934 -428532033 -428432035 -428376367 -428430382 -428515735 -428498746 -428370541 -428264951 -428232893 -428175709
1506d28175709J26832J40557J34921J38395J08455M6644L7704R4030J44319J70183
$$ -428175709 -428048877 -427908320 -427773399 -427635004 -427526549 -427479905 -427442201 -427348171 -427203852 -427033669
1496d27033669J58554J20597Q2372R523j04978j58386j26032j10945j19727m9593
$$ -427033669 -426875115 -426754518 -426672146 -426662623 -426767601 -426925987 -427052019 -427162964 -427282691 -427332284
1486d27332284J08822K25905J91963J7950j70477k71665l30695m05820l93753
$$ -427332284 -427223462 -426997557 -426805594 -426787644 -426958121 -427229786 -427560481 -427966301 -428360054
1477d28360054k22162O148J71522K41116K47269K28893K26556K42501K06178R1999
$$ -428360054 -428582216 -428576068 -428404546 -428163430 -427916161 -427687268 -427460712 -427218211 -427012033 -426920034
1467d26920034o3057k04358k84539k70822j32510P5896K30625K18574L5232j50261
$$ -426920034 -426983091 -427187449 -427471988 -427742810 -427875320 -427799424 -427568799 -427350225 -427314993 -427465254
1457d27465254j59310m9977P033O939J663n5478j63695k44411k59207k50487k75443
$$ -427465254 -427624564 -427674541 -427667508 -427660569 -427658906 -427714384 -427878079 -428122490 -428381697 -428632184 -428907627
1446d28907627k87891k22510j37722j06278j10217o6932O2127K09873K89648K56596
$$ -428907627 -429195518 -429418028 -429555750 -429662028 -429772245 -429839177 -429777050 -429567177 -429277529 -429020933
1436d29020933J54177M1494r7989k10578k07316j41935q5908J572J15071J75426
$$ -429020933 -428866756 -428825262 -428923251 -429133829 -429341145 -429483080 -429568988 -429567416 -429452345 -429276919
1426d29276919J56623J07967P4769K8941p9917j86003j95343j26544p6754j02204
$$ -429276919 -429120296 -429012329 -428937560 -428908619 -428988536 -429174539 -429369882 -429496426 -429573180 -429675384
1416d29675384j83282k35877j73357m5563O901k6871k0851P8851J92824K26730
$$ -429675384 -429858666 -430094543 -430267900 -430313463 -430306562 -430333433 -430354284 -430275433 -430082609 -429855879
1406d29855879K06878K08032J78619N2035j14947k45748k76928j53281M7453J23842
$$ -429855879 -429649001 -429440969 -429262350 -429210315 -429325262 -429571010 -429847938 -430001219 -429953766 -429829924
1396d29829924M1705n5025j13775j51384j23712K0218K18362L19697K22731l317
$$ -429829924 -429788219 -429843244 -429957019 -430108403 -430232115 -430211897 -429993535 -429673838 -429451107 -429454424
1386d29454424j74725k26721k35667k21745j37318k3562N8896J36832K22767K56333
$$ -429454424 -429629149 -429855870 -430091537 -430313282 -430450600 -430474162 -430415266 -430278434 -430055667 -429799334
1376d29799334K03231R8421k1296j29187j81427j96712j75490o5698P8545J72026
$$ -429799334 -429596103 -429497682 -429518978 -429648165 -429829592 -430026304 -430201794 -430267492 -430188947 -430016921
1366d30016921J66308K3198j59266j78660P195K00985K30544J53388J15436R8768
$$ -430016921 -429850613 -429827415 -429986681 -430165341 -430158146 -429957161 -429726617 -429573229 -429457793 -429359025
1356d29359025R937j18061j94990j82433j52186j94675k47891k09607o5925R5856
$$ -429359025 -429349088 -429467149 -429662139 -429844572 -429996758 -430191433 -430439324 -430648931 -430714856 -430619000
1346d30619000K36636L51766L80164L15333K08234J17437R0652N4142o5444k00813
$$ -430619000 -430382364 -430030598 -429650434 -429335101 -429126867 -429009430 -428918778 -428864636 -428930080 -429130893
1336d29130893k70334k23275p4152J20222L05297L75810K61394N2843j00539j13788
$$ -429130893 -429401227 -429624502 -429698654 -429578432 -429273135 -428897325 -428635931 -428583088 -428683627 -428797415
1326d28797415k1818O5370R4310M8502m3420j36500k68774m12403m40351l35147
$$ -428797415 -428819233 -428753863 -428659553 -428611051 -428654471 -428790971 -429059745 -429472148 -429912499 -430247646
1316d30247646k18485j75896j90743j74094m9606J29771K39729K35328J77544
$$ -430247646 -430466131 -430642027 -430832770 -431006864 -431056470 -430926699 -430686970 -430451642 -430274098
1307d30274098J17837P5145Q4507J42200J68550J15299K6639l6907p9786j12033
$$ -430274098 -430156261 -430081116 -429996609 -429854409 -429685859 -429570560 -429543921 -429580828 -429660614 -429772647
1297d29772647p4714M3440R9532K86j62492k36234j43894L9940J69277J78540
$$ -429772647 -429847361 -429803921 -429704389 -429704103 -429866595 -430102829 -430246723 -430206783 -430037506 -429858966
1287d29858966J13691P3854R7114J16741R3623O6019N8453K8255k7205o4020o6315
$$ -429858966 -429745275 -429671421 -429574307 -429457566 -429363943 -429297924 -429239471 -429211216 -429238421 -429302441 -429368756
1276d29368756p5127j33722j53954o6566L6222M4539l1126q0093m268J43117J92351
$$ -429368756 -429443883 -429577605 -429731559 -429798125 -429761903 -429717364 -429748490 -429828583 -429832851 -429689734 -429497383
1265d29497383R1683l1859o1464k5323M21m57k0976j6990K4805O0122O6774N1102
$$ -429497383 -429405700 -429437559 -429499023 -429524346 -429523925 -429524382 -429545358 -429562348 -429537543 -429477421 -429410647 -429359545
1253d29359545Q0176J76990K89470L02882J52542n2323k08374k81856k52765j72755
$$ -429359545 -429279369 -429102379 -428812909 -428510027 -428357485 -428409808 -428618182 -428900038 -429152803 -429325558
1243d29325558j11557m6687L6147R3784R1241O6290Q7461P0713n8698k28298l38813
$$ -429325558 -429437115 -429483802 -429447655 -429353871 -429262630 -429196340 -429108879 -429038166 -429096864 -429325162 -429663975
1232d29663975l59521k72217j07454K6666N8513J8360k2586n292K9491P879m2794
$$ -429663975 -430023496 -430295713 -430403167 -430376501 -430317988 -430299628 -430322214 -430327506 -430298015 -430290136 -430332930
1221d30332930o3841l1679j282n1591j64561k10728j36666m1295K8894R3807J40611
$$ -430332930 -430396771 -430428450 -430429732 -430481323 -430645884 -430856612 -430993278 -431034573 -431005679 -430911872 -430771261
1210d30771261J63685J95169K09144J50020N0777n4044k04598l33588l59775k85061
$$ -430771261 -430607576 -430412407 -430203263 -430053243 -430002466 -430056510 -430261108 -430594696 -430954471 -431239532
1200d31239532j34252j1514J492k6964q703K4063J7373L9138J27217J88646J69320
$$ -431239532 -431373784 -431385298 -431383806 -431410770 -431419473 -431395410 -431378037 -431338899 -431211682 -431023036 -430853716
1189d30853716J24496J18136J08184N7428j3117n5366M269J06376R8263m4769
$$ -430853716 -430729220 -430611084 -430502900 -430445472 -430458589 -430513955 -430509686 -430403310 -430305047 -430349816
1179d30349816j60417r5814Q3943J99496K01940J74290J85430K48603L31930L70108
$$ -430349816 -430510233 -430606047 -430522104 -430322608 -430120668 -429946378 -429760948 -429512345 -429180415 -428810307
1169d28810307L33585K69568J43548r6866l66069n47367n60195m36262k92754
$$ -428810307 -428476722 -428207154 -428063606 -428160472 -428526541 -429073908 -429634103 -430070365 -430363119
1160d30363119k00820j55402j10983l436K01947L79845M22370L39461J51076m2682
$$ -430363119 -430563939 -430719341 -430830324 -430833760 -430631813 -430251968 -429829598 -429490137 -429339061 -429381743
1150d29381743j13988j19504j50935j72077j27138k1019P1391P8323L3181k2150
$$ -429381743 -429495731 -429615235 -429766170 -429938247 -430065385 -430086404 -430015013 -429936690 -429903509 -429925659
1140d29925659r6720j64653j65261n2668J40324L20779L84047K83476J41726J02559
$$ -429925659 -430022379 -430187032 -430352293 -430404961 -430264637 -429943858 -429559811 -429276335 -429134609 -429032050
1130d29032050J19050J10463R9845J16411J41440J30084M6937p2264j49299k00745
$$ -429032050 -428913000 -428802537 -428702692 -428586281 -428444841 -428314757 -428267820 -428340084 -428489383 -428690128
$$ [...]
##END NTUPLES=NMR SPECTRUM
##END=
