##TITLE=31P ikalashn
DE-79_rm 2h30(nlock)
21.11.2024
##JCAMPDX= 6.0         $$ Bruker NMR JCAMP-DX V2.0
##DATA TYPE= NMR SPECTRUM
##DATA CLASS= NTUPLES
##ORIGIN= UXNMR, Bruker Analytische Messtechnik GmbH
##OWNER= root
$$ TOPSPIN		Version 1.3
$$ 2024-11-21 14:21:32.421 +0400  Irina@DPX200
$$ Compression mode = diff/dup
##.OBSERVE FREQUENCY= 81.01967998063
##.OBSERVE NUCLEUS= ^31P
##.ACQUISITION MODE= SIMULTANEOUS
##.ACQUISITION SCHEME= undefined
##.AVERAGES= 64
##.DIGITISER RES= 17
##SPECTROMETER/DATA SYSTEM= spect
##.PULSE SEQUENCE= zgpg
##.SOLVENT NAME= CDCl3
##.SHIFT REFERENCE= INTERNAL, CDCl3, 1, 298.5841
##AUDIT TRAIL= $$ (NUMBER, WHEN, WHO, WHERE, WHAT)
$$ ##TITLE= Audit trail, TOPSPIN		Version 1.3
$$ ##JCAMPDX= 5.01
$$ ##ORIGIN= Bruker BioSpin GmbH
$$ ##OWNER= Irina
$$ $$ F:/spectra/data/iren/nmr/P31dec/1/pdata/1/auditp.txt
$$ ##AUDIT TRAIL=  $$ (NUMBER, WHEN, WHO, WHERE, VERSION, WHAT)
(   1,<2024-11-21 14:19:12.640 +0400>,<Irina>,<DPX200>,<TOPSPIN 1.3>,
      <acquisition in progress>)
(   2,<2024-11-21 14:20:54.500 +0400>,<Irina>,<DPX200>,<TOPSPIN 1.3>,
      <Start of raw data processing
       efp BC_mod = 2 LB = 10 FT_mod = 6 PKNL = 1 PHC0 = 180.3041 PHC1 = 106.9568 SI = 32K 
       data hash MD5: 32K
       74 BE DB 72 78 D4 76 83 C4 C1 CE A9 11 05 8B 8A>)
(   3,<2024-11-21 14:20:56.703 +0400>,<Irina>,<DPX200>,<TOPSPIN 1.3>,
      <apk 
       data hash MD5: 32K
       B9 B7 48 8C 0F EF 63 D8 C7 A6 D2 59 E6 E3 74 9C>)
(   4,<2024-11-21 14:21:19.546 +0400>,<Irina>,<DPX200>,<TOPSPIN 1.3>,
      <pk fgphup PHC0 = -74.12168 PHC1 = 164.8 
       data hash MD5: 32K
       89 DE 4A EB 61 30 50 D1 86 A7 86 A0 AA 08 4D 19>)
(   5,<2024-11-21 14:21:21.093 +0400>,<Irina>,<DPX200>,<TOPSPIN 1.3>,
      <abs n ABSG = 5 
       data hash MD5: 32K
       2C B9 69 A3 7B 02 18 B2 7F D2 B8 64 AC 56 53 F9>)
$$ ##END=
$$ 
$$ $$ hash MD5
$$ $$ A0 65 4D FE 3E 6C DF D5 03 A6 5F 0C 95 74 F2 A9
##$RELAX= 
##$RELAX= 
##$RELAX= 
##$RELAX= 
##$RELAX= 
##$RELAX= 
##$RELAX= 
##$RELAX= 
##$RELAX= 
##$RELAX= 
##$RELAX= 
$$ Bruker specific parameters
$$ --------------------------
##$DU= <F:/spectra>
##$EXPNO= 1
##$NAME= <P31dec>
##$PROCNO= 1
##$TYPE= <nmr>
##$USER= <iren>
##$AMP= (0..31)
100 100 100 100 100 100 100 100 100 100 100 100 100 100 100 100 100 100 
100 100 100 100 100 100 100 100 100 100 100 100 100 100 
##$ANAVPT= -1
##$AQSEQ= 0
##$AQ_mod= 1
##$AUNM= <au_zg>
##$AUTOPOS= <>
##$BF1= 81.014009
##$BF2= 200.13
##$BF3= 200.13
##$BF4= 200.13
##$BF5= 200.13
##$BF6= 200.13
##$BF7= 200.13
##$BF8= 200.13
##$BYTORDA= 1
##$CFDGTYP= 0
##$CFRGTYP= 5
##$CHEMSTR= <none>
##$CNST= (0..63)
1 1 145 1 1 1 1 1 1 1 1 1 1 1 1 1 1 1 1 1 1 1 1 1 1 1 1 1 1 1 1 1 1 1 
1 1 1 1 1 1 1 1 1 1 1 1 1 1 1 1 1 1 1 1 1 1 1 1 1 1 1 1 1 1 
##$CPDPRG= <waltz16>
##$CPDPRG1= <>
##$CPDPRG2= <waltz16>
##$CPDPRG3= <>
##$CPDPRG4= <mlev>
##$CPDPRG5= <mlev>
##$CPDPRG6= <mlev>
##$CPDPRG7= <mlev>
##$CPDPRG8= <mlev>
##$CPDPRGB= <>
##$CPDPRGT= <>
##$D= (0..63)
$$ [...]
##$SW_h= 37037.037037037
##$TD= 32768
##$TD0= 1
##$TE= 300
##$TE2= 300
##$TE3= 300
##$TEG= 300
##$TL= (0..7)
0 120 53 12 22 120 120 120 
##$TP= (0..7)
150 150 150 150 150 150 150 150 
##$TP07= 0
##$TPNAME0= <>
##$TPNAME1= <>
##$TPNAME2= <>
##$TPNAME3= <>
##$TPNAME4= <>
##$TPNAME5= <>
##$TPNAME6= <>
##$TPNAME7= <>
##$TPOAL= (0..7)
0.5 0.5 0.5 0.5 0.5 0.5 0.5 0.5 
##$TPOFFS= (0..7)
0 0 0 0 0 0 0 0 
##$TUNHIN= 0
##$TUNHOUT= 0
##$TUNXOUT= 0
##$USERA1= <user>
##$USERA2= <user>
##$USERA3= <user>
##$USERA4= <user>
##$USERA5= <user>
##$V9= 5
##$VALIST= <valist>
##$VCLIST= <CCCCCCCCCCCCCCC>
##$VD= 0
##$VDLIST= <DDDDDDDDDDDDDDD>
##$VPLIST= <PPPPPPPPPPPPPPP>
##$VTLIST= <TTTTTTTTTTTTTTT>
##$WBST= 1024
##$WBSW= 4
##$XGAIN= (0..3)
0 0 0 0 
##$XL= 0
##$YL= 0
##$YMAX_a= 4025
##$YMIN_a= -7734
##$ZGOPTNS= <>
##$ZL1= 120
##$ZL2= 120
##$ZL3= 120
##$ZL4= 120
##$ABSF1= 298.5841
##$ABSF2= -158.5842
##$ABSG= 5
##$ABSL= 5
##$ALPHA= 0
##$AQORDER= 0
##$ASSFAC= 0
##$ASSFACI= 0
##$ASSFACX= 0
##$ASSWID= 0
##$AUNMP= <proc_1d>
##$AXLEFT= 0
##$AXRIGHT= 0
##$AXTYPE= 0
##$AXUNIT= <>
##$AZFE= 0.1
##$AZFW= 0.5
##$BCFW= 0
##$BC_mod= 2
##$BYTORDP= 0
##$COROFFS= 0
##$CY= 12.5935478210449
##$DATMOD= 1
##$DC= 0
##$DFILT= <>
##$DTYPP= 0
##$F1P= 47.1127640792319
##$F2P= -24.0371245302204
##$FCOR= 0.5
##$FTSIZE= 32768
##$FT_mod= 6
##$GAMMA= 0
##$GB= 0
##$INTBC= 1
##$INTSCL= 7.269226e-011
##$ISEN= 30
##$LB= 10
##$LEV0= 0
##$LPBIN= 0
##$MAXI= 12.09355
##$MC2= 0
##$MEAN= 0
##$ME_mod= 0
##$MI= 0.7550151
##$NCOEF= 0
##$NC_proc= -11
##$NLEV= 6
##$NOISF1= 298.5841
##$NOISF2= 270.0111
##$NSP= 0
##$NTH_PI= 0
##$NZP= 0
##$OFFSET= 298.5841
##$PC= 1.4
##$PHC0= 194.7541
##$PHC1= 57.6963
##$PH_mod= 1
##$PKNL= yes
##$PPARMOD= 0
##$PPDIAG= 0
##$PPIPTYP= 0
##$PPMPNUM= 100
##$PPRESOL= 1
##$PSCAL= 0
##$PSIGN= 0
##$REVERSE= no
##$SF= 81.014009
##$SI= 32768
##$SIGF1= 270.0111
##$SIGF2= -158.5842
##$SINO= 77.54984
##$SIOLD= 32768
##$SREGLST= <31P.CDCl3>
##$SSB= 0
##$STSI= 32768
##$STSR= 0
##$SW_p= 37037.037037037
##$SYMM= 0
##$S_DEV= 0
##$TDeff= 32768
##$TDoff= 0
##$TI= <>
##$TILT= no
##$TM1= 0
##$TM2= 0
##$TOPLEV= 0
##$USERP1= <user>
##$USERP2= <user>
##$USERP3= <user>
##$USERP4= <user>
##$USERP5= <user>
##$WDW= 1
##$XDIM= 32768
##$YMAX_p= 288768117
##$YMIN_p= -6386740
$$ End of Bruker specific parameters
$$ ---------------------------------
##NTUPLES= NMR SPECTRUM
##VAR_NAME=  FREQUENCY,     SPECTRUM/REAL,   SPECTRUM/IMAG
##SYMBOL=    X,             R,               I
##VAR_TYPE=  INDEPENDENT,   DEPENDENT,       DEPENDENT
##VAR_FORM=  AFFN,          ASDF,            ASDF
##VAR_DIM=   32768,         32768,           32768
##UNITS=     HZ,            ARBITRARY UNITS, ARBITRARY UNITS
##FACTOR=    1.13031516577767, 1,            1
##FIRST=     37037.037037037, 1684600,       -7197846
##LAST=      0,             -4566313,        6284001
##MIN=       0,             -6386740,        0
##MAX=       37037.037037037, 288768117,     0
$$ Real data points
##PAGE= N=1
##DATA TABLE= (X++(R..R)), XYDATA
$$ [...]
18397G26016O39229M89034L29400K21171J68532J43709J03681K2162r2648j93843
18387B556443k18313j29948O1097K97168N00701O16910O24917N31452L75261K04762
18377E420450L6379j32432k81112l68303l78339l49081l37600l49658l30826k69266
18367B660212k48969l08588l47824k78625j32115J6029R1045M0578j02879k38412
18357A150452k95321k85012k54527k27469j91652j07253M4068K12581L15801L03805
18347F65473J94721N4201p6744k11140l61040m96501n70255n55069m56698k98135
18337b111187j20450Q576L1925m6193j42418j64746j15507o5205m4692j8517L7223
18326b751191Q4666O7203k6719j60323k82298l46965l32347k52275j44654l5844
$$ y = [726016, 1365245, 1854279, 2183679, 2404850, 2573382, 2717091, 2820772, 2842934, 2750286, 2556443, 2338130, 2208182, 2269279, 2566447, 3067148, 3684058, 4308975, 4840427, 5215688, 5420450, 5456829, 5324397, 5043285, 4674982, 4296643, 3947562, 3609962, 3260304, 2929478, 2660212, 2411243, 2102655, 1754831, 1476206, 1344091, 1360120, 1451165, 1491743, 1388864, 1150452, 855131, 570119, 315592, 88123, -103529, -210782, -166714, 45867, 361668, 665473, 860194, 914395, 837651, 626511, 265471, -231030, -801285, -1356354, -1813052, -2111187, -2231637, -2223061, -2191136, -2237329, -2379747, -2544493, -2660000, -2725205, -2769897, -2788414, -2751191, -2666525, -2599322, -2626041, -2786364, -3068662, -3415627, -3747974, -4000249, -4144903, -4180747]
18316d180747O5554J48132J91052J59284N0631n6142p8236l2882l23l3605j23693
18305c890975k06066k15024j35334J0191J98410L97554N35259N40338M10432K04210
18295b151005q771j93199l36199m11423m05156l51381k91248k21390j17943J5957
18285d471758J61622L21423N06355P00037Q75550R94916R77335P74970M38202
18276A278652N8622k80700n21106o51825p17958p79458q26977p83330o12801l72617
18266d209498j39598P1738K88549N13688O95290P64563O98401N44897L97111L00948
18256g3911K11224O3688j41042l20766l72373k76859j34160o0233o0713o3470
18246a228615l9250j0342O478K1014N7946J34806K27718K67807K12771R9856j0138
$$ y = [-4180747, -4115193, -3967061, -3776009, -3616725, -3566094, -3622236, -3700472, -3733354, -3733677, -3767282, -3890975, -4097041, -4312065, -4447399, -4437208, -4238798, -3841244, -3305985, -2765647, -2355215, -2151005, -2159776, -2352975, -2689174, -3100597, -3505753, -3857134, -4148382, -4369772, -4487715, -4471758, -4310136, -3988713, -3482358, -2782321, -1906771, -911855, 65480, 840450, 1278652, 1337274, 1056574, 535468, -116357, -834315, -1613773, -2440750, -3224080, -3836881, -4209498, -4349096, -4277358, -3988809, -3475121, -2779831, -2015268, -1316867, -771970, -374859, -73911, 137313, 201001, 59959, -260807, -633180, -910039, -1044199, -1104432, -1165145, -1228615, -1267865, -1278207, -1271729, -1250715, -1192769, -1057963, -830245, -562438, -349667, -249811, -259949]
18235b59949r7490j66880k12977k14583j49855j8018J53570L13218L93741L47546
18225H8323J96733J5754j19958j62539j07976P189J12338J41470R1129L104q4653
18214A80914j46530j58809r8647Q353P4803N4486P604J7841R6329J91708K43991
18203D72043K03745P6119o3446j42366j27195l9363M6280P7030O6339N2379K8129
18192F49694n8252k11989l65534m60177m88614m64539l87919k54310j10794o1095
18182b213529j60153l33755m55116m73121m12812k88166j04102Q7987K15211K63639
18172c873917K88478L29794L63245L57760L29186L05099K69493J97207J10573
18163a323082M5027N373j6288k223P6628K21740M03304N52720N71388M17820J75813
$$ y = [-259949, -357439, -524319, -737296, -951879, -1101734, -1119752, -966182, -652964, -259223, 88323, 285056, 300810, 180852, 18313, -89663, -82474, 29864, 171334, 262463, 265567, 180914, 34384, -124425, -223072, -214719, -139916, -85430, -77826, -59985, 36344, 228052, 472043, 675788, 751907, 688461, 546095, 418900, 379537, 425817, 502847, 569186, 621565, 649694, 591442, 379453, 13919, -446258, -934872, -1399411, -1787330, -2041640, -2152434, -2213529, -2373682, -2707437, -3162553, -3635674, -4048486, -4336652, -4440754, -4352767, -4137556, -3873917, -3585439, -3255645, -2892400, -2534640, -2205454, -1900355, -1630862, -1433655, -1323082, -1278055, -1272682, -1288970, -1291193, -1214565, -992825, -589521, -36801, 534587, 952407, 1128220]
18152A128220j5915p8982k8760P1183J66104K21400K03797R4558q3633k76183
18142A401789m22182m63225l63242j48502P2937J80758J68335J35155J49122K03834
18132I14779K96526M35264N66399N85755M40968J71292j41148m14553n83066o20116
18122A652100n50206m23863k91866k06503j93265k20749k58805l14013l66179
18113a173349l56458k41648k4608K32000M38523N56383N98296N56597M08448J99657
18103A193841L7677j5115K7122J28601K52991L35139K93751R4227j99687m46345
18093A702202n53186n51248m90625l54010j43960M1264J05711M9299n8174j40011
18083c92738j56151q7451N7288K05822K87909L09426L22755L50143L65322L42281
$$ y = [1128220, 1112305, 1033323, 1004563, 1075746, 1241850, 1463250, 1667047, 1761605, 1677972, 1401789, 979607, 516382, 153140, 4638, 77575, 258333, 426668, 561823, 710945, 914779, 1211305, 1646569, 2212968, 2798723, 3239691, 3410983, 3269835, 2855282, 2272216, 1652100, 1101894, 678031, 386165, 179662, -13603, -234352, -493157, -807170, -1173349, -1529807, -1771455, -1796063, -1564063, -1125540, -569157, 29139, 585736, 994184, 1193841, 1231518, 1216403, 1243525, 1372126, 1625117, 1960256, 2254007, 2348234, 2148547, 1702202, 1149016, 597768, 107143, -246867, -390827, -349563, -243852, -194553, -252727, -392738, -548889, -636340, -579052, -373230, -85321, 224105, 546860, 897003, 1262325, 1604606]
18073A604606K83412K15343J60536J02808J1445r7367j64394j57321j16582j19843
18063A722643k00519l27778m71306o08654o87187o56907n20185l32074j53805
18054b235772j3720O8933O3392q741n4123r033R3945J86664K42149K67736K66024
18043a132546K32799J72713J01184L8486O37j6121k6722m3833p7250j16407j23640
18032i90700p6793j7509m361m5877j11531j53584j27514m4494K6519O0886J18865
18021a366093K12741K37667J15052j12544l62526n53631n73194l53283J1860L28023
18011b415928M57484L80924J93478M5282J9953Q2792J43427J49179J07258M3163
18001g92988k5883q5629j11525q1067J1247J51462K94401L79108L57883K23933
$$ y = [1604606, 1888018, 2103361, 2263897, 2366705, 2378150, 2280783, 2116389, 1959068, 1842486, 1722643, 1522124, 1194346, 723040, 114386, -572801, -1229708, -1749893, -2081967, -2235772, -2249492, -2180559, -2117167, -2125908, -2180031, -2189064, -2095119, -1908455, -1666306, -1398570, -1132546, -899747, -727034, -625850, -587364, -586727, -602848, -629570, -673403, -750653, -867060, -990700, -1067493, -1085002, -1089363, -1135240, -1246771, -1400355, -1527869, -1572363, -1545844, -1484958, -1366093, -1153352, -915685, -800633, -913177, -1275703, -1829334, -2402528, -2755811, -2743951, -2415928, -1958444, -1577520, -1384042, -1338760, -1318807, -1236015, -1092588, -943409, -836151, -792988, -818871, -904500, -1016025, -1097092, -1085845, -934383, -639982, -260874, 97009, 320942]
17991C20942M2783r0850j51493j85859k23590k30598j56508m550J64953K83038
17981b31732L12355K82822K91059M01991N70378O73297O11042L76985L7271k94036
17971C031432n00434n52028m98807l83935k26716o3072N1206R0075Q4860Q1152
17961A113733R0527J06030J15732R1861L4142j0627j9848k3924l4404k0609J1197
17950A453810L3916Q2210K01680L70255N10575N38208M09692J59874j20911l54655
17940C284654n04641n71313n63349m72528l29516k12470j33449l3809Q9895J71342
17930G24816J66814Q5151m1766j75730k68711k89057k50955j53829M9393L65149
17920B11275P03997R36814R59812P43749L84031M3042j88488l23028m04129m56774
$$ y = [320942, 363725, 272875, 121382, -64477, -288067, -518665, -675173, -679723, -514770, -231732, 80623, 363445, 654504, 1056495, 1626873, 2300170, 2911212, 3288197, 3325468, 3031432, 2530998, 1978970, 1480163, 1096228, 869512, 806440, 857646, 947721, 1032581, 1113733, 1204260, 1310290, 1426022, 1517883, 1552025, 1541398, 1521550, 1497626, 1463222, 1442613, 1453810, 1487726, 1569936, 1771616, 2141871, 2652446, 3190654, 3600346, 3760220, 3639309, 3284654, 2780013, 2208700, 1645351, 1172823, 843307, 630837, 497388, 463579, 553474, 724816, 891630, 976781, 935015, 759285, 490574, 201517, -49438, -203267, -153874, 211275, 915272, 1852086, 2811898, 3555647, 3939678, 3982720, 3794232, 3471204, 3067075, 2610301]
17910B610301m82156m69161m12181l05797j48991Q653Q8409Q9583O4233J4127
17900A057020p4072j92411l47995n49491p46682q37816p63810n65282l21266o0121
17890c401926K12303M45533N80567O09482N70720N20732M86992M43552L41198
17881H09153J55589q1368l13821n15773o85473q15012q82472q45478o43938k88304
17871d106897Q9401L29675L60651K37414P9863l5570j01756j09624l5814J05083
17861c187574K66762M09177N15165N77641N76045N00839L91778K91503J94385
17852E35721Q9267K597j2843O2493J67809K28387K44455K55523K49664J83197
17842B006270P0281j9866n1787o0463r1337j50501k16306k45577j79355J605K44670
$$ y = [2610301, 2128145, 1658984, 1246803, 941006, 792015, 800668, 889077, 978660, 1042893, 1057020, 982948, 790537, 442542, -106949, -853631, -1691447, -2455257, -3020539, -3341805, -3401926, -3189623, -2744090, -2163523, -1554041, -983321, -462589, 24403, 467955, 809153, 964742, 883374, 569553, 53780, -631693, -1446705, -2329177, -3174655, -3818593, -4106897, -4017496, -3687821, -3327170, -3089756, -3009893, -3045463, -3147219, -3256843, -3292657, -3187574, -2920812, -2511635, -1996470, -1418829, -842784, -341945, 49833, 341336, 535721, 624988, 627585, 614742, 677235, 845044, 1073431, 1317886, 1573409, 1823073, 2006270, 2076551, 2056685, 2004898, 1944435, 1853098, 1702597, 1486291, 1240714, 1061359, 1062964, 1307634]
17831A307634M66445O02710O23979N39350L81842J71159q5611l44798n18214n30943
17821B613553l93927k26473j76878k77373l95828l90544k49188n2154R6513J21710
17811F69411L5240n9496n7458L1084J01342J01519Q2241Q5736P7870K1098o8786
17800A019801j49478j76823j31165l8014N6371J15540J30979J09170N4020k1855
17790I68546r7976j43588j18845k0348J03863K09149K62342K21844R8163l0541
17780A452609j13892j65733k04091k14019j62337k7806J69157L70367N34406O66213
17770B304874P65084P93486P26936N76560L61043R0002k16037n09332p51567r33564
17760C207485j043846j055162r69444q48554p33910n85103l56059p8697J69438
$$ y = [1307634, 1774079, 2376789, 3000768, 3540118, 3921960, 4093119, 4007508, 3662710, 3144496, 2613553, 2219626, 1993153, 1816275, 1538902, 1143074, 752530, 503342, 451188, 547701, 669411, 704651, 645155, 587697, 618781, 720123, 821642, 903883, 989619, 1067489, 1088587, 1019801, 870323, 693500, 562335, 524321, 580692, 696232, 827211, 936381, 990401, 968546, 870570, 726982, 608137, 587789, 691652, 900801, 1163143, 1384987, 1483150, 1452609, 1338717, 1172984, 968893, 754874, 592537, 564731, 733888, 1104255, 1638661, 2304874, 3069958, 3863444, 4590380, 5166940, 5527983, 5617985, 5401948, 4892616, 4141049, 3207485, 2163639, 1108477, 139033, -709521, -1443431, -2028534, -2384593, -2463290, -2293852]
17751b293852L33622L85285L14831J28581j48758m30717n76041m89087j95374
17742b971510J78653M89374O50797O54951N44194L60618J26578j12233k64548
17733c43126k57406j12997M4243P2152p0990k94600m61066m90181m01450k61938
17723b577359j08932M0104J44567J69507J34350R6507P1958L1300k1398m8589
17713b067985m9260o8548j26487j75753j57753q9531m9797p5341j30043j77024
17703c167522k21496k56554k38179j52327l9349N3431J16895J71457K42867L42364
17693c148413M45558N15022N36735N24533N06466M96881M72905L80061K03377
17684I33125K6737m8817p920R3079J97252K64532K70359K24936J50929M7381r0440
$$ y = [-2293852, -1960230, -1574945, -1260114, -1131533, -1280291, -1711008, -2287049, -2776136, -2971510, -2792857, -2303483, -1652686, -997735, -453541, -92923, 33655, -78578, -343126, -600532, -713529, -669286, -597134, -668124, -962724, -1423790, -1913971, -2315421, -2577359, -2686291, -2646187, -2501620, -2332113, -2197763, -2101256, -2029298, -1997998, -2019396, -2067985, -2117245, -2185793, -2312280, -2488033, -2645786, -2735317, -2785114, -2860455, -2990498, -3167522, -3389018, -3645572, -3883751, -4036078, -4075427, -4021996, -3905101, -3733644, -3490777, -3148413, -2702855, -2187833, -1651098, -1126565, -620099, -123218, 349687, 729748, 933125, 959862, 911045, 903125, 996204, 1193456, 1457988, 1728347, 1953283, 2104212, 2151593, 2061153]
17673B061153k35615l36541l53361k91935j97359j36389j58440k39117l06801
17664a94405l31307l43781l58707l33611k34872r0246M1181J13255J13843P9052
17654a539598O9950J03268J32239J04787J4578q2181j13286p0761J4439J45669
17644a220896L20239M78374N46611M98917L67266K02721M0661j02395k33033l64176
17634E34289m57410m45367l19485j16933J02730K35379K15156J00641J3376M188
17624a33436K2120O157l7321n5741l1253l665l445o673K4621Q9392J58892K15130
17612B44778K65823L26964L88300M18386L79461K49065O8978r1629k29345l77783
17602A642998n31617o51070p01477o73277n91668m98179l98244k60001p7327J04190
$$ y = [2061153, 1825538, 1488997, 1135636, 843701, 646342, 509953, 351513, 112396, -194405, -525712, -869493, -1228200, -1561811, -1796683, -1886929, -1845748, -1732493, -1618650, -1539598, -1469648, -1366380, -1234141, -1129354, -1114776, -1196957, -1310243, -1381004, -1366565, -1220896, -900657, -422283, 124328, 623245, 990511, 1193232, 1233893, 1131498, 898465, 534289, 76879, -368488, -687973, -804906, -702176, -466797, -251641, -151000, -137624, -133436, -111316, -105159, -142480, -198221, -229474, -233139, -236584, -243257, -218636, -129244, 29648, 244778, 510601, 837565, 1225865, 1644251, 2023712, 2272777, 2341755, 2250126, 2020781, 1642998, 1111381, 460311, -241166, -914443, -1506111, -2004290, -2402534, -2662535, -2739862, -2635672]
17592b635672K29941K79462K69992K36779K10952K01852J91523J61342J13068
17583g40761N4674j0236q5190j76254k78413l63460l86175l31554k35602j45457
17573b698428p5863o276Q4164J67852J62548L9959j12369j69751p5409J08315
17563b575258K67237L37029L37173L37755L77761M38196M88973N01712M37207
17554I47785K93281J27050k5518j84874l64501n32339o38888o40922n08148k66389
17544a793463j3404J75247K99832L70969L97487M05008L90554L26817K01954K9712
17534G90713j28508k05000j92731j22448l3544K5087M2681P1254J44011K18634
17524F10149K30485J54958K8204o1501m0310P5259K08781L11737L68810L61775
$$ y = [-2635672, -2405731, -2126269, -1856277, -1619498, -1408546, -1206694, -1015171, -853829, -740761, -686087, -696323, -781513, -957767, -1236180, -1599640, -1985815, -2317369, -2552971, -2698428, -2774291, -2780567, -2696403, -2528551, -2366003, -2326044, -2438413, -2608164, -2683573, -2575258, -2308021, -1970992, -1633819, -1296064, -918303, -480107, 8866, 510578, 947785, 1241066, 1368116, 1342598, 1157724, 793223, 260884, -378004, -1018926, -1527074, -1793463, -1806867, -1631620, -1331788, -960819, -563332, -158324, 232230, 559047, 761001, 790713, 662205, 457205, 264474, 142026, 108482, 133569, 176250, 247504, 391515, 610149, 840634, 995592, 1023796, 962295, 921985, 997244, 1206025, 1517762, 1886572, 2248347]
17514B248347K67978R1313j24379l37052n04732n67174n25212m50843l84549l23699
17504f10002k81497k81108l12105l28804l01562k47062j86629j31004q8354l3980
17494b802107P2864K34994M06729M97168M04759J07932k64406n15855n66502m81025
17484b905449l55678k56878k04655j56613n7695P9211K00702K90914L70920M51021
17474b544200N12431N20352M32478K40127J1487j48417j91781j59689j10970n8731
17464a496913Q685P1562Q9132N8717K0533m550l5618p5456j24356k14032l37323
17453b039619m32794m74482m84147m55623l52858j91060l7547O8658J39738K12450
17443d047284L32448N12369O93032P96683Q14225P99177P79617P27675O14754
$$ y = [2248347, 2516325, 2607638, 2483259, 2146207, 1641475, 1074301, 549089, 98246, -286303, -610002, -891499, -1172607, -1484712, -1813516, -2115078, -2362140, -2548769, -2679773, -2768127, -2802107, -2729243, -2494249, -2087520, -1590352, -1185593, -1077661, -1342067, -1857922, -2424424, -2905449, -3261127, -3518005, -3722660, -3879273, -3936968, -3857757, -3657055, -3366141, -2995221, -2544200, -2031769, -1511417, -1078939, -838812, -827325, -975742, -1167523, -1327212, -1438182, -1496913, -1488228, -1416666, -1327534, -1268817, -1248284, -1252834, -1288452, -1363908, -1488264, -1702296, -2039619, -2472413, -2946895, -3431042, -3886665, -4239523, -4430583, -4468130, -4399472, -4259734, -4047284, -3714836, -3202467, -2509435, -1712752, -898527, -99350, 680267, 1407942, 2022696]
17434B022696M49165K65561J26002Q9380J52403K62547L45852L27006K02728N5136
17424D298476m6388r9218j20166j23785j41471k16974l76879n80314p26509p51059
17414A115713o92989o33548n96958n63108n21538m78197m26401l38426j97388
17405c332840N964K59647M84112N76262N07950L35111J37208k8533j11849p4703
17395a241671N2850J87765K69901L00477L15203L25702K94617J80126N640j38162
17385E52448j71022r1443K5558R6663R6538M7326l4128j40344k30329k54116k24035
17374c26884j79758q9936Q8906K92127L92589L34273J78249J6222j03427j65681
17364D36680j86010k06370k32618k23532j56878o1837N236K4973L6914P1278R6022
$$ y = [2022696, 2471861, 2737422, 2863424, 2952804, 3105207, 3367754, 3713606, 4040612, 4243340, 4298476, 4252088, 4152870, 4032704, 3908919, 3767448, 3550474, 3173595, 2593281, 1866772, 1115713, 422724, -210824, -807782, -1370890, -1892428, -2370625, -2797026, -3135452, -3332840, -3326876, -3067229, -2583117, -2006855, -1498905, -1163794, -1026586, -1055119, -1166968, -1241671, -1188821, -1001056, -731155, -430678, -115475, 210227, 504844, 684970, 690610, 552448, 381426, 289983, 315541, 412204, 508742, 556068, 521940, 381596, 151267, -102849, -326884, -506642, -596578, -507672, -215545, 177044, 511317, 689566, 705788, 602361, 436680, 250670, 44300, -188318, -411850, -568728, -630565, -625329, -600356, -563442, -492164, -396142]
17353c96142M5108j08246k98642m28750m71153m59656m28517l84235l26853k69420
17343c526506k09294j16524K4323J72699K59030K71105K57612K54746K75901L19145
17333b017763L46270K98847J84465R0599O1813O2231P4841J11331J35486P4802
17323e77078p5717k15066k39016j22736R1171L07252M08940L36414J28641j25023
17313h2218l49363n05541n78417n57900m59862l44412k63821k10415j27869L2069
17303c447749K49425M44177N31633M57177K32692n1448k95485m58791n54028n97578
17293c489975n75182m62566k73953n8137J48667L39053M94258N67306N48018M89494
17283b273017M31675L66533L23849L68818M67579N03866M48422L73268L14794
$$ y = [-396142, -351034, -459280, -757922, -1186672, -1657825, -2117481, -2545998, -2930233, -3257086, -3526506, -3735800, -3852324, -3828001, -3655302, -3396272, -3125167, -2867555, -2612809, -2336908, -2017763, -1671493, -1372646, -1188181, -1097582, -1035769, -973538, -898697, -787366, -651880, -577078, -652795, -867861, -1106877, -1229613, -1138442, -831190, -422250, -85836, 42805, -82218, -431581, -937122, -1515539, -2073439, -2533301, -2877713, -3141534, -3351949, -3479818, -3447749, -3198324, -2754147, -2222514, -1765337, -1532645, -1584093, -1879578, -2338369, -2892397, -3489975, -4065157, -4527723, -4801676, -4859813, -4711146, -4372093, -3877835, -3310529, -2762511, -2273017, -1841342, -1474809, -1150960, -782142, -314563, 189303, 637725, 1010993, 1325787]
17274A325787K16334q03l29327o61302q79338r22607p81834n02805k15921o2643
17264b814459o3094j15041j20908q9754p2247l8069O4816J89859K45461K10743
17254b602693J26168K0449j02208k39883l81269m96122n35828m60540k85807r4630
17244e052363L3028R0306J22629J59656J99840K44005K81713K78552K28053J64212
17234c250369J26604J46383K30672L55761N07673O84948Q58640R91225J061539
17225A713076J054164R58473P61998M49587N2843l04623m93815n14998m68896
17216C207809m40062m43733m34349l58158j80944R3894L75642N42095N49698M31266
17206C343158K52381Q0851n8071j94476l59583n31080o53646o75871n55328l01920
$$ y = [1325787, 1542121, 1541318, 1211991, 550689, -328649, -1251256, -2033090, -2535895, -2751816, -2814459, -2877553, -2992594, -3113502, -3203256, -3275503, -3313572, -3248756, -3058897, -2813436, -2602693, -2476525, -2456076, -2558284, -2798167, -3179436, -3675558, -4211386, -4671926, -4957733, -5052363, -5019335, -4929029, -4806400, -4646744, -4446904, -4202899, -3921186, -3642634, -3414581, -3250369, -3123765, -2977382, -2746710, -2390949, -1883276, -1198328, -339688, 651537, 1713076, 2767240, 3725713, 4487711, 4937298, 4990141, 4685518, 4191703, 3676705, 3207809, 2767747, 2324014, 1889665, 1531507, 1350563, 1444457, 1820099, 2362194, 2911892, 3343158, 3595539, 3676390, 3618319, 3423843, 3064260, 2533180, 1879534, 1203663, 648335, 346415]
17196C46415l3300R6531O0178j4442p572P8410J78404K38119K26830J61807J05070
17185A436450R8274J23458J27303P1507m4749j86807l04741l60277l57327l37875
17175B65216l26798l16573k92950k40076j55500o8579j7705n034J2723N9312Q9832
17164i96132N4175k8855q9121o4574N2514K11562L64030M99398O02490O31917
17154A237404N76848M71534L50564K27531Q5859q2691k37605l29199l65960m08895
17144A525390m67313m64749l42950j50313J5528J20723J87145J97272J01584o6190
17134F56127k01912k50937k29164j77527j18968l7187Q1794J91862K21160J61118
17124B96366O5887p070k2455K6094J12423J84859K03110J63191Q7131K9589L6055
$$ y = [346415, 313115, 409646, 469824, 455382, 447810, 526220, 704624, 942743, 1169573, 1331380, 1436450, 1534724, 1658182, 1785485, 1856992, 1812243, 1625436, 1320695, 960418, 603091, 265216, -61582, -378155, -671105, -911181, -1066681, -1135260, -1152965, -1157999, -1145276, -1085964, -996132, -941957, -970812, -1059933, -1124507, -1071993, -860431, -496401, 2997, 605487, 1237404, 1814252, 2285786, 2636350, 2863881, 2949740, 2867049, 2629444, 2300245, 1934285, 1525390, 1058077, 593328, 250378, 100065, 115593, 236316, 423461, 620733, 722317, 656127, 454215, 203278, -25886, -203413, -322381, -359568, -277774, -85912, 135248, 296366, 362253, 355183, 332728, 358822, 471245, 656104, 859214, 1022405, 1109536, 1139125, 1175180]
17113A175180P7317R0847P2711P6548J23544J63500J23348k1680k13061l63589
17103A304665m25806l99843l39037l28873m04669n18117o15974o92173p43994
17094c163821p27287n89688l48083r6467R5924K49813M00955N25335N68152N05700
17084b579467L56304J67015J8515j5061O2151J79745K71690L15815L28049L30557
17074e64687L15093K66042J98476J25149L1879q0967j70835j92322j47992o9161
17064b89325N1023K40265M73088O64746P15498N86120L51750J32324q239q7535
17054B829715j54334k12889k26210j71889o5510P3046K34807L56782L39565J74079
17044C177162k7172j43562j53685j21391j07535j18488j36143j47691j35927q7974
$$ y = [1175180, 1252497, 1343344, 1416055, 1492603, 1616147, 1779647, 1902995, 1881315, 1668254, 1304665, 878859, 479016, 139979, -188894, -593563, -1111680, -1727654, -2419827, -3163821, -3891108, -4480796, -4828879, -4925346, -4829422, -4579609, -4178654, -3653319, -3085167, -2579467, -2223163, -2056148, -2037633, -2052694, -1990543, -1810798, -1539108, -1223293, -895244, -564687, -249594, 16448, 214924, 340073, 371952, 290985, 120150, -72172, -220164, -289325, -238302, 1963, 475051, 1139797, 1855295, 2441415, 2793165, 2925489, 2917250, 2829715, 2675381, 2462492, 2236282, 2064393, 1998883, 2071929, 2306736, 2663518, 3003083, 3177162, 3149990, 3006428, 2852743, 2731352, 2623817, 2505329, 2369186, 2221495, 2085568, 1997594]
17034A997594k0850J1923l8077j59699k72636k88485j99612p4400K4362O3742
17024A043862L3122m2162j14771j49557j31436m8590J00799K95262M98615O61939
17014B147083P27342O83291N89929N14573M66481M11659L29267K18751P5478r0956
17004F072898k28726k80864k54088k08717j90715j97154j98337j73009j21360
16995D219928o3170j7011R246O316l7643j13450j91084k83126m23903n77953o60705
16984A867445o20052m71708k89505j45620p3513q1323j51489k25022k29775j52462
16974e73024n3594Q205L9700Q3328J57654K35660K93656L38740L58966L17999
16964A207290K06418P6086R642N7111K03265L70458M50308L65215J24028j71126
$$ y = [1997594, 1976744, 1988667, 1950590, 1790891, 1518255, 1229770, 1030158, 955758, 980120, 1043862, 1076984, 1034822, 920051, 770494, 639058, 590468, 691267, 986529, 1485144, 2147083, 2874425, 3557716, 4147645, 4662218, 5128699, 5540358, 5869625, 6088376, 6163854, 6072898, 5844172, 5563308, 5309220, 5100503, 4909788, 4712634, 4514297, 4341288, 4219928, 4156758, 4139747, 4148993, 4155309, 4117666, 4004216, 3813132, 3530006, 3106103, 2528150, 1867445, 1247393, 775685, 486180, 340560, 267047, 185724, 34235, -190787, -420562, -573024, -626618, -618413, -578713, -495385, -337731, -102071, 191585, 530325, 889291, 1207290, 1413708, 1489794, 1499436, 1556547, 1759812, 2130270, 2580578, 2945793, 3069821, 2898695]
16954B898695m02911n30030n83726n99254n69554m71760l19677j52678Q907J62976
16944e59012K84086K99969J84153M0876P736J07665K51389L56286M03587L89210
16934A765945L04688J67259Q012j64875l43032m61494m55227l49483k39291k14100
16924A8402k81089l65653m06718m02205l63729k85797j58295J5798K06136L48218
16914a674932L83259L25773K58778K54699L07917L49782L34760K83720K29720
16905A053476J83497J52518J48922J80746K42703L30968M32843N00198M88540
16896C714411L91874K24832Q525k13802l65487l61322j57004J71213M47378N51653
16886D412271M85299K94260J5084k94896n31480o05716n30194m02320l16956k96840
$$ y = [2898695, 2495784, 1965754, 1382028, 782774, 213220, -258540, -578217, -730895, -721988, -559012, -274926, 25043, 209196, 250072, 257808, 365473, 616862, 973148, 1376735, 1765945, 2070633, 2237892, 2245904, 2081029, 1737997, 1276503, 821276, 471793, 232502, 18402, -262687, -628340, -1035058, -1437263, -1800992, -2086789, -2245084, -2229286, -2023150, -1674932, -1291673, -965900, -707122, -452423, -144506, 205276, 540036, 823756, 1053476, 1236973, 1389491, 1538413, 1719159, 1961862, 2292830, 2725673, 3225871, 3714411, 4106285, 4331117, 4339642, 4125840, 3760353, 3399031, 3242027, 3413240, 3860618, 4412271, 4897570, 5191830, 5206914, 4912018, 4380538, 3774822, 3244628, 2842308, 2525352, 2228512]
16876B228512l10803l59352m52595n40916n70732n36579m59844l49782j89323
16867a541414J3511K09786L59784M51670M86025M82996M84045M92948M52430L16933
16857B208714J05546j21420l11021m40415n00508m92543m21062k71884m3790K14097
16847g4286M19842N01534M27600K38884L8269r6444j60462j78145j67862j36258
16837H12672p2964J6082R0581J06552L3966j21574k94125l99709m21671l95093
16827f45283l22970k01486o4697N0264J34129J88812K03989J87506J83953K36412
16817d9371L42620M34247M27683K93473N9971j98817l95097n03491n54530n40962
16807f84274m13770j60245J59066M26227N37719M86436L61852K80324K85912L24423
$$ y = [2228512, 1917709, 1558357, 1105762, 564846, -5886, -542465, -1002309, -1352091, -1541414, -1527903, -1318117, -958333, -506663, -20638, 462358, 946403, 1439351, 1891781, 2208714, 2314260, 2192840, 1881819, 1441404, 940896, 448353, 27291, -244593, -288383, -74286, 345556, 847090, 1274690, 1513574, 1551843, 1455399, 1294937, 1116792, 948930, 812672, 739708, 755790, 846371, 952923, 986889, 865315, 571190, 171481, -250190, -645283, -968253, -1169739, -1234436, -1184172, -1050043, -861231, -657242, -469736, -285783, -49371, 293249, 727496, 1155179, 1448652, 1508623, 1309806, 914709, 411218, -143312, -684274, -1098044, -1258289, -1099223, -672996, -135277, 351159, 713011, 993335, 1279247, 1603670]
16797A603670L31406K89269K01949P8848o4736k12787l29051l56203k90866k12956
16787A038543j78853j56062j03443m4239l3982r1814j72479j96376j04216Q5458
16777D2537K68090L35682K78530J88754J60277K06477K62323K63754K12469J45277
16767B364170Q9099O3333P3771Q8479N8508l3224j52884k32083k17752j13022
16757A988395L4281J60676K05398J67893J22334J38832K22865L17318L34961K21925
16747C914878N409k28892l90279m27036l52011k31873j45041j36635j86944k23574
16737A598002k01219j38430n8864K1620P4244P9026K5340p3873j59174j89449
16727I77223j89903j89593j64380p7192O0605K01786L19372M12654M75108M95577
$$ y = [1603670, 1935076, 2224345, 2426294, 2505142, 2440406, 2227619, 1898568, 1542365, 1251499, 1038543, 859690, 703628, 600185, 555946, 521964, 430150, 257671, 61295, -42921, 42537, 310627, 646309, 924839, 1113593, 1273870, 1480347, 1742670, 2006424, 2218893, 2364170, 2453269, 2516602, 2590373, 2678852, 2737360, 2704136, 2551252, 2319169, 2101417, 1988395, 2022676, 2183352, 2388750, 2556643, 2678977, 2817809, 3040674, 3357992, 3692953, 3914878, 3920287, 3691395, 3301116, 2874080, 2522069, 2290196, 2145155, 2008520, 1821576, 1598002, 1396783, 1258353, 1199489, 1221109, 1295353, 1374379, 1399719, 1325846, 1166672, 977223, 787320, 597727, 433347, 356155, 416760, 618546, 937918, 1350572, 1825680, 2321257]
16717B321257M80154M32031L21303J06032k04643n13893o98737o97534n19202
16708A026768k10607J42223M12493N13123M73264L86573L15607K82381K97816
16699C639641L47207L71410L11408J74091K6396m4762J7902J63972K48148J60932
16689E416345o5841k85034l77620l54102k99934k63337k18435j12095N7272K35053
16679C732272L82577M93567N36439M62659K73068K5763k10054l88701m78021m63839
16669D365730l70336k31855o5967J17423K98016M34612M95827M92679M41386L32744
16659F310259J74269K0471o1575m3412M6560J35208J54070J09166O0645L3587
16649F939248K0155J2575k3427j26273k71937l82120l93860l14405k17034j63254
$$ y = [2321257, 2801411, 3233442, 3554745, 3660777, 3456134, 2942241, 2243504, 1545970, 1026768, 816161, 958384, 1370877, 1884000, 2357264, 2743837, 3059444, 3341825, 3639641, 3986848, 4358258, 4669666, 4843757, 4870153, 4825391, 4843293, 5007265, 5255413, 5416345, 5350504, 5065470, 4687850, 4333748, 4033814, 3770477, 3552042, 3439947, 3497219, 3732272, 4114849, 4608416, 5144855, 5607514, 5880582, 5906345, 5696291, 5307590, 4829569, 4365730, 3995394, 3763539, 3697572, 3814995, 4113011, 4547623, 5043450, 5536129, 5977515, 6310259, 6484528, 6504999, 6443424, 6400012, 6446572, 6581780, 6735850, 6845016, 6905661, 6939248, 6959403, 6971978, 6948551, 6822278, 6550341, 6168221, 5774361, 5459956, 5242922, 5079668]
16639E079668j37087p8612L8450J94329L44858M42635M64873M26281L50126K32467
16629G357988P8337o2356j40739j47237r9886l4433L117j0615n9283j44006k94809
16618F446078m82550o19782o71701o69930o37964n70839m66032l29051j64606
16609A833623n848P7158L8046j18644l44772n41590n81247l90746l7843L17153
16599B45290N47890O01284M92174L01526J14049l5405j14165p3282Q3365K92704
16589B455430N02438O82148P83286P65955O46392M89375L80161L64712L84285
16580G454182L35489J94616J1081j62472k87255l38834l10940k22595j22774n8241
16570F492257k6495O153M2560O1266Q7784J60403K19067J72295L5497j08125k10564
$$ y = [5079668, 4942581, 4863969, 4902419, 5096748, 5441606, 5884241, 6349114, 6775395, 7125521, 7357988, 7436325, 7373969, 7233230, 7085993, 6986107, 6951674, 6954791, 6944176, 6884893, 6740887, 6446078, 5963528, 5343746, 4672045, 4002115, 3364151, 2793312, 2327280, 1998229, 1833623, 1827775, 1904933, 1942979, 1824335, 1479563, 937973, 356726, -34020, -71863, 245290, 793180, 1394464, 1886638, 2188164, 2302213, 2266808, 2152643, 2079361, 2162726, 2455430, 2957868, 3640016, 4423302, 5189257, 5835649, 6325024, 6705185, 7069897, 7454182, 7789671, 7984287, 7995368, 7832896, 7545641, 7206807, 6895867, 6673272, 6550498, 6492257, 6465762, 6471915, 6514475, 6575741, 6663525, 6823928, 7042995, 7215290, 7250787, 7142662, 6932098]
16559F932098k61909k50081j58406P100K09764L80128M33168L33951J41889j8276
16549G749426l4609J21047L68503N63557O05296N03927L51320K36202J77905J48963
16539A0791537J37207J40344J38094J31783J69215K67307L54151L49066K73766
16530A2752470K25059K35415K28511J32742l6523k25550m02624n57147o68125
16521A1684228o92368o15055m99262m43553m77026n20554m77674l38547j60916
16512G459273J8509K09507M01489N34122N78796N60073M88632L59036K07662J01904
16502A0919003O4693N7368L3692m5877k20428m50342o04475n87858m29776k38676
16492H497324j17028j10260j93449k90350l11672k12919l8799Q9819O5986r6661
$$ y = [6932098, 6670189, 6420108, 6261702, 6268802, 6478566, 6858694, 7291862, 7625813, 7767702, 7749426, 7714817, 7835864, 8204367, 8767924, 9373220, 9877147, 10228467, 10464669, 10642574, 10791537, 10928744, 11069088, 11207182, 11338965, 11508180, 11775487, 12129638, 12478704, 12752470, 12977529, 13212944, 13441455, 13574197, 13537674, 13312124, 12909500, 12352353, 11684228, 10991860, 10376805, 9877543, 9433990, 8956964, 8436410, 7958736, 7620189, 7459273, 7477782, 7687289, 8088778, 8622900, 9201696, 9761769, 10250401, 10609437, 10817099, 10919003, 10983696, 11041064, 11074756, 11028879, 10808451, 10358109, 9753634, 9165776, 8736000, 8497324, 8380296, 8270036, 8076587, 7786237, 7474565, 7261646, 7222847, 7312666, 7378652, 7281991]
16482G281991k81632l90579m05195l54835k91221k69633l00524l40178l35508
16473D312686k73609j91626j55912k39460m73926q09330j142426j371505j426041
16464a771149j309797j100430q19270l30701N13909J587390K413783K606321K271614
16455D061670J759119J304608R77440P43043N37082L25522J32690K3624J3989
16446I878787K5580k0836j13633j82120j77852r1383O8938K63818M07743M23959
16436A0483001L29894K36627K25992K49253K04778P4213q9707k45661l71280m50393
16426A0646717m86869m98630m76136l79122j90701L8920K15853L00912L62185
16417I533129M71861O11299O89332O21769M26705K23438J22348J37644K17451
$$ y = [7281991, 7000359, 6609780, 6204585, 5849750, 5558529, 5288896, 4988372, 4648194, 4312686, 4039077, 3847451, 3691539, 3452079, 2978153, 2168823, 1026397, -345108, -1771149, -3080946, -4181376, -5000646, -5331347, -4817438, -3230048, -816265, 1790056, 4061670, 5820789, 7125397, 8102837, 8845880, 9382962, 9708484, 9841174, 9864798, 9878787, 9904367, 9883531, 9769898, 9587778, 9409926, 9318543, 9387481, 9651299, 10059042, 10483001, 10812895, 11049522, 11275514, 11524767, 11729545, 11803758, 11714051, 11468390, 11097110, 10646717, 10159848, 9661218, 9185082, 8805960, 8615259, 8654179, 8870032, 9170944, 9533129, 10004990, 10616289, 11305621, 11927390, 12354095, 12577533, 12699881, 12837525, 13054976]
16408A3054976L65040O45273J025038J355456J552342J652475J679173J598807
16400B2928580J425087J248920J155176J168618J259017J382058J510633J619987
16392C3698076J696559J753116J774579J697616J503127J261179J077272J057439
16384D5518963J204721J315109J154547O86789K6729o71643j256844j632497j764406
16375D4581468j676212j461550j228363j029220q39000n91910k79169J8091K32206
16366C7726341L84969N06128N24549L16064j45632p49880j335348j770924j995306
16357C3460961k026524j931028j765262j553654j315774j080807q61637o53224
16349B2273051m76547l78640l69641m07422m50276m78156m64649l83928k54378
$$ y = [13054976, 13420016, 14065289, 15090327, 16445783, 17998125, 19650600, 21329773, 22928580, 24353667, 25602587, 26757763, 27926381, 29185398, 30567456, 32078089, 33698076, 35394635, 37147751, 38922330, 40619946, 42123073, 43384252, 44461524, 45518963, 46723684, 48038793, 49193340, 49880129, 49906858, 49235215, 47978371, 46345874, 44581468, 42905256, 41443706, 40215343, 39186123, 38347123, 37755213, 37476044, 37494135, 37726341, 38111310, 38617438, 39141987, 39458051, 39312419, 38562539, 37227191, 35456267, 33460961, 31434437, 29503409, 27738147, 26184493, 24868719, 23787912, 22926275, 22273051, 21796504, 21417864, 21048223, 20640801, 20190525, 19712369, 19247720, 18863792, 18609414]
16340A8609414j55522j77078l25361n19284o84029q07829r04286r65597r69340
16331A3101088q87519p00360m40084j87239M595J37236K25467K67695K45168J53854
16321A1919901M6785j2547l2840m1746r413R9616K66129M27054N00578M23634
16311A3587151J82510j85977n83236q75239j016392j042153r57107p58181m90485
16302G860891k33655o7228l4246r5961j50011j28300m5536N3464J55068K65069
16292G579555L56003L81451L33690K55180J81681Q5040o0267j89605k28232j73077
16282H521419n6513Q3852J96360K39627K38769K54933K86259K68174J61707J2571
16272A0207158r5724j17858m9534J01338L05276M91086O06127O57619O68998O62337
$$ y = [18609414, 18453892, 18276814, 17951453, 17432169, 16748140, 15940311, 15036025, 14070428, 13101088, 12213569, 11513209, 11073125, 10885886, 10890481, 11027717, 11253184, 11520879, 11766047, 11919901, 11966686, 11954139, 11921299, 11879553, 11870140, 11969756, 12235885, 12662939, 13163517, 13587151, 13769661, 13583684, 13000448, 12125209, 11108817, 10066664, 9109557, 8351376, 7860891, 7627236, 7560008, 7525762, 7429801, 7279790, 7151490, 7105954, 7159418, 7314486, 7579555, 7935558, 8317009, 8650699, 8905879, 9087560, 9172600, 9112333, 8922728, 8694496, 8521419, 8464906, 8548758, 8745118, 8984745, 9223514, 9478447, 9764706, 10032880, 10194587, 10207158, 10111434, 9993576, 9944042, 10045380, 10350656, 10841742, 11447869, 12105488, 12774486, 13436823]
16262A3436823O57011O62491O78833O73163N96926M31511K24123P6483J6195n6328
16252A7397231k23044m58469o87951q49800r25793r59042r92125r83622q74109
16243A0443276p01877n62732m89903m53214m09544l31406k48823k34147l12177
16234F699453m16233m49819l66792j84143K7631J69065K06531K24938L27152N25250
16224F763033P57214R23213R30987P61732M71599J49227j16337k57230k56440
16215A0126998j57305m5368J3990L2690N6209J11464J95050K60462K47299J40531
16205A0982020J867p2279n1456J997K3771L0993P2930J27302J43498J32951J33491
16194A1527085J62110K22605K99870L69876M22445M46535M09352K82377Q3550
$$ y = [13436823, 14093834, 14756325, 15435158, 16108321, 16705247, 17136758, 17360881, 17437364, 17453559, 17397231, 17174187, 16715718, 16027767, 15177967, 14252174, 13293132, 12301007, 11317385, 10443276, 9741399, 9178667, 8688764, 8235550, 7826006, 7494600, 7245777, 7011630, 6699453, 6283220, 5833401, 5466609, 5282466, 5310097, 5479162, 5685693, 5910631, 6237783, 6763033, 7520247, 8443460, 9374447, 10136179, 10607778, 10757005, 10640668, 10383438, 10126998, 9969693, 9924325, 9938315, 9971005, 10027214, 10138678, 10333728, 10594190, 10841489, 10982020, 10983887, 10911608, 10860152, 10862149, 10885920, 10916913, 10989843, 11117145, 11260643, 11393594, 11527085, 11689195, 11911800, 12211670, 12581546, 13003991, 13450526, 13859878, 14142255, 14225805]
16185A4225805j30614l01438l87036l80115l05370j83149n1147m908r4869k14470
16175A2172689k00302J2977L62673P14434R38215R71784Q61559P15199N82090
16166A7131318M32851K52290Q9327Q145R857K5975J2065k74L8750J33432K55383
16155A8389119L86935N25499O74591Q55254J086723J355296J621537J841788K028720
16146B8765462K283267K722540L374873M118307M696703M808464M213482K809795
16138E7792893O98079j740894l910093n290986n716009n379309m645572l830475
16130B7977634l115152k587077k248162k022491j812403j536624j185239q39054
16122A2631432n70169l59735j63714j040P7613N4161l4020j06792j25611j41194
$$ y = [14225805, 14095191, 13793753, 13406717, 13026602, 12721232, 12538083, 12486936, 12482028, 12387159, 12172689, 11972387, 11985364, 12348037, 13062471, 14000686, 14972470, 15834029, 16549228, 17131318, 17564169, 17816459, 17905786, 17913931, 17923788, 17949763, 17961828, 17961554, 18000304, 18133736, 18389119, 18776054, 19301553, 19976144, 20831398, 21918121, 23273417, 24894954, 26736742, 28765462, 31048729, 33771269, 37146142, 41264449, 45961152, 50769616, 54983098, 57792893, 58490972, 56750078, 52839985, 47548999, 41832990, 36453681, 31808109, 27977634, 24862482, 22275405, 20027243, 18004752, 16192349, 14655725, 13470486, 12631432, 12061263, 11701528, 11537814, 11536774, 11614387, 11668548, 11634528, 11527736, 11402125, 11260931]
16112A1260931j99126k53904k24231j01961L8364J27329J50284J15149L2341o1252
16102A0883924j13134j21480j52681k45970l46839l84128l51624k78743j77630
16093H711695p0131j5781n0846j24180j47998j20255j18062j55133j58182p9912
16083G671215M3612J29582J19145K2185j00427j69798j07847R3468L54177N92926
16073H648238P66970Q72497R26872R26707Q51439P14906N58595L83493J69422
16064A4819139l4717j31226r5883q435M6678O4474Q0220Q3629L2646r7208k96743
16053A4462574n04693o36621o60379o03934m88816k99654k0759L09142N98159
16044A2155019P80544Q66442Q95359Q93672Q69344Q27451Q17602R12440J104738
$$ y = [11260931, 11061805, 10807901, 10583670, 10481709, 10520073, 10647402, 10797686, 10912835, 10945176, 10883924, 10770790, 10649310, 10496629, 10250659, 9903820, 9519692, 9168068, 8889325, 8711695, 8641564, 8625783, 8574937, 8450757, 8302759, 8182504, 8064442, 7909309, 7751127, 7671215, 7714827, 7844409, 7963554, 7985739, 7885312, 7715514, 7607667, 7701135, 8055312, 8648238, 9415208, 10287705, 11214577, 12141284, 12992723, 13707629, 14266224, 14649717, 14819139, 14784422, 14653196, 14557313, 14548878, 14595556, 14660030, 14740250, 14823879, 14856525, 14759317, 14462574, 13957881, 13321260, 12660881, 12056947, 11568131, 11268477, 11247718, 11556860, 12155019, 12935563, 13802005, 14697364, 15591036, 16460380, 17287831, 18105433, 19017873, 20122611]
16035B0122611J313190J484195J605357J680162J725513J758425J796606J848591
16027C3334650J884925J843664J680193J401588J022304N29336p6478p48138j406098
16018C9465946j966319k364332k576274k605068k474055k244107j981364j710114
16010B1544313j419796j126550q95404p74718p39844p10326o11200m39479k71618
16001A4555378j95478k36050l26108l83309l98260l94135l90726m14908m52634
15992A1363770m41342l51391k15587j01833p4092j36710k43493l43410l69246
15983I086666k58672n2380J23064K13291K64743L14153L66873M21987M54012M32048
15973A1365785L50244K10904K8091j26998j58711k8260K43398N84035Q72897J008849
$$ y = [20122611, 21435801, 22919996, 24525353, 26205515, 27931028, 29689453, 31486059, 33334650, 35219575, 37063239, 38743432, 40145020, 41167324, 41696660, 41620182, 40872044, 39465946, 37499627, 35135295, 32559021, 29953953, 27479898, 25235791, 23254427, 21544313, 20124517, 18997967, 18102563, 17327845, 16588001, 15877675, 15266475, 14826996, 14555378, 14359900, 14123850, 13797742, 13414433, 13016173, 12622038, 12231312, 11816404, 11363770, 10922428, 10571037, 10355450, 10253617, 10179525, 10042815, 9799322, 9455912, 9086666, 8827994, 8775614, 8898678, 9111969, 9376712, 9690865, 10057738, 10479725, 10933737, 11365785, 11716029, 11926933, 11955024, 11828026, 11669315, 11641055, 11884453, 12468488, 13341385, 14350234]
15963A4350234J006139R62071R26510Q93570Q54520P89288O77308N41820M25119
15954B1426579L29656K25452R1859n2825j65928k27282k50151k53694k50259k63751
15944B0609656l14615l65693l53779k64649j23897J6475P9650M1094j4197R361
15934A9319406J14396K58945M22876N87419P04383P20240O34946N09132L82700
15925B3654443K29298K3041k06000m05835n29747n29500m15944k89466k41073
15916B1289217k94162m35283o09804p23682p05038n54742l60454k43800k46151
15907A7116101k81527k35136p0994J58874L53441M10020L06610J24349l9157j34550
15897A7708031j40723m2369J37652L36301N05078O32537P08566O90811N33341
$$ y = [14350234, 15356373, 16318444, 17244954, 18138524, 18993044, 19782332, 20459640, 21001460, 21426579, 21756235, 21981687, 22073546, 22020721, 21854793, 21627511, 21377360, 21123666, 20873407, 20609656, 20295041, 19929348, 19575569, 19310920, 19187023, 19203498, 19283148, 19324242, 19310045, 19319406, 19433802, 19692747, 20115623, 20703042, 21407425, 22127665, 22762611, 23271743, 23654443, 23883741, 23906782, 23700782, 23294947, 22765200, 22235700, 21819756, 21530290, 21289217, 20995055, 20559772, 19949968, 19226286, 18521248, 17966506, 17606052, 17362252, 17116101, 16834574, 16599438, 16528444, 16687318, 17040759, 17450779, 17757389, 17881738, 17842581, 17708031, 17567308, 17524939, 17662591, 17998892, 18503970, 19136507, 19845073, 20535884, 21069225]
15888B1069225K57346l4945k32866l10311l16911k82168j97007o3423J01729K76056
15878B0266725M09294M46783L95684L27813L23431M03856N10316N74222N89191
15869B4247315N81381N46590M64880L45191J98102O520k19395m22401n46090n50660
15859B4651433m26152k17449J3619K35403M13933M96840M74000M03049L62632
15850B6407308L96951N08601O85654Q73334R41992Q09302N62799L67139L19803
15841C1872883M34138O58428Q74629R74850R56594R05081Q96674R31971R52775
15832C9458023R20590Q67060Q73028J017363J334172J794750K302171K728175
15824E1295332K982731L044666K964968K870035K908497L157278L606686M215649
$$ y = [21069225, 21326571, 21291626, 21058760, 20748449, 20431538, 20149370, 19952363, 19888940, 19990669, 20266725, 20676019, 21122802, 21518486, 21846299, 22169730, 22573586, 23083902, 23658124, 24247315, 24828696, 25375286, 25840166, 26185357, 26383459, 26389979, 26170584, 25748183, 25202093, 24651433, 24225281, 24007832, 24021451, 24256854, 24670787, 25167627, 25641627, 26044676, 26407308, 26804259, 27312860, 27998514, 28871848, 29813840, 30623142, 31185941, 31553080, 31872883, 32307021, 32965449, 33840078, 34814928, 35771522, 36676603, 37573277, 38505248, 39458023, 40378613, 41245673, 42118701, 43136064, 44470236, 46264986, 48567157, 51295332, 54278063, 57322729, 60287697, 63157732, 66066229, 69223507, 72830193, 77045842]
15816G7045842M936695N744853O683510P822029R182569J0757221J2555859J4574094
15808A49302672J6710622J8712728K0136016K0298954J8341368J3533430N840126
15801B62875916l562062j2494293j8920738k2021342k2246953k0644631j8201770
15794A44784127j5551482j2995737j0653145q586112o856809n474809m349508
15787H0316525l383494k559060j892177j356514q68051l72276O1969L43646N22820
15778G0813388P47213J106933J575681K094219K682102L420301M342290N386237
15770I2168364O442646P418739Q268890Q999992R633370J0138553J0427702J0386198
15762A63884454R832208Q478575O052346K527653j739903o082243r763717j2265411
$$ y = [77045842, 81982537, 87727390, 94410900, 102232929, 111415498, 122172719, 134728578, 149302672, 166013294, 184726022, 204862038, 225160992, 243502360, 257035790, 262875916, 259313854, 246819561, 227898823, 205877481, 183630528, 162985897, 144784127, 129232645, 116236908, 105583763, 96997651, 90140842, 84666033, 80316525, 76933031, 74373971, 72481794, 71125280, 70257229, 69884953, 69946922, 70290568, 70813388, 71560601, 72667534, 74243215, 76337434, 79019536, 82439837, 86782127, 92168364, 98611010, 106029749, 114298639, 123298631, 132932001, 143070554, 153498256, 163884454, 173716662, 182195237, 188247583, 190775236, 189035333, 182953090, 173189373, 160923962]
15754A60923962j3433483j3457985j2718433j1562356j0191967q732177p313789
15747H3513772o034131m897983l890203l076232k548930k304140k229777k202628
15739E6329748k152986k056573j921775j796873j730630j690425j558310j234514
15731D2187662p51373k60095Q0863J92950R5799j17960l23927m31283m16460l03339
15721C9952837j31827O9343K89081N12082P18963R03180J066119J207670J330116
15712D5917564J454188J608945J792341J972712K134520K319211K615953L060981
15704F2876415L574622M083964M640339N331941O163954P056849P877876Q442828
15696A10048788Q527117P918486O496193M292660J530095j405791m069449o081715
$$ y = [160923962, 147490479, 134032494, 121314061, 109751705, 99559738, 90827561, 83513772, 77479641, 72581658, 68691455, 65615223, 63066293, 60762153, 58532376, 56329748, 54176762, 52120189, 50198414, 48401541, 46670911, 44980486, 43422176, 42187662, 41436289, 41176194, 41257057, 41450007, 41545806, 41427846, 41103919, 40672636, 40256176, 39952837, 39821010, 39890353, 40179434, 40691516, 41410479, 42313659, 43379778, 44587448, 45917564, 47371752, 48980697, 50773038, 52745750, 54880270, 57199481, 59815434, 62876415, 66451037, 70535001, 75175340, 80507281, 86671235, 93728084, 101605960, 110048788, 118575905, 126494391, 132990584, 137283244, 138813339, 137407548, 133338099, 127256384]
15688A27256384p216512p452809o981144o102560n065855l988856k922061j911964
15680H5614623r84199j30240O59573J371636K004179K616165L270347L915814
15672I8337898M392963M549239M320539L738376K894793J910374Q92862q0578
15664A20956466r18886j508181j735369j489540p06649N34807K041616L682973
15656A20857237N469318P440477R557115J1749066J3993943J6264537J8390740
15649B03722433J9999560K0536260J9298075J5584063R105562N22164q459021
15642B80309096j5824509k0300108k1772799k0970641j8878204j6272148j3574911
15635A52715776j0978985q602849o507164m650972k918598j226471M06048J915808
$$ y = [127256384, 120039872, 112587063, 105605919, 99503359, 94437504, 90448648, 87526587, 85614623, 84630424, 84500184, 85159757, 86531393, 88535572, 91151737, 94422084, 98337898, 102730861, 107280100, 111600639, 115339015, 118233808, 120144182, 121037044, 120956466, 120037580, 118529399, 116794030, 115304490, 114597841, 115132648, 117174264, 120857237, 126326555, 133767032, 143324147, 155073213, 169067156, 185331693, 203722433, 223721993, 244258253, 263556328, 279140391, 288245953, 288768117, 280309096, 264484587, 244184479, 222411680, 201441039, 182562835, 166290687, 152715776, 141736791, 133133942, 126626778, 121975806, 119057208, 117830737, 118236785, 120152593]
15627A20152593L289257M548645N589066O045881N444523L545417N74961k781677
15619A46408666n630846p295851p636329o965298n728182m299222k935697j782805
15611A04134436q73025j63380L61944N76381K11910r49922k833810m961252o641019
15602H8862263p398266p237024o512940n619306m780792m063827l466517k961659
15594D6821932k521800k131405j753224j327267q59207m47392j84745p4674o5087
15585C7457131j50031l54190o17054q14533q66312p35867m20218J7080M89014
15576C4005020R31752J287180J525172J675623J786236J906538K105287K413949
15568D7636757K769591L082641L335518L557417L769727M005710M301395M645901
$$ y = [120152593, 123441850, 127990495, 133579561, 139625442, 145069965, 148615382, 149190343, 146408666, 140777820, 133481969, 125845640, 118880342, 113152160, 108852938, 105917241, 104134436, 103261411, 103098031, 103459975, 104036356, 104248266, 103298344, 100464534, 95503282, 88862263, 81463997, 74226973, 67714033, 62094727, 57313935, 53250108, 49783591, 46821932, 44300132, 42168727, 40415503, 39088236, 38229029, 37781637, 37596892, 37522218, 37457131, 37307100, 36952910, 36335856, 35521323, 34655011, 33919144, 33498926, 33516006, 34005020, 34936772, 36223952, 37749124, 39424747, 41210983, 43117521, 45222808, 47636757, 50406348, 53488989, 56824507, 60381924, 64151651, 68157361, 72458756, 77104657]
15560G7104657M950176N042236M712693L866332K688296J549459P13340K17556
15552A00844745l0135j24921p0465J86553O41736J236640J921892K643030L315397
15543A10564472L863141M222421M241727L673050K349502L43257k040992m400633
15535A22815945o366009p682020q259309q166086p567602o670224n673940m720251
15527F7710504l874460l163594k608545k214083j951539j762939j589895j407076
15519D9138373j242278j148090j124848j115809j076570r87794q31543o08140
15511D1003301l32252J5343M86967J106918J841748K638065L472176M348425N193570
15502E9774261N760483N710140M759499K827317K45204k263700m043415m893676
$$ y = [77104657, 82054833, 87097069, 91809762, 95676094, 98364390, 99913849, 100627189, 100844745, 100814610, 100689689, 100619224, 100805777, 101447513, 102684153, 104606045, 107249075, 110564472, 114427613, 118650034, 122891761, 126564811, 128914313, 129257570, 127216578, 122815945, 116449936, 108767916, 100508607, 92342521, 84774919, 78104695, 72430755, 67710504, 63836044, 60672450, 58063905, 55849822, 53898283, 52135344, 50545449, 49138373, 47896095, 46748005, 45623157, 44507348, 43430778, 42442984, 41611441, 41003301, 40671049, 40686392, 41173359, 42280277, 44122025, 46760090, 50232266, 54580691, 59774261, 65534744, 71244884, 76004383, 78831700, 79076904, 76813204, 72769789, 67876113]
15494F7876113m977375m577090l977508l404309l006061k848927k880930k944208
15486C9259705k899973k737377k511660k238984j907318j549933j257868j095041
15478B3061551j035773r95295r07746p70649o17428m80098l83591l24626k51210
15469A7295135j32671m5781j10380l38491o17023q20433q92263q53202p63338
15460A2721553o58665n26371l65025k29817j55052j15987q8690p4531p1598o7607
15450A0368210o4038o2731m0388L3611J58480K91742L79146M07181M31036N22816
15440A2425065O79164Q12643Q37238P19749M77676J72112j27775l74441n20453
15431A5100978n38000m79872m55790n31112o72630q00040q50698q10855p41560
$$ y = [67876113, 62898738, 58321648, 54344140, 50939831, 47933770, 45084843, 42203913, 39259705, 36359732, 33622355, 31110695, 28871711, 26964393, 25414460, 24156592, 23061551, 22025778, 21030483, 20122737, 19352088, 18734660, 18254562, 17870971, 17546345, 17295135, 17162464, 17116683, 17006303, 16667812, 16050789, 15230356, 14338093, 13484891, 12721553, 12062888, 11536517, 11171492, 10941675, 10786623, 10670636, 10581946, 10507415, 10435817, 10368210, 10304172, 10241441, 10201053, 10234664, 10393144, 10684886, 11064032, 11471213, 11902249, 12425065, 13104229, 13916872, 14754110, 15473859, 15951535, 16123647, 15995872, 15621431, 15100978, 14562978, 14083106, 13627316, 13096204, 12423574, 11623534, 10772836, 9961981, 9220421]
15422I220421p28298p68924p70424o47684l89425n0799K96423O01818Q35277R69406
15412H567791R74920Q54303O86130N88055O21655P68730R58824J106046J160932
15403A6287386J112936R66408P39253M74057K33097O0683m3631j09500j67759
15394A9552930k43327l44243m37683m90607n15454n57767o42981p26778p19027
15385A4875063n69137l35264j51123j10724k06252l69691n21165n96942n90211
15376A1424554n36426m47184l22852j95931q6032K8087J63143L15297M54275N06321
15366A1303252L97383J43689j28169k80861k77918j91171j20738j13811j30370
15357A0601286q8309L3868J70828K45011K23801J26520q458j52252k73858l41978
$$ y = [9220421, 8492123, 7723199, 6952775, 6305091, 5915666, 5864867, 6161290, 6763108, 7598385, 8567791, 9542711, 10397014, 11083144, 11671199, 12292854, 13061584, 14020408, 15126454, 16287386, 17400322, 18366730, 19105983, 19580040, 19813137, 19873820, 19830189, 19720689, 19552930, 19309603, 18965360, 18527677, 18037070, 17521616, 16963849, 16320868, 15594090, 14875063, 14305926, 13970662, 13819539, 13708815, 13502563, 13132872, 12611707, 12014765, 11424554, 10888128, 10440944, 10118092, 9922161, 9836129, 9864216, 10027359, 10342656, 10796931, 11303252, 11700635, 11844324, 11716155, 11435294, 11157376, 10966205, 10845467, 10731656, 10601286, 10512977, 10546845, 10717673, 10962684, 11186485, 11313005, 11304547, 11152295, 10878437, 10536459]
15347A0536459l37594k61844j59333r2911p0984m0485L9067J53476K75486L87020
15337A0428357M63672M65827L68658K28135J31722P5087j8802j64937k84629l27209
15327A1365881l27570l25258l24476l25584l30076l36527l38141k99090j58212
15318H600947R1054L46694M95381N09094M25326L26266K82517K87117L14445L88183
15308A2067024N40199P40372R10749R73384Q82643O52167L48261P4803q9168j67354
15298A6933080k31698l06919l73062m11788m20334m13354m18094m42680m60316
15289A3454835m48260m20015l95302l60905k74345j15202P7784K42871L40811
15280A2102272L58698L10661K24935J44058J23446J56099J52580N8047p4336j78946
$$ y = [10536459, 10198865, 9937021, 9777688, 9684777, 9613793, 9573308, 9612375, 9765851, 10041337, 10428357, 10892029, 11357856, 11726514, 11954649, 12086371, 12161458, 12142656, 11977719, 11693090, 11365881, 11038311, 10713053, 10388577, 10062993, 9732917, 9396390, 9058249, 8759159, 8600947, 8692001, 9038695, 9534076, 10043170, 10468496, 10794762, 11077279, 11364396, 11678841, 12067024, 12607223, 13347595, 14258344, 15231728, 16114371, 16766538, 17114799, 17189602, 17100434, 16933080, 16701382, 16394463, 16021401, 15609613, 15189279, 14775925, 14357831, 13915151, 13454835, 13006575, 12586560, 12191258, 11830353, 11556008, 11440806, 11518590, 11761461, 12102272, 12460970, 12771631, 12996566, 13140624, 13264070, 13420169, 13572749, 13630796, 13556460, 13377514]
15270A3377514k71579l77570m69152n20067n21676m55104l18187j53730l0781
15261A0259668p75p2105j95102k69174k37530j36757k0008R2600K05312L14506
15251I940635L86759L76404K67647J05460j9131l6438L1168Q6325O9842K0755
15241A1229426j1745l4704p3487j55529l03695m87067o33169p04929p15936o67004
15231G442161n18475k57245N4873L29638N06928N62326N06349L78929K19242N8982
15221I283708n0042p7319p4037r5534j17177j16844j57126l00964m95564n98089
15211G201012n20179k95638k0574K08673L47481M23334M78080N14511N04301M18794
15201I259795K52986M8518j11104j48818n6433Q1804J67357J55674N1129p3382
$$ y = [13377514, 13105935, 12728365, 12259213, 11739146, 11217470, 10762366, 10444179, 10290449, 10259668, 10258893, 10186788, 9991686, 9722512, 9484982, 9348225, 9328217, 9420817, 9626129, 9940635, 10327394, 10703798, 10971445, 11076905, 11057774, 11021336, 11052504, 11138829, 11208671, 11229426, 11217681, 11182977, 11109490, 10953961, 10650266, 10163199, 9530030, 8825101, 8109165, 7442161, 6923686, 6666441, 6721314, 7050952, 7557880, 8120206, 8626555, 9005484, 9224726, 9283708, 9233666, 9156347, 9082310, 8986776, 8869599, 8752755, 8595629, 8294665, 7799101, 7201012, 6680833, 6385195, 6364621, 6573294, 6920775, 7344109, 7822189, 8336700, 8841001, 9259795, 9512781, 9561299, 9450195, 9301377, 9244944, 9326748, 9494105, 9649779, 9700908, 9627526]
15191I627526r8599J3928J63763J94108M5371j67364k78972k34540j03043O489
15181I168667K5901n0277j66365k21142j48453K3760K09763L25234L22479K20783
15171I710350Q0534p2501k37728l72810m27915m09407l34632k03551m0850J03048
15161G794538J75931J49104O7474J3663J0069K2422J0831l7625r2709j13558r6726
15150G903414q4480j08855j44212j55462j49031j54302k00558k91271l69542l47183
15140E898518k07926l5250Q6002J37628J41087J12406N4610k4809j08230j76162
15130E877874k12286j95403j12194K0393J56143K47978K94949L17126K94578K14550
15120F903708J35522J20029J68393K48597L30486L96910M43913M69492M72460
$$ y = [9627526, 9528927, 9542855, 9706618, 9900726, 9946097, 9778733, 9499761, 9265221, 9162178, 9168667, 9194568, 9144291, 8977926, 8756784, 8608331, 8632091, 8841854, 9167088, 9489567, 9710350, 9790884, 9718383, 9480655, 9107845, 8679930, 8270523, 7935891, 7732340, 7691490, 7794538, 7970469, 8119573, 8187047, 8200710, 8210779, 8233201, 8244032, 8206407, 8113698, 8000140, 7903414, 7818934, 7710079, 7565867, 7410405, 7261374, 7107072, 6906514, 6615243, 6245701, 5898518, 5690592, 5655342, 5741344, 5878972, 6020059, 6132465, 6187075, 6162266, 6054036, 5877874, 5665588, 5470185, 5357991, 5378384, 5534527, 5782505, 6077454, 6394580, 6689158, 6903708, 7039230, 7159259, 7327652, 7576249, 7906735, 8303645, 8747558, 9217050, 9689510]
15111I689510M58428M46315M49015M41603L80808K39718L2903j55282k25116j80019
15101A1577883j41105k22469m15100o08259o95855o44285m94863l18504j69681
15092G867762q1012o6991j16066k01774l00897l92075m41722m16435l20863k07371
15082E322556j20363n3980O1L5172M8989N3377Q3924J64458K67702L20090K60511
15071F382497Q9035j43315l60628n06000n68943n63583m93916l48056j49280J7921
15061C355732Q0458L1707r1760k45792l84977m53148l96362j92773J22218M45754
15051B271057O69646P68470P94468P92186P40135N89267L45473Q4060j02013j65872
15041F786877j46443j17775j05935q9052l3150R2063K71050M17895M39974L21097
$$ y = [9689510, 10147938, 10594253, 11043268, 11484871, 11865679, 12105397, 12138300, 11983018, 11757902, 11577883, 11436778, 11214309, 10799209, 10190950, 9495095, 8850810, 8355947, 8037443, 7867762, 7786750, 7719759, 7603693, 7401919, 7101022, 6708947, 6267225, 5850790, 5529927, 5322556, 5202193, 5148213, 5148274, 5183446, 5232435, 5285812, 5369736, 5534194, 5801896, 6121986, 6382497, 6471532, 6328217, 5967589, 5461589, 4892646, 4329063, 3835147, 3487091, 3337811, 3355732, 3436190, 3467897, 3376137, 3130345, 2745368, 2292220, 1895858, 1703085, 1825303, 2271057, 2940703, 3709173, 4503641, 5295827, 6035962, 6625229, 6970702, 7054762, 6952749, 6786877, 6640434, 6522659, 6416724, 6327672, 6294522, 6386585, 6657635, 7075530, 7515504, 7836601]
15031G836601J28646n5517j80060k08307j46278p5129n3724m1579O194M4176K9530
15020G284553L5016J47525L41063N14697N65984M25796J23006j85143l26835k65876
15010H659786j10950J2779P5943J22081J71732K11070K14422J55790P0579L6917
15000I620149P4999J38812J81833J99290K32479L30298M81190N85512N57333M39952
14990A2841847L40540K93963K74770K79543L38539M88766P27399R92565J220097
14981A7798029J373858J430371J403379J354543J356393J468796J718738K091298
14973B9995405K552034L058078L565471M061673M522843M838631M874686M571349
14965F2040170L935524L016038J894023O69386n47051j654967k580417l267532
$$ y = [7836601, 7965247, 7909730, 7729670, 7521363, 7375085, 7299956, 7246232, 7204653, 7210847, 7255023, 7284553, 7319569, 7467094, 7808157, 8322854, 8888838, 9314634, 9437640, 9252497, 8925662, 8659786, 8548836, 8561615, 8637558, 8759639, 8931371, 9142441, 9356863, 9512653, 9583232, 9620149, 9695148, 9833960, 10015793, 10215083, 10447562, 10777860, 11259050, 11844562, 12401895, 12841847, 13182387, 13476350, 13751120, 14030663, 14369202, 14857968, 15585367, 16577932, 17798029, 19171887, 20602258, 22005637, 23360180, 24716573, 26185369, 27904107, 29995405, 32547439, 35605517, 39170988, 43232661, 47755504, 52594135, 57468821, 62040170, 65975694, 68991732, 70885755, 71555141, 71008090, 69353123, 66772706, 63505174]
14957F3505174l687905l859917l823322l634202l370801l084710k783376k467306
14949C6793635k140093j815341j526813j277165j031371p83196n67155l94374
14941B7258127k02723P4054M19367P70893J066343J256902J341493J334501J223227
14932C4542184J007440P10248L19446j80169p17025j186888j559781j855268k054838
14923B9025349k100395j954812j615502j141083o96774m72637n12529o73604p73652
14914A9084361p38856o00484m13242k34558j23012j22329k56866m93757p21553
14905A5379704q14789p30181n42855l74058k81431k52649k65599k80642k29389
14896A1608111p1378J54498L47101M34917M29309L84362L62677M25884N85055
$$ y = [63505174, 59817269, 55957352, 52134030, 48499828, 45129027, 42044317, 39260941, 36793635, 34653542, 32838201, 31311388, 30034223, 29002852, 28219656, 27652501, 27258127, 27055404, 27129458, 27548825, 28319718, 29386061, 30642963, 31984456, 33318957, 34542184, 35549624, 36259872, 36579318, 36399149, 35682124, 34495236, 32935455, 31080187, 29025349, 26924954, 24970142, 23354640, 22213557, 21516783, 21044146, 20531617, 19858013, 19084361, 18345505, 17745021, 17331779, 17097221, 16974209, 16851880, 16595014, 16101257, 15379704, 14564915, 13834734, 13291879, 12917821, 12636390, 12383741, 12118142, 11837500, 11608111, 11536733, 11691231, 12038332, 12473249, 12902558, 13286920, 13649597, 14075481, 14660536]
14887A4660536P77241R38388J076442J231382J400503J570891J742903J901197
14879B5299483K041055K186444K331106K393026K278977J945355J362763N59481
14871D0397690k95977r77889j348599j383956j139207p50324m06765k43373k66959
14862C3584641m08703o04012p89672q98042r12763q79664q41203q02120p56115
14853B6692347p01518o37742n84197n86121o75522q22652r35527r35202q22905
14844A9990961o66586n28712m20815l17682j83698j2764J45945K47245L05836
14835A8559730L54644L78468L33728K36048J60763J44500J63961K06954K86813
14826B0825609L94130M89491N31688N16937N11657N96016P75832J005156J256446
$$ y = [14660536, 15437777, 16376165, 17452607, 18683989, 20084492, 21655383, 23398286, 25299483, 27340538, 29526982, 31858088, 34251114, 36530091, 38475446, 39838209, 40397690, 40101713, 39123824, 37775225, 36391269, 35252062, 34501738, 34094973, 33851600, 33584641, 33175938, 32571926, 31782254, 30884212, 29971449, 29091785, 28250582, 27448462, 26692347, 25990829, 25353087, 24768890, 24182769, 23507247, 22684595, 21749068, 20813866, 19990961, 19324375, 18795663, 18374848, 18057166, 17873468, 17860704, 18006649, 18253894, 18559730, 18914374, 19292842, 19626570, 19862618, 20023381, 20167881, 20331842, 20538796, 20825609, 21219739, 21709230, 22240918, 22757855, 23269512, 23865528, 24641360, 25646516, 26902962]
14817B6902962J539571J858209K149795K328328K405632K487375K654371K916236
14809D5242479L231522L541122L822387M127190M535735N053271N590626O053529
14801H1197861O410649O665759O798830O763510O502573N949324N069586L902206
14793A29260298K519481R69800o95679k390707m024702n523565o804960p759003
14785A05550963q279674q317335p922582p242876o448251n678183n032867m512325
14777E2116870l971724l285772k555634k005752j710275j529983j275763q73987
14769C4907980l75394J24806N72683J008613J490758J962803K243477K098641
14761D4034367J335856n774j527549k712077l334397l518922l458245l231465
$$ y = [26902962, 28442533, 30300742, 32450537, 34778865, 37184497, 39671872, 42326243, 45242479, 48474001, 52015123, 55837510, 59964700, 64500435, 69553706, 75144332, 81197861, 87608510, 94274269, 101073099, 107836609, 114339182, 120288506, 125358092, 129260298, 131779779, 132749579, 132053900, 129663193, 125638491, 120114926, 113309966, 105550963, 97271289, 88953954, 81031372, 73788496, 67340245, 61662062, 56629195, 52116870, 48145146, 44859374, 42303740, 40297988, 38587713, 37057730, 35781967, 34907980, 34532586, 34657392, 35230075, 36238688, 37729446, 39692249, 41935726, 44034367, 45370223, 45364449, 43836900, 41124823, 37790426, 34271504, 30813259, 27581794]
14753B7581794k870244k440542k015173j627116j264240r14273n91389l06490
14745A5552327m9691J75049L31065L86946L54213K67708J44971r15j49288k95616
14735A6716769m40072n74128o92034p80808q15858p87558p14182o20866n29523
14726A0761740m44021l20328j11298J57892M08301N78982O63352P00740P41961
14717A3137321Q14548R30097J085140J239588J352614J412235J402433J312495
14709B2686471J180249J073469J045165J120092J273802J443370J588444J694275
14701C3105337J748580J743452J686827J604694J522791J445230J350238J212008
14693D5419157J016117P52645M07843k1303n18234j035358j477101j752279j846728
$$ y = [27581794, 24711550, 22271008, 20255835, 18628719, 17364479, 16450206, 15858817, 15552327, 15502636, 15677685, 16008750, 16395696, 16749909, 17017617, 17162588, 17161673, 17012385, 16716769, 16276697, 15702569, 15010535, 14229727, 13413869, 12626311, 11912129, 11291263, 10761740, 10317719, 9997391, 9886093, 10043985, 10452286, 11031268, 11694620, 12395360, 13137321, 13951869, 14881966, 15967106, 17206694, 18559308, 19971543, 21373976, 22686471, 23866720, 24940189, 25985354, 27105446, 28379248, 29822618, 31411062, 33105337, 34853917, 36597369, 38284196, 39888890, 41411681, 42856911, 44207149, 45419157, 46435274, 47187919, 47595762, 47574459, 47056225, 46020867, 44543766, 42791487, 40944759]
14684D0944759j819897j745785j662452j573433j502489j502281j583377j686601
14676B7868444j726067j675203j588049j497610j388438j273049j199852j190764
14668A6329412j199788j138053r54387o73885l80219j82319j55374k62520l62811
14659A1020056l65323l32820l77561n04552o08488o08739n44884n05728m85921
14650F686040m00845k24001j9824J19972J50109R9125K708j25376k30611k22474
14640E834823n9380K17937M99089O53945O32367M77291K61187O3572m1330k1933
14630H517568R2328K23006K83613K28663O8020j47394l12816k95497n3292L09695
14620H913894O35162Q29616Q81006P99981N90305K71446r5718m12548n97615o46102
$$ y = [40944759, 39124862, 37379077, 35716625, 34143192, 32640703, 31138422, 29555045, 27868444, 26142377, 24467174, 22879125, 21381515, 19993077, 18720028, 17520176, 16329412, 15129624, 13991571, 13037184, 12363299, 11983080, 11800761, 11645387, 11382867, 11020056, 10654733, 10321913, 9944352, 9439800, 8831312, 8222573, 7677689, 7171961, 6686040, 6285195, 6061194, 6041370, 6161342, 6311451, 6410576, 6413284, 6287908, 6057297, 5834823, 5775443, 5993380, 6492469, 7146414, 7778781, 8256072, 8517259, 8580831, 8539501, 8517568, 8609896, 8832902, 9116515, 9345178, 9413198, 9265804, 8952988, 8657491, 8604199, 8913894, 9549056, 10378672, 11259678, 12059659, 12649964, 12921410, 12825692, 12413144, 11815529, 11169427]
14610A1169427o08197n27471m21859k93556j55830n5893j7336L0372J74101L89470
14600I683228N64681O28366N94744N27049M85339M82757M84139M45148L85908
14591A4281359L84877M81976O41055Q13113R83158J116526J125858R43740N87574
14582B1359236J60277k12180m67610o39575q03280r84364j138115j216799j218796
14573A4838794j151152j012861q49419p28744o60867o08658n30333l88362j66641
14564H741757J05352L52412N03209N38343M71794L16245R3986j27311k47823k17399
14554A0530565q7442L8661Q3578L3128p9038k20759l67377m68809m74432l92178
14544H595897k79295j72311q5525n7508j15510k08582k27344j00043J39967L70651
$$ y = [11169427, 10561230, 10033759, 9611900, 9318344, 9162514, 9106621, 9089285, 9119657, 9293758, 9683228, 10247909, 10876275, 11471019, 11998068, 12483407, 12966164, 13450303, 13895451, 14281359, 14666236, 15148212, 15789267, 16602380, 17585538, 18702064, 19827922, 20771662, 21359236, 21519513, 21307333, 20839723, 20200148, 19396868, 18412504, 17274389, 16057590, 14838794, 13687642, 12674781, 11825362, 11096618, 10435751, 9827093, 9296760, 8908398, 8741757, 8847109, 9199521, 9702730, 10241073, 10712867, 11029112, 11123098, 10995787, 10747964, 10530565, 10443123, 10481784, 10565362, 10598490, 10519452, 10298693, 9931316, 9462507, 8988075, 8595897, 8316602, 8144291, 8058766, 8001258, 7885748, 7677166, 7449822, 7349779, 7489746, 7860397]
14534G860397M73299M36893L74560M07258N45671O89568P11594N72119L48848
14525A2420207J40781l581p7437r3720o1109J5046J06608J77136K08883J92835
14515A3025649J18391k1550k11903m00413n23023n36860m42311k73272o3067J39788
14505A0811429K91908M06092N06245N86539O10791N15684K93834M7937j11495
14496A3958964j68299j66922j54442j54225j46128j08333o4398n2872q5381j55619
14486A2702345k42808l00672k89060k18946j35195o6123K587Q5493J62176K14582
14476A1914379K46962K73814L04484L43533M01863M62684M62695L67321K19470
14467A4997205P7818m3777j64569k73877l18726k72752j72801p4809O65N4281
$$ y = [7860397, 8333696, 8770589, 9145149, 9552407, 10098078, 10787646, 11499240, 12071359, 12420207, 12560988, 12557407, 12479970, 12386250, 12325141, 12340187, 12446795, 12623931, 12832814, 13025649, 13144040, 13122490, 12910587, 12510174, 11987151, 11450291, 11007980, 10734708, 10671641, 10811429, 11103337, 11509429, 12015674, 12602213, 13213004, 13728688, 14022522, 14070459, 13958964, 13790665, 13623743, 13469301, 13315076, 13168948, 13060615, 12996217, 12943345, 12857964, 12702345, 12459537, 12158865, 11869805, 11650859, 11515664, 11449541, 11452128, 11537621, 11699797, 11914379, 12161341, 12435155, 12739639, 13083172, 13485035, 13947719, 14410414, 14777735, 14997205, 15075023, 15031246, 14866677, 14592800, 14274074, 14001322, 13828521, 13753712, 13754377, 13808658]
14457A3808658N4275m2046j93158l09613l86322m79024n86942o47266o34683o01368
14447I982511n84650n55291m90850m29727m13759m23484m05451l26346j80171
14438F172782K8515K73740N12681P16712Q61364R16439Q76086P51250N43893K61687
14428A1915149n0558l06528m42043m62534m20657l92090m48166n90846p32286
14419H069441p71700o71663m46369j64343N5820J38288R6940L971m6900n265P6599
14408F334819J15024R2648L4677k1264m4310m7124l6696L5125J67882K55102K19308
14397G105191J02054q53k3019K6191N5750j7148j55113k43303k16213j18679o0638
14386F454220q7254j51173k14652k82012l48048l88297l85367l45573k97507k58397
$$ y = [13808658, 13862933, 13820887, 13627729, 13318116, 12931794, 12452770, 11865828, 11218562, 10583879, 9982511, 9397861, 8842570, 8351720, 7921993, 7508234, 7084750, 6679299, 6352953, 6172782, 6201297, 6475037, 6987718, 7704430, 8565794, 9482233, 10358319, 11109569, 11653462, 11915149, 11864591, 11558063, 11116020, 10653486, 10232829, 9840739, 9392573, 8801727, 8069441, 7297741, 6626078, 6179709, 6015366, 6071186, 6209474, 6306414, 6310385, 6263485, 6258220, 6334819, 6449843, 6542491, 6577168, 6555904, 6511594, 6464470, 6427774, 6462899, 6630781, 6885883, 7105191, 7207245, 7206392, 7183373, 7209564, 7265314, 7248166, 7093053, 6849750, 6633537, 6514858, 6454220, 6366966, 6215793, 6001141, 5719129, 5371081, 4982784, 4597417, 4251844, 3954337, 3695940]
14376C695940k01748j02420J8445J28365K22363K99455L49514L73538L87067M17415
14366E587934M78538N15427M28876K10497k8153j89939k65320k69708j92045l7375
14356F238732J27041K15964K03218J20918J195j37305k69695l66161m06934l79448
14346E347525k82861j45165j6334M3697J2056l9094j961J47787L38426N05763
14336E909839O37475P12593O80989N25964L10642J30648M1663K6240K1558j5926
14326H981685q2933j50233j96258k28678k57402k54821j93644p6419Q3985K53932
14316G879214L68398L83913L07812J64339j6534j79408k53252k07254q0519M2098
14306H408807P3960J618q9967j20276r6800o3123k2938M9803J54807K64332L54889
$$ y = [3695940, 3494192, 3391772, 3410217, 3538582, 3760945, 4060400, 4409914, 4783452, 5170519, 5587934, 6066472, 6581899, 7010775, 7221272, 7193119, 7003180, 6737860, 6468152, 6276107, 6238732, 6365773, 6581737, 6784955, 6905873, 6907068, 6769763, 6500068, 6133907, 5726973, 5347525, 5064664, 4919499, 4903165, 4946862, 4958918, 4919824, 4917863, 5065650, 5404076, 5909839, 6547314, 7259907, 7940896, 8466860, 8777502, 8908150, 8949813, 8976053, 8997611, 8981685, 8898752, 8748519, 8552261, 8323583, 8066181, 7811360, 7617716, 7541297, 7625282, 7879214, 8247612, 8631525, 8939337, 9103676, 9087142, 8907734, 8654482, 8447228, 8366709, 8408807, 8482767, 8484385, 8394418, 8274142, 8177342, 8114219, 8091281, 8141084, 8295891, 8560223, 8915112]
14295H915112M20475M69537N17275N73787O26917O43864N97814N02630L94769
14286A3662180K87728J95381J61620J97604K43400K23625R5523j19731l16603
14277A4630727l93784l65961l22515l29837l83681m27899m31253m20072m22540
14268A1133185m02487l11866j88521j26942j91393l79953o26336q33347r27633
14259G144707r04025p95879o22582l86937j03564J65819L36876L94448L87935
14250E616798L31401K07057M4832p9808j25441j07136l7998Q9331K35490L13358
14240F487884K86689J94976J05637Q3953J62441L03653M13457M10972K80860Q1701
14230H812223r1358j90889k46837k94323l25341l06376k14095q9476k6695q0196
$$ y = [8915112, 9335587, 9805124, 10322399, 10896186, 11523103, 12166967, 12764781, 13267411, 13662180, 13949908, 14145289, 14306909, 14504513, 14747913, 14971538, 15067061, 14947330, 14630727, 14236943, 13870982, 13548467, 13218630, 12834949, 12407050, 11975797, 11555725, 11133185, 10730698, 10418832, 10230311, 10103369, 9911976, 9532023, 8905687, 8072340, 7144707, 6240682, 5444803, 4822221, 4435284, 4331720, 4497539, 4834415, 5228863, 5616798, 5948199, 6155256, 6200088, 6120280, 5994839, 5887703, 5849705, 5939036, 6174526, 6487884, 6774573, 6969549, 7075186, 7159139, 7321580, 7625233, 8038690, 8449662, 8730522, 8812223, 8720865, 8529976, 8283139, 7988816, 7663475, 7357099, 7143004, 7053528, 7026833, 6946637]
14220F946637k23249l76912m50288m05700k99276k11530j73178j86532k30519
14211D389453k38953j70903q9537j04839k32012l54968l55342k26963m2284J30384
14201B704036K55710L25929L50397L41468L07145K58005K06564J51740Q5371K7053
14191E013418K3884Q3511J47147J60942J24386M7119q6977k54163l48486l01298
14181D609483j84132j14591j32126k10075l11646l75541l36857k16880j11354
14172B616281q6083j11264r5395K8015K39500M43178N41973M98854L26686N8218
14162D459963k33122m31071m63150l61769k01351l7645Q4986J47333J62674J50770
14152C277618J31740J23867J32329J62656K19434K79999L05609K80280K11064
$$ y = [6946637, 6723388, 6346476, 5896188, 5490488, 5191212, 4979682, 4806504, 4619972, 4389453, 4150500, 3979597, 3890060, 3785221, 3553209, 3198241, 2842899, 2615936, 2573652, 2704036, 2959746, 3285675, 3636072, 3977540, 4284685, 4542690, 4749254, 4900994, 4986365, 5013418, 5037302, 5120813, 5267960, 5428902, 5553288, 5600407, 5513430, 5259267, 4910781, 4609483, 4425351, 4310760, 4178634, 3968559, 3656913, 3281372, 2944515, 2727635, 2616281, 2530198, 2418934, 2323539, 2351554, 2591054, 3034232, 3576205, 4075059, 4401745, 4459963, 4226841, 3795770, 3332620, 2970851, 2769500, 2731855, 2816841, 2964174, 3126848, 3277618, 3409358, 3533225, 3665554, 3828210, 4047644, 4327643, 4633252, 4913532, 5124596]
14143E124596R8712m8447j89164k65699k45399j42976L535J61264L17335M65781
14133E279538N83568O47465O58392O30747N68736M61421L09994J38984l8163k21863
14123I018819l96074n35864o07212n80280m80140l52247k02238k9819J33379K49464
14113F217788L14116L45343L41950K90979K09998J43317J11384J01385J06765
14104H183025J41297K11057K91554L36354L24236K76204K00168O3463j41992l42074
14094I543292m40455m23461l52722k82740k32922k11111k25659k65382k74841
14085F833999j93869l7920R5402J10943l079j77122l25743l95332l76460k98996
14075E231823j93292q4965j6036m510j0962j2212m3884j17195j78945j81003j21728
$$ y = [5124596, 5223308, 5174861, 4985697, 4719998, 4474599, 4331623, 4335158, 4496422, 4813757, 5279538, 5863106, 6510571, 7168963, 7799710, 8368446, 8829867, 9139861, 9278845, 9240682, 9018819, 8622745, 8086881, 7479669, 6899389, 6419249, 6067002, 5864764, 5834945, 5968324, 6217788, 6531904, 6877247, 7219197, 7510176, 7720174, 7863491, 7974875, 8076260, 8183025, 8324322, 8535379, 8826933, 9163287, 9487523, 9763727, 9963895, 10027358, 9885366, 9543292, 9102837, 8679376, 8326654, 8043914, 7810992, 7599881, 7374222, 7108840, 6833999, 6640130, 6602210, 6697612, 6808555, 6805476, 6628354, 6302611, 5907279, 5530819, 5231823, 5038531, 4953566, 4937530, 4933020, 4922058, 4909846, 4865962, 4748767, 4569822, 4388819, 4267091]
14064D267091j6944J20984K68457L81774M31455M31232L97597L04907J24750j05214
14054F606089k96268l92841l86727k89461j49824m4043j4259k8434r451O1533
14044E056314J19383J16371N2320p4190k65240m73093n94137n59377l89621j44387
14034B844343J18093L24718M05752L59744K48852J34855M7264j3951p3854j46664
14024D249152j85812j25284K4772J81761K76035K94434K57374J88184J26634J15763
14014E403013J49849J76849J37980J4995j52017l06323m21355m96231n17209m64377
14004C525174l26510j03108J68493M09999N39361N13362L65588K02906J16511
13995E411776R7479P1755k3339j88021l38317l65360k41463k7372J79848K61886
$$ y = [4267091, 4250147, 4371131, 4639588, 5021362, 5452817, 5884049, 6281646, 6586553, 6711303, 6606089, 6309821, 5916980, 5530253, 5240792, 5090968, 5046925, 5032666, 5004232, 4994781, 5056314, 5175697, 5292068, 5344388, 5270198, 5004958, 4531865, 3937728, 3378351, 2988730, 2844343, 2962436, 3287154, 3692906, 4052650, 4301502, 4436357, 4483621, 4469670, 4395816, 4249152, 4063340, 3938056, 3962828, 4144589, 4420624, 4715058, 4972432, 5160616, 5287250, 5403013, 5552862, 5729711, 5867691, 5882686, 5730669, 5424346, 5002991, 4506760, 3989551, 3525174, 3198664, 3095556, 3264049, 3674048, 4213409, 4726771, 5092359, 5295265, 5411776, 5509255, 5581010, 5557671, 5369650, 5031333, 4665973, 4424510, 4397138, 4576986, 4838872]
13985D838872J44538j17140l76092n10015m76754l17482j28053M00M1028M9908
13975C149210Q4296J21928J01105l72j42128k51190k75631k12732j10841m6943
13965B416702m2699l7882L457M0879J6973q9675k37258l44629l76814l62466l20542
13954F66046k29195q2681N6435J23277J45783K07881L34508M52901M87455M48035
13944B610445L81908K86061J19416j21468l71259n21870m91649k98856m6421J57133
13934A703440K48565K26353J39756M3182m4761j27750j93635k20135k07950j81566
13924A385499j65101j52787j23736q5564l7971P4147K76393M85520N87502N35535
13914B779437L50375J07064q1953j41074q0744L3371J30942J68961J40381O0296
$$ y = [4838872, 4983410, 4866270, 4490178, 3980163, 3503409, 3185927, 3057874, 3058274, 3099302, 3149210, 3233506, 3355434, 3456539, 3456167, 3314039, 3062849, 2787218, 2574486, 2463645, 2416702, 2374003, 2336121, 2339578, 2380457, 2397430, 2307755, 2070497, 1725868, 1349054, 986588, 666046, 436851, 354170, 410605, 533882, 679665, 887546, 1222054, 1674955, 2162410, 2610445, 2992353, 3278414, 3397830, 3276362, 2905103, 2383233, 1891584, 1592728, 1546307, 1703440, 1952005, 2178358, 2318114, 2361296, 2316535, 2188785, 1995150, 1775015, 1567065, 1385499, 1220398, 1067611, 943875, 858311, 820340, 894487, 1170880, 1656400, 2243902, 2779437, 3129812, 3236876, 3154923, 3013849, 2933105, 2966476, 3097418, 3266379, 3406760, 3467056]
13904C467056n1518j71180k71114l35606l63483l63511l72334m23733m87186m94176
13894A33215m26817l43269l07240l27182l75300m11922l82694k56311n8957J50335
13884b606142L17809M31370N25564O13127O44292N72169M16436K49352J27699
13875A291676N3647J9316K7867O3220R7076R8853O1394K4264K4852K9921l2528
13864A759558j42700j97667j75951j58390j89597k29872k34676k04164j53584
13855G2957r7118m2528J4271O2789O3022k727p3726p4504m1377j03525k88233
13844e10699m72466n49278n02603l68059j84936L8586K91867N03653N76465M66847
13834g10623K07114j27055m42273o46795o83437n44035k67991O5462L39959M34594
$$ y = [3467056, 3415538, 3244358, 2973244, 2637638, 2274155, 1910644, 1538310, 1114577, 627391, 133215, -293602, -636871, -944111, -1271293, -1646593, -2058515, -2441209, -2697520, -2756477, -2606142, -2288333, -1856963, -1331399, -718272, -73980, 498189, 914625, 1163977, 1291676, 1345323, 1364639, 1392506, 1455726, 1552802, 1651655, 1713049, 1737313, 1762165, 1792086, 1759558, 1616858, 1419191, 1243240, 1084850, 895253, 665381, 430705, 226541, 72957, -24161, -66689, -52418, 10371, 73393, 70666, -3060, -77564, -118941, -222466, -510699, -983165, -1532443, -2035046, -2403105, -2588041, -2549455, -2257588, -1753935, -1177470, -710623, -503509, -630564, -1072837, -1719632, -2403069, -2947104, -3215095, -3149633, -2809674, -2375080]
13824b375080L09976P0731q7789l5370J96355M46898N39909M01375Q7120k90055
13814g35930o09583p59404p07101n29022l22489j20285J16442M19804P29371R28111
13804a590086R77684R36101Q54622P56345O43765M93978L07583J25862j8763j07967
13794C379124j30173j18203j28150j79532k53171l09370l08502k19008l3288J96656
13784A896383L97044N18288N21723L73334Q2788k37199m25887m27145l21002k05456
13774B172871j18499n8788l2672o3373j54170k70211l63704m02149l64711k57186
13764H7408j31629n1653n0098j07577j72893k15561k30158k14135j89357k05226
13754a480879k97390m44832n66602o00660n72917n38316n02709m26301k47390
$$ y = [-2375080, -2065104, -1994373, -2082162, -2117532, -1921177, -1474279, -934370, -532995, -445875, -735930, -1345513, -2104917, -2812018, -3341040, -3663529, -3783814, -3667372, -3247568, -2518197, -1590086, -612402, 323699, 1178321, 1934666, 2578431, 3072409, 3379992, 3505854, 3487091, 3379124, 3248951, 3130748, 3002598, 2823066, 2569895, 2260525, 1952023, 1733015, 1699727, 1896383, 2293427, 2811715, 3333438, 3706772, 3789560, 3552361, 3126474, 2699329, 2378327, 2172871, 2054372, 1995584, 1962912, 1899539, 1745369, 1475158, 1111454, 709305, 344594, 87408, -44221, -95874, -145972, -253549, -426442, -642003, -872161, -1086296, -1275653, -1480879, -1778269, -2223101, -2789703, -3390363, -3963280, -4501596, -5004305, -5430606, -5677996]
13745e677996N0714L58077N16957M67372K66863L1532j27262j51250m1141J50404
13735d155730L56127N57716P71508R63953J049135R85521P98387N25119K33352
13726B085088L3295k2123K1508J12010K20202K79679J96246m7135l50987n95377
13716A932406p09538o63538m91808l22145k90965m11207n67106o17637n11541
13707b653079l03870p9651R4872J92942K34518K79772L90073N55731O91809P23983
13697A27100O41223M77868K88110J34522O0160O1592J07415J62620J97253J98131
13687B455994J82870J82178J98361K06178J75067R6003q565j25165k62933m01673
13677B698315m76837m20107k13626P1943L16043M36729M11584K44056m3180l66549
$$ y = [-5677996, -5627282, -5269205, -4752248, -4284876, -4018013, -3986481, -4113743, -4264993, -4306134, -4155730, -3799603, -3241887, -2470379, -1506426, -457291, 528230, 1326617, 1851736, 2085088, 2118383, 2096260, 2117768, 2229778, 2449980, 2729659, 2925905, 2878770, 2527783, 1932406, 1222868, 559330, 67522, -254623, -545588, -956795, -1523901, -2141538, -2653079, -2956949, -3036600, -2941728, -2748786, -2514268, -2234496, -1844423, -1288692, -596883, 127100, 768323, 1246191, 1534301, 1668823, 1728983, 1790575, 1897990, 2060610, 2257863, 2455994, 2638864, 2821042, 3019403, 3225581, 3400648, 3496651, 3488086, 3362921, 3099988, 2698315, 2221478, 1801371, 1587745, 1659688, 1975731, 2412460, 2824044, 3068100, 3024920, 2658371]
13667B658371n72012n44726l21973n9328J16077K05243K76750L38959L37994K62536
13657B697891J49927K1397j08237k02757k26994j65312m0932Q6320J69559K13290
13647B594152K60946L32513L78198L29338J84190r90j63381k60384k86034k56469
13637C112079j96542j37715q8236k6160N7562J34242J70086J63743J26751N3352
13627C369162p0528k42466m27422n58399n72403m58069k66388p3663O4650J28992
13617H93466J27090O9788j6430p2101m4884P4055K44681L87803M15359K75343
13607B354170r895l53457o46735q00252p98948p03581n78571m55263l48239k57180
13597b597951j65158p2969j5232r197j9385p970J4553K7173M2234Q6084J67251
$$ y = [2658371, 2086359, 1541633, 1219660, 1160332, 1276409, 1481652, 1758402, 2097361, 2435355, 2697891, 2847818, 2869215, 2760978, 2558221, 2331227, 2165915, 2124983, 2211303, 2380862, 2594152, 2855098, 3187611, 3565809, 3895147, 4079337, 4078347, 3914966, 3654582, 3368548, 3112079, 2915537, 2777822, 2689586, 2663426, 2720988, 2855230, 3025316, 3189059, 3315810, 3369162, 3298634, 3056168, 2628746, 2070347, 1497944, 1039875, 773487, 699824, 764474, 893466, 1020556, 1090344, 1073914, 1001813, 956929, 1030984, 1275665, 1663468, 2078827, 2354170, 2344275, 1990818, 1344083, 543831, -255117, -958698, -1537269, -1992532, -2340771, -2597951, -2763109, -2836078, -2851310, -2860507, -2879892, -2887862, -2873309, -2846136, -2803902, -2717818, -2550567]
13586b550567K67582L44595L39444K21681M3139q7324q7468M0727K17178L49006
13576i02007M07421M23499M08234L39911K23800J12166M7647J5063l1297j09541
13566I34896j95035k60318l01519l23770l48637l96761m39503m36791l92800l14446
13556b474684j80014J8556K47601M48561N57236N36881M12521K48469J00171l2728
13546a17430j80272l02211l25043k62994j80041q4557N5093K28721L63914L76870
13536d27950K63997J28821O3849O6013R6309J28983J41253J34876J33038J30277
13526H59466J19391J34680J93678K41435J98884O8966l9685l3528N8367J35674
13516A937328J37893P1771k9357j53008k89312l68967l07370j11668J32296L44256
$$ y = [-2550567, -2282985, -1938390, -1598946, -1377265, -1334126, -1421450, -1508918, -1468191, -1251013, -902007, -494586, -71087, 337147, 677058, 900858, 1013024, 1060671, 1075734, 1044437, 934896, 739861, 479543, 178024, -145746, -494383, -891144, -1330647, -1767438, -2160238, -2474684, -2654698, -2636142, -2388541, -1939980, -1382744, -845863, -433342, -184873, -84702, -117430, -297702, -599913, -924956, -1187950, -1367991, -1452548, -1397455, -1168734, -804820, -427950, -163953, -35132, 28717, 94730, 191039, 320022, 461275, 596151, 729189, 859466, 978857, 1113537, 1307215, 1548650, 1747534, 1816500, 1776815, 1743287, 1801654, 1937328, 2075221, 2146992, 2117635, 1964627, 1675315, 1306348, 998978, 887310, 1019606, 1363862]
13506A363862M69284M60709L07651P4484j40427k80253l26241k70569j40701k0288
13496A497511J913n2343n4744M8267J68019K19325K03135J56511J25860J37085
13486B450539J68345K00444K51282L18903L41631K56399O3703j73189l64699m46256
13476C067102m27542l51792k16693J162K57019M63180O02326P12605Q02879Q45359
13466E755605Q23862P55678O54877N29040M26146L96251M15607M14312L55300
13457A0526678K60781J67898Q3557q850j25850k61776l87558m75473n12094n07941
13447H759372n09000n59141o31571o41748n50811m07579k62304j11404L6231J40855
13437E262900J96253K14807J64893r67k73908n82221q32667r54431r34345q06273
$$ y = [1363862, 1833146, 2293855, 2601506, 2675990, 2535563, 2255310, 1929069, 1658500, 1517799, 1497511, 1499424, 1447081, 1392337, 1440604, 1608623, 1827948, 2031083, 2187594, 2313454, 2450539, 2618884, 2819328, 3070610, 3389513, 3731144, 3987543, 4051246, 3878057, 3513358, 3067102, 2639560, 2287768, 2071075, 2072237, 2329256, 2792436, 3394762, 4107367, 4910246, 5755605, 6579467, 7335145, 7990022, 8519062, 8945208, 9341459, 9757066, 10171378, 10526678, 10787459, 10955357, 11038914, 11030064, 10904214, 10642438, 10254880, 9779407, 9267313, 8759372, 8250372, 7691231, 7059660, 6417912, 5867101, 5459522, 5197218, 5085814, 5122045, 5262900, 5459153, 5673960, 5838853, 5837886, 5563978, 4981757, 4149090, 3194659, 2260314, 1454041]
13427A454041o13362m10436k75602k61137l28475l98752m29414m07780l20310
13418a991227j47895J08453M09548O83296Q44513Q19567N83509J87218k50497
13409A246485n90081p37451o81629m83976k43103l2115J50961L19206M17038L76698
13399b57967K13093J6778j08335j00556L456Q4953O0048m2535j49290k35153l06190
13388h21698l51484l35956k31497o5042R7190K16759K88681L08907K91521K58121
13378c44498K02571J21219L4885k7273m7453l7240k6982m1064o5268n5636k5162
13367c11901m8293j60270l18984m45609m63344l38932j14497J07631K20406J85948
13357a687845N6083p2612j13554o0586R697K9233m981l1773J1815J02728J57265
$$ y = [1454041, 840679, 430243, 154641, -106496, -434971, -833723, -1263137, -1670917, -1991227, -2139122, -2030669, -1621121, -937825, -93312, 726255, 1309764, 1496982, 1246485, 656404, -81047, -762676, -1246652, -1489755, -1521870, -1370909, -1051703, -634665, -257967, -44874, -28096, -136431, -236987, -233531, -148578, -88530, -131065, -280355, -515508, -821698, -1173182, -1509138, -1740635, -1805677, -1708487, -1491728, -1203047, -894140, -602619, -344498, -141927, -20708, 14177, -13096, -60549, -97789, -124771, -165835, -231103, -286739, -311901, -360194, -520464, -839448, -1285057, -1748401, -2087333, -2201830, -2094199, -1873793, -1687845, -1631762, -1704374, -1817928, -1878514, -1868817, -1839584, -1844565, -1876338, -1864523, -1761795, -1604530]
13346a604530J44335J15128J25578J83014K54748L05147L17808K88747K32753
13337C62728J86672J66274J47534J10964N7514j4026r6645j28904m5242J18528
13327H65397K49503K67107J79003N0265p3824j96645l20279m07464m10247l11678
13317a08862j41742L3741J61686K24268K22720J70516Q4812n886l9073M8917K43602
13306H94699M45762N61772N56608M41423K74116J21506p975j42726k62110k84369
13296B598706j61444M2928K02724K41947J85533J23870J23728J67689J82463J21251
13286C829395K1809m5726p9325j44273k76387m36250n59750n97838n38546m35228
13276G37881l54577k83094j48228P9712L46704N49661O13596N37619L72331J79605
$$ y = [-1604530, -1460195, -1345067, -1219489, -1036475, -781727, -476580, -158772, 129975, 362728, 549400, 715674, 863208, 974172, 1031686, 1017660, 921015, 792111, 746869, 865397, 1114900, 1382007, 1561010, 1611275, 1537451, 1340806, 1020527, 613063, 202816, -108862, -250604, -216863, -55177, 169091, 391811, 562327, 647139, 641253, 602180, 651097, 894699, 1340461, 1902233, 2458841, 2900264, 3174380, 3295886, 3287911, 3145185, 2883075, 2598706, 2437262, 2480190, 2682914, 2924861, 3110394, 3234264, 3357992, 3525681, 3708144, 3829395, 3851204, 3805478, 3726153, 3581880, 3305493, 2869243, 2309493, 1711655, 1173109, 737881, 383304, 100210, -48018, 31694, 378398, 928059, 1541655, 2079274, 2451605, 2631210]
13266B631210J1186r7185j53419k01849k60425l00704k92724k66557k82079l31418
13256D56036l60932l39366k81176k37759k35853k44388k09176r7926P3433K39518
13246a237589L37442L64123L60195L62524L74664L71619L50225L31723K96824
13237A911750K01172O0014o1529j16732r9529k8847O8086J71898K72681L40733
13227B719697L19187J87260o54j66330k87840l79630m06013l32876j99119n6148
13217A397534O0819J03356O4943Q045l6777r8132j78321k49495k95965l04950
13207D71057k66633j66138K2608K67716M44302M57935L56597K64661K59208L29014
13197B440327M21563M83372M66075L52844J90156N2960l1146r6501j73674k36348
$$ y = [2631210, 2642396, 2545211, 2391792, 2189943, 1929518, 1628814, 1336090, 1069533, 787454, 456036, 95104, -244262, -525438, -763197, -999050, -1243438, -1452614, -1550540, -1477107, -1237589, -900147, -536024, -175829, 186695, 561359, 932978, 1283203, 1614926, 1911750, 2112922, 2172936, 2111407, 1994675, 1895146, 1866299, 1934385, 2106283, 2378964, 2719697, 3038884, 3226144, 3225490, 3059160, 2771320, 2391690, 1985677, 1652801, 1453682, 1397534, 1458353, 1561709, 1626652, 1634697, 1597920, 1499788, 1321467, 1071972, 776007, 471057, 204424, 38286, 60894, 328610, 772912, 1230847, 1587444, 1852105, 2111313, 2440327, 2861890, 3345262, 3811337, 4164181, 4354337, 4407297, 4376151, 4279650, 4105976, 3869628]
13187C869628k43605k14481k02260k17602k42559k71559k80362k09586o0125O1244
13177A988733Q1158N2872O8973J49350K44273L22031L93435M57651M90976M74846
13167D724298M06581K93001J53987L1098l4172m9640o4116r2893j15590j14431
13157E138123q2395l7355k5314p5709j55481k07370k23359k45306k93412l30676
13147C461746l03849j88674j9694J16485J56544J16779N0823j039j1771J6950
13137C394300K6260n0513k09944l87690n31807o37334p31733q18238q53605q15538
13127a615842p11307n41385l12754n2599J91440L57911M11140L88272L71078M05910
13117a108136M83475N64779O06634N86781N09863L94451K68540J62038Q7724L7697
$$ y = [3869628, 3626023, 3411542, 3209282, 2991680, 2749121, 2477562, 2197200, 1987614, 1927489, 1988733, 2069891, 2122763, 2191736, 2341086, 2585359, 2907390, 3300825, 3758476, 4249452, 4724298, 5130879, 5423880, 5577867, 5608965, 5574793, 5525153, 5461037, 5368144, 5252554, 5138123, 5055728, 5018373, 4993059, 4917350, 4761869, 4554499, 4331140, 4085834, 3792422, 3461746, 3157897, 2969223, 2949529, 3066014, 3222558, 3339337, 3390160, 3389121, 3377350, 3394300, 3420560, 3370047, 3160103, 2772413, 2240606, 1603272, 871539, 53301, -800304, -1615842, -2327149, -2868534, -3181288, -3233887, -3042447, -2684536, -2273396, -1885124, -1514046, -1108136, -624661, -59882, 546752, 1133533, 1643396, 2037847, 2306387, 2468425, 2556149, 2593846]
13107B593846L500j67M0593Q5659P1647q22o2475q1193q3801q3261p2516m1556
13095B369454K2936J16866K06254K52402K14946N5878k01891m47886n50056m52721
13085A586182k26816L280J70043K63106K85112K52176J86675R1734l1477j62668
13075B417347k76746l53171l74500l09535j29413J14040K82948K89415K00549
13066A860934J46550J70361K43525L33912L95079L78955K91550K09108K13407
13057D243381K94526L48667K87780R4690j89180m70658o38978o21900m33653j63852
13047B750823Q3019K36482K80574K45661J68154O9223j754P213N9416O3494j3544
13036C948761j23605k15489k85232l35277l35727k49074r8994L2626J13861J87112
$$ y = [2593846, 2597346, 2597179, 2637772, 2723431, 2795078, 2794256, 2731781, 2650588, 2566787, 2483526, 2411010, 2369454, 2392390, 2509256, 2715510, 2967912, 3182858, 3238736, 3036845, 2588959, 2038903, 1586182, 1359366, 1362646, 1532689, 1795795, 2080907, 2333083, 2519758, 2611492, 2580015, 2417347, 2140601, 1787430, 1412930, 1103395, 973982, 1088022, 1370970, 1660385, 1860934, 2007484, 2177845, 2421370, 2755282, 3150361, 3529316, 3820866, 4029974, 4243381, 4537907, 4886574, 5174354, 5269044, 5079864, 4609206, 3970228, 3348328, 2914675, 2750823, 2833842, 3070324, 3350898, 3596559, 3764713, 3833936, 3832182, 3839395, 3898811, 3962305, 3948761, 3825156, 3609667, 3324435, 2989158, 2653431, 2404357, 2305363, 2337989, 2451850, 2638962]
13026B638962K76280L52699L83813L73469L48365L12085K22421N0661j48795l14560
13016D495400m53232n56762n59898m22987j93169K6377J42697J29802N8341K3553
13006B690122L5199L9877K5791L1148O7129R7366Q6808M1175l529P31R3534K49399
12994C454750L64286L48758K14203M5311o7238q3511m5367m0823j03006j69179
12984C918184j66406p6611O5069K01049K99707L25650K27264K5483j80681l13147
12974D325561l64772l72415l55882l00104k08852j28050j03699j45176k33332
12965B113279l54563m96402o18159o63906o05121m57064k63733o4658J14970K39210
12955a056147K87380K98661L11227K97000K31991J59938J24180J09322P6155O772
$$ y = [2638962, 2915242, 3267941, 3651754, 4025223, 4373588, 4685673, 4908094, 4958755, 4809960, 4495400, 4042168, 3485406, 2925508, 2502521, 2309352, 2335729, 2478426, 2608228, 2666569, 2690122, 2725321, 2765198, 2790989, 2822137, 2889266, 2986632, 3073440, 3114615, 3111086, 3111817, 3205351, 3454750, 3819036, 4167794, 4381997, 4427308, 4360070, 4276559, 4231192, 4190369, 4087363, 3918184, 3751778, 3675167, 3740236, 3941285, 4240992, 4566642, 4793906, 4819389, 4638708, 4325561, 3960789, 3588374, 3232492, 2932388, 2723536, 2595486, 2491787, 2346611, 2113279, 1758716, 1262314, 644155, -19751, -624872, -1081936, -1345669, -1410327, -1295357, -1056147, -768767, -470106, -158879, 138121, 370112, 530050, 654230, 763552, 839707, 846479]
12945H46479q6660j68939k19419k67740l63845n21822p09021q69166r56850r43727
12935d260710p86966m67622p1171K46150M00367M16487L51589K57721J61308O6688
12925c686159OQ881P8868J13304L9959j17938k78904l69131l60784k81146j73291
12914e026335o1485M9209J73220K94693L38477K62569J11674m5441j68031k43873
12904d315323k72662k50952j89066j19536o5664k0434L2429Q2465R5362N7808
$$ y = [846479, 759819, 590880, 371461, 103721, -260124, -781946, -1490967, -2360133, -3316983, -4260710, -5047676, -5515298, -5586469, -5340319, -4939952, -4523465, -4171876, -3914155, -3752847, -3686159, -3686153, -3677272, -3598404, -3485100, -3445141, -3563079, -3841983, -4211114, -4571898, -4853044, -5026335, -5087820, -5038611, -4865391, -4570698, -4232221, -3969652, -3857978, -3903419, -4071450, -4315323, -4587985, -4838937, -5028003, -5147539, -5213203, -5233637, -5201208, -5118743, -5023381, -4965573]
$$ [...]
##END NTUPLES=NMR SPECTRUM
##END=
