##TITLE=31P ikalashn
DE-78_oil4(nlock)
19.12.2024
##JCAMPDX= 6.0         $$ Bruker NMR JCAMP-DX V2.0
##DATA TYPE= NMR SPECTRUM
##DATA CLASS= NTUPLES
##ORIGIN= UXNMR, Bruker Analytische Messtechnik GmbH
##OWNER= root
$$ TOPSPIN		Version 1.3
$$ 2024-12-19 15:01:39.171 +0400  Irina@DPX200
$$ Compression mode = diff/dup
##.OBSERVE FREQUENCY= 81.01967998063
##.OBSERVE NUCLEUS= ^31P
##.ACQUISITION MODE= SIMULTANEOUS
##.ACQUISITION SCHEME= undefined
##.AVERAGES= 64
##.DIGITISER RES= 17
##SPECTROMETER/DATA SYSTEM= spect
##.PULSE SEQUENCE= zgpg
##.SOLVENT NAME= DMSO
##.SHIFT REFERENCE= INTERNAL, DMSO, 1, 298.5841
##AUDIT TRAIL= $$ (NUMBER, WHEN, WHO, WHERE, WHAT)
$$ ##TITLE= Audit trail, TOPSPIN		Version 1.3
$$ ##JCAMPDX= 5.01
$$ ##ORIGIN= Bruker BioSpin GmbH
$$ ##OWNER= Irina
$$ $$ F:/spectra/data/iren/nmr/P31dec/1/pdata/1/auditp.txt
$$ ##AUDIT TRAIL=  $$ (NUMBER, WHEN, WHO, WHERE, VERSION, WHAT)
(   1,<2024-12-19 14:59:20.421 +0400>,<Irina>,<DPX200>,<TOPSPIN 1.3>,
      <acquisition in progress>)
(   2,<2024-12-19 15:01:02.343 +0400>,<Irina>,<DPX200>,<TOPSPIN 1.3>,
      <Start of raw data processing
       efp BC_mod = 2 LB = 15 FT_mod = 6 PKNL = 1 PHC0 = 89.78606 PHC1 = -18.0231 SI = 32K 
       data hash MD5: 32K
       D1 0E A6 04 0D BC 1A E2 2C 21 60 D5 67 EC 1A 43>)
(   3,<2024-12-19 15:01:04.718 +0400>,<Irina>,<DPX200>,<TOPSPIN 1.3>,
      <apk 
       data hash MD5: 32K
       6D ED 7C CB F7 9F B2 85 DC E4 72 7E C7 10 BF 74>)
(   4,<2024-12-19 15:01:17.343 +0400>,<Irina>,<DPX200>,<TOPSPIN 1.3>,
      <pk fgphup PHC0 = 18.2 PHC1 = 0 
       data hash MD5: 32K
       F9 F0 8C AD AC 8C DE 9D EA 39 0A 87 BF 4A 2B C1>)
(   5,<2024-12-19 15:01:22.406 +0400>,<Irina>,<DPX200>,<TOPSPIN 1.3>,
      <abs n ABSG = 5 
       data hash MD5: 32K
       41 5B 7C 91 2B E7 01 29 D6 AE 6F F3 1F 08 F1 71>)
$$ ##END=
$$ 
$$ $$ hash MD5
$$ $$ 4F A3 83 55 DD 3F A6 44 2D 80 57 17 57 5F 3B ED
##$RELAX= 
##$RELAX= 
##$RELAX= 
##$RELAX= 
##$RELAX= 
##$RELAX= 
##$RELAX= 
##$RELAX= 
##$RELAX= 
##$RELAX= 
##$RELAX= 
$$ Bruker specific parameters
$$ --------------------------
##$DU= <F:/spectra>
##$EXPNO= 1
##$NAME= <P31dec>
##$PROCNO= 1
##$TYPE= <nmr>
##$USER= <iren>
##$AMP= (0..31)
100 100 100 100 100 100 100 100 100 100 100 100 100 100 100 100 100 100 
100 100 100 100 100 100 100 100 100 100 100 100 100 100 
##$ANAVPT= -1
##$AQSEQ= 0
##$AQ_mod= 1
##$AUNM= <au_zg>
##$AUTOPOS= <>
##$BF1= 81.014009
##$BF2= 200.13
##$BF3= 200.13
##$BF4= 200.13
##$BF5= 200.13
##$BF6= 200.13
##$BF7= 200.13
##$BF8= 200.13
##$BYTORDA= 1
##$CFDGTYP= 0
##$CFRGTYP= 5
##$CHEMSTR= <none>
##$CNST= (0..63)
1 1 145 1 1 1 1 1 1 1 1 1 1 1 1 1 1 1 1 1 1 1 1 1 1 1 1 1 1 1 1 1 1 1 
1 1 1 1 1 1 1 1 1 1 1 1 1 1 1 1 1 1 1 1 1 1 1 1 1 1 1 1 1 1 
##$CPDPRG= <waltz16>
##$CPDPRG1= <>
##$CPDPRG2= <waltz16>
##$CPDPRG3= <>
##$CPDPRG4= <mlev>
##$CPDPRG5= <mlev>
##$CPDPRG6= <mlev>
##$CPDPRG7= <mlev>
##$CPDPRG8= <mlev>
##$CPDPRGB= <>
##$CPDPRGT= <>
##$D= (0..63)
$$ [...]
##$SW_h= 37037.037037037
##$TD= 32768
##$TD0= 1
##$TE= 300
##$TE2= 300
##$TE3= 300
##$TEG= 300
##$TL= (0..7)
0 120 53 12 22 120 120 120 
##$TP= (0..7)
150 150 150 150 150 150 150 150 
##$TP07= 0
##$TPNAME0= <>
##$TPNAME1= <>
##$TPNAME2= <>
##$TPNAME3= <>
##$TPNAME4= <>
##$TPNAME5= <>
##$TPNAME6= <>
##$TPNAME7= <>
##$TPOAL= (0..7)
0.5 0.5 0.5 0.5 0.5 0.5 0.5 0.5 
##$TPOFFS= (0..7)
0 0 0 0 0 0 0 0 
##$TUNHIN= 0
##$TUNHOUT= 0
##$TUNXOUT= 0
##$USERA1= <user>
##$USERA2= <user>
##$USERA3= <user>
##$USERA4= <user>
##$USERA5= <user>
##$V9= 5
##$VALIST= <valist>
##$VCLIST= <CCCCCCCCCCCCCCC>
##$VD= 0
##$VDLIST= <DDDDDDDDDDDDDDD>
##$VPLIST= <PPPPPPPPPPPPPPP>
##$VTLIST= <TTTTTTTTTTTTTTT>
##$WBST= 1024
##$WBSW= 4
##$XGAIN= (0..3)
0 0 0 0 
##$XL= 0
##$YL= 0
##$YMAX_a= 1883
##$YMIN_a= -529
##$ZGOPTNS= <>
##$ZL1= 120
##$ZL2= 120
##$ZL3= 120
##$ZL4= 120
##$ABSF1= 298.5841
##$ABSF2= -158.5842
##$ABSG= 5
##$ABSL= 5
##$ALPHA= 0
##$AQORDER= 0
##$ASSFAC= 0
##$ASSFACI= 0
##$ASSFACX= 0
##$ASSWID= 0
##$AUNMP= <proc_1d>
##$AXLEFT= 0
##$AXRIGHT= 0
##$AXTYPE= 0
##$AXUNIT= <>
##$AZFE= 0.1
##$AZFW= 0.5
##$BCFW= 0
##$BC_mod= 2
##$BYTORDP= 0
##$COROFFS= 0
##$CY= 12.5935478210449
##$DATMOD= 1
##$DC= 0
##$DFILT= <>
##$DTYPP= 0
##$F1P= 47.1127640792319
##$F2P= -24.0371245302204
##$FCOR= 0.5
##$FTSIZE= 32768
##$FT_mod= 6
##$GAMMA= 0
##$GB= 0
##$INTBC= 1
##$INTSCL= 7.269226e-011
##$ISEN= 30
##$LB= 15
##$LEV0= 0
##$LPBIN= 0
##$MAXI= 12.09355
##$MC2= 0
##$MEAN= 0
##$ME_mod= 0
##$MI= 0.7550151
##$NCOEF= 0
##$NC_proc= -14
##$NLEV= 6
##$NOISF1= 298.5841
##$NOISF2= 270.0111
##$NSP= 0
##$NTH_PI= 0
##$NZP= 0
##$OFFSET= 298.5841
##$PC= 1.4
##$PHC0= 51.69177
##$PHC1= 66.77242
##$PH_mod= 1
##$PKNL= yes
##$PPARMOD= 0
##$PPDIAG= 0
##$PPIPTYP= 0
##$PPMPNUM= 100
##$PPRESOL= 1
##$PSCAL= 0
##$PSIGN= 0
##$REVERSE= no
##$SF= 81.014009
##$SI= 32768
##$SIGF1= 270.0111
##$SIGF2= -158.5842
##$SINO= 77.54984
##$SIOLD= 32768
##$SREGLST= <31P.CDCl3>
##$SSB= 0
##$STSI= 32768
##$STSR= 0
##$SW_p= 37037.037037037
##$SYMM= 0
##$S_DEV= 0
##$TDeff= 32768
##$TDoff= 0
##$TI= <>
##$TILT= no
##$TM1= 0
##$TM2= 0
##$TOPLEV= 0
##$USERP1= <user>
##$USERP2= <user>
##$USERP3= <user>
##$USERP4= <user>
##$USERP5= <user>
##$WDW= 1
##$XDIM= 32768
##$YMAX_p= 520437914
##$YMIN_p= -45739844
$$ End of Bruker specific parameters
$$ ---------------------------------
##NTUPLES= NMR SPECTRUM
##VAR_NAME=  FREQUENCY,     SPECTRUM/REAL,   SPECTRUM/IMAG
##SYMBOL=    X,             R,               I
##VAR_TYPE=  INDEPENDENT,   DEPENDENT,       DEPENDENT
##VAR_FORM=  AFFN,          ASDF,            ASDF
##VAR_DIM=   32768,         32768,           32768
##UNITS=     HZ,            ARBITRARY UNITS, ARBITRARY UNITS
##FACTOR=    1.13031516577767, 1,            1
##FIRST=     37037.037037037, 9521352,       -17748976
##LAST=      0,             -15369086,       11373213
##MIN=       0,             -45739844,       0
##MAX=       37037.037037037, 520437914,     0
$$ Real data points
##PAGE= N=1
##DATA TABLE= (X++(R..R)), XYDATA
$$ [...]
19393 3342097 2148016 1072169 96756 -822476 -1754248 -2758613 -3840452 -4929622 -5906691
19384 -5906691 -6654808 -7104449 -7256471 -7187054 -7032952 -6947798 -7040585 -7335060 -7777950 -8285251
19374 -8285251 -8795251 -9300970 -9843713 -10464370 -11136382 -11727810 -12033294 -11868325 -11158834
19365 -11158834 -9956724 -8383900 -6569073 -4624273 -2656724 -792578 808759 1976211
19357 1976211 2594965 2677605 2373250 1903676 1475931 1221861 1181667 1326670 1610221 2019979
19347 2019979 2589469 3355665 4300767 5322909 6249447 6886413 7088288 6814601 6130860
19338 6130860 5147196 3949603 2586849 1112627 -373572 -1733595 -2839884 -3622962
19330 -3622962 -4084512 -4279925 -4289046 -4189980 -4045545 -3897842 -3759287 -3606373 -3392394 -3070527
19320 -3070527 -2599929 -1930907 -999482 236570 1727717 3291494 4665844 5637231 6143811
19311 6143811 6286633 6270601 6328716 6659155 7382880 8523665 10009201 11691318 13385333
19302 13385333 14919917 16174331 17084318 17622846 17784118 17592301 17119302 16478116 15790819
19293 15790819 15163605 14682748 14410644 14367907 14514411 14744900 14909989 14868794 14549264 13967829
19283 13967829 13190596 12272447 11221202 9997155 8531077 6756230 4657553 2313298
19275 2313298 -110750 -2416859 -4437032 -6060931 -7235977 -7967913 -8326020 -8438623 -8469179
19266 -8469179 -8570188 -8829121 -9239232 -9719573 -10175208 -10554036 -10852696 -11068049 -11143224 -10961906
19256 -10961906 -10403391 -9422695 -8099331 -6618973 -5195360 -3979727 -3018831 -2287212 -1753821
19247 -1753821 -1417338 -1287164 -1339449 -1491990 -1630554 -1685397 -1706804 -1873666 -2417699 -3510160
19237 -3510160 -5177908 -7290952 -9626442 -11975256 -14226695 -16377345 -18469410 -20515016
19229 -20515016 -22452587 -24143585 -25405672 -26071963 -26044610 -25309759 -23913329 -21922595 -19399447
19220 -19399447 -16401452 -13011256 -9374027 -5707562 -2260929 767765 3314437 5482053
19212 5482053 7485827 9527537 11682595 13874960 15932649 17658231 18862464 19369491
19204 19369491 19048074 17888461 16062489 13896835 11770298 10008420 8826192 8311303
19196 8311303 8424313 9014551 9859259 10718561 11384123 11704008 11592045 11045482 10168308
19187 10168308 9160748 8251667 7610157 7295496 7263209 7403632 7592972 7748401 7863853
19178 7863853 7993187 8182093 8403324 8556446 8537628 8327153 8027703 7809258 7781999 7896929
19168 7896929 7962492 7754254 7118266 6001276 4418006 2407743 21712 -2652920 -5458418
19159 -5458418 -8162338 -10510147 -12313328 -13508449 -14140468 -14297410 -14060688 -13492223 -12637744
19150 -12637744 -11534828 -10227574 -8783486 -7302953 -5912545 -4737456 -3859338 -3282199
19142 -3282199 -2938994 -2746163 -2664564 -2711832 -2916241 -3262564 -3685307 -4104539 -4455158 -4683103
19132 -4683103 -4726378 -4514505 -3998613 -3184082 -2130950 -930002 314509 1490593 2490348
19123 2490348 3239288 3732990 4050476 4322420 4665497 5117284 5609757 6000595 6142504
19114 6142504 5947495 5419546 4659068 3845040 3176803 2770681 2574870 2390369 1997950
19105 1997950 1287103 291822 -858034 -1993613 -2929761 -3476839 -3474799 -2842721 -1613635
19096 -1613635 64856 1966099 3836999 5439559 6579585 7138992 7100364 6531167 5527821
19087 5527821 4163158 2480076 535953 -1538650 -3516616 -5113493 -6077716 -6287860
19079 -6287860 -5801855 -4824033 -3606640 -2350766 -1169308 -118124 753887 1384557 1711527
19070 1711527 1693686 1325898 647415 -257346 -1269235 -2249103 -3054997 -3571575 -3740169
19061 -3740169 -3559513 -3057689 -2267859 -1223655 33528 1437555 2877711 4203095 5259231
19052 5259231 5925086 6127301 5848680 5149436 4181334 3162990 2319977 1823377 1753569
19043 1753569 2099562 2795617 3780084 5035945 6575779 8381548 10352448 12301735 13999454
19034 13999454 15233291 15862005 15845058 15239549 14167858 12774173 11193195 9541592 7921953
19025 7921953 6419801 5084675 3911724 2851755 1851684 895255 17222 -709166 -1192079
19016 -1192079 -1336973 -1069103 -369443 698608 2000153 3373351 4677216 5822291 6781322
19007 6781322 7578117 8257219 8853387 9379399 9835228 10233663 10623901 11077957 11630333
18998 11630333 12218607 12684200 12836792 12533157 11726165 10471394 8899790 7171215 5420444
18989 5420444 3711527 2030015 333360 -1365798 -2946253 -4203051 -4947495 -5118201
18981 -5118201 -4816119 -4243411 -3610450 -3069646 -2684353 -2423817 -2181985 -1821007 -1228726
18972 -1228726 -363823 734954 1974562 3243212 4433692 5456632 6257207 6834240 7237159
18963 7237159 7521680 7693193 7695192 7454775 6938174 6169240 5206792 4111132 2923614
18954 2923614 1657002 295294 -1188191 -2801045 -4510338 -6239608 -7883031 -9326867
18946 -9326867 -10463300 -11198298 -11470777 -11283884 -10725468 -9956875 -9168412 -8519764 -8096389
18937 -8096389 -7908036 -7926611 -8129475 -8513981 -9076667 -9784412 -10574976 -11389558 -12201135 -13010899
18927 -13010899 -13824927 -14646348 -15498990 -16452525 -17605911 -19027982 -20688638 -22412915 -23892066
18918 -23892066 -24775324 -24807087 -23925637 -22271603 -20125716 -17823372 -15674222 -13898717 -12597151
18909 -12597151 -11764315 -11337892 -11247658 -11440257 -11876514 -12514124 -13293846 -14144315 -15007978
18900 -15007978 -15868838 -16751942 -17684817 -18644211 -19526435 -20168054 -20413631 -20194064 -19566179
18891 -19566179 -18692205 -17784033 -17047579 -16637234 -16619377 -16956823 -17530589 -18190034 -18797382
18882 -18797382 -19250124 -19497462 -19562306 -19549148 -19605893 -19842104 -20259175 -20751706 -21178270 -21441326
18872 -21441326 -21515604 -21415175 -21141337 -20657431 -19905591 -18848470 -17493777 -15872391 -13997179
18863 -13997179 -11848392 -9393384 -6622839 -3583701 -392426 2773268 5704764 8221744
18855 8221744 10236779 11774613 12926259 13770609 14317411 14506371 14254226 13515742 12332203
18846 12332203 10846182 9259134 7741289 6352413 5032238 3663032 2147256 438977
18838 438977 -1475539 -3601224 -5924471 -8383979 -10867817 -13259020 -15500350 -17630516
18830 -17630516 -19765861 -22032992 -24487470 -27058903 -29536589 -31595866 -32870512 -33062451
18822 -33062451 -32049897 -29939252 -27023466 -23665344 -20180499 -16789979 -13642973 -10848883
18814 -10848883 -8468590 -6477807 -4759144 -3154251 -1544315 97206 1705052 3166627
18806 3166627 4386820 5341819 6092107 6745810 7393134 8048180 8633863 9023823 9109019
18797 9109019 8840173 8241324 7416788 6533846 5747118 5102029 4507208 3797056 2809655
18788 2809655 1419978 -450922 -2814567 -5594812 -8639064 -11758980 -14776493 -17554334
18780 -17554334 -19999558 -22045477 -23636674 -24737887 -25359335 -25568265 -25464987 -25133976 -24603462
18771 -24603462 -23837348 -22757313 -21279250 -19345872 -16945258 -14126124 -11019438 -7838867
18763 -7838867 -4828580 -2184017 -5552 1695864 2972605 3920155 4658061 5300189 5916694
18754 5916694 6509389 7024320 7392198 7559668 7492709 7168718 6585846 5792876 4907485 4096919
18744 4096919 3533068 3349209 3616153 4343844 5497102 7001246 8733566 10531296 12233218
18735 12233218 13721720 14930517 15831024 16429305 16776536 16960787 17057200 17075468 16969191
18726 16969191 16702514 16300535 15838697 15398349 15035729 14778819 14633210 14577162 14550415 14454337
18716 14454337 14172258 13608286 12731404 11596562 10321232 9035397 7846895 6833224
18708 6833224 6039007 5471555 5099916 4849362 4589912 4147550 3358466 2137512 510564
18699 510564 -1408221 -3467359 -5518161 -7432970 -9112534 -10484274 -11489656 -12077603
18691 -12077603 -12220125 -11934747 -11287575 -10379002 -9327352 -8244206 -7190123 -6133244 -4956191
18682 -4956191 -3527573 -1799198 138392 2086681 3837426 5263512 6342017 7119100
18674 7119100 7662243 8027687 8250219 8348595 8330098 8186500 7890720 7406493 6710599 5814308
18664 5814308 4769915 3654827 2537264 1446996 373419 -714573 -1845285 -3024928
18656 -3024928 -4226683 -5394839 -6460323 -7354594 -8011818 -8357685 -8296948 -7722121 -6552416
18647 -6552416 -4783653 -2514096 79790 2807681 5522227 8132822 10592492 12887108
18639 12887108 15020112 16977201 18691460 20045090 20913315 21223446 20997142 20351092 19443676
18630 19443676 18384997 17167914 15688321 13859478 11725935 9474365 7345899 5538220
18622 5538220 4160087 3236218 2735047 2597815 2754116 3121634 3605927 4110646 4548905
18613 4548905 4851516 4980034 4939178 4774454 4554276 4342170 4163070 3976916 3678182 3125890
18603 3125890 2191424 808331 -991385 -3076346 -5263652 -7392176 -9373365 -11192101
18595 -11192101 -12868177 -14407888 -15771170 -16870574 -17609648 -17944057 -17919356 -17651082 -17268289
18586 -17268289 -16871113 -16516396 -16204197 -15854628 -15304016 -14349982 -12836643 -10738552 -8202205
18577 -8202205 -5523462 -3063467 -1137797 68873 527759 333403 -350086 -1328417 -2400243
18568 -2400243 -3379953 -4124672 -4560961 -4703772 -4657773 -4596732 -4725755 -5229947 -6209147 -7613189
18558 -7613189 -9214335 -10650305 -11535551 -11593081 -10742595 -9113478 -6997518 -4771623 -2808307
18549 -2808307 -1385001 -615712 -439432 -677317 -1123191 -1612550 -2045355 -2371867 -2560151
18540 -2560151 -2566248 -2325457 -1771263 -877242 300334 1616431 2880613 3917776 4606136
18531 4606136 4884402 4745992 4229231 3396973 2309907 1007075 -511235 -2302177 -4462526
18522 -4462526 -7042439 -9946275 -12914603 -15601742 -17679815 -18910082 -19177298 -18501833
18514 -18501833 -17025567 -14968626 -12579867 -10100845 -7734763 -5617238 -3812477 -2346827
18506 -2346827 -1252122 -581811 -387634 -671185 -1341201 -2212132 -3058655 -3692849 -4002938
18497 -4002938 -3931264 -3430951 -2448328 -940462 1087139 3540202 6218911 8853314 11182763
18488 11182763 13025214 14295130 14986757 15158062 14915592 14383580 13660126 12777159 11685373
18479 11685373 10286996 8509015 6364154 3952159 1411879 -1127242 -3567107 -5844326
18471 -5844326 -7925530 -9796510 -11452201 -12899488 -14175737 -15369199 -16617275 -18065249
18463 -18065249 -19796728 -21779897 -23874275 -25905941 -27767535 -29464759 -31059801 -32550627
18455 -32550627 -33786645 -34488872 -34353224 -33166879 -30891723 -27698891 -23942558 -20075345
18447 -20075345 -16534759 -13637441 -11512327 -10102019 -9237027 -8738291 -8481934 -8394800 -8406919
18438 -8406919 -8411476 -8263710 -7823284 -7020745 -5904823 -4631143 -3392277 -2325925 -1447578
18429 -1447578 -641770 285960 1531867 3229922 5408502 7964647 10674665 13260157
18421 13260157 15482915 17206877 18394477 19061885 19235488 18934817 18188880 17074214 15743680
18412 15743680 14415796 13317618 12608676 12333792 12424965 12726720 13024335 13095681 12799593
18403 12799593 12151040 11318448 10546066 10060686 10006910 10417727 11220272 12275732 13425289
18394 13425289 14506275 15347701 15788015 15728215 15182066 14276768 13203320 12158718 11308387
18385 11308387 10765551 10589166 10802237 11402288 12343038 13515118 14762390 15927691 16890051
18376 16890051 17569277 17913332 17896668 17531274 16871142 15995327 14971979 13821909 12505410
18367 12505410 10943052 9058923 6825556 4295567 1612231 -1004403 -3297941 -5039773
18359 -5039773 -6100920 -6503224 -6422540 -6136255 -5932881 -6018492 -6459425 -7186140 -8051561 -8905353
18349 -8905353 -9639984 -10198195 -10565740 -10763861 -10832669 -10809862 -10729578 -10644025 -10635399 -10795100
18339 -10795100 -11188482 -11837085 -12724517 -13808098 -15021066 -16270870 -17450189 -18459700
18331 -18459700 -19221534 -19674731 -19766298 -19446226 -18660995 -17350829 -15468695 -13022371 -10113003
18322 -10113003 -6936820 -3736610 -727265 1950274 4213860 5994970 7224855 7869733
18314 7869733 7974075 7661466 7079166 6320858 5385136 4202600 2707923 897899 -1158483
18305 -1158483 -3339036 -5485824 -7423014 -8994965 -10122974 -10847074 -11317388 -11738354 -12304527
18296 -12304527 -13151668 -14314531 -15694544 -17075464 -18213807 -18960707 -19321292 -19406225 -19333922
18287 -19333922 -19178937 -18997758 -18879157 -18950393 -19325235 -20035944 -20993409 -21989746 -22748862
18278 -22748862 -23025415 -22712540 -21886806 -20753613 -19528595 -18333742 -17174218 -16002025
18270 -16002025 -14808226 -13673710 -12747468 -12160255 -11916763 -11848944 -11690066 -11222929 -10385494
18261 -10385494 -9267645 -8029162 -6809053 -5675228 -4627939 -3643961 -2729088 -1937687
18253 -1937687 -1341459 -978643 -834330 -861917 -1009176 -1223650 -1451930 -1646816 -1771738 -1797531
18243 -1797531 -1702584 -1473495 -1090026 -506665 328895 1412111 2620139 3710524 4396786
18234 4396786 4462658 3851096 2683666 1207572 -299376 -1619996 -2643797 -3351690 -3758367
18225 -3758367 -3853714 -3580731 -2862082 -1657196 -14078 1919294 3935642 5838041 7501022
18216 7501022 8897093 10078305 11121985 12076339 12943800 13701970 14331452 14828656 15197849
18207 15197849 15426800 15465668 15232869 14652321 13696410 12399398 10833078 9069294 7163498
18198 7163498 5176494 3215123 1448383 69151 -788534 -1133114 -1152214 -1175052 -1566680
18189 -1566680 -2600258 -4372495 -6795743 -9648168 -12646898 -15520817 -18065840 -20170776
18181 -20170776 -21814887 -23046032 -23947580 -24601181 -25051800 -25283249 -25222262 -24787642 -23963175
18172 -23963175 -22838468 -21589929 -20427409 -19533387 -19000300 -18792110 -18768834 -18759345 -18622129
18163 -18622129 -18264700 -17639278 -16737316 -15591038 -14275958 -12904608 -11610391 -10524470
18155 -10524470 -9754757 -9379740 -9450548 -9979608 -10914743 -12122097 -13394089 -14479670 -15132287
18146 -15132287 -15167089 -14502024 -13160689 -11247825 -8922154 -6364978 -3733264 -1122607
18138 -1122607 1417044 3819650 5952663 7617423 8588968 8668895 7741508 5822327 3073466
18129 3073466 -227414 -3746528 -7153860 -10170856 -12607695 -14392291 -15580770 -16331414
18121 -16331414 -16840464 -17263345 -17656920 -17977496 -18143200 -18111390 -17895682 -17510792 -16918337
18112 -16918337 -16040372 -14825418 -13302706 -11584834 -9831375 -8210100 -6870973 -5921329
18104 -5921329 -5402064 -5285893 -5500707 -5950776 -6519850 -7073900 -7486267 -7680061 -7655497 -7476083
18094 -7476083 -7221231 -6940140 -6638363 -6298218 -5907804 -5473251 -5007714 -4512526 -3970863
18085 -3970863 -3356285 -2643456 -1811121 -837303 301810 1615572 3070092 4569502 5967790
18076 5967790 7115297 7916210 8357614 8491612 8385250 8075356 7569061 6892517 6134875
18067 6134875 5432498 4896517 4544845 4303533 4080288 3841735 3624287 3476777 3396460 3315766
18057 3315766 3139623 2791390 2236449 1486335 597129 -340230 -1227863 -1998516 -2638262
18048 -2638262 -3181966 -3689798 -4214628 -4764613 -5279929 -5654996 -5801557 -5697308 -5379113
18039 -5379113 -4903788 -4325260 -3697617 -3073591 -2482716 -1908088 -1279489 -482691 615972
18030 615972 2128405 4094572 6445517 9005158 11534423 13786815 15538615 16595866
18022 16595866 16812711 16128500 14589650 12336536 9575028 6555682 3557298 855219
18014 855219 -1324647 -2838891 -3631251 -3717897 -3165542 -2079575 -621299 962867 2352410
18005 2352410 3230369 3396244 2850552 1798749 565774 -537832 -1333948 -1825687 -2155836
17996 -2155836 -2499850 -2961681 -3537268 -4146447 -4678600 -5018899 -5074245 -4813308 -4290751 -3621270
17986 -3621270 -2913214 -2207686 -1466434 -619187 362931 1423028 2433968 3256729 3797681
17977 3797681 4036535 4024757 3861906 3657544 3491807 3389529 3323606 3254300 3174074 3104163
17967 3104163 3042263 2927208 2662638 2171372 1434707 498628 -553070 -1649423 -2773405
17958 -2773405 -3951582 -5199324 -6481432 -7726876 -8875896 -9914664 -10873904 -11796134
17950 -11796134 -12692336 -13518863 -14198934 -14674684 -14944727 -15063836 -15122048 -15222712 -15458750
17941 -15458750 -15885140 -16499628 -17251123 -18081286 -18972740 -19962552 -21109190 -22446065 -23959101
17932 -23959101 -25586396 -27215936 -28681468 -29780924 -30327001 -30210011 -29447672 -28203633
17924 -28203633 -26762426 -25464713 -24620273 -24419438 -24870088 -25790570 -26871675 -27784214 -28282850
17915 -28282850 -28264783 -27770317 -26931999 -25891252 -24724453 -23430575 -21989985 -20442338 -18917288
17906 -18917288 -17594484 -16625069 -16072307 -15912219 -16086128 -16555155 -17314452 -18366044 -19673000
17897 -19673000 -21118234 -22498700 -23578662 -24173703 -24202833 -23685106 -22706222 -21380929 -19824837
17888 -19824837 -18145868 -16452676 -14863018 -13496588 -12451885 -11783191 -11488736 -11500110 -11669783
17879 -11669783 -11782947 -11613082 -10995605 -9875988 -8317825 -6479538 -4564637 -2757677
17871 -2757677 -1176556 142586 1239686 2206359 3134063 4058598 4944181 5715316 6307187
17862 6307187 6700894 6925994 7036715 7083701 7098595 7091649 7049578 6929899 6665958 6188753
17852 6188753 5445835 4398742 3014893 1288236 -709939 -2795904 -4703315 -6180968
17844 -6180968 -7108147 -7558737 -7768750 -8014572 -8474536 -9163493 -9962934 -10700831 -11232887
17835 -11232887 -11494482 -11500153 -11298628 -10930957 -10430180 -9854027 -9310856 -8942647 -8863440 -9094299
17825 -9094299 -9546219 -10067106 -10518620 -10831081 -11012323 -11120072 -11219009 -11345016 -11496389 -11654871
17815 -11654871 -11811719 -11969603 -12126033 -12270306 -12405323 -12569728 -12831751 -13255795 -13869005
17806 -13869005 -14646981 -15516411 -16371976 -17107888 -17647963 -17952261 -18003561 -17797116 -17344935
17797 -17344935 -16682368 -15859429 -14913568 -13836963 -12564235 -11005755 -9122987 -7001573
17789 -7001573 -4860691 -2978598 -1591518 -838680 -758523 -1297339 -2320930 -3641492 -5053321
17780 -5053321 -6364302 -7418724 -8105454 -8351785 -8115953 -7389138 -6206803 -4660054 -2888813
17771 -2888813 -1044884 751468 2411892 3824677 4801613 5098037 4509132 2975466 628570
17762 628570 -2244005 -5287432 -8170999 -10641634 -12540198 -13806124 -14479615 -14691881 -14635179
17753 -14635179 -14503427 -14408527 -14322278 -14101651 -13586878 -12699647 -11486242 -10103215 -8765923
17744 -8765923 -7680822 -6987767 -6734980 -6886379 -7343951 -7975030 -8640447 -9212490 -9578086
17735 -9578086 -9635531 -9291545 -8469321 -7141209 -5372285 -3336176 -1282531 527764 1887289
17726 1887289 2677853 2863394 2451297 1455321 -104251 -2154804 -4515219 -6887537 -8926906
17717 -8926906 -10356398 -11053727 -11062455 -10538915 -9678297 -8650507 -7558213 -6431888 -5261840
17708 -5261840 -4033194 -2740884 -1398693 -47751 1253641 2457162 3542329 4512716
17700 4512716 5380319 6149574 6808951 7333483 7689789 7835663 7726780 7348269 6759052
17691 6759052 6109321 5605420 5438509 5724330 6490251 7697578 9259054 11040183 12869766
17682 12869766 14575805 16030170 17172671 17996177 18503275 18676414 18496784 17992125 17257122
17673 17257122 16424147 15613765 14896435 14275341 13694843 13071061 12323513 11388489 10218821
17664 10218821 8789122 7111104 5240793 3262499 1259940 -702277 -2578707 -4335817
17656 -4335817 -5947520 -7397860 -8694157 -9877469 -11002400 -12088369 -13088603 -13912887
17648 -13912887 -14486894 -14798893 -14900705 -14872245 -14786975 -14705240 -14687672 -14794798 -15050237 -15394288
17638 -15394288 -15685850 -15767824 -15544804 -15017663 -14264012 -13389763 -12491183 -11653297 -10974554
17629 -10974554 -10583474 -10614757 -11138158 -12080931 -13207658 -14179202 -14653380 -14381040 -13278916
17620 -13278916 -11471727 -9284472 -7168998 -5582809 -4871637 -5201962 -6556593 -8774729
17612 -8774729 -11602906 -14735649 -17846739 -20620794 -22793915 -24200555 -24805261 -24694345
17604 -24694345 -24024313 -22955827 -21615165 -20095938 -18471910 -16800946 -15140211 -13585629
17596 -13585629 -12301987 -11498463 -11351532 -11928291 -13163029 -14895032 -16927375 -19058449
17588 -19058449 -21080729 -22781849 -23970622 -24515932 -24377171 -23613303 -22366809 -20830120
17580 -20830120 -19212417 -17718863 -16536678 -15816943 -15648435 -16026669 -16833737 -17853068 -18817414
17571 -18817414 -19457895 -19537810 -18886212 -17438748 -15260261 -12524944 -9470432 -6355108 -3422126
17562 -3422126 -863688 1207852 2770056 3878320 4641729 5199254 5697149 6260679 6959531
17553 6959531 7777458 8604914 9273197 9621146 9549308 9031500 8105714 6874340 5501179
17544 5501179 4169185 3002661 2017532 1152859 359937 -323146 -762645 -786653 -269582
17535 -269582 811598 2385123 4342003 6591031 9064309 11668909 14232412 16506298
17527 16506298 18242111 19288068 19638759 19412181 18784881 17935982 17016523 16127120 15299260
17518 15299260 14492670 13611172 12532456 11148887 9406516 7326634 5002062 2563562
17510 2563562 129664 -2227839 -4489790 -6681051 -8851918 -11040376 -13224569 -15293730
17502 -15293730 -17053241 -18262937 -18707153 -18278680 -17029867 -15156844 -12940547 -10699006
17494 -10699006 -8761315 -7420282 -6853270 -7069252 -7924525 -9180338 -10560122 -11796374
17486 -11796374 -12672400 -13057235 -12928316 -12373252 -11559860 -10678761 -9885641 -9272443 -8870987
17477 -8870987 -8663452 -8581351 -8511283 -8328983 -7945949 -7334746 -6519812 -5549320 -4470422 -3314162
17467 -3314162 -2084812 -759778 682278 2214287 3742298 5139450 6291951 7111839
17459 7111839 7522280 7444272 6799683 5535856 3668892 1323569 -1266397 -3821882 -6122367
17450 -6122367 -8078031 -9713082 -11082967 -12202988 -13044234 -13591977 -13913601 -14170356 -14546640
17441 -14546640 -15148913 -15959992 -16870685 -17733966 -18400543 -18748741 -18717675 -18322961 -17644174
17432 -17644174 -16793711 -15874476 -14935691 -13951429 -12842911 -11536759 -10026221 -8398643 -6808659
17423 -6808659 -5409469 -4293395 -3490891 -3014444 -2887659 -3130784 -3726015 -4595147 -5600689
17414 -5600689 -6566527 -7313860 -7708198 -7703454 -7361054 -6829845 -6290208 -5885218 -5669550 -5593624
17404 -5593624 -5529216 -5332865 -4914119 -4265459 -3451043 -2581473 -1779141 -1123571 -604543 -136379
17394 -136379 367447 928881 1503094 2024559 2452393 2781254 3018880 3158625 3175820 3054463
17384 3054463 2821864 2549560 2297901 2039941 1636430 896659 -316904 -2015340 -4078348
17375 -4078348 -6303793 -8478203 -10435681 -12083028 -13391871 -14378522 -15088897 -15588887 -15954529
17366 -15954529 -16261679 -16576397 -16946986 -17400594 -17942391 -18553161 -19191380 -19804514 -20336764
17357 -20336764 -20723249 -20884364 -20740477 -20245690 -19418718 -18350824 -17184604 -16069672 -15113697
17348 -15113697 -14353116 -13752792 -13226236 -12668870 -11994847 -11160617 -10170841 -9077195 -7974316
17339 -7974316 -6984932 -6225647 -5761184 -5571634 -5550550 -5534453 -5355865 -4901571 -4146253 -3143433
17329 -3143433 -1986196 -766268 443700 1571883 2515391 3146434 3367392 3160076 2582968
17320 2582968 1731155 701063 -417634 -1527746 -2508928 -3227131 -3581882 -3566996 -3295311
17311 -3295311 -2961887 -2765770 -2835226 -3195532 -3783013 -4473379 -5097628 -5450996 -5318047 -4524609
17301 -4524609 -3001562 -833619 1726334 4289532 6415583 7733550 8057940 7445883
17293 7445883 6159745 4550895 2931999 1498998 309007 -704598 -1683419 -2772237
17285 -2772237 -4061685 -5570541 -7251958 -9002096 -10677323 -12131826 -13264845 -14056976
17277 -14056976 -14580983 -14972958 -15362821 -15803721 -16257151 -16638733 -16872381 -16916811 -16776029
17268 -16776029 -16506234 -16202057 -15953721 -15803727 -15733438 -15680142 -15568173 -15341894 -14993076 -14567160
17258 -14567160 -14134380 -13737311 -13349135 -12881583 -12255175 -11483738 -10695272 -10062090 -9692873
17249 -9692873 -9567173 -9549984 -9460664 -9147378 -8539324 -7671395 -6672460 -5706839 -4885738 -4198040
17239 -4198040 -3512670 -2658287 -1521732 -96638 1534227 3250728 4944480 6546628
17231 6546628 8028392 9381733 10598835 11662135 12539100 13172197 13473919 13347477 12733649
17222 12733649 11656674 10238139 8674694 7201149 6048571 5383129 5234362 5470768
17214 5470768 5865473 6211123 6396225 6398845 6230681 5896790 5398828 4756436 4013968 3223256
17204 3223256 2412670 1563311 610882 -524773 -1896517 -3490887 -5209413 -6886006 -8343796
17195 -8343796 -9463855 -10215996 -10628917 -10735639 -10545696 -10057281 -9290370 -8316047 -7264240
17186 -7264240 -6312437 -5664678 -5513124 -5983068 -7090057 -8730064 -10699002 -12737552 -14599174
17177 -14599174 -16114774 -17212093 -17879113 -18109848 -17879513 -17157762 -15938079 -14259363 -12201280
17168 -12201280 -9857475 -7321615 -4707743 -2180713 40540 1721495 2679340 2844305
17160 2844305 2277380 1133334 -401764 -2153133 -3962489 -5681317 -7181638 -8376570
17152 -8376570 -9228486 -9744182 -9965723 -9956623 -9785272 -9519829 -9241436 -9055359 -9077133 -9398341
17142 -9398341 -10048511 -10958888 -11938173 -12691094 -12899745 -12339407 -10972825 -8976094 -6674227
17133 -6674227 -4414737 -2451462 -890129 301303 1233234 2013030 2688651 3250606 3671702
17124 3671702 3928397 3977175 3726559 3064446 1934475 390021 -1418840 -3296842 -5045214
17115 -5045214 -6480696 -7447279 -7833433 -7589679 -6728915 -5302348 -3371525 -1005740 1693263
17106 1693263 4569135 7422154 10059292 12351189 14245764 15728011 16772279 17329260
17098 17329260 17351306 16843388 15916581 14804604 13812667 13209193 13119455 13489718 14134318
17089 14134318 14814703 15300958 15405298 15000110 14036239 12559540 10702287 8639685 6537319
17080 6537319 4516976 2639699 902873 -734997 -2302636 -3769933 -5043526 -6008039
17072 -6008039 -6579504 -6734136 -6511307 -6011570 -5384639 -4781533 -4282614 -3859883 -3410732
17063 -3410732 -2832017 -2074502 -1156518 -160800 768271 1446382 1706073 1455966 692414
17054 692414 -537262 -2172807 -4150661 -6398939 -8834929 -11361717 -13861079 -16192836
17046 -16192836 -18210265 -19790451 -20869402 -21461669 -21644957 -21515728 -21145315 -20563682 -19775902
17037 -19775902 -18787117 -17603936 -16213356 -14574972 -12650308 -10449965 -8059375 -5625032
17029 -5625032 -3311465 -1247818 516255 2017351 3326922 4464871 5340618 5773254
17021 5773254 5585337 4705012 3211680 1317801 -689175 -2530182 -4020109 -5112993
17013 -5112993 -5883002 -6462127 -6972631 -7479013 -7977761 -8434533 -8843528 -9258430 -9766204
17004 -9766204 -10421994 -11193545 -11956301 -12539164 -12780570 -12556214 -11779457 -10403962 -8438097
16995 -8438097 -5946070 -3029180 178144 3484707 6635012 9359504 11461291 12870562
16987 12870562 13626736 13821473 13555482 12916803 11962976 10714188 9178429 7398330 5488187
16978 5488187 3647431 2141170 1231362 1075656 1651231 2748051 4031715 5143768 5797839
16969 5797839 5838705 5246435 4092913 2485145 525733 -1703753 -4137774 -6701660 -9282209
16960 -9282209 -11717791 -13815206 -15385566 -16291042 -16488870 -16054457 -15175515 -14115079 -13140514
16951 -13140514 -12435381 -12043382 -11891857 -11889295 -12026229 -12393677 -13098712 -14149650 -15405387
16942 -15405387 -16618744 -17530302 -17949970 -17792258 -17069403 -15868564 -14334116 -12650006 -11002490
16933 -11002490 -9523858 -8246846 -7101427 -5961424 -4716164 -3323533 -1816321 -273278
16925 -273278 1210776 2536558 3603840 4323506 4638614 4539452 4059862 3260944 2220446
16916 2220446 1033397 -191392 -1352183 -2387463 -3302725 -4166005 -5063131 -6042754 -7094092
16907 -7094092 -8163664 -9185386 -10105310 -10896324 -11558688 -12102444 -12522183 -12785790 -12843948
16898 -12843948 -12649613 -12177039 -11432800 -10453134 -9290849 -8006418 -6679423 -5435192 -4450009
16889 -4450009 -3898019 -3847775 -4174423 -4569793 -4670477 -4228337 -3213528 -1794870 -234987
16880 -234987 1213476 2360116 3083811 3319184 3048759 2316465 1245672 25642 -1147259
16871 -1147259 -2141815 -2925982 -3545278 -4071391 -4549506 -4961103 -5221162 -5222781 -4913211 -4353058
16861 -4353058 -3708656 -3177906 -2908121 -2957084 -3295384 -3826441 -4416676 -4932949 -5277687 -5418143
16851 -5418143 -5406404 -5371472 -5468454 -5806497 -6405833 -7215128 -8168295 -9229026 -10389609 -11638239
16841 -11638239 -12938675 -14240037 -15493992 -16668313 -17771226 -18875737 -20100966 -21535994
16833 -21535994 -23158119 -24821332 -26335370 -27569162 -28489872 -29120022 -29474929 -29546629 -29339625
16824 -29339625 -28910281 -28366628 -27832551 -27410878 -27160807 -27079168 -27088913 -27056661 -26842586 -26354008
16814 -26354008 -25571939 -24545683 -23366000 -22126737 -20894125 -19704715 -18586098 -17570982
16806 -17570982 -16685713 -15926044 -15248768 -14589419 -13888010 -13103597 -12219497 -11248378 -10237754
16797 -10237754 -9272871 -8467555 -7928401 -7706109 -7774580 -8053205 -8455914 -8941309 -9525121
16788 -9525121 -10233896 -11043276 -11865829 -12598922 -13185722 -13636291 -13998670 -14315169 -14597510
16779 -14597510 -14822053 -14936314 -14880133 -14618088 -14161289 -13564948 -12911546 -12298756 -11836019
16770 -11836019 -11629747 -11744427 -12165137 -12799642 -13518056 -14189004 -14691259 -14926310 -14853668
16761 -14853668 -14522215 -14059978 -13630024 -13388838 -13458742 -13902212 -14702980 -15773682 -16986374
16752 -16986374 -18203315 -19299118 -20173693 -20752565 -20979242 -20809462 -20212692 -19182923 -17754704
16743 -17754704 -16014003 -14096085 -12167997 -10393248 -8881419 -7648026 -6623269 -5714366
16735 -5714366 -4880331 -4173082 -3720101 -3654564 -4033224 -4791868 -5761123 -6726056 -7491556 -7921443
16725 -7921443 -7942628 -7529329 -6682622 -5410270 -3720751 -1644965 733180 3271210 5789344
16716 5789344 8095085 10008716 11406244 12271120 12710272 12898293 12970085 12930609 12641230
16707 12641230 11887300 10483173 8361419 5613201 2471700 -754288 -3776549 -6413243
16699 -6413243 -8615559 -10416563 -11840043 -12841205 -13324801 -13217966 -12532990 -11379687 -9934479
16690 -9934479 -8389062 -6901428 -5574220 -4460119 -3566227 -2857076 -2285962 -1844961 -1584727
16681 -1584727 -1587144 -1920475 -2610383 -3633772 -4918812 -6336924 -7696996 -8774076 -9387410
16672 -9387410 -9484697 -9159949 -8581781 -7888937 -7126103 -6237115 -5095990 -3566714 -1575887
16663 -1575887 839629 3533605 6290915 8883382 11118294 12867728 14076564 14746762
16655 14746762 14903943 14574102 13796262 12658981 11324534 10019479 8990914 8444020 8491686
16646 8491686 9142375 10329555 11957060 13918006 16070219 18200783 20028186 21260095
16638 21260095 21683942 21245953 20081568 18481260 16795555 15307877 14132066 13192822
16630 13192822 12298151 11247553 9907920 8235964 6266991 4090617 1822042 -425904
16622 -425904 -2564727 -4544764 -6364775 -8069893 -9719781 -11329363 -12826749 -14077245
16614 -14077245 -14962948 -15455206 -15640168 -15706832 -15912676 -16524555 -17736582 -19591962 -21948852
16605 -21948852 -24509668 -26898034 -28746479 -29771188 -29837351 -29002733 -27494157 -25608311
16597 -25608311 -23606147 -21676650 -19964366 -18588543 -17611386 -16991508 -16586046 -16216777 -15752236
16588 -15752236 -15149790 -14446341 -13721099 -13056827 -12518809 -12159300 -12034399 -12202179 -12686388
16579 -12686388 -13431911 -14293950 -15076522 -15604409 -15795494 -15696743 -15465613 -15312134 -15431189
16570 -15431189 -15941441 -16843730 -18020417 -19280643 -20425371 -21303818 -21848656 -22076972 -22049269
16561 -22049269 -21812222 -21371132 -20710668 -19838176 -18807368 -17702004 -16599791 -15554782 -14611342
16552 -14611342 -13825917 -13262824 -12957544 -12882317 -12956844 -13103036 -13291770 -13532468 -13821826 -14122108
16542 -14122108 -14401482 -14685354 -15056295 -15602990 -16360508 -17277805 -18231967 -19087576 -19764694
16533 -19764694 -20261988 -20614498 -20825831 -20838401 -20563496 -19936413 -18954689 -17685160 -16243480
16524 -16243480 -14757838 -13331711 -12014242 -10785532 -9570945 -8288629 -6912174 -5519052
16516 -5519052 -4291120 -3442766 -3108298 -3278009 -3833138 -4631582 -5568093 -6582244 -7631484
16507 -7631484 -8655254 -9555390 -10216217 -10559811 -10588638 -10368793 -9967150 -9409594 -8706813
16498 -8706813 -7920520 -7200256 -6750672 -6752141 -7293219 -8361060 -9885325 -11781758 -13947613
16489 -13947613 -16225064 -18398358 -20258396 -21689204 -22702420 -23393950 -23860757 -24136179
16481 -24136179 -24178232 -23908450 -23268057 -22256180 -20944173 -19475328 -18047618 -16876951 -16151693
16472 -16151693 -15993406 -16439211 -17463421 -19035934 -21172698 -23929237 -27342011 -31356019
16464 -31356019 -35753763 -40091772 -43688961 -45739844 -45588354 -43059957 -38599842 -33057318
16456 -33057318 -27281868 -21840666 -16976431 -12709723 -8965885 -5673564 -2810293 -380679
16448 -380679 1641675 3342739 4836506 6202034 7438302 8469729 9198342 9562514 9561774
16439 9561774 9241008 8655738 7841844 6803187 5520474 3976181 2185985 229569 -1721886
16430 -1721886 -3395705 -4463732 -4665030 -3946021 -2507938 -717671 1050952 2550724
16422 2550724 3717785 4644899 5501157 6442933 7546233 8776786 10007464 11077801 11868380
16413 11868380 12341369 12507573 12344845 11755326 10615761 8867849 6556194 3795954 720973
16404 720973 -2553358 -5952147 -9437363 -12960639 -16393851 -19497657 -21967884 -23534046
16396 -23534046 -24039558 -23453496 -21830632 -19275543 -15935851 -12007049 -7729753 -3373599
16388 -3373599 796215 4574108 7873580 10739098 13271206 15503502 17333560 18575813
16380 18575813 19098232 18932976 18277391 17394088 16489361 15634395 14739786 13583555 11898826
16371 11898826 9492587 6336541 2594877 -1415361 -5323728 -8820496 -11714877 -13922388
16363 -13922388 -15428767 -16258731 -16436267 -15941848 -14710970 -12692494 -9920801 -6547017
16355 -6547017 -2824303 926970 4363115 7171598 9120867 10087780 10071624 9206167 7754150
16346 7754150 6067437 4516869 3400839 2851145 2784295 2946895 3042561 2860582 2326859
16337 2326859 1467717 353261 -913401 -2175878 -3239224 -3939115 -4214553 -4126388 -3813499
16328 -3813499 -3423227 -3062903 -2798539 -2683025 -2771359 -3109039 -3716188 -4585002 -5681413
16319 -5681413 -6938015 -8252871 -9521313 -10697742 -11847386 -13138352 -14750077 -16720085
16311 -16720085 -18793508 -20385501 -20770898 -19468757 -16553728 -12614722 -8408666 -4521273
16303 -4521273 -1237455 1415899 3568722 5408388 7099951 8740368 10352754 11904612
16295 11904612 13320929 14479501 15213466 15355633 14818619 13657395 12056470 10237260
16287 10237260 8350475 6433799 4461915 2442510 476939 -1257808 -2570918 -3303048
16279 -3303048 -3348800 -2687906 -1421209 226644 1947825 3411056 4324398 4504338 3942900
16270 3942900 2828425 1473726 179517 -867214 -1600489 -2028364 -2194675 -2160691 -1988847
16261 -1988847 -1729021 -1423277 -1122697 -883627 -733823 -642320 -523456 -268659 218745 1006199
16251 1006199 2138704 3651444 5554370 7785236 10178882 12500761 14530543 16128650
16243 16128650 17237714 17836573 17897958 17383172 16276945 14642226 12657820 10604264 8792548
16234 8792548 7468480 6744073 6588626 6870440 7419493 8091622 8816681 9599752 10462516
16225 10462516 11366470 12184824 12751584 12958869 12839837 12575084 12404785 12498181 12866278
16216 12866278 13373177 13835054 14137439 14288168 14375276 14477769 14600466 14662681 14532847 14089640
16206 14089640 13280487 12149393 10828694 9505225 8371307 7576988 7205277 7273495 7739615
16197 7739615 8503068 9418262 10331707 11123234 11726186 12116356 12280358 12191610 11815355 11138205
16187 11138205 10199458 9096945 7953133 6862331 5863011 4952330 4116605 3345411 2626363
16178 2626363 1936932 1240906 490623 -354821 -1292063 -2244847 -3085472 -3708372 -4104323
16169 -4104323 -4382204 -4730535 -5341383 -6321883 -7629188 -9068924 -10366258 -11278514 -11695225
16160 -11695225 -11673155 -11389711 -11050365 -10810728 -10753221 -10910980 -11297438 -11910040 -12712829 -13618958
16150 -13618958 -14487618 -15146994 -15444095 -15293487 -14692110 -13702370 -12429754 -11002783 -9542558
16141 -9542558 -8129967 -6805459 -5613139 -4650375 -4069196 -4016104 -4550229 -5591652 -6921499
16132 -6921499 -8228250 -9189855 -9570636 -9289093 -8419228 -7134591 -5638450 -4114840 -2713736
16123 -2713736 -1562129 -767523 -389262 -402599 -700588 -1137353 -1573369 -1893322 -2005266
16114 -2005266 -1844586 -1385555 -645310 324793 1449974 2632453 3743388 4629949 5153420
16105 5153420 5239457 4908536 4272247 3498727 2755696 2150327 1699823 1348531 1006743 578715
16095 578715 -22758 -855778 -1917132 -3126570 -4353950 -5470717 -6385196 -7045271 -7420869
16086 -7420869 -7485927 -7210255 -6559265 -5492461 -3962538 -1935085 564520 3408004 6364918
16077 6364918 9156717 11537565 13361124 14601583 15319271 15596203 15491417 15041422 14286082
16068 14286082 13287922 12130054 10897981 9658817 8450091 7283284 6159812 5090203
16060 5090203 4102097 3233217 2525797 2038015 1852076 2037807 2586325 3386763 4276527
16051 4276527 5116598 5833294 6411891 6866395 7219588 7504822 7771224 8073347 8445385
16042 8445385 8874698 9299042 9639893 9844258 9893147 9784521 9541470 9251886 9076659 9188500
16032 9188500 9690238 10576264 11735873 12968095 14015052 14631144 14660409 14076517 12977935
16023 12977935 11561921 10087705 8820361 7966729 7643623 7892817 8706174 10030144 11759671
16014 11759671 13742051 15796232 17736989 19392115 20617930 21324697 21501286 21210205
16006 21210205 20545332 19582534 18354248 16848842 15026618 12849924 10314003 7463689
15998 7463689 4396069 1252784 -1792650 -4544223 -6796180 -8364159 -9130832 -9082328 -8311565
15989 -8311565 -6981153 -5265957 -3311008 -1220373 934712 3101756 5235532 7295159
15981 7295159 9242043 11027057 12575684 13793643 14597465 14944632 14837125 14310563 13442112
15972 13442112 12371952 11295417 10410505 9858449 9697903 9911653 10425006 11130814 11921162
15963 11921162 12710586 13439537 14068252 14573951 14949573 15196615 15309682 15252594 14935408
15954 14935408 14220954 12980721 11167635 8843345 6143646 3228635 263072 -2577914
15946 -2577914 -5115305 -7204441 -8778469 -9852902 -10483296 -10719208 -10601280 -10195724 -9615989
15937 -9615989 -9000061 -8464206 -8070804 -7824020 -7689124 -7625955 -7617911 -7677957 -7825296 -8038991
15927 -8038991 -8211932 -8145457 -7611679 -6461086 -4708839 -2544182 -268643 1788437 3343583
15918 3343583 4215810 4358858 3857812 2893710 1691252 461605 -647078 -1571107 -2314861
15909 -2314861 -2909153 -3363566 -3630945 -3598895 -3110345 -2009100 -203633 2273824 5242076
15900 5242076 8392417 11355322 13795249 15494545 16391024 16567719 16217648 15594373 14940217
15891 14940217 14402707 13987037 13587173 13077737 12397413 11570833 10675950 9799577 9007562
15882 9007562 8324739 7717869 7094382 6334578 5349961 4131809 2762276 1393920 213613
15873 213613 -607841 -972236 -884002 -434242 241677 1004692 1737370 2352609 2795322 3049326
15863 3049326 3147302 3164364 3180744 3229041 3266171 3199724 2956585 2550571 2107475 1827880
15853 1827880 1906580 2457130 3477735 4862700 6444784 8044219 9500793 10684997 11503244
15844 11503244 11908581 11909159 11558486 10925748 10062833 8988659 7697178 6174597 4410047
15835 4410047 2403063 177950 -2203987 -4652943 -7076260 -9397801 -11559616 -13517955
15827 -13517955 -15247782 -16745652 -18009750 -19012082 -19705483 -20066780 -20124351 -19934600 -19531675
15818 -19531675 -18898100 -17977476 -16721541 -15145796 -13353477 -11499154 -9710590 -8032970
15810 -8032970 -6445780 -4923806 -3462498 -2040381 -580333 1021465 2810848 4714403
15802 4714403 6560315 8164759 9415964 10298419 10850546 11096190 11007650 10540081 9721727
15793 9721727 8718268 7787578 7138240 6809646 6679972 6581875 6404280 6095760 5601566
15784 5601566 4822515 3640671 1986674 -101815 -2462629 -4838243 -6942810 -8553410
15776 -8553410 -9590160 -10129906 -10342443 -10407226 -10464485 -10599433 -10840521 -11168265 -11531493 -11865752
15766 -11865752 -12111685 -12224289 -12166749 -11901877 -11398542 -10651843 -9700653 -8630151 -7560109
15757 -7560109 -6626891 -5963995 -5678412 -5817877 -6341625 -7129406 -8040905 -8979496 -9904301
15748 -9904301 -10793576 -11609612 -12299752 -12825964 -13192722 -13449242 -13664931 -13897222 -14172727
15739 -14172727 -14484099 -14790434 -15017817 -15072725 -14874847 -14391122 -13645869 -12701593 -11622821
15730 -11622821 -10441701 -9148260 -7716379 -6143812 -4471654 -2777570 -1162350 261777
15722 261777 1388522 2141957 2498969 2498410 2225963 1780187 1246667 692623 170021 -275028
15712 -275028 -585185 -694226 -569248 -255684 130006 464803 700862 919206 1315029 2102767
15702 2102767 3395265 5145130 7182245 9298842 11313451 13089021 14522751 15529855
15694 15529855 16032691 15964457 15290767 14031826 12256326 10046406 7471950 4601399 1529952
15685 1529952 -1608243 -4653538 -7448520 -9867721 -11845978 -13399175 -14617078 -15620238
15677 -15620238 -16509239 -17340758 -18134482 -18890841 -19601883 -20248793 -20791632 -21169541 -21325481
15668 -21325481 -21239785 -20938004 -20468257 -19881723 -19232096 -18570402 -17922862 -17277460 -16609351
15659 -16609351 -15943894 -15413029 -15244030 -15671624 -16840458 -18766068 -21357432 -24461838 -27896797
15650 -27896797 -31453471 -34883029 -37901835 -40235993 -41682190 -42151725 -41688270 -40457184
15642 -40457184 -38700016 -36666122 -34556749 -32504327 -30573807 -28759555 -26975370 -25071836
15634 -25071836 -22909842 -20455052 -17818987 -15218977 -12898116 -11057138 -9816190 -9197344
15626 -9197344 -9119754 -9418739 -9900045 -10402576 -10823602 -11099609 -11181417 -11040937 -10706374 -10286092
15616 -10286092 -9951028 -9886192 -10240718 -11096190 -12455738 -14242241 -16300343 -18417281 -20372909
15607 -20372909 -21993659 -23170654 -23839324 -23955952 -23495407 -22462790 -20903502 -18906906
15599 -18906906 -16608591 -14191292 -11867457 -9829106 -8183578 -6921529 -5948901 -5162313
15591 -5162313 -4513415 -4023011 -3739558 -3670206 -3740284 -3821822 -3807495 -3668891 -3470896 -3353149
15581 -3353149 -3486253 -4006179 -4951364 -6237965 -7690431 -9110049 -10335739 -11261752 -11823126
15572 -11823126 -11985744 -11759740 -11223132 -10521481 -9824715 -9272118 -8952798 -8923221 -9220490
15563 -9220490 -9844202 -10729048 -11753994 -12801115 -13819324 -14833739 -15892301 -16993447
15555 -16993447 -18040988 -18848173 -19191091 -18890738 -17886344 -16262520 -14214480 -11966644
15547 -11966644 -9687062 -7452037 -5289437 -3264101 -1520603 -231033 516399 795590
15539 795590 820225 836547 1014043 1408250 2002339 2773964 3728998 4887709 6250924 7784465
15529 7784465 9442096 11201896 13063890 14999364 16900946 18580797 19819791 20435743
15521 20435743 20334339 19522479 18083833 16138001 13811679 11229537 8515520 5799158
15513 5799158 3220336 917513 -1004497 -2506963 -3628036 -4471689 -5182481 -5909177 -6769905
15504 -6769905 -7835567 -9129618 -10629631 -12259829 -13880711 -15299703 -16313775 -16760108
15496 -16760108 -16543123 -15634109 -14067140 -11950651 -9476703 -6885236 -4380528 -2064898
15488 -2064898 50702 1980235 3706563 5173526 6320079 7124131 7618199 7864246 7911649
15479 7911649 7768248 7393925 6716565 5668264 4225854 2434468 407424 -1692748 -3683489
15470 -3683489 -5392521 -6688078 -7507168 -7867216 -7848001 -7548796 -7044101 -6368956 -5545561
15461 -5545561 -4625624 -3710679 -2937594 -2443481 -2329529 -2639037 -3359223 -4440952 -5814186
15452 -5814186 -7385356 -9031564 -10611132 -11985905 -13040523 -13697720 -13935873 -13802198 -13406606
15443 -13406606 -12893955 -12408203 -12066596 -11954788 -12136663 -12659164 -13536461 -14718749 -16077985
15434 -16077985 -17440802 -18655047 -19639283 -20372809 -20832634 -20937928 -20561170 -19599046 -18041561
15425 -18041561 -15988238 -13606420 -11065964 -8498654 -6009615 -3720341 -1791220 -392249
15417 -392249 359629 445690 -65437 -1069720 -2465845 -4147445 -5972752 -7752250 -9265179
15408 -9265179 -10289437 -10630832 -10150031 -8789523 -6594571 -3714277 -374066 3172846
15400 3172846 6693150 9998392 12940580 15390488 17223311 18333795 18676446 18299416
15392 18299416 17350331 16056261 14678662 13444313 12477384 11770335 11210698 10646655 9955275
15383 9955275 9085384 8066578 6987786 5954465 5038840 4238799 3464498 2574299 1453184
15374 1453184 79567 -1468039 -3050521 -4508432 -5685866 -6448345 -6700369 -6390965 -5497562
15365 -5497562 -4008670 -1936768 644232 3577372 6643052 9608118 12270289 14477731
15357 14477731 16128615 17162729 17552996 17305875 16468902 15126162 13378429 11338680
15349 11338680 9160104 7058807 5278625 4003400 3284250 3039201 3115797 3364551 3686910
15340 3686910 4053104 4489111 5032024 5679616 6375351 7044240 7650913 8226714 8839506
15331 8839506 9538899 10329964 11186127 12067289 12917482 13659278 14217638 14570146 14782199
15322 14782199 14990978 15336513 15874468 16530915 17142406 17554577 17699247 17598330 17312289
15313 17312289 16886055 16328420 15625011 14759852 13722190 12504536 11114687 9600040 8059911
15304 8059911 6636940 5495443 4786450 4598145 4914711 5616714 6525900 7467918 8328808
15295 8328808 9086990 9801006 10554990 11402324 12349454 13381181 14497161 15734562 17172288
15286 17172288 18915532 21056345 23624468 26558708 29709763 32861488 35762459 38169883
15278 38169883 39901266 40875988 41119588 40718292 39759464 38317087 36492217 34453126 32419466
15269 32419466 30598753 29133455 28096334 27521505 27442691 27919912 29039844 30876683 33418899
15260 33418899 36503324 39809609 42930465 45485375 47221883 48055326 48042256 47327016 46099290
15251 46099290 44572712 42969736 41493746 40294409 39450442 38977888 38843471 38963107 39199926
15242 39199926 39389125 39385111 39100798 38519200 37680362 36662839 35580616 34590476 33871257
15233 33871257 33554874 33654598 34055362 34572027 35020405 35250848 35150610 34654891 33774541
15224 33774541 32603537 31281438 29935792 28648121 27461580 26413471 25559259 24963671
15216 24963671 24664632 24648089 24860247 25237299 25723630 26275199 26853681 27415430 27905402
15207 27905402 28270936 28496652 28634642 28799627 29131293 29757988 30786344 32299137 34325250
15198 34325250 36782202 39440494 41956885 43974472 45239721 45674902 45378098 44567330
15190 44567330 43500430 42397111 41388217 40513404 39762158 39120955 38592993 38192310 37934252
15181 37934252 37830228 37881191 38070626 38365679 38730614 39140442 39577216 40012776 40397086
15172 40397086 40658493 40710936 40471482 39892802 38992917 37853777 36587901 35302101 34074998
15163 34074998 32939905 31876562 30832939 29774033 28719153 27736340 26901830 26253795
15155 26253795 25768893 25384171 25058165 24826799 24811307 25173122 26035964 27406305 29142253
15146 29142253 31007000 32773826 34302467 35544042 36505548 37226662 37779827 38269995 38817236
15137 38817236 39522560 40429823 41508231 42673920 43839780 44958556 46034503 47109475
15129 47109475 48241263 49483536 50870352 52407409 54074205 55841053 57692534 59634969
15121 59634969 61677354 63807750 65993603 68198461 70384782 72497390 74450638 76139178
15113 76139178 77468391 78380754 78862160 78932622 78632425 78016191 77166620 76222220 75389498
15104 75389498 74915500 75035397 75933484 77735181 80520027 84349553 89310311 95541957
15096 95541957 103203232 112388397 123070262 135108975 148289876 162361026 177087584
15089 177087584 192320008 208024700 224237591 240960856 258069026 275280623 292189113
15082 292189113 308300849 323052253 335818527 345919344 352627382 355233396 353219492
15075 353219492 346483866 335469479 321097615 304541891 286969581 269368269 252491218
15068 252491218 236868848 222821801 210463765 199722986 190400566 182249535 175040185
15061 175040185 168587010 162742976 157388951 152436169 147832014 143549927 139565383 135839919
15053 135839919 132325977 128980606 125767413 122642481 119537489 116355198 112986520 109348489
15045 109348489 105429395 101316400 97184867 93254685 89739143 86798158 84492818 82764849
15037 82764849 81483351 80545574 79951567 79795155 80193430 81211357 82813466 84853593 87113627
15028 87113627 89388549 91582554 93765927 96166399 99111062 102955181 108017612 114519907
15020 114519907 122534267 131966046 142591537 154142316 166393650 179201285 192460376
15013 192460376 206008819 219520289 232436287 243997309 253407025 260067579 263755697
15006 263755697 264660033 263306750 260446115 256935235 253604241 251111749 249846640 249927096
14998 249927096 251287263 253801160 257396487 262130599 268221500 276039687 286063302 298795790
14990 298795790 314661680 333908154 356516860 382110266 409860315 438432172 465985530
14983 465985530 490255133 508774757 519311358 520437914 511986171 495107194 471885904
14976 471885904 444717864 415753958 386610404 358345081 331577911 306641820 283706605
14969 283706605 262848991 244070341 227296828 212395549 199200644 187518784 177113824
14962 177113824 167716490 159083733 151061298 143591764 136671831 130300257 124441149 119007763
14954 119007763 113869303 108876446 103889113 98791756 93503822 88007198 82385645 76832123
14946 76832123 71589893 66851165 62679561 59010684 55726324 52740405 50040879 47684186
14938 47684186 45765490 44381423 43598009 43431990 43836891 44681612 45733026 46672469 47163801
14929 47163801 46957698 45985006 44386549 42461255 40564332 39005807 37979186 37527706
14921 37527706 37550252 37844792 38174944 38331664 38164625 37582719 36546955 35072823 33229612
14912 33229612 31116608 28829016 26449031 24065758 21780676 19662243 17670397 15612997
14904 15612997 13179049 10037395 5948340 834497 -5214701 -11986984 -19192944 -26474576
14896 -26474576 -33364009 -39214519 -43185572 -44412708 -42386366 -37287618 -29956188 -21511262
14888 -21511262 -12946097 -4916480 2274348 8568421 14006620 18627074 22447701 25500803
14880 25500803 27862616 29661054 31075580 32321085 33595560 35007473 36532303 38033698
14872 38033698 39339463 40327075 40968618 41313375 41439439 41432709 41408830 41531200 41974749 42839334
14862 42839334 44069436 45446440 46672427 47488999 47753330 47449559 46661391 45527548 44189963
14853 44189963 42745980 41221830 39591711 37844343 36046005 34337097 32860920 31689374
14845 31689374 30804056 30128477 29564573 29003865 28327634 27421660 26202750 24638942 22761885
14836 22761885 20679375 18579857 16703667 15272621 14417211 14155150 14423570 15120272 16123828
14827 16123828 17298111 18498969 19592641 20484952 21153511 21669088 22188752 22905977 23964765
14818 23964765 25380350 27018059 28646168 30032415 31032403 31626073 31887945 31917502 31780092
14809 31780092 31494283 31062065 30507877 29895163 29314308 28855270 28582885 28525549 28677770
14800 28677770 29012584 29498212 30117029 30887915 31878868 33181755 34845433 36812539 38910917
14791 38910917 40902030 42551861 43695746 44284505 44398152 44216887 43965819 43861835 44069652
14782 44069652 44664281 45613655 46800490 48076666 49315364 50434509 51395643 52191677 52832397
14773 52832397 53339596 53753602 54131131 54524029 54956853 55416971 55850598 56165575 56250881
14764 56250881 56007483 55374864 54346343 52971012 51331836 49493806 47446736 45089511
14756 45089511 42284418 38961673 35208573 31274834 27479748 24078823 21176818 18732658
14748 18732658 16636487 14812268 13300505 12274647 11967321 12546874 14028222 16266619
14740 16266619 19017653 22017961 25044511 27929975 30545380 32789299 34611256 36043873
14732 36043873 37189404 38150732 38962138 39573280 39880498 39774775 39197076 38187959 36892623
14723 36892623 35498739 34142790 32854166 31571870 30207147 28706415 27095438 25496539
14715 25496539 24096470 23064502 22474819 22292503 22420094 22748524 23174276 23600608 23955124
14706 23955124 24213991 24397652 24539723 24664370 24782921 24894597 24989549 25058207 25094549 25088968
14696 25088968 25033751 24952677 24924222 25067605 25501519 26300350 27461490 28896049 30447593
14687 30447593 31923916 33128862 33893124 34102417 33722719 32819301 31548031 30104482 28661629
14678 28661629 27341684 26225638 25368525 24795318 24478469 24325181 24209536 24046733 23856473
14669 23856473 23758964 23898900 24356264 25112103 26076020 27128348 28144785 29011794 29649879
14660 29649879 30035979 30197699 30177164 29998460 29668701 29206076 28659990 28097411 27571080
14651 27571080 27108962 26731744 26464689 26322692 26287897 26309149 26325984 26300499 26246278 26239578
14641 26239578 26385621 26744221 27275128 27855933 28349837 28658881 28733625 28557371 28130722
14632 28130722 27466784 26597238 25584399 24524649 23530826 22703801 22113620 21795520 21751955
14623 21751955 21947030 22292282 22653703 22904529 22988879 22936397 22819154 22690966 22549866 22345044
14613 22345044 22022906 21576832 21057322 20527876 20000982 19413303 18669165 17725165 16653325
14604 16653325 15634339 14889558 14601595 14861650 15648150 16828012 18185499 19490338 20588555
14595 20588555 21467950 22254559 23132506 24227454 25525766 26881761 28101935 29046380 29689859
14586 29689859 30116789 30454755 30780834 31060994 31168196 30962627 30370208 29411966 28187363
14577 28187363 26842457 25538350 24410677 23526484 22875744 22411547 22101326 21949550 21989561
14568 21989561 22264236 22804835 23599974 24563340 25538584 26356913 26904342 27142151 27074591
14559 27074591 26710517 26062575 25177814 24158754 23148894 22292761 21696399 21404734 21397504
14550 21397504 21595217 21863951 22021906 21867567 21238477 20075850 18456331 16577491 14714595
14541 14714595 13168085 12204749 11993680 12560723 13793504 15492335 17425759 19362829
14533 19362829 21092985 22453090 23355616 23800666 23867061 23684329 23388142 23070967 22755348
14524 22755348 22414881 22029028 21624544 21273832 21061886 21049803 21247879 21598612 21978334
14515 21978334 22229986 22221055 21899160 21316988 20613629 19956992 19474877 19215544 19156846 19243382
14505 19243382 19415758 19619308 19805546 19927333 19917192 19678727 19136145 18311358 17343044
14496 17343044 16422587 15713303 15320620 15302452 15668535 16361377 17250340 18149209 18848680
14487 18848680 19170835 19041764 18530062 17804277 17045443 16392065 15931995 15696765 15640190
14478 15640190 15630634 15485922 15044215 14233892 13107254 11829713 10633728 9747405 9314857
14469 9314857 9340648 9688196 10135800 10463154 10527356 10295811 9827713 9223898 8581190 7978914
14459 7978914 7491046 7186708 7096999 7176703 7303566 7318766 7084332 6537769 5726550 4804189
14449 4804189 3982860 3460391 3358622 3710403 4502083 5737033 7469619 9780627 12712335
14440 12712335 16214510 20138218 24273295 28400124 32329743 35921049 39072298 41693261
14432 41693261 43685022 44964518 45531961 45518285 45153665 44675438 44245256 43919564 43667840
14423 43667840 43409922 43051458 42517042 41780193 40874809 39886452 38938966 38171935 37693732
14414 37693732 37531608 37623573 37858630 38124573 38326141 38375468 38182231 37661602 36759869 35489543
14404 35489543 33952415 32325565 30810887 29574459 28708077 28231363 28123432 28352920 28883254
14395 28883254 29656027 30575409 31515164 32351702 33003348 33443879 33677252 33701086 33502734
14386 33502734 33091625 32523739 31888004 31271407 30731910 30286092 29900542 29483190 28895079
14377 28895079 28000415 26726888 25085859 23142258 20971497 18643393 16238991 13874197
14369 13874197 11704888 9910976 8668117 8113746 8320503 9290810 10970729 13269831
14361 13269831 16069117 19201741 22423668 25424626 27900571 29647448 30621582 30940577
14353 30940577 30825444 30512837 30188649 29970476 29921588 30067862 30402962 30883994 31435750
14344 31435750 31970910 32406094 32658264 32634424 32238428 31406807 30163307 28658142 27151000
14335 27151000 25927321 25189267 24993053 25280749 25978154 27067205 28570296 30476255 32687680
14326 32687680 35034525 37328000 39395889 41079436 42230417 42743593 42609313 41946701
14318 41946701 40989468 40017664 39259927 38822593 38692738 38799320 39065200 39412294 39751664
14309 39751664 40005149 40151429 40244371 40384217 40685264 41272849 42279244 43794801 45788926
14300 45788926 48074616 50369653 52419544 54091666 55381973 56353953 57075873 57602871
14292 57602871 57998355 58355304 58784076 59367988 60121284 60979360 61814583 62459567 62741558
14283 62741558 62533024 61797899 60603875 59091386 57416397 55695324 53970932 52206698
14275 52206698 50317940 48240385 46003555 43754939 41710044 40059940 38896738 38193217
14267 38193217 37826813 37618205 37367936 36893123 36068044 34855213 33303118 31508290 29572410
14258 29572410 27588330 25652790 23871663 22338272 21102904 20164176 19491869 19062598
14250 19062598 18880310 18965233 19320137 19903087 20629062 21398673 22138480 22834199 23536348
14241 23536348 24329401 25281221 26401280 27623571 28813280 29791864 30382076 30467940 30040972
14232 30040972 29198009 28081985 26797908 25361744 23716282 21798369 19618670 17312351
14224 17312351 15124228 13327150 12114998 11521473 11399562 11467455 11393870 10885937 9754690
14215 9754690 7945180 5532911 2701061 -290909 -3147808 -5594840 -7444891 -8643749
14207 -8643749 -9255470 -9390066 -9124661 -8482851 -7485892 -6219234 -4847958 -3562228 -2489128
14198 -2489128 -1635911 -909413 -190367 610621 1556967 2709643 4109366 5720324 7397948
14189 7397948 8925620 10097765 10788805 10970089 10684450 10015574 9077027 8007448 6939297
14180 6939297 5942216 4989586 3987312 2846741 1551267 184439 -1080944 -2024553 -2442969
14171 -2442969 -2209674 -1296086 244233 2293783 4675519 7160763 9500150 11475393
14163 11475393 12947991 13872206 14263987 14160474 13608190 12677266 11474562 10143815 8857091
14154 8857091 7795116 7111386 6895775 7161572 7852670 8852030 9992662 11084007 11954859
14145 11954859 12500486 12706995 12622925 12287262 11676566 10724446 9392308 7723275 5844032
14136 5844032 3932398 2175424 726100 -333702 -1010961 -1391607 -1606937 -1792553 -2056121
14127 -2056121 -2457114 -3001341 -3662806 -4426324 -5309827 -6337753 -7490204 -8676954 -9762425
14118 -9762425 -10630054 -11245814 -11676383 -12048221 -12479566 -13031680 -13697921 -14420170 -15118492
14109 -15118492 -15725500 -16208308 -16555484 -16741933 -16722304 -16473266 -16042780 -15550687 -15125070
14100 -15125070 -14817408 -14568776 -14257487 -13778104 -13080897 -12162191 -11047920 -9795372 -8497534
14091 -8497534 -7267769 -6207633 -5381062 -4809643 -4478188 -4332935 -4279528 -4205579 -4028733
14082 -4028733 -3731018 -3339141 -2862967 -2258409 -1465824 -492083 548951 1478847 2138729
14073 2138729 2447684 2405916 2060037 1468033 693620 -167631 -959256 -1471538 -1503778 -955116
14063 -955116 120871 1551983 3155097 4831927 6590403 8505108 10661460 13103017
14055 13103017 15787029 18570348 21248274 23630582 25603403 27132731 28216657 28847911
14047 28847911 29038446 28877990 28547148 28253983 28146066 28265960 28564260 28939736 29283086
14038 29283086 29517593 29619759 29595929 29427812 29043648 28351715 27306399 25945143 24365472
14029 24365472 22664030 20886553 19025907 17066841 15038051 13032760 11195488 9693426
14021 9693426 8676084 8220517 8286762 8728640 9369193 10085442 10837482 11636826 12502398
14012 12502398 13441473 14446163 15483456 16489576 17392360 18152128 18787173 19365459 19968033
14003 19968033 20638936 21341416 21950471 22309164 22337761 22128128 21945060 22118005 22886814
13994 22886814 24299544 26215698 28377155 30475813 32203201 33312873 33692715 33391023
13986 33391023 32557246 31337858 29811674 28002299 25928807 23638976 21207896 18717434
13978 18717434 16238300 13826836 11534790 9423723 7573346 6069423 4965633 4236946
13970 4236946 3757634 3329165 2750294 1885914 692174 -801157 -2514960 -4330599 -6097638
13961 -6097638 -7652944 -8843939 -9543522 -9658240 -9138295 -7989451 -6283716 -4166738 -1845838
13952 -1845838 461482 2607174 4568466 6421787 8229698 9919940 11263762 11985114
13944 11985114 11926582 11159494 9970845 8747652 7839629 7467817 7702558 8502112 9772367
13935 9772367 11398577 13236753 15102116 16802808 18215021 19327839 20203444 20895207
13927 20895207 21407262 21719331 21836109 21814673 21754023 21758541 21895036 22165361 22513638 22860383
13917 22860383 23134969 23291894 23312472 23193568 22928054 22488296 21824452 20882219 19630832
13908 19630832 18084621 16310355 14421342 12557189 10852612 9412538 8307405 7577357
13900 7577357 7225806 7209384 7447361 7852733 8364480 8962775 9663440 10497322 11487578 12639901
13890 12639901 13947967 15403609 17006967 18775626 20741583 22925040 25289361 27701065
13882 27701065 29930432 31707679 32803077 33080692 32508217 31146877 29145031 26722824
13874 26722824 24126070 21572742 19234772 17244611 15687716 14589411 13929060 13670681
13866 13670681 13771963 14164743 14730150 15290468 15634359 15582063 15062073 14144320 13003706
13857 13003706 11842591 10822314 10031175 9481137 9110035 8779554 8291201 7450354 6155994
13848 6155994 4444087 2450890 339416 -1754816 -3741736 -5568122 -7197262 -8588757
13840 -8588757 -9684120 -10402462 -10652478 -10365936 -9547327 -8310877 -6866442 -5453227 -4268148
13831 -4268148 -3428690 -2967619 -2845923 -2981195 -3278783 -3646778 -3995175 -4230790 -4257722 -3996732
13821 -3996732 -3424402 -2601703 -1660673 -755589 -6707 543536 946389 1323755 1818683
13812 1818683 2548147 3570323 4862007 6313383 7753571 9007947 9971199 10654786 11168932
13803 11168932 11655309 12228946 12957845 13858434 14883715 15916429 16797064 17391433 17658607
13794 17658607 17669514 17570404 17528804 17689981 18142108 18890445 19859493 20927675 21963188
13785 21963188 22832454 23395939 23528846 23173935 22385550 21320178 20177713 19138089 18328583
13776 18328583 17826412 17678372 17905047 18470836 19250928 20047346 20652315 20901100 20678131
13767 20678131 19902027 18534884 16619829 14303315 11806433 9358266 7133536 5229527
13759 5229527 3687756 2532053 1787016 1466037 1546960 1963533 2622953 3431213 4306543
13750 4306543 5182662 6011711 6765557 7424562 7953555 8289427 8363556 8141999 7637112 6873429
13740 6873429 5841570 4483165 2723325 538662 -1979047 -4611464 -7065227 -9051265
13732 -9051265 -10356577 -10897491 -10745449 -10111293 -9287520 -8563800 -8138556 -8055841 -8194169
13723 -8194169 -8316803 -8170437 -7590885 -6560617 -5193864 -3666566 -2127420 -643061 777757
13714 777757 2104278 3232787 4019884 4368009 4285553 3880973 3318958 2785372 2462724
13705 2462724 2485597 2878371 3522510 4189737 4625081 4632281 4123721 3119347 1703101 -23956
13695 -23956 -1951705 -3935032 -5783600 -7299459 -8337268 -8839883 -8833199 -8398822 -7643952
13686 -7643952 -6673115 -5567100 -4376726 -3127010 -1823742 -463285 955129 2418034
13678 2418034 3884450 5277822 6504453 7502278 8294493 9012112 9860124 11035450 12642106
13669 12642106 14652354 16928715 19282539 21526959 23497023 25049887 26082150 26572291
13661 26572291 26604934 26334699 25906522 25392697 24789515 24063359 23200573 22230537 21228046
13652 21228046 20310477 19627767 19325599 19468865 19959048 20519881 20791365 20484827 19502566
13643 19502566 17960465 16121676 14287489 12691695 11435859 10484526 9706833 8937132
13635 8937132 8041723 6984723 5867229 4902966 4330294 4315177 4899669 6008781 7503864
13626 7503864 9251350 11156143 13136929 15084097 16862669 18371559 19600023 20611507
13618 20611507 21457702 22105681 22449149 22386521 21893981 21047221 19999301 18944363 18081744
13609 18081744 17578692 17533282 17946200 18711665 19640183 20521169 21205722 21656431 21922561
13600 21922561 22064252 22095890 21986089 21686728 21154087 20364396 19334373 18126568 16817852
13591 16817852 15451637 14019964 12494017 10876106 9230786 7672472 6316082 5219731
13583 5219731 4355131 3623028 2900453 2091739 1166278 173605 -782419 -1609955 -2289826
13574 -2289826 -2883070 -3487500 -4172617 -4919082 -5600219 -6039380 -6117408 -5854866 -5415587 -5031108
13564 -5031108 -4887919 -5043200 -5418362 -5868361 -6281376 -6649227 -7064142 -7646009 -8456028
13555 -8456028 -9453634 -10507642 -11439481 -12077096 -12303432 -12085150 -11474221 -10581748 -9535236
13546 -9535236 -8446593 -7406535 -6488982 -5744881 -5190479 -4810522 -4581663 -4493360 -4544849
13537 -4544849 -4729391 -5028262 -5414309 -5851719 -6290736 -6669687 -6933149 -7056657 -7051859 -6934313
13527 -6934313 -6681429 -6233318 -5538949 -4593664 -3432138 -2096239 -620843 949508 2547109
13518 2547109 4105163 5607810 7122305 8777356 10684608 12841864 15078637 17083342
13510 17083342 18507546 19107803 18865561 18022193 17000397 16250543 16104451 16697845 17967394
13501 17967394 19698337 21603372 23413158 24941411 26091406 26813223 27058087 26769027
13493 26769027 25911118 24514746 22691829 20599322 18376656 16117699 13896990 11804426
13485 11804426 9939075 8363606 7061332 5938117 4873649 3784878 2660381 1551134
13477 1551134 529555 -357466 -1117115 -1803552 -2470271 -3107044 -3611036 -3821716 -3599188
13468 -3599188 -2894114 -1770138 -374908 1119923 2578226 3929010 5158213 6281008
13460 6281008 7322046 8312811 9288130 10266619 11229248 12120194 12872702 13436691 13782953
13451 13782953 13881182 13670550 13050316 11912980 10216266 8050586 5644819 3292334 1239950
13442 1239950 -391965 -1619155 -2543896 -3284002 -3914155 -4439491 -4803489 -4915176 -4680376
13433 -4680376 -4031703 -2953749 -1493789 251305 2165306 4138553 6080726 7932631
13425 7932631 9679405 11347581 12981740 14619971 16278805 17941675 19552525 21021039
13417 21021039 22231210 23042349 23292238 22823968 21538483 19446661 16691657 13532700
13409 13532700 10300251 7335978 4926710 3241263 2288034 1921571 1910979 2041775 2200297
13400 2200297 2402173 2752798 3369976 4329929 5661515 7348120 9297684 11308762 13098584
13391 13098584 14407665 15116183 15292319 15144877 14914320 14769297 14764345 14862651 14984820 15050484
13381 15050484 15004638 14828527 14538740 14184083 13841163 13597100 13519871 13641463 13967758 14485933
13371 14485933 15138038 15784525 16213758 16209853 15627328 14420797 12632770 10376004 7825814
13362 7825814 5202432 2728801 588518 -1084308 -2196629 -2708848 -2663504 -2180565 -1403640
13353 -1403640 -440029 665860 1920329 3339213 4902028 6534534 8124688 9545859
13345 9545859 10677484 11439098 11831761 11949532 11944087 11968025 12128787 12467003 12963540 13572571
13335 13572571 14263742 15049702 15985540 17140142 18550426 20185977 21947032 23686233
13327 23686233 25237719 26453005 27238133 27576024 27522097 27173987 26634451 25994604 25342607
13318 25342607 24767391 24328327 24008170 23694580 23211168 22377271 21059969 19204535 16853404
13309 16853404 14150701 11312336 8562050 6063779 3884805 2003447 348118 -1152716
13301 -1152716 -2525360 -3734375 -4710212 -5395101 -5770089 -5861830 -5742543 -5517077 -5292813
13292 -5292813 -5148387 -5112815 -5147512 -5127894 -4846950 -4063275 -2575604 -284078 2774418
13283 2774418 6408521 10282350 13974800 17087191 19366982 20787934 21530129 21871989
13275 21871989 22074615 22317170 22677850 23137244 23600967 23946307 24079283 23967884 23629079
13266 23629079 23091616 22378964 21523434 20578039 19597631 18605362 17583906 16504877 15365509
13257 15365509 14193226 13020237 11866036 10746737 9693688 8758205 7995760 7440345
13249 7440345 7088709 6902110 6810716 6716519 6520255 6175434 5722142 5264005 4909107 4719361
13239 4719361 4693320 4782991 4925813 5065319 5153214 5147551 5017304 4748994 4345845 3816722
13229 3816722 3169006 2422871 1638188 918031 362436 -11108 -326392 -832694 -1806499
13220 -1806499 -3422307 -5660529 -8290386 -10935235 -13202620 -14822777 -15721206 -15997182
13212 -15997182 -15845602 -15469912 -15008069 -14492045 -13868128 -13071067 -12095557 -11015065 -9953780
13203 -9953780 -9049749 -8428956 -8178081 -8300380 -8677269 -9087482 -9295868 -9154447 -8646012
13194 -8646012 -7850833 -6874375 -5797687 -4682914 -3609602 -2694446 -2072320 -1852676 -2080941
13185 -2080941 -2726831 -3698953 -4860791 -6029711 -6980611 -7489289 -7407344 -6718999 -5542565
13176 -5542565 -4082300 -2563932 -1182759 -74632 688934 1090566 1164265 1003004 747293
13167 747293 537590 455614 495973 583220 616169 513411 238515 -210204 -833639 -1649301
13157 -1649301 -2666290 -3837940 -5040892 -6115067 -6947499 -7537831 -7996185 -8477060 -9093658
13148 -9093658 -9864961 -10718243 -11530357 -12178584 -12575283 -12674487 -12463811 -11959450 -11202345 -10247843
13138 -10247843 -9154638 -7980741 -6780561 -5595686 -4445785 -3324151 -2190187 -961204
13130 -961204 478218 2240649 4388402 6897098 9643127 12416700 14959379 17019212
13122 17019212 18409581 19059907 19046227 18586343 17996600 17619378 17727406 18425109 19602403
13113 19602403 20986966 22266382 23197675 23652468 23610595 23133680 22326282 21287035 20074260
13104 20074260 18707954 17195333 15550147 13791471 11928784 9948143 7815969 5508541
13096 5508541 3045934 502092 -2001356 -4296583 -6178794 -7451847 -8004274 -7866448
13088 -7866448 -7203217 -6241600 -5178913 -4130174 -3139261 -2229307 -1447925 -874812 -593086
13079 -593086 -657094 -1079157 -1824669 -2804859 -3883576 -4921942 -5852404 -6725129 -7669491
13070 -7669491 -8790001 -10086415 -11462724 -12798465 -13998788 -14974649 -15589999 -15651692 -14968285
13061 -14968285 -13431153 -11059303 -7990504 -4433518 -607674 3296423 7110807 10654882
13053 10654882 13727430 16167508 17952744 19242907 20307503 21383788 22574430 23837186
13045 23837186 25028399 25951064 26403617 26238184 25407139 23969945 22067977 19892924 17649721
13036 17649721 15501891 13514744 11639786 9763323 7789172 5701559 3572153 1511845
13028 1511845 -387312 -2068122 -3486371 -4594441 -5349100 -5732258 -5770203 -5542126 -5178361
13019 -5178361 -4847997 -4719699 -4889427 -5311423 -5790931 -6063502 -5917697 -5280579 -4223582
13010 -4223582 -2910473 -1527369 -220807 938744 1957944 2893804 3819462 4796260 5850580
13001 5850580 6953024 8013195 8908577 9538775 9865968 9916109 9753271 9449591 9060412
12992 9060412 8610929 8100688 7521831 6884594 6244527 5707371 5383067 5302691 5361910 5355652
12982 5355652 5101348 4560736 3862533 3219371 2819153 2764757 3067335 3664984 4458857 5362043
12972 5362043 6328776 7338095 8355682 9319820 10168304 10885098 11531220 12239659 13175125
12963 13175125 14462863 16100674 17902486 19531326 20625533 20951536 20494939 19439063
12955 19439063 18052016 16559341 15074816 13607001 12105168 10503514 8759182 6893506
12947 6893506 5017406 3308985 1947722 1047726 627196 621625 925093 1433892 2071616
12938 2071616 2793898 3580450 4416934 5280271 6150890 7041821 7998933 9049904 10140220
12929 10140220 11121246 11810218 12076321 11899415 11383886 10728905 10163047 9870039 9942781
12920 9942781 10380856 11115594 12040006 13035228 13998885 14878827 15690962 16489617 17301683
12911 17301683 18080298 18713412 19070163 19048596 18602546 17742677 16519299 15009457 13324686
12902 13324686 11620139 10069447 8801344 7832392 7040855 6209520 5121349 3651111
12894 3651111 1803620 -306705 -2508777 -4631487 -6545508 -8179935 -9514544 -10565191
12886 -10565191 -11377162 -12024042 -12610587 -13273859 -14155336 -15333946 -16760451 -18242596 -19493249
12877 -19493249 -20218484 -20208823 -19404498 -17915329 -15974646 -13831920 -11644984 -9442791 -7167136
12868 -7167136 -4747023 -2160952 536634 3228008 5763217 7985938 9748756 10923363
12860 10923363 11417080 11206156 10373462 9117417 7712845 6436239 5485434 4930137 4722150
12851 4722150 4754008 4922611 5171762 5511798 6010462 6745679 7733305 8874721 9972702
12842 9972702 10819317 11298820 11432600 11344241 11188609 11100703 11176890 11461368 11922830 12445325
12832 12445325 12860096 13014123 12843514 12406691 11855976 11377522 11139845 11258438 11772315
12823 11772315 12636259 13727236 14860144 15820106 16416130 16533239 16151299 15332159 14203648
12814 14203648 12943609 11734442 10686768 9788096 8928684 7986637 6905578 5720319
12806 5720319 4536223 3492813 2733457 2381478 2510112 3104951 4044364 5127040 6139250
12797 6139250 6918851 7380842 7504596 7307509 6829672 6137164 5334706 4570396 4015832
12788 4015832 3816728 4033255 4607778 5387670 6192252 6883091 7405659 7793514 8135225
12779 8135225 8513099 8943273 9358689 9649146 9721689 9534737 9095759 8433459 7560896 6466395
12769 6466395 5158713 3727623 2345690 1195160 386860 -63573 -212715 -168222 -81931
12760 -81931 -134567 -498440 -1289363 -2533359 -4165688 -6054452 -8034019 -9943670 -11655296
12751 -11655296 -13067953 -14086592 -14628736 -14660421 -14211978 -13346022 -12114538 -10560170 -8766684
12742 -8766684 -6902476 -5194975 -3831761 -2858260 -2161197 -1553082 -881371 -92891 752554
12733 752554 1515810 2061692 2354125 2494100 2666617 3034298 3651271 4444731 5263207 5958379
12723 5958379 6457002 6788438 7061178 7410280 7942049 8691821 9606162 10554943 11368266
12714 11368266 11891195 12042597 11846463 11411470 10873154 10337751 9857152 9442117 9099549
12705 9099549 8864418 8802403 8984374 9450933 10182412 11083892 12001906 12782215 13333022 13636061
12695 13636061 13703390 13537593 13132290 12491845 11639038 10610081 9450116 8213890 6966405
12686 6966405 5771010 4660231 3607187 2525681 1308585 -116500 -1748765 -3513962
12678 -3513962 -5299349 -7002686 -8566666 -9976719 -11228933 -12308170 -13207100 -13960092
12670 -13960092 -14635571 -15278390 -15859082 -16280426 -16425537 -16203434 -15577871 -14577654 -13278885
12661 -13278885 -11770654 -10135959 -8457582 -6830656 -5367511 -4192026 -3422122 -3140904
12653 -3140904 -3362586 -4012800 -4949041 -6015881 -7087809 -8066785 -8862263 -9396224 -9628558
12644 -9628558 -9572386 -9287994 -8861965 -8387226 -7960401 -7694317 -7721261 -8164778 -9087589 -10450035
12634 -10450035 -12109817 -13863209 -15497275 -16823327 -17693914 -18023945 -17810435 -17124916 -16086459
12625 -16086459 -14849406 -13601857 -12536410 -11788839 -11389819 -11269760 -11311313 -11412505 -11527174
12616 -11527174 -11666616 -11865052 -12136429 -12457351 -12781481 -13055919 -13214627 -13165718 -12810743
12607 -12810743 -12099421 -11080025 -9908074 -8803196 -7964585 -7479473 -7275582 -7142928 -6808092
12598 -6808092 -6031767 -4701870 -2883618 -792397 1300986 3172149 4691163 5809884
12590 5809884 6528838 6882214 6943220 6822366 6636556 6459776 6289526 6053512 5655632 5040664
12580 5040664 4247766 3420257 2754364 2415099 2480409 2945389 3764341 4894979 6324805
12571 6324805 8067392 10126336 12446733 14883314 17209168 19177855 20618098 21502473
12563 21502473 21942365 22119845 22206262 22307672 22453039 22614581 22730036 22709251 22434138 21772844
12553 21772844 20620168 18947573 16829642 14436175 12001163 9776972 7983446 6772012
12545 6772012 6215549 6311092 6976579 8048021 9305577 10537381 11608820 12494511 13261034
12536 13261034 14024890 14913002 16022848 17366716 18818613 20112519 20910841 20902618 19882905
12527 19882905 17804957 14805025 11174555 7269234 3399355 -236045 -3552550 -6545073
12519 -6545073 -9236365 -11620457 -13624064 -15114168 -15953121 -16067209 -15484071 -14318873 -12725529
12510 -12725529 -10845374 -8774986 -6555580 -4180728 -1627929 1086377 3857414 6490183
12502 6490183 8758004 10490247 11639175 12287568 12592543 12702114 12695682 12576124 12303303
12493 12303303 11834812 11147499 10246454 9186598 8099255 7173506 6574432 6362228 6484515
12484 6484515 6832060 7295058 7785026 8230995 8573461 8772246 8826251 8784260 8725280 8713941
12474 8713941 8763898 8837417 8875063 8824103 8646178 8312949 7805533 7125229 6312901 5452398
12464 5452398 4627104 3847027 3014958 1975730 618643 -1039253 -2848073 -4600942 -6126437
12455 -6126437 -7326215 -8151133 -8567358 -8561009 -8173462 -7511300 -6706698 -5872809 -5097412 -4457213
12445 -4457213 -4011368 -3774831 -3709549 -3746538 -3812307 -3840935 -3776542 -3569279 -3164554 -2500847
12435 -2500847 -1535220 -288055 1127077 2516938 3667875 4423276 4732964 4642367 4236010
12426 4236010 3585504 2739075 1744665 668196 -421234 -1489375 -2559637 -3693533 -4943863
12417 -4943863 -6320062 -7788490 -9297435 -10795031 -12218885 -13475630 -14451479 -15064216
12409 -15064216 -15316058 -15299369 -15154452 -15023371 -15029867 -15269531 -15783401 -16518602 -17311108 -17922061
12399 -17922061 -18115967 -17734770 -16737599 -15208336 -13339969 -11398215 -9667175 -8379411
12391 -8379411 -7639878 -7379756 -7380900 -7365807 -7106336 -6503705 -5612597 -4612644 -3755128 -3306769
12381 -3306769 -3496824 -4474837 -6283148 -8837744 -11921547 -15211960 -18350254 -21026337
12373 -21026337 -23038874 -24303270 -24809339 -24565542 -23581396 -21903101 -19659839 -17068989
12365 -17068989 -14389774 -11851679 -9589993 -7616900 -5848319 -4169155 -2487378 -755685
12357 -755685 1017130 2751905 4304498 5514470 6281178 6616791 6633476 6468721 6207052
12348 6207052 5866708 5456626 5031545 4676195 4430884 4232538 3929759 3367525 2480652
12339 2480652 1330085 69517 -1120313 -2096472 -2803725 -3291704 -3687897 -4142854 -4777791
12330 -4777791 -5649723 -6733186 -7924985 -9084328 -10096667 -10924656 -11618407 -12287065 -13056431
12321 -13056431 -14031613 -15260961 -16701868 -18217450 -19631148 -20821918 -21797950 -22687097
12313 -22687097 -23640754 -24717498 -25827938 -26773864 -27348662 -27429940 -27009310 -26157460 -24970772
12304 -24970772 -23542626 -21962635 -20320948 -18703941 -17190977 -15862818 -14807371 -14105247
12296 -14105247 -13809526 -13940526 -14475996 -15309410 -16212405 -16871388 -17001165 -16458219 -15283677
12287 -15283677 -13673089 -11905856 -10258668 -8929951 -8006987 -7474466 -7235994 -7140351 -7026681
12278 -7026681 -6783533 -6387086 -5890856 -5379110 -4926676 -4593624 -4438204 -4509663 -4814489 -5300028
12268 -5300028 -5894537 -6570672 -7355695 -8268080 -9246339 -10145972 -10815608 -11195371 -11357072
12259 -11357072 -11443780 -11547478 -11621074 -11495761 -10983966 -9980453 -8493174 -6610016 -4460890
12250 -4460890 -2218143 -112564 1593498 2695055 3144627 3086573 2791207 2524889 2435400
12241 2435400 2523592 2709247 2920977 3127396 3297122 3349751 3160539 2618421 1685242 411632
12231 411632 -1088027 -2670314 -4190611 -5529169 -6614631 -7429565 -7995738 -8363238 -8615016
12222 -8615016 -8860353 -9196323 -9661634 -10224883 -10819544 -11398307 -11966606 -12575995 -13289696
12213 -13289696 -14144053 -15121488 -16148641 -17129561 -17993481 -18712523 -19273805 -19640978 -19749901
12204 -19749901 -19547261 -19038984 -18306928 -17483207 -16702391 -16057429 -15580833 -15260711 -15073022
12195 -15073022 -14999048 -15021412 -15117817 -15268365 -15471414 -15748067 -16123461 -16596303 -17119514 -17604869
12185 -17604869 -17947245 -18055374 -17877530 -17413190 -16705102 -15819994 -14837355 -13845312 -12916239
12176 -12916239 -12058588 -11191282 -10182325 -8930201 -7423991 -5739321 -3982389 -2228553
12168 -2228553 -489983 1285494 3194985 5340711 7769449 10415621 13090016 15532473
12160 15532473 17497852 18824700 19468373 19512420 19157649 18667173 18264077 18019891 17802243
12151 17802243 17331148 16318722 14605552 12219578 9346126 6252267 3213054 456875
12143 456875 -1863056 -3660531 -4889373 -5545870 -5711639 -5572736 -5353934 -5210577 -5181406
12134 -5181406 -5230164 -5306625 -5368958 -5378843 -5304698 -5143707 -4945182 -4804347 -4808200 -4960365 -5149970
12123 -5149970 -5203387 -4984677 -4473388 -3774196 -3060146 -2486000 -2115893 -1895239 -1673228 -1260022
12113 -1260022 -491326 727775 2412627 4513046 6936557 9570111 12296337 15012813
12105 15012813 17656320 20208040 22660693 24967496 27014305 28639467 29689985 30079008
12097 30079008 29814820 28992571 27762532 26300234 24785794 23377604 22182045 21245734
12089 21245734 20580459 20193712 20089681 20237798 20544279 20861183 21027335 20907810 20412866
12080 20412866 19501017 18175082 16480805 14522476 12483150 10596496 9049909 7889327
12072 7889327 7009680 6224456 5346111 4240543 2861256 1259565 -448560 -2148608 -3776080
12063 -3776080 -5308921 -6718146 -7924577 -8798271 -9200813 -9042081 -8318534 -7109414 -5528282
12054 -5528282 -3663522 -1561009 728954 3079675 5262301 7002441 8084927 8436577
12046 8436577 8142003 7398145 6438372 5450345 4510429 3565429 2478153 1113858 -583436
12037 -583436 -2563852 -4698394 -6834618 -8845225 -10651563 -12232086 -13622797 -14896021
12029 -14896021 -16113370 -17280191 -18337978 -19201923 -19810115 -20143592 -20208147 -20003244 -19511425
12020 -19511425 -18722083 -17674571 -16489049 -15355436 -14470825 -13954195 -13792473 -13850448 -13930346
12011 -13930346 -13842841 -13461307 -12751579 -11782103 -10715537 -9766999 -9121514 -8846295 -8854766 -8944116
12001 -8944116 -8884856 -8523829 -7855275 -7019206 -6221675 -5626237 -5293704 -5207132 -5333901 -5644639
11991 -5644639 -6075086 -6492144 -6716667 -6591021 -6042301 -5106870 -3909979 -2609173 -1325814
11982 -1325814 -102693 1086406 2284124 3498963 4705303 5892051 7102936 8420167
11974 8420167 9903683 11538798 13222923 14776040 15959659 16523908 16293491 15248113
11966 15248113 13535149 11400825 9088676 6769543 4525098 2366918 272439 -1777637
11958 -1777637 -3782748 -5734335 -7631845 -9477363 -11254295 -12906639 -14326538 -15361542
11950 -15361542 -15851045 -15681104 -14838535 -13445639 -11746277 -10027726 -8516154 -7309170
11942 -7309170 -6374458 -5603240 -4887307 -4171068 -3437158 -2641074 -1667947 -365414 1374752
11933 1374752 3554881 6064425 8720777 11337884 13790871 16032291 18044545 19772043
11925 19772043 21092425 21841409 21859180 21030672 19323686 16820709 13710751 10230997 6601650
11916 6601650 2996309 -454666 -3647961 -6488434 -8875953 -10706325 -11886592 -12362589
11908 -12362589 -12153171 -11369947 -10203975 -8885153 -7627681 -6571759 -5744450 -5067581 -4406852
11899 -4406852 -3626236 -2630481 -1399960 -7054 1404786 2673936 3682631 4408716 4942276
11890 4942276 5443489 6058974 6849991 7767704 8674357 9393957 9770584 9713239 9216380 8354399
11880 8354399 7254897 6063028 4913068 3916806 3158293 2677255 2447389 2377204 2349367
11871 2349367 2280411 2160482 2051618 2058880 2293058 2828449 3663624 4709773 5824616 6878592
11861 6878592 7817134 8686164 9606061 10700723 12014728 13470553 14899429 16126592 17053363
11852 17053363 17690161 18138233 18545453 19056521 19766921 20688648 21737566 22750616 23531658
11843 23531658 23905482 23750759 23009347 21700060 19945287 17974381 16075368 14516229
11835 14516229 13475447 13004021 13027837 13386759 13888033 14348672 14618350 14593891 14239305
11826 14239305 13600173 12778381 11861000 10855551 9693030 8300544 6684443 4960608
11818 4960608 3319071 1958273 1020473 540950 431407 517735 622375 649476 623424 658975
11808 658975 889476 1403221 2213676 3259914 4435470 5643694 6849374 8082454 9385768
11799 9385768 10749712 12087345 13269947 14200775 14879073 15408275 15940985 16607090 17475699
11790 17475699 18548017 19754496 20963647 22022378 22809236 23257098 23335732 23030354 22341842
11781 22341842 21292071 19913904 18237996 16299566 14158431 11902732 9622858 7375186
11773 7375186 5167569 2980585 808282 -1314985 -3316418 -5096849 -6538826 -7525935
11765 -7525935 -7982878 -7911724 -7398195 -6589244 -5651658 -4716365 -3824280 -2906289 -1816125
11756 -1816125 -396953 1454159 3746668 6389806 9216748 12027552 14632524 16880012
11748 16880012 18660005 19887490 20487540 20404273 19627401 18209562 16259286 13919991 11357851
11739 11357851 8763603 6345478 4295377 2742216 1722171 1180966 1000451 1034591 1147968
11730 1147968 1251187 1316148 1357399 1396345 1444031 1509504 1606037 1744673 1930202 2155438
11720 2155438 2376048 2482436 2316564 1753785 799530 -381576 -1534846 -2431475 -2954083
11711 -2954083 -3112139 -2995230 -2703869 -2306440 -1843463 -1354880 -893529 -518702 -284716
11702 -284716 -225497 -328750 -510013 -611365 -447391 109599 1059021 2268349 3527389
11693 3527389 4614009 5349113 5638305 5487162 4981703 4247664 3412624 2585265 1846907
11684 1846907 1247125 808665 547483 489780 655920 1018146 1478908 1895999 2135195 2119091
11674 2119091 1850382 1401323 881779 408807 87315 -2384 193543 718683 1628626 2993543
11664 2993543 4868446 7250163 10060683 13168099 16411599 19610122 22575866 25143736
11656 25143736 27192882 28646091 29467749 29676689 29348817 28582999 27455625 26008262 24273777
11647 24273777 22311509 20218981 18107770 16066504 14148870 12396020 10872536 9691411
11639 9691411 9005238 8953037 9587630 10828313 12466871 14224275 15830582 17094770 17944137
11630 17944137 18427964 18686597 18885981 19131833 19412496 19617686 19616079 19323927 18720908 17825725
11620 17825725 16667567 15271738 13653958 11821090 9789616 7621990 5453095 3469181
11612 3469181 1833458 605675 -278747 -947373 -1495174 -1931847 -2198867 -2212628 -1887377
11603 -1887377 -1145559 56197 1691972 3650590 5749182 7768550 9497576 10770645
11595 10770645 11486018 11601430 11110255 10019245 8357419 6212422 3747240 1158859
11587 1158859 -1396331 -3838032 -6119358 -8152184 -9782735 -10844720 -11242453 -11005183
11579 -11005183 -10294149 -9364761 -8484772 -7832678 -7434849 -7191663 -6979571 -6749285 -6548061
11570 -6548061 -6469682 -6589068 -6925135 -7434312 -8014381 -8509083 -8725901 -8477311 -7635376 -6175320
11560 -6175320 -4181645 -1813842 732840 3239065 5458332 7133586 8045659 8076001 7253082
11551 7253082 5754637 3853848 1828498 -115062 -1851693 -3286805 -4311158 -4811562
11543 -4811562 -4727462 -4111748 -3152306 -2122117 -1269081 -712421 -413466 -231119 -15981
11534 -15981 326005 841577 1576970 2595167 3948229 5643868 7629886 9788208 11932514
11525 11932514 13824576 15228825 15989196 16075683 15567061 14590679 13265259 11674581 9873550
11516 9873550 7912327 5857913 3797924 1822979 -1420 -1644800 -3078792 -4221730
11508 -4221730 -4920432 -5004301 -4378060 -3085593 -1310255 679945 2620631 4334969 5760535
11499 5760535 6904117 7774827 8359067 8655534 8736052 8776123 9021932 9710100 10983249
11490 10983249 12831449 15075293 17409318 19501032 21089905 22031347 22292856 21939374
11482 21939374 21115544 20012034 18820750 17698979 16749983 16012483 15458699 15007683 14549647
11473 14549647 13972588 13191951 12179231 10968890 9632794 8240846 6827943 5372767
11465 5372767 3802900 2041562 73454 -2021061 -4088409 -5956188 -7477038 -8541873
11457 -8541873 -9073413 -9025278 -8394456 -7225213 -5593871 -3600586 -1386440 849134 2865672
11448 2865672 4436247 5416689 5800665 5722991 5389886 4974266 4550602 4104617 3587771
11439 3587771 2973595 2297545 1663883 1201711 992033 1029387 1255919 1629780 2155996 2857037
11429 2857037 3721487 4676426 5599338 6356759 6844901 7014127 6874987 6486295 5920497
11420 5920497 5225087 4423009 3555883 2720633 2063491 1742459 1883616 2544365 3693046
11411 3693046 5218566 6970010 8796799 10558547 12112040 13309678 14025972 14196475
11403 14196475 13843698 13073000 12037009 10889696 9760827 8755989 7957842 7415682 7138096
11394 7138096 7099587 7250798 7518533 7802707 7992846 8005054 7811737 7445937 6985629 6529611
11384 6529611 6174239 5993227 6014185 6197173 6439901 6619708 6643140 6468194 6098608 5571441
11374 5571441 4953114 4341458 3849137 3552310 3438542 3404253 3300977 2987711 2368719 1433549
11364 1433549 300697 -784705 -1544988 -1812391 -1610691 -1120068 -576202 -190300 -115981
11355 -115981 -428295 -1098179 -1993619 -2937052 -3797160 -4549698 -5259758 -6009485 -6840573 -7749545
11345 -7749545 -8717105 -9736271 -10816785 -11954963 -13081082 -14032508 -14597395 -14614852 -14065765
11336 -14065765 -13089556 -11910996 -10726461 -9630138 -8624641 -7683542 -6792879 -5941354 -5088211
11327 -5088211 -4141744 -2968586 -1448805 443730 2595207 4778539 6734998 8265465
11319 8265465 9291174 9856501 10072424 10039128 9803975 9381466 8807146 8171357 7605348
11310 7605348 7230995 7102425 7173161 7310231 7339146 7082836 6383039 5126150 3285039
11301 3285039 949214 -1689678 -4389841 -6910480 -9036741 -10584708 -11415171 -11476078 -10845133
11292 -10845133 -9715099 -8310008 -6792212 -5230868 -3642912 -2054391 -528687 839762
11284 839762 1937853 2646179 2863402 2539469 1699366 444426 -1072480 -2696672 -4327927
11275 -4327927 -5946678 -7593313 -9322773 -11161545 -13077985 -14977801 -16736659 -18260829
11267 -18260829 -19540571 -20651181 -21687523 -22679330 -23552893 -24158106 -24337633 -24004282 -23183242
11258 -23183242 -21985320 -20531394 -18894400 -17099667 -15158055 -13084449 -10890165 -8567720
11250 -8567720 -6085552 -3405265 -524285 2479098 5436600 8132199 10372829 12049016
11242 12049016 13163053 13824256 14215912 14541312 14971164 15619156 16546445 17767090 19238090
11233 19238090 20853410 22468038 23947194 25205251 26204782 26929330 27370717 27542010 27484764
11224 27484764 27245266 26835506 26220014 25349788 24207887 22812377 21184817 19340424 17312270
11215 17312270 15164166 12961297 10723019 8405422 5934828 3268709 444084 -2403839
11207 -2403839 -5055158 -7262647 -8846639 -9774163 -10165432 -10222029 -10121343 -9941915 -9664088
11198 -9664088 -9233189 -8629158 -7895500 -7114213 -6346212 -5583127 -4750103 -3754197 -2539481
11189 -2539481 -1114387 456654 2076274 3631726 5014946 6154776 7044126 7738616
11181 7738616 8326489 8891661 9490139 10146481 10871111 11689272 12651265 13799788 15114419
11172 15114419 16478036 17687249 18501338 18714122 18222056 17053789 15347696 13301561
11164 13301561 11125973 9007804 7075778 5373837 3866458 2490310 1226891 144506
11156 144506 -622095 -938686 -733742 -13054 1169957 2751172 4664537 6817447 9065876
11147 9065876 11222842 13094707 14521963 15413655 15767945 15669219 15262104 14715749 14195887
11138 14195887 13847883 13773522 13993782 14425631 14908763 15279798 15453062 15466541 15471327 15664928
11128 15664928 16200947 17124642 18358561 19730470 21028226 22066674 22746307 23078014 23155188
11119 23155188 23081564 22896490 22544914 21902382 20821282 19169412 16873020 13971522 10642607
11110 10642607 7164555 3843491 948808 -1331948 -2917067 -3824450 -4140045 -3982335
11102 -3982335 -3480850 -2768359 -1970426 -1185605 -466657 188430 829895 1528588 2336856
11093 2336856 3262170 4265563 5272997 6183314 6871701 7205451 7085669 6495547 5512104
11084 5512104 4265208 2880761 1458028 87230 -1135769 -2137272 -2918983 -3579829
11076 -3579829 -4273266 -5122622 -6151216 -7274292 -8352090 -9254868 -9891142 -10201794 -10156894
11067 -10156894 -9768660 -9103053 -8274420 -7415084 -6621523 -5912465 -5246777 -4595144 -3999282
11058 -3999282 -3563062 -3384786 -3488720 -3807299 -4222163 -4634596 -5016498 -5398604 -5802324
11049 -5802324 -6179334 -6414270 -6376871 -5971068 -5158038 -3963639 -2470131 -781903 1016361
11040 1016361 2871119 4732925 6520800 8111826 9367306 10178932 10504300 10375991 9892657
11031 9892657 9199921 8455190 7774502 7183921 6617204 5975826 5211268 4364879 3532488
11022 3532488 2786496 2133076 1547457 1040056 673640 523453 642300 1063464 1808305
11013 1808305 2864938 4151287 5497989 6673361 7443380 7637159 7189971 6148152 4638001
11004 4638001 2822856 874493 -1037560 -2754155 -4145298 -5133758 -5703407 -5884047 -5730807
10995 -5730807 -5316262 -4725607 -4033607 -3267741 -2390970 -1328030 -22577 1513277 3196653
10986 3196653 4923506 6623739 8272236 9860081 11367767 12761435 14002630 15063790
10978 15063790 15946897 16690634 17354616 17993770 18638042 19274408 19831043 20179017 20167570
10969 20167570 19689010 18736573 17410871 15873703 14289913 12785907 11429489 10240691
10961 10240691 9237374 8480450 8066394 8059870 8419460 8978020 9500564 9788514 9757530 9433871
10951 9433871 8889353 8181417 7336002 6360950 5265758 4076135 2839244 1621302 503546
10942 503546 -423607 -1070739 -1363133 -1260146 -775698 18209 1014610 2111063 3247092
10933 3247092 4421074 5675400 7056913 8576539 10192733 11821434 13352056 14658422
10925 14658422 15614489 16119345 16121934 15635590 14736842 13548301 12210504 10845181 9510879
10916 9510879 8167599 6681718 4882493 2640363 -75448 -3178885 -6486945 -9773092
10908 -9773092 -12833880 -15524030 -17735922 -19359090 -20279412 -20433726 -19872180 -18768383 -17369082
10899 -17369082 -15923486 -14623959 -13565108 -12734466 -12050892 -11432816 -10849048 -10321099 -9888173
10890 -9888173 -9573757 -9384369 -9330270 -9432886 -9709138 -10157883 -10765760 -11520197 -12410731 -13415464
10880 -13415464 -14486349 -15549228 -16515631 -17290925 -17777183 -17881095 -17530338 -16692542 -15384343
10871 -15384343 -13662537 -11611255 -9342849 -7002622 -4753629 -2736884 -1027437 386333
10863 386333 1588245 2689533 3764201 4790773 5648640 6190500 6337129 6112874 5609680
10854 5609680 4938345 4203022 3478902 2778801 2034642 1125243 -53818 -1524494 -3218302
10845 -3218302 -5032585 -6900815 -8823274 -10842620 -12981777 -15182848 -17290123 -19090586
10837 -19090586 -20386847 -21063099 -21110895 -20602879 -19635747 -18281917 -16577346 -14546181 -12239060
10828 -12239060 -9752073 -7202531 -4675550 -2195311 247138 2636345 4888807 6847763
10820 6847763 8325519 9180241 9383707 9035705 8321173 7446494 6594595 5915500 5543405
10811 5543405 5606658 6199510 7333625 8922092 10809073 12801159 14669827 16151691 16985386
10802 16985386 16981297 16086540 14416778 12248042 9969764 8002675 6694186 6226759 6585443
10793 6585443 7593813 8980396 10435270 11646955 12339780 12331932 11592975 10252578 8545029
10784 8545029 6718033 4945271 3282444 1696796 153653 -1311721 -2598213 -3602343
10776 -3602343 -4274814 -4635914 -4770708 -4830425 -5032822 -5630725 -6825855 -8655370 -10938323
10767 -10938323 -13343792 -15533696 -17277488 -18485756 -19172932 -19384443 -19134103 -18393748 -17142608
10758 -17142608 -15432911 -13408828 -11259981 -9154155 -7203539 -5471172 -3984459 -2734886
10750 -2734886 -1680784 -772040 18681 686441 1210577 1574672 1767259 1768012 1542859 1062504
10740 1062504 337461 -555686 -1483993 -2309787 -2952501 -3408992 -3721112 -3935891 -4100547
10731 -4100547 -4287906 -4611633 -5196468 -6116819 -7348967 -8760389 -10137115 -11248931 -11922761
10722 -11922761 -12065154 -11627313 -10583760 -8969438 -6924004 -4670762 -2432242 -344820
10714 -344820 1574113 3391218 5182820 6977130 8738754 10377215 11773394 12835139
10706 12835139 13554644 14007696 14282776 14406191 14328847 13964851 13233386 12084374 10518756
10697 10518756 8611972 6524809 4467982 2618293 1042273 -317075 -1591929 -2912782
10689 -2912782 -4330088 -5766965 -7039289 -7937205 -8316995 -8164423 -7615835 -6919914 -6338530
10680 -6338530 -6040267 -6059726 -6335226 -6770531 -7273104 -7772142 -8238173 -8696118 -9201265 -9780123
10670 -9780123 -10386001 -10914301 -11270370 -11434007 -11463192 -11437824 -11403811 -11366601 -11325202 -11306168
10660 -11306168 -11368879 -11575716 -11938506 -12375298 -12719599 -12787624 -12455119 -11692051 -10551878
10651 -10551878 -9142442 -7596277 -6047329 -4618517 -3420529 -2555748 -2110001 -2118281 -2524305
10642 -2524305 -3175202 -3864653 -4395879 -4629122 -4499722 -4009378 -3203074 -2147705 -919235
10633 -919235 403666 1743693 3028294 4191855 5179647 5955446 6506165 6837905 6966220
10624 6966220 6905032 6656718 6205103 5514330 4542089 3268597 1719602 -36956 -1907083
10615 -1907083 -3778203 -5528764 -7063002 -8355567 -9451838 -10402980 -11196031 -11748594 -11958509
10606 -11958509 -11754824 -11125420 -10120196 -8833199 -7382737 -5913069 -4613377 -3713868
10598 -3713868 -3419943 -3805135 -4747093 -5965730 -7130246 -7963115 -8307570 -8155565 -7632528
10589 -7632528 -6945339 -6317773 -5932096 -5881737 -6141029 -6563547 -6920885 -6979876 -6586475 -5711657
10579 -5711657 -4437972 -2901795 -1232569 469080 2106786 3550735 4629148 5165840
10571 5165840 5046739 4281567 3029684 1571695 228703 -742969 -1236474 -1318544 -1180027
10562 -1180027 -1040337 -1058956 -1292803 -1705942 -2213459 -2729286 -3195160 -3584862 -3887178 -4081698
10552 -4081698 -4134286 -4026177 -3795900 -3557632 -3471921 -3672812 -4192697 -4940243 -5748548 -6455414
10542 -6455414 -6963226 -7252490 -7352042 -7289888 -7063189 -6654437 -6080836 -5431949 -4855775 -4493953
10532 -4493953 -4413262 -4585955 -4925012 -5334028 -5731489 -6045299 -6206415 -6165521 -5918917 -5509898
10522 -5509898 -5000384 -4439337 -3840768 -3169208 -2350408 -1318719 -61974 1384715 2984444
$$ [...]
##END NTUPLES=NMR SPECTRUM
##END=
