##TITLE=31P ikalashn
DE-78_oil2
19.11.2024
##JCAMPDX= 6.0         $$ Bruker NMR JCAMP-DX V2.0
##DATA TYPE= NMR SPECTRUM
##DATA CLASS= NTUPLES
##ORIGIN= UXNMR, Bruker Analytische Messtechnik GmbH
##OWNER= root
$$ TOPSPIN		Version 1.3
$$ 2024-11-19 16:29:36.921 +0400  Irina@DPX200
$$ Compression mode = diff/dup
##.OBSERVE FREQUENCY= 81.01967998063
##.OBSERVE NUCLEUS= ^31P
##.ACQUISITION MODE= SIMULTANEOUS
##.ACQUISITION SCHEME= undefined
##.AVERAGES= 64
##.DIGITISER RES= 17
##SPECTROMETER/DATA SYSTEM= spect
##.PULSE SEQUENCE= zgpg
##.SOLVENT NAME= CDCl3
##.SHIFT REFERENCE= INTERNAL, CDCl3, 1, 298.5841
##AUDIT TRAIL= $$ (NUMBER, WHEN, WHO, WHERE, WHAT)
$$ ##TITLE= Audit trail, TOPSPIN		Version 1.3
$$ ##JCAMPDX= 5.01
$$ ##ORIGIN= Bruker BioSpin GmbH
$$ ##OWNER= Irina
$$ $$ F:/spectra/data/iren/nmr/P31dec/1/pdata/1/auditp.txt
$$ ##AUDIT TRAIL=  $$ (NUMBER, WHEN, WHO, WHERE, VERSION, WHAT)
(   1,<2024-11-19 16:29:00.453 +0400>,<Irina>,<DPX200>,<TOPSPIN 1.3>,
      <created by zg
	started at 2024-11-19 16:27:16.734 +0400,
	POWCHK disabled, PULCHK disabled
       configuration hash MD5:
       BE 6D 3F 07 2A EA 11 49 91 17 2B D3 AF B3 58 0D
       data hash MD5: 32K
       22 A8 07 5B 37 1A EB F8 1B 60 80 CF 6C 3D B1 C4>)
(   2,<2024-11-19 16:29:17.843 +0400>,<Irina>,<DPX200>,<TOPSPIN 1.3>,
      <Start of raw data processing
       efp BC_mod = 2 LB = 18 FT_mod = 6 PKNL = 1 PHC0 = 261.9372 PHC1 = -70.54639 SI = 32K 
       data hash MD5: 32K
       6B CD CA 4E 77 A8 14 BF 7E B9 C7 8F 32 09 80 55>)
(   3,<2024-11-19 16:29:20.234 +0400>,<Irina>,<DPX200>,<TOPSPIN 1.3>,
      <apk 
       data hash MD5: 32K
       1C BC 8F 9D AD 93 3B C9 D8 36 78 22 A2 48 DE F5>)
(   4,<2024-11-19 16:29:22.375 +0400>,<Irina>,<DPX200>,<TOPSPIN 1.3>,
      <abs n ABSG = 5 
       data hash MD5: 32K
       4F A9 D2 39 DD A1 34 B9 98 46 D9 7C 1F E9 2C 1F>)
$$ ##END=
$$ 
$$ $$ hash MD5
$$ $$ CC 51 2B FD 36 35 C0 33 AC C6 8A 27 D9 99 37 EB
##$RELAX= 
##$RELAX= 
##$RELAX= 
##$RELAX= 
##$RELAX= 
##$RELAX= 
##$RELAX= 
##$RELAX= 
##$RELAX= 
##$RELAX= 
##$RELAX= 
$$ Bruker specific parameters
$$ --------------------------
##$DU= <F:/spectra>
##$EXPNO= 1
##$NAME= <P31dec>
##$PROCNO= 1
##$TYPE= <nmr>
##$USER= <iren>
##$AMP= (0..31)
100 100 100 100 100 100 100 100 100 100 100 100 100 100 100 100 100 100 
100 100 100 100 100 100 100 100 100 100 100 100 100 100 
##$ANAVPT= -1
##$AQSEQ= 0
##$AQ_mod= 1
##$AUNM= <au_zg>
##$AUTOPOS= <>
##$BF1= 81.014009
##$BF2= 200.13
##$BF3= 200.13
##$BF4= 200.13
##$BF5= 200.13
##$BF6= 200.13
##$BF7= 200.13
##$BF8= 200.13
##$BYTORDA= 1
##$CFDGTYP= 0
##$CFRGTYP= 5
##$CHEMSTR= <none>
##$CNST= (0..63)
1 1 145 1 1 1 1 1 1 1 1 1 1 1 1 1 1 1 1 1 1 1 1 1 1 1 1 1 1 1 1 1 1 1 
1 1 1 1 1 1 1 1 1 1 1 1 1 1 1 1 1 1 1 1 1 1 1 1 1 1 1 1 1 1 
##$CPDPRG= <waltz16>
##$CPDPRG1= <>
##$CPDPRG2= <waltz16>
##$CPDPRG3= <>
##$CPDPRG4= <mlev>
##$CPDPRG5= <mlev>
##$CPDPRG6= <mlev>
##$CPDPRG7= <mlev>
##$CPDPRG8= <mlev>
##$CPDPRGB= <>
##$CPDPRGT= <>
##$D= (0..63)
$$ [...]
##$SW_h= 37037.037037037
##$TD= 32768
##$TD0= 1
##$TE= 300
##$TE2= 300
##$TE3= 300
##$TEG= 300
##$TL= (0..7)
0 120 53 12 22 120 120 120 
##$TP= (0..7)
150 150 150 150 150 150 150 150 
##$TP07= 0
##$TPNAME0= <>
##$TPNAME1= <>
##$TPNAME2= <>
##$TPNAME3= <>
##$TPNAME4= <>
##$TPNAME5= <>
##$TPNAME6= <>
##$TPNAME7= <>
##$TPOAL= (0..7)
0.5 0.5 0.5 0.5 0.5 0.5 0.5 0.5 
##$TPOFFS= (0..7)
0 0 0 0 0 0 0 0 
##$TUNHIN= 0
##$TUNHOUT= 0
##$TUNXOUT= 0
##$USERA1= <user>
##$USERA2= <user>
##$USERA3= <user>
##$USERA4= <user>
##$USERA5= <user>
##$V9= 5
##$VALIST= <valist>
##$VCLIST= <CCCCCCCCCCCCCCC>
##$VD= 0
##$VDLIST= <DDDDDDDDDDDDDDD>
##$VPLIST= <PPPPPPPPPPPPPPP>
##$VTLIST= <TTTTTTTTTTTTTTT>
##$WBST= 1024
##$WBSW= 4
##$XGAIN= (0..3)
0 0 0 0 
##$XL= 0
##$YL= 0
##$YMAX_a= 3256
##$YMIN_a= -5079
##$ZGOPTNS= <>
##$ZL1= 120
##$ZL2= 120
##$ZL3= 120
##$ZL4= 120
##$ABSF1= 298.5841
##$ABSF2= -158.5842
##$ABSG= 5
##$ABSL= 5
##$ALPHA= 0
##$AQORDER= 0
##$ASSFAC= 0
##$ASSFACI= 0
##$ASSFACX= 0
##$ASSWID= 0
##$AUNMP= <proc_1d>
##$AXLEFT= 0
##$AXRIGHT= 0
##$AXTYPE= 0
##$AXUNIT= <>
##$AZFE= 0.1
##$AZFW= 0.5
##$BCFW= 0
##$BC_mod= 2
##$BYTORDP= 0
##$COROFFS= 0
##$CY= 12.5935478210449
##$DATMOD= 1
##$DC= 0
##$DFILT= <>
##$DTYPP= 0
##$F1P= 47.1127640792319
##$F2P= -24.0371245302204
##$FCOR= 0.5
##$FTSIZE= 32768
##$FT_mod= 6
##$GAMMA= 0
##$GB= 0
##$INTBC= 1
##$INTSCL= 7.269226e-011
##$ISEN= 30
##$LB= 18
##$LEV0= 0
##$LPBIN= 0
##$MAXI= 12.09355
##$MC2= 0
##$MEAN= 0
##$ME_mod= 0
##$MI= 0.7550151
##$NCOEF= 0
##$NC_proc= -15
##$NLEV= 6
##$NOISF1= 298.5841
##$NOISF2= 270.0111
##$NSP= 0
##$NTH_PI= 0
##$NZP= 0
##$OFFSET= 298.5841
##$PC= 1.4
##$PHC0= 236.4109
##$PHC1= 36.4109
##$PH_mod= 1
##$PKNL= yes
##$PPARMOD= 0
##$PPDIAG= 0
##$PPIPTYP= 0
##$PPMPNUM= 100
##$PPRESOL= 1
##$PSCAL= 0
##$PSIGN= 0
##$REVERSE= no
##$SF= 81.014009
##$SI= 32768
##$SIGF1= 270.0111
##$SIGF2= -158.5842
##$SINO= 77.54984
##$SIOLD= 32768
##$SREGLST= <31P.CDCl3>
##$SSB= 0
##$STSI= 32768
##$STSR= 0
##$SW_p= 37037.037037037
##$SYMM= 0
##$S_DEV= 0
##$TDeff= 32768
##$TDoff= 0
##$TI= <>
##$TILT= no
##$TM1= 0
##$TM2= 0
##$TOPLEV= 0
##$USERP1= <user>
##$USERP2= <user>
##$USERP3= <user>
##$USERP4= <user>
##$USERP5= <user>
##$WDW= 1
##$XDIM= 32768
##$YMAX_p= 345644208
##$YMIN_p= -83187217
$$ End of Bruker specific parameters
$$ ---------------------------------
##NTUPLES= NMR SPECTRUM
##VAR_NAME=  FREQUENCY,     SPECTRUM/REAL,   SPECTRUM/IMAG
##SYMBOL=    X,             R,               I
##VAR_TYPE=  INDEPENDENT,   DEPENDENT,       DEPENDENT
##VAR_FORM=  AFFN,          ASDF,            ASDF
##VAR_DIM=   32768,         32768,           32768
##UNITS=     HZ,            ARBITRARY UNITS, ARBITRARY UNITS
##FACTOR=    1.13031516577767, 1,            1
##FIRST=     37037.037037037, -39962609,     84788057
##LAST=      0,             10376960,        35555121
##MIN=       0,             -83187217,       0
##MAX=       37037.037037037, 345644208,     0
$$ Real data points
##PAGE= N=1
##DATA TABLE= (X++(R..R)), XYDATA
$$ [...]
17444A7522062K271641J963291J363800M79261n89423j676110k600444l218195
17436A5515883l457376l334337k946560k443903j987139j704697j658235j828893
17428c845257k131974k455153k701718k815186k771779k552000k122366j450084
17420b2845517n39851N44135J696534K817299L848149M771168N573964O212493
17412B078374O602311O643952O264410N453512M282841K900881J501610K71650
17404C5999541o64785j274578j602729j731875j741429j681322j562147j361068
17396B4379608j040897n73598M2020P70423J535368K228590K738871K990335K966170
17387C6036890K705612K280223J762360J199300O05532k2451o77664j318829j869945
$$ y = [17522062, 19793703, 21756994, 23120794, 23600055, 23010632, 21334522, 18734078, 15515883, 12058507, 8724170, 5777610, 3333707, 1346568, -358129, -2016364, -3845257, -5977231, -8432384, -11134102, -13949288, -16721067, -19273067, -21395433, -22845517, -23385368, -22841233, -21144699, -18327400, -14479251, -9708083, -4134119, 2078374, 8680685, 15324637, 21589047, 27042559, 31325400, 34226281, 35727891, 35999541, 35334756, 34060178, 32457449, 30725574, 28984145, 27302823, 25740676, 24379608, 23338711, 22765113, 22807133, 23577556, 25112924, 27341514, 30080385, 33070720, 36036890, 38742502, 41022725, 42785085, 43984385, 44589917, 44567466, 43889802, 42570973, 40701028]
17378D0701028k249464k414882k395159k288445k222008k292877k519865k831978
17370B1486350l098605l185905l013378k585077j980318j312544o88494j91373
17362E430656J20875K21308J22019j28384m58206p90905j066614j259740j377498
17353H13511j438486j452217j416263j323828j167677r40553o39823k75604J26243
17344g714697N32217R15508J262686J565775J809829J968977K011842J915414
17336D267551J688738J391952J123422R72857R75380J101321J279867J427579
17328A4228667J465092J330246R94720M74874j72386q65012j513465k034817k361489
17319A1546430k446620k268623j833086j170735l37393N80345J462852K171490
$$ y = [40701028, 38451564, 36036682, 33641523, 31353078, 29131070, 26838193, 24318328, 21486350, 18387745, 15201840, 12188462, 9603385, 7623067, 6310523, 5622029, 5430656, 5551531, 5772839, 5894858, 5766474, 5308268, 4517363, 3450749, 2191009, 813511, -624975, -2077192, -3493455, -4817283, -5984960, -6925513, -7565336, -7840940, -7714697, -7182480, -6266972, -5004286, -3438511, -1628682, 340295, 2352137, 4267551, 5956289, 7348241, 8471663, 9444520, 10419900, 11521221, 12801088, 14228667, 15693759, 17024005, 18018725, 18493599, 18321213, 17456201, 15942736, 13907919, 11546430, 9099810, 6831187, 4998101, 3827366, 3489973, 4070318, 5533170, 7704660]
17311G704660K583941K641935K383600J928754J417676R46079N40477J78825j72039
17302B0153908n30176q91743j238342j550126j817376k044186k241189k411656
17294G429114k541041k599056k555889k403035k160930j864658j542471j211210
17286i449176q91533o19074m29016l20845k37765r0328J84732N75383R95012J331024
17276h951586J503829J499885J367158J182343J009587Q73117P58769O40958N11695
17267C95755L86552K84575K03810J14115k8637k56410n64881r06769j209860j410755
17257b992505j487084j473943j454224j518233j707038j977512k221869k331536
17249a7163944k256695k020902j691203j333367r79209o16673k02933L06142R23865
$$ y = [7704660, 10288601, 12930536, 15314136, 17242890, 18660566, 19606645, 20147122, 20325947, 20153908, 19623732, 18731989, 17493647, 15943521, 14126145, 12081959, 9840770, 7429114, 4888073, 2289017, -266872, -2669907, -4830837, -6695495, -8237966, -9449176, -10340709, -10959783, -11388799, -11709644, -11947409, -12037737, -11853005, -11277622, -10282610, -8951586, -7447757, -5947872, -4580714, -3398371, -2388784, -1515667, -756898, -115940, 395755, 782307, 1066882, 1270692, 1384807, 1356170, 1099760, 534879, -371890, -1581750, -2992505, -4479589, -5953532, -7407756, -8925989, -10633027, -12610539, -14832408, -17163944, -19420639, -21441541, -23132744, -24466111, -25445320, -26061993, -26264926, -25958784, -25034919]
17240b5034919J611915K276685K785835L008235K864483K357619J568888O34254
17232g927005k79966j006321j420450j487649j279069r38722o17853m13084l36440
17223a5706559l26426k92612j69782M8323L09123N26681O16792N30009K73665
17214a4190786q6368m47874p09049q01964p09328m61720j22697K28591N16084
17205a6785111O90677P51630P44166P23554P06650O47853M58574N4745n99517
17196a2606779j468777k441873l347114l995064m243339m050807l483538k669525
17188c8306816j742302q16263N295O23938R66335J018865Q45461N70361L31108
17179c6504018K23510K67410M14003N86610P22002P88203P81461P16906O21999
$$ y = [-25034919, -23423004, -21146319, -18360484, -15352249, -12487766, -10130147, -8561259, -7927005, -8206971, -9213292, -10633742, -12121391, -13400460, -14339182, -14957035, -15370119, -15706559, -16032985, -16325597, -16495379, -16447056, -16137933, -15611252, -14994460, -14464451, -14190786, -14277154, -14725028, -15434077, -16236041, -16945369, -17407089, -17529786, -17301195, -16785111, -16094434, -15342804, -14598638, -13875084, -13168434, -12520581, -12062007, -12007262, -12606779, -14075556, -16517429, -19864543, -23859607, -28102946, -32153753, -35637291, -38306816, -40049118, -40865381, -40860086, -40236148, -39269813, -38250948, -37405487, -36835126, -36504018, -36280508, -36013098, -35599095, -35012485, -34290483, -33502280, -32720819, -32003913, -31381914]
17170c1381914N34212M98333N56151P28957J007696J365254J783163K265709K824346
17161a9818093L446989M081944M647532N053897N222261N098482M663382L941213
17153A6337607L003707J961243R34880J9211p42453j356788j854176k251449k528163
17144A3523619k634604k523511k179217j627992r33551j87227N04769J038166
17136D980452J326200J305838R37995K15793q14856k039547l286660m369717n142326
17127f886828n538556n580101n351474m962535m516911m091136l723636l415713
17119d4066890l143150k869762k557627k177582j723639j224338p35822l09896
17111e8808706M4403L73374P53374J249501J886984K641530L441390M183716M769221
$$ y = [-31381914, -30847702, -30349369, -29793218, -29064261, -28056565, -26691311, -24908148, -22642439, -19818093, -16371104, -12289160, -7641628, -2587731, 2634530, 7733012, 12396394, 16337607, 19341314, 21302557, 22237437, 22256648, 21514195, 20157407, 18303231, 16051782, 13523619, 10889015, 8365504, 6186287, 4558295, 3624744, 3437517, 3942286, 4980452, 6306652, 7612490, 8550485, 8766278, 7951422, 5911875, 2625215, -1744502, -6886828, -12425384, -18005485, -23356959, -28319494, -32836405, -36927541, -40651177, -44066890, -47210040, -50079802, -52637429, -54815011, -56538650, -57762988, -58498810, -58808706, -58764303, -58390929, -57637555, -56388054, -54501070, -51859540, -48418150, -44234434, -39465213]
17102c9465213N137563N277404N207822M952260M525923L942538L232390K454664
17094d734649J688193J000707M19374o9633m88838q32975j060219j114169r56256
17085f148465n90689p5924M79565R40336J185162J151802Q61765M12986n1093
17076a834555l82608m72700k87897J16515O16862J066668J344995J391074J220774
17067B779128R21186O18817M29866M17102N75634Q48945J158689J431817J617838
17058A0799022J694113J659929J525944J307966J026334P03917L58279q468m12945
17049A8654091q78601j411120j978572k514589k943981l211308l292096l183127
17041g59303k889459k428259j841837j192585n36079R7987O97285J247197J722899
$$ y = [-39465213, -34327650, -29050246, -23842424, -18890164, -14364241, -10421703, -7189313, -4734649, -3046456, -2045749, -1626375, -1696008, -2184846, -3017821, -4078040, -5192209, -6148465, -6739154, -6815078, -6335513, -5395177, -4210015, -3058213, -2196448, -1783462, -1834555, -2217163, -2689863, -2977760, -2861245, -2244383, -1177715, 167280, 1558354, 2779128, 3700314, 4319131, 4748997, 5166099, 5741733, 6590678, 7749367, 9181184, 10799022, 12493135, 14153064, 15679008, 16986974, 18013308, 18717225, 19075504, 19067036, 18654091, 17775490, 16364370, 14385798, 11871209, 8927228, 5715920, 2423824, -759303, -3648762, -6077021, -7918858, -9111443, -9647522, -9549535, -8852250, -7605053, -5882154]
17032e882154K092045K318079K367593K227411J924362J534685J173163R60210
17024H715394R76838J226461J623459K019521K258407K231158J906223J326367
17016B2283828N78600k45943j078468j871633k582001l159998l560343l764830
17008F599212l796095l704798l535279l298383k976467k554098k043970j486501
17000a6796379r29465m09183N4489M53968P88912J060703J264446J384540J401070
16991a1726899J302273J093555Q03152M87879K28115R8807J29284K85391M91141
16982f807302O71587P84513Q24894Q10840P69165P29679P22062P66653Q61928
16973A34019R78558J064562J062694R40003P16644M67662K86759K36940L23265
$$ y = [-5882154, -3790109, -1472030, 895563, 3122974, 5047336, 6582021, 7755184, 8715394, 9692232, 10918693, 12542152, 14561673, 16820080, 19051238, 20957461, 22283828, 22862428, 22616485, 21538017, 19666384, 17084383, 13924385, 10364042, 6599212, 2803117, -901681, -4436960, -7735343, -10711810, -13265908, -15309878, -16796379, -17725844, -18135027, -18080538, -17626570, -16837658, -15776955, -14512509, -13127969, -11726899, -10424626, -9331071, -8527919, -8040040, -7811925, -7713118, -7583834, -7298443, -6807302, -6135715, -5351202, -4526308, -3715468, -2946303, -2216624, -1494562, -727909, 134019, 1112577, 2177139, 3239833, 4179836, 4896480, 5364142, 5650901, 5887841, 6211106]
16964F211106M97497O82503Q06596Q39280Q09304P88046Q44617J000170J210117
16955A3689236J384512J430487J288127R44222M30089j83548p92619j276038j528908
16946A5385560j500430j209890p29189j51132M33611R50203J350920J618212J752684
16937A7900549J757062J635153J404965J104386P76186M46491J18798k14502n59568
16928B4369520r18190j286605j644094j937119k078271j970177j548539q28934
16920A2157591O8543R43149J583775J848756J716283J291410P72086L80230K77349
16911B1039172N02437R64373J488912J890331K033098J864444J416236P83989
16903C1982992R5081n21101r56398j143941j074507q01440m29743r0265J00499
$$ y = [6211106, 6708603, 7391106, 8197702, 9036982, 9846286, 10634332, 11478949, 12479119, 13689236, 15073748, 16504235, 17792362, 18736584, 19166673, 18983125, 18190506, 16914468, 15385560, 13885130, 12675240, 11946051, 11794919, 12228530, 13178733, 14529653, 16147865, 17900549, 19657611, 21292764, 22697729, 23802115, 24578301, 25024792, 25143590, 24929088, 24369520, 23451330, 22164725, 20520631, 18583512, 16505241, 14535064, 12986525, 12157591, 12226134, 13169283, 14753058, 16601814, 18318097, 19609507, 20381593, 20761823, 21039172, 21541609, 22505982, 23994894, 25885225, 27918323, 29782767, 31199003, 31982992, 32078073, 31556972, 30600574, 29456633, 28382126, 27580686, 27150943, 27060678, 27161177]
16894B7161177Q6632r9251l48558n26210n31191l40815k2036K94845M68829M01879
16884B6545301P1251m66751j098854j695478k156234k443501k591431k683436
16876A3480867k804448k994002l227700l429515l498535l340118k897943k175263
16868a0886657j235090j86420Q33796J688706K283393K598543K685785K622870
16860D04926K461852K207271J833824J324979P08057O7558m74027q04856q78665
16851F850919p41042n05685k94366j79061j57727j70637j44707m1782J15658K56100
16841D987670L00868K11726J7348j95214l17952k66750j1310M18466R43543J457554
16831G545949J858787K087361K148953K105805K034619J975703J908350J769258
$$ y = [27161177, 27247809, 27148558, 26800000, 26273790, 25742599, 25401784, 25379748, 25674593, 26143422, 26545301, 26616552, 26149801, 25050947, 23355469, 21199235, 18755734, 16164303, 13480867, 10676419, 7682417, 4454717, 1025202, -2473333, -5813451, -8711394, -10886657, -12121747, -12308167, -11474371, -9785665, -7502272, -4903729, -2217944, 404926, 2866778, 5074049, 6907873, 8232852, 8940909, 9008467, 8534440, 7729584, 6850919, 6109877, 5604192, 5309826, 5130765, 4973038, 4802401, 4657694, 4615912, 4731570, 4987670, 5288538, 5500264, 5517612, 5322398, 5004446, 4737696, 4726386, 5144852, 6088395, 7545949, 9404736, 11492097, 13641050, 15746855, 17781474, 19757177, 21665527, 23434785]
16823B3434785J494580J051079M42895k94733j102611j905536k624165l188391
16815A7307903l546448l668795l552789l231159k775810k286260j863134j576287
16807e192779j438765j399273j364457j246608j011354o97302l97766k16230k21013
16798a3185547m25255p97989j285024j817012k307179k656085k769397k580189
16790b7823677k067030j264776k65992P90753J746687K459019K839076K877440
16782b0708500K640233K234633J760196J270017P64531K28293l11560p53012r44612
16773a3819781p54361j39395Q21364J948064L025030L878587M430256M701945
16765D091709M775301M731815M610836M406963M097767L675073L158293K584409
$$ y = [23434785, 24929365, 25980444, 26423339, 26128606, 25025995, 23120459, 20496294, 17307903, 13761455, 10092660, 6539871, 3308712, 532902, -1753358, -3616492, -5192779, -6631544, -8030817, -9395274, -10641882, -11653236, -12350538, -12748304, -12964534, -13185547, -13610802, -14408791, -15693815, -17510827, -19818006, -22474091, -25243488, -27823677, -29890707, -31155483, -31421475, -30630722, -28884035, -26425016, -23585940, -20708500, -18068267, -15833634, -14073438, -12803421, -12038890, -11810597, -12122157, -12875169, -13819781, -14574142, -14713537, -13892173, -11944109, -8919079, -5040492, -610236, 4091709, 8867010, 13598825, 18209661, 22616624, 26714391, 30389464, 33547757, 36132166]
16757C6132166J985780J375138P48733J01613n58584j207348j808279k322887
16749C4446332k721907k997830l175758l311595l468856l682835l935020m154710
16741F997821m248035m141765l821382l341339k799841k293952j882677j578279
16733a7109449j367806j244851j220671j301210j450936j582705j594629j431859
16725b8304116j123108p59826m35230j93422k4267J07330K37042M00211O37407
16716b9457979R86980J470151K085208K813300L624056M471406N282627N953953
16708b770298O364197O405083O015704N207070M067634K747515J424670K61286
16700B9722861o37216j248781j638582j935336k282857k780895l437875m159615
$$ y = [36132166, 38117946, 39493084, 40241817, 40343430, 39784846, 38577498, 36769219, 34446332, 31724425, 28726595, 25550837, 22239242, 18770386, 15087551, 11152531, 6997821, 2749786, -1391979, -5213361, -8554700, -11354541, -13648493, -15531170, -17109449, -18477255, -19722106, -20942777, -22243987, -23694923, -25277628, -26872257, -28304116, -29427224, -30187050, -30622280, -30815702, -30839969, -30732639, -30495597, -30095386, -29457979, -28470999, -27000848, -24915640, -22102340, -18478284, -14006878, -8724251, -2770298, 3593899, 9998982, 16014686, 21221756, 25289390, 28036905, 29461575, 29722861, 29085645, 27836864, 26198282, 24262946, 21980089, 19199194, 15761319, 11601704]
16692A1601704m784453n147342n136845m719680l935489k879970j685708m96447
16684a7184230N66112J430360K081541K545520K864930L082334L227784L304546
16676A918897L283727L122266K795407K315492J722553J062493L76959k93066
16668A6304728r05985j428302j843558k151278k359865k482103k532125k519746
16660H1766k446828k309350k098019j794802j378967q49921k47605L52881Q67753
16651i823092J226436J375715J280801R40655M06420k25047q47014j379605j780188
16642h824919k031816k132356k092322j930554j660389j274715p45271m5170Q13699
16633a9923813J755819K655635L384047L852457M026607L915589L557462L010759
$$ y = [11601704, 6817251, 1669909, -3466936, -8186616, -12122105, -15002075, -16687783, -17184230, -16618118, -15187758, -13106217, -10560697, -7695767, -4613433, -1385649, 1918897, 5202624, 8324890, 11120297, 13435789, 15158342, 16220835, 16597794, 16304728, 15398743, 13970441, 12126883, 9975605, 7615740, 5133637, 2601512, 81766, -2365062, -4674412, -6772431, -8567233, -9946200, -10796121, -11043726, -10690845, -9823092, -8596656, -7220941, -5940140, -4999485, -4593065, -4818112, -5665126, -7044731, -8824919, -10856735, -12989091, -15081413, -17011967, -18672356, -19947071, -20692342, -20737512, -19923813, -18167994, -15512359, -12128312, -8275855, -4249248, -333659, 3223803, 6234562]
16625F234562K345567J628880R08493K04524m84925j163959j813662k375446k753133
16616B730901k834782k529252j808475p39375N16593J747641K760504L432929
16608C276684L722095L637382L210194K486529J538834M72078n93498j554277
16600A6196021k346981k952975l389861l698382l924780m101959m240120m330686
16592a2789723m353348m274639m041070l584165k848662j831455o03031P06593
16584c3619500J950291L011587L835809M432771M852735N148126N338522N397931
16576C48272N275610M937231M391202L676304K825936J847655P39500m72699j714258
16567B1854753k878625l866924m616278n101371n321755n292624n040514m594986
$$ y = [6234562, 8580129, 10209009, 11117502, 11322026, 10837101, 9673142, 7859480, 5484034, 2730901, -103881, -2633133, -4441608, -5180983, -4664390, -2916749, -156245, 3276684, 6998779, 10636161, 13846355, 16332884, 17871718, 18343796, 17750298, 16196021, 13849040, 10896065, 7506204, 3807822, -116958, -4218917, -8459037, -12789723, -17143071, -21417710, -25458780, -29042945, -31891607, -33723062, -34326093, -33619500, -31669209, -28657622, -24821813, -20389042, -15536307, -10388181, -5049659, 348272, 5623882, 10561113, 14952315, 18628619, 21454555, 23302210, 24041710, 23569011, 21854753, 18976128, 15109204, 10492926, 5391555, 69800, -5222824, -10263338, -14858324]
16559a4858324l977030l197661k274576j253736k10507P77640J661779K423315
16551b0909100L046842L495149L711333L648657L312556K787759K221639J763346
16543C078181J496069J405307J398717J360733J207617R12769M95680l262n32635
16534A0819176j023696j394960j580511j561482j376865j113447q84220p95971
16526A088024r10981j223758j667971k143774k546948k792483k831290k655130
16518a5684311k287288j767528j141970m59221K31638Q83493J453946J906758
16510a6864483K210108K334474K255573J964105J477807Q48281J57888m91553
16502f107800r94022j257189j222322q82060k89187M50320J201754J834886K250090
$$ y = [-14858324, -18835354, -22033015, -24307591, -25561327, -25771834, -24994194, -23332415, -20909100, -17862258, -14367109, -10655776, -7007119, -3694563, -906804, 1314835, 3078181, 4574250, 5979557, 7378274, 8739007, 9946624, 10859393, 11355073, 11351811, 10819176, 9795480, 8400520, 6820009, 5258527, 3881662, 2768215, 1883995, 1088024, 177043, -1046715, -2714686, -4858460, -7405408, -10197891, -13029181, -15684311, -17971599, -19739127, -20881097, -21340318, -21108680, -20225187, -18771241, -16864483, -14654375, -12319901, -10064328, -8100223, -6622416, -5774135, -5616247, -6107800, -7101822, -8359011, -9581333, -10463393, -10752580, -10302260, -9100506, -7265620, -5015530]
16493e015530K388747K232880J803646J161440M01615l62088j026947j531539
16485E2224j871006k089158k252304k419551k623019k859414l086882l228130
16477b0377240l189198k896368k336634j580711p74734j01087K75448K53808j76486
16468c0903202r27542j825439k643272l142119l105237k373806r05938J149429
16460d4677126L427361N443022O791764P320141P144609O532035N754059N001915
16452B737780M371818L885891L515029L193063K831340K345114J688066Q75050
16444B5443151k1968r00639j662965k245233k632687k853336k956668k993000
16436I176655l004538l023522l065448l116584l130996l049684k833151k483500
$$ y = [-5015530, -2626783, -393903, 1409743, 2571183, 2972798, 2610710, 1583763, 52224, -1818782, -3907940, -6160244, -8579795, -11202814, -14062228, -17149110, -20377240, -23566438, -26462806, -28799440, -30380151, -31154885, -31255972, -30980524, -30726716, -30903202, -31830744, -33656183, -36299455, -39441574, -42546811, -44920617, -45826555, -44677126, -41249765, -35806743, -29014979, -21694838, -14550229, -8018194, -2264135, 2737780, 7109598, 10995489, 14510518, 17703581, 20534921, 22880035, 24568101, 25443151, 25421183, 24520544, 22857579, 20612346, 17979659, 15126323, 12169655, 9176655, 6172117, 3148595, 83147, -3033437, -6164433, -9214117, -12047268, -14530768]
16428a4530768k041894j567941j115928p18265l83327j09135J00402K36713L07756
16419a9822387L57736M61601O92303J080145J587045K108299K500949K626003
16411h408306K389731J774606Q53929k17463j241803k038502k500793k622180
16403a2010781k483497k212073j935459j750379j713136j841918k119191k493410
16395b8559844k888059l221313l427180l465116l313058k949066k334801j419476
16387e1577913j72833J371042L090996M789856O229091P177988P473255P073016
16379a4545502O079971M720431L286330K056345J214683P93126O68400O30728
16371D904512M97356K08714j48104l96323l68791K410O46347J382810K007595
$$ y = [-14530768, -16572662, -18140603, -19256531, -19974796, -20358123, -20467258, -20366856, -20130143, -19822387, -19464651, -19003050, -18310747, -17230602, -15643557, -13535258, -11034309, -8408306, -6018575, -4243969, -3390040, -3607503, -4849306, -6887808, -9388601, -12010781, -14494278, -16706351, -18641810, -20392189, -22105325, -23947243, -26066434, -28559844, -31447903, -34669216, -38096396, -41561512, -44874570, -47823636, -50158437, -51577913, -51750746, -50379704, -47288708, -42498852, -36269761, -29091773, -21618518, -14545502, -8465531, -3745100, -458770, 1597575, 2812258, 3605384, 4273784, 4904512, 5401868, 5610582, 5462478, 5066155, 4697364, 4699774, 5346121, 6728931, 8736526]
16362H736526K383583K481073K351087K068164J694034J281701Q97215O23150
16354B2516533N31646O49395R44702J341068J738253K029263K122773J978128
16346C3851761J631955J184017P42159L66380N0910k52750n97740j012390j483937
16337C4480365j950797k304071k404579k120251j378168k06801J263469K848625
16329B8227792M373867N706810O753139P445559P752573P697913P362122O855092
16321H2174867O277593N699599N164389M698249M299338L907863L389097K553412
16313A18164407J206214p93010l471473o684535j0077392j3121099j5271929j6206033
16305E3745150j5969704j4925596j3549233j2227922j1157593j0338395r632032
$$ y = [8736526, 11120109, 13601182, 15952269, 18020433, 19714467, 20996168, 21893383, 22516533, 23048179, 23697574, 24642276, 25983344, 27721597, 29750860, 31873633, 33851761, 35483716, 36667733, 37409892, 37776272, 37827182, 37574432, 36976692, 35964302, 34480365, 32529568, 30225497, 27820918, 25700667, 24322499, 24115698, 25379167, 28227792, 32601659, 38308469, 45061608, 52507167, 60259740, 67957653, 75319775, 82174867, 88452460, 94152059, 99316448, 104014697, 108314035, 112221898, 115610995, 118164407, 119370621, 118577611, 115106138, 108421603, 98344211, 85223112, 69951183, 53745150, 37775446, 22849850, 9300617, -2927305, -14084898, -24423293, -34055325]
16298c4055325q847532p826833o502264m910524l170113j441292J14419J366709
16290f5272755K239557K724222K878197K807191K632381K451489K309638K195896
16282d5034184K068358J892090J664128J411421J174296R97781R33572J033745
16274c3858793J322820J765398K265445K708681L017932L182880L251555L292586
16266a3051496L343792L373791L291755L011456K521703J902429J275753P36888
16258F406071L15295j8008l14504o12734r21468j220179j467621j616032j633266
16249a082446j526230j345973j162288j024299r37871q72385p84716o43081m41494
16240i820783k03538K3822J87418K54337K33715J75224J43430J87818L26651N45750
$$ y = [-34055325, -42902857, -50729690, -57231954, -62142478, -65312591, -66753883, -66639464, -65272755, -63033198, -60308976, -57430779, -54623588, -51991207, -49539718, -47230080, -45034184, -42965826, -41073736, -39409608, -37998187, -36823891, -35826110, -34892538, -33858793, -32535973, -30770575, -28505130, -25796449, -22778517, -19595637, -16344082, -13051496, -9707704, -6333913, -3042158, -30702, 2491001, 4393430, 5669183, 6406071, 6721366, 6703358, 6388854, 5776120, 4854652, 3634473, 2166852, 550820, -1082446, -2608676, -3954649, -5116937, -6141236, -7079107, -7951492, -8736208, -9379289, -9820783, -10024321, -10000499, -9813081, -9558744, -9325029, -9149805, -9006375, -8818557, -8491906, -7946156]
16230g946156Q04531J047138J217913J271535J169882Q77541L76583l02840j067809
16221b551682j787622k345622k683252k815028k816205k792082k837051k998675
16213b3627219l266327l587936l895316m117861m184709m032142l627490k997495
16205e3336495k232013j449591p47864j74672K66586N90568Q04953R03119Q75273
16196e4500136P24414M71921J48029k25171o43407j111713j623683k146489k621980
16187f1528215k978559l144092l056754k677944k008239j097415l8840J049516
16179g5480542K047286K851419L392444L643203L613538L332423K830981K139606
16171e1629642J299989L81728n10772j252679j732994j890428j728431j302345
$$ y = [-7946156, -7141625, -6094487, -4876574, -3605039, -2435157, -1557616, -1181033, -1483873, -2551682, -4339304, -6684926, -9368178, -12183206, -14999411, -17791493, -20628544, -23627219, -26893546, -30481482, -34376798, -38494659, -42679368, -46711510, -50339000, -53336495, -55568508, -57018099, -57765963, -57940635, -57674049, -57083481, -56278528, -55375409, -54500136, -53775722, -53303801, -53155772, -53380943, -54024350, -55136063, -56759746, -58906235, -61528215, -64506774, -67650866, -70707620, -73385564, -75393803, -76491218, -76530058, -75480542, -73433256, -70581837, -67189393, -63546190, -59932652, -56600229, -53769248, -51629642, -50329653, -49947925, -50458697, -51711376, -53444370, -55334798, -57063229, -58365574]
16163e8365574o92620J4871P32783J370126J840476K084528K091699J901241J580748
16154d7441722J197900Q02522M24188P8590k27334m92603p15417q83644r73552
16145d8231072r61333q37863o14856l20997M038L12425N53018O84118O89356N85914
16135d8137252M18145K36999P5810n8493j68027k34731k09295l2513L30093Q70521
16125d6908743J543838K279590K989619L583047L994242M203175M226220M088353
16117b0000659L808000L405942K921688K416181J954261J577707J289595J063024
16109a564261Q66597O84105N12521L43382J48683j11086m58510q71833j281595
16100a731997j592878j713386j572717j139556m43105M16927J290377K019939
$$ y = [-58365574, -59058194, -59043323, -58310540, -56940414, -55099938, -53015410, -50923711, -49022470, -47441722, -46243822, -45441300, -45017112, -44938522, -45165856, -45658459, -46373876, -47257520, -48231072, -49192405, -50030268, -50645124, -50966121, -50962083, -50649658, -50096640, -49412522, -48723166, -48137252, -47719107, -47482108, -47406298, -47464791, -47632818, -47867549, -48076844, -48109357, -47779264, -46908743, -45364905, -43085315, -40095696, -36512649, -32518407, -28315232, -24089012, -20000659, -16192659, -12786717, -9865029, -7448848, -5494587, -3916880, -2627285, -1564261, -697664, -13559, 498962, 842344, 991027, 879941, 421431, -450402, -1731997, -3324875, -5038261, -6610978, -7750534, -8193639, -7776712, -6486335, -4466396]
16092d466396K481998K607734K384928J851497J090318K21763o19625j325506
16084D226711j847481k197160k414624k537086k593295k616603k651135k737549
16076a5368222k886346l059141l177269l160793k974448k647744k258684j897965
16068c7430612j633715j487358j429110j397420j331461j194126r70039o47669
16060d7521510k14382L20287Q96801J412758J770721J928253J910635J782912
16052c7713525J606375J407707J180025R16384O47385M43911L78016M77020P07874
16043b9948828R94705J247697J385409J347763J106318O77657J33860m07182q19645
16034b4282246j018887r90940p84991m79224j47460J53553L81674N12984N58053
$$ y = [-4466396, -1984398, 623336, 3008264, 4859761, 5950079, 6171842, 5552217, 4226711, 2379230, 182070, -2232554, -4769640, -7362935, -9979538, -12630673, -15368222, -18254568, -21313709, -24490978, -27651771, -30626219, -33273963, -35532647, -37430612, -39064327, -40551685, -41980795, -43378215, -44709676, -45903802, -46873841, -47521510, -47735892, -47415605, -46518804, -45106046, -43335325, -41407072, -39496437, -37713525, -36107150, -34699443, -33519418, -32603034, -31955649, -31511738, -31133722, -30656702, -29948828, -28954123, -27706426, -26321017, -24973254, -23866936, -23189279, -23055419, -23462601, -24282246, -25301133, -26292073, -27077064, -27556288, -27703748, -27550195, -27168521, -26655537, -26097484]
16025b6097484N71837O36946Q25013J160218J605434K077329K482317K750345
16017a3988045K841188K724245K365980J751239R19937k2244r33049j679754k175186
16008h195689k394578k373261k185405j912073j616777j341739j120644r90536
16000b2130702r87716j127458j382627j679030j915165j999026j883863j584237
15992c4689824j165618p16166l15809j2951J87275L19642M39387N97849Q30489
15983c4525726J157624J582578K083537K613379L113806L529662L809243L897947
15975a2737950L744190L321384K649810J801352Q84257J7702o93114j177137j413121
15966c602627j438494j344845j255611j290018j525007j969855k565421l210280
$$ y = [-26097484, -25525647, -24888701, -24063688, -22903470, -21298036, -19220707, -16738390, -13988045, -11146857, -8422612, -6056632, -4305393, -3385456, -3407700, -4340749, -6020503, -8195689, -10590267, -12963528, -15148933, -17061006, -18677783, -20019522, -21140166, -22130702, -23118418, -24245876, -25628503, -27307533, -29222698, -31221724, -33105587, -34689824, -35855442, -36571608, -36887417, -36900368, -36713093, -36393451, -35954064, -35356215, -34525726, -33368102, -31785524, -29701987, -27088608, -23974802, -20445140, -16635897, -12737950, -8993760, -5672376, -3022566, -1221214, -336957, -319255, -1012369, -2189506, -3602627, -5041121, -6385966, -7641577, -8931595, -10456602, -12426457, -14991878, -18202158]
15958a8202158l801042m262744m550220m626700m448509l976656l206358k189476
15950d9263863j032894J26692J159183J975238K548718K918275L161005L347794
15942c5059852L509213L635184L701483L694674L614480L457585L204951K830724
15934g411558K328232J732133J121017O00471K74496K13790M31889Q81371J472800
15925A644641K102077K668844L086133L294164L278303L075331K758287K408423
15917B4316203K090224J839590J666108J562468J511433J490208J481412J486660
15909C7444306J521243J584659J633541J585139J352445Q89714K22987n51465
15901D5682569j300642j902679k285713k442717k419588k286932k113694j952395
$$ y = [-18202158, -22003200, -26265944, -30816164, -35442864, -39891373, -43868029, -47074387, -49263863, -50296757, -50170065, -49010882, -47035644, -44486926, -41568651, -38407646, -35059852, -31550639, -27915455, -24213972, -20519298, -16904818, -13447233, -10242282, -7411558, -5083326, -3351193, -2230176, -1629705, -1355209, -1141419, -709530, 171841, 1644641, 3746718, 6415562, 9501695, 12795859, 16074162, 19149493, 21907780, 24316203, 26406427, 28246017, 29912125, 31474593, 32986026, 34476234, 35957646, 37444306, 38965549, 40550208, 42183749, 43768888, 45121333, 46011047, 46234034, 45682569, 44381927, 42479248, 40193535, 37750818, 35331230, 33044298, 30930604, 28978209]
15893B8978209j830385j741854j645970j478004j173731p00252p8915O17109J293988
15884B2240195J875616K320773K613744K748113K721045K537619K217311J794831
15876D1069247J307467P73588J86215m61661j136671j744885k153393k247166
15868C5592741j990264j452062p78208j25117L97862P48916R40506J012227J003551
15859C5350152R31806P80517N05613O2044n61164j321117k131466k893379l523416
15850B7199590l962737m171207m122925l814616l278757k584875j827312j112278
15842B324883n47405k22154j75892l71895o97896r95545j108398r34817m65579
15833c194698K13282R51698J582887J972026K057471J868505J503362J076220
$$ y = [28978209, 27147824, 25405970, 23760000, 22281996, 21108265, 20408013, 20329098, 20946207, 22240195, 24115811, 26436584, 29050328, 31798441, 34519486, 37057105, 39274416, 41069247, 42376714, 43150302, 43336517, 42874856, 41738185, 39993300, 37839907, 35592741, 33602477, 32150415, 31372207, 31247090, 31644952, 32393868, 33334374, 34346601, 35350152, 36281958, 37062475, 37568088, 37630132, 37068968, 35747851, 33616385, 30723006, 27199590, 23236853, 19065646, 14942721, 11128105, 7849348, 5264473, 3437161, 2324883, 1777478, 1555324, 1379432, 1007537, 309641, -685904, -1794302, -2729119, -3194698, -2981416, -2029718, -446831, 1525195, 3582666, 5451171, 6954533, 8030753]
15825H030753O71015L36114J15810P6799K90109P76914J469862K225584K873720
15816A6866680L268087L323339L033121K462276J710402Q64121k9812r53723j888348
15807B8656143k794248l615485m293891m784913n074247n190195n201556n194430
15799g492822n230729n306238n339014n206850m814508m144876l261788k270877
15791d3067702j271479l26817N43766J357723K150254K945848L730400M438087
15783b9499920M963269N195798N063104M556860L732538K688054J536462L84692
15775a379143o76491j573911k253193k682658k853640k777194k488009k054826
15767a8739065j575936j145814q12740n62841l42366r9380J82526M75560P22692
$$ y = [8030753, 8701768, 9037882, 9153692, 9230491, 9520600, 10297514, 11767376, 13992960, 16866680, 20134767, 23458106, 26491227, 28953503, 30663905, 31528026, 31498214, 30544491, 28656143, 25861895, 22246410, 17952519, 13167606, 8093359, 2903164, -2298392, -7492822, -12723551, -18029789, -23368803, -28575653, -33390161, -37535037, -40796825, -43067702, -44339181, -44665998, -44122232, -42764509, -40614255, -37668407, -33938007, -29499920, -24536651, -19340853, -14277749, -9720889, -5988351, -3300297, -1763835, -1379143, -2055634, -3629545, -5882738, -8565396, -11419036, -14196230, -16684239, -18739065, -20315001, -21460815, -22273555, -22836396, -23178762, -23278142, -23095616, -22620056, -21897364]
15758b1897364Q60638Q38794O36957K85867j21829m49583n66806m08683j0291
15749b0832300N10723J015615J408518J658592J771285J743785J550532J169571
15741a0003679O18517l4273o87235j233974j589982j714883j624284j380528j061414
15732a8711735p24442l89137m3028L39151P72493J243420J709951K126033K469078
15723a1208216K741304K941568L036291K960246K651351K097683J367226N97630
15715G185083n5949m88790o90129p38129p54089q44723j060575j384549j748597
15706e80447k066785k267609k309039k173219j855854j366565p38509l1444O80869
15697a2708602J331431J873585K279591K531282K615876K531291K294836J946629
$$ y = [-21897364, -21036726, -20197932, -19560975, -19275108, -19396937, -19846520, -20413326, -20822009, -20832300, -20321577, -19305962, -17897444, -16238852, -14467567, -12723782, -11173250, -10003679, -9385162, -9419435, -10106670, -11340644, -12930626, -14645509, -16269793, -17650321, -18711735, -19436177, -19825314, -19868342, -19529191, -18756698, -17513278, -15803327, -13677294, -11208216, -8466912, -5525344, -2489053, 471193, 3122544, 5220227, 6587453, 7185083, 7129134, 6640344, 5950215, 5212086, 4457997, 3613274, 2552699, 1168150, -580447, -2647232, -4914841, -7223880, -9397099, -11252953, -12619518, -13358027, -13389471, -12708602, -11377171, -9503586, -7223995, -4692713, -2076837, 454454, 2749290, 4695919]
15689D695919J541545J130476P41455L74476J2719l61003p55906j175635j622510
15680D581536k094570k576262l030999l401486l618544l618309l364896k865525
15672a9989055k166066j334353m49490M00937J132766J691664K071161K299347
15664a6343089K405839K403878K302676K129035J929550J748579J600519J458655
15656c64358J269591R81167N60830l403p03371j499434k308401l009611l473368
15647h550358l601170l360664k799114k029170j194957m30893J74869N98433Q70690
15638b0322334J048085J182014J301221J410483J498787J545067J518800J388656
15630i429221J146119Q24936M93475K23813O0817Q894M0169J17496K16742L32550
$$ y = [4695919, 6237464, 7367940, 8109395, 8483871, 8496590, 8135587, 7379681, 6204046, 4581536, 2486966, -89296, -3120295, -6521781, -10140325, -13758634, -17123530, -19989055, -22155121, -23489474, -23938964, -23538027, -22405261, -20713597, -18642436, -16343089, -13937250, -11533372, -9230696, -7101661, -5172111, -3423532, -1823013, -364358, 905233, 1886400, 2447230, 2443827, 1740456, 241022, -2067379, -5076990, -8550358, -12151528, -15512192, -18311306, -20340476, -21535433, -21966326, -21791457, -21193024, -20322334, -19274249, -18092235, -16791014, -15380531, -13881744, -12336677, -10817877, -9429221, -8283102, -7458166, -6964691, -6740878, -6680061, -6671167, -6630998, -6513502, -6296760, -5964210]
15620e964210M65260O01533P03655P16710N93503L23938n1760m56431q07035j043293
15610d918130j139024j095196r25315o46430k82439J24486N06376P77539Q59703
15601f738430P12190L51587j49308o84567j148638j459620j560664j410913r88608
15592a3076971l13035N34885J418727K180567K681470K831094K604837K050788
15584I12362J281004M39713l45516j008343j560944k072651k617458l217279l811984
15575a2001096m271388m442055m208890l548577k554488j418348l68407M10521
15567c2402728Q34090R27365P92851N60569L38876J81990Q8652K8830k4557p6512
15557b8750574j03364n7445J10808M18509Q30702J276152J683933K007045K219001
$$ y = [-5964210, -5498950, -4897417, -4193762, -3477052, -2883549, -2559611, -2611371, -3067802, -3874837, -4918130, -6057154, -7152350, -8077665, -8724095, -9006534, -8882048, -8375672, -7598133, -6738430, -6026240, -5674653, -5823961, -6508528, -7657166, -9116786, -10677450, -12088363, -13076971, -13390006, -12855121, -11436394, -9255827, -6574357, -3743263, -1138426, 912362, 2193366, 2633079, 2287563, 1279220, -281724, -2354375, -4971833, -8189112, -12001096, -16272484, -20714539, -24923429, -28472006, -31026494, -32444842, -32813249, -32402728, -31568638, -30641273, -29848422, -29287853, -28948977, -28766987, -28678335, -28649505, -28674062, -28750574, -28853938, -28911383, -28800575, -28382066, -27551364, -26275212, -24591279, -22584234, -20365233]
15548b0365233K297377K215504J951223J505541R15580K49656m14550j013833
15540a2658735j509329j879677k107750k173873k063944j788742j393580r38474
15532b6514104m60289M5764O05141J223365J862643K454165K931195L253255L407878
15523a1190987L400717L249855K986119K649144K275201J885763J488153J091204
15515G835169P26525M54466L40372M13411O38584R24077J162212J278276J254899
15506A5027991J120313R19610O95341M83647L14880K11259J82213K17576K79414
15497A9452244K99609J95364r2761n59798j130286j703953k218281k670122l078200
15488H493816l428706l658983l690553l476463l024441k386688j632305q22714
$$ y = [-20365233, -18067856, -15852352, -13901129, -12395588, -11480008, -11230352, -11644902, -12658735, -14168064, -16047741, -18155491, -20329364, -22393308, -24182050, -25575630, -26514104, -26974393, -26928629, -26323488, -25100123, -23237480, -20783315, -17852120, -14598865, -11190987, -7790270, -4540415, -1554296, 1094848, 3370049, 5255812, 6743965, 7835169, 8561694, 9016160, 9356532, 9769943, 10408527, 11332604, 12494816, 13773092, 15027991, 16148304, 17067914, 17763255, 18246902, 18561782, 18773041, 18955254, 19172830, 19452244, 19751853, 19947217, 19854456, 19294658, 18164372, 16460419, 14242138, 11572016, 8493816, 5065110, 1406127, -2284426, -5760889, -8785330, -11172018, -12804323, -13627037]
15480a3627037l098P86542J490025K024289K298512K260746J940170J445029R08226
15471d76596M18864r305m15915q45151j309405j785738k237771k639988k984822
15462a2285827l268992l473497l560229l493046l263303k895450k433792j928527
15454c6602663j427214r65306n58020k04048R9531L45653N21294O25572O86099
15445c7479102P53901Q72266J039391J194807J243335J101269P35194J75116m96151
15436c0859974j165874j716686k051135k116621j926768j563989j150514p97901
15428d3349462n67317m66217m72971n56365o73510p63045p53562n84478k24236
15419d8411163L22542J015738J781207K513035L085180L377373L309693K873650
$$ y = [-13627037, -13630135, -12843593, -11353568, -9329279, -7030767, -4770021, -2829851, -1384822, -476596, -57732, -67037, -482952, -1328103, -2637508, -4423246, -6661017, -9301005, -12285827, -15554819, -19028316, -22588545, -26081591, -29344894, -32240344, -34674136, -36602663, -38029877, -38995183, -39553203, -39757251, -39657720, -39312067, -38790773, -38165201, -37479102, -36725201, -35852935, -34813544, -33618737, -32375402, -31274133, -30538939, -30363823, -30859974, -32025848, -33742534, -35793669, -37910290, -39837058, -41401047, -42551561, -43349462, -43916779, -44382996, -44855967, -45412332, -46085842, -46848887, -47602449, -48186927, -48411163, -48088621, -47072883, -45291676, -42778641, -39693461, -36316088, -33006395, -30132745]
15411c0132745K143094J250648L37316m90803j171040j666579j953630k028840
15403c3712579j924675j709868j464439j241083j037277p94180m21098J63804
15395d2141395R89492K004220L081072M054161M767176N118415N091905M761216
15387a2273738M257092L710794L203742K748396K303169J808446J229167N90051
15379G577119j5262m57917o41681n63704l26613r5661k6844k00555n90953j086325
15369C571604j548152j872857k022578k017881j909820j752613j588867j449526
15361a0590690j362654j360027j472416j711421k047922k407044k690243k810148
15353b6452565k714779k393934j874082j203814m32294M04456J275838K135196
$$ y = [-30132745, -27989651, -26739003, -26401687, -26892490, -28063530, -29730109, -31683739, -33712579, -35637254, -37347122, -38811561, -40052644, -41089921, -41884101, -42305199, -42141395, -41151903, -39147683, -36066611, -32012450, -27245274, -22126859, -17034954, -12273738, -8016646, -4305852, -1102110, 1646286, 3949455, 5757901, 6987068, 7577119, 7561857, 7103940, 6462259, 5898555, 5571942, 5476281, 5449437, 5248882, 4657929, 3571604, 2023452, 150595, -1871983, -3889864, -5799684, -7552297, -9141164, -10590690, -11953344, -13313371, -14785787, -16497208, -18545130, -20952174, -23642417, -26452565, -29167344, -31561278, -33435360, -34639174, -35071468, -34667012, -33391174, -31255978]
15345c1255978K906404L493110L808856L812470L528405L042503K480208J976976
15337f207046J642162J521343J577421J710299J809025J805050J696593J538086
15329G092933J409072J379490J481557J697213J970469K243320K494028K749405
15321B2517487L060925L463220L948020M473576M998042N503134N986322O432008
15313F0382734O789921O978640O911200O526922N815244M824672L652511K416136
15305A04297980J219868J37123p87871j532457k094235k493272k767636k959822
15297I3019678l103686l221851l330599l440789l551720l646736l698430l681605
15289F5344262l585348l415138l183535k898970k565030k192164j812209j483716
$$ y = [-31255978, -28349574, -24856464, -21047608, -17235138, -13706733, -10664230, -8184022, -6207046, -4564884, -3043541, -1466120, 244179, 2053204, 3858254, 5554847, 7092933, 8502005, 9881495, 11363052, 13060265, 15030734, 17274054, 19768082, 22517487, 25578412, 29041632, 32989652, 37463228, 42461270, 47964404, 53950726, 60382734, 67172655, 74151295, 81062495, 87589417, 93404661, 98229333, 101881844, 104297980, 105517848, 105654971, 104867100, 103334643, 101240408, 98747136, 95979500, 93019678, 89915992, 86694141, 83363542, 79922753, 76371033, 72724297, 69025867, 65344262, 61758914, 58343776, 55160241, 52261271, 49696241, 47504077, 45691868, 44208152]
15281D4208152j281409j269781j468003j823618k216231k498031k554815k357924
15273B8738340j979188j556275j222098j036080r59018q87783p25500m39502p4996
15264A9857900K72116M99388N37701L73392M3733l91215q79955j390486j896235
15255A7026339k355493k707286k890172k870694k662005k321236j928574j561343
15247b270464j274405j087403r77568q87640p55714n51866k95724m5213J33098
15238h012899J95693J42755K0260r5417j22978m765K69163O53522J066865J430803
15228d456998J705410J898537K046479K183974K328113K485373K665307K880127
15220A3736322L132723L413485L710629M015876M313037M562220M699769M656590
$$ y = [44208152, 42926743, 41656962, 40188959, 38365341, 36149110, 33651079, 31096264, 28738340, 26759152, 25202877, 23980779, 22944699, 21985681, 21097898, 20372398, 19932896, 19857900, 20130016, 20629404, 21167105, 21540497, 21584230, 21193015, 20313060, 18922574, 17026339, 14670846, 11963560, 9073388, 6202694, 3540689, 1219453, -709121, -2270464, -3544869, -4632272, -5609840, -6497480, -7253194, -7805060, -8100784, -8145997, -8012899, -7817206, -7674451, -7654191, -7749608, -7872586, -7877351, -7608188, -6954666, -5887801, -4456998, -2751588, -853051, 1193428, 3377402, 5705515, 8190888, 10856195, 13736322, 16869045, 20282530, 23993159, 28009035, 32322072, 36884292, 41584061, 46240651]
15212D6240651M381850L860909L124030K245039J331160N05307j19928m72762
15204F1096256n43843l85959r1685K39499N28785P27829Q09778P54518N41777
15195F3676955J54326m12193j134271j945566k736072l376866l764134l857721
15187D6604458l687960l327175k848177k296343j686964j023313l19011L93215
15179C1808730J068281J656296K103290K355129K370772K133916J654205R64491
15171D6115110J22163p88611j662126k386467k862511l018211k818855k281935
15163C0418557j494405o10904J85819P49876J021674J026117Q24007M60744m3928
15154C2537557o63305j326824j914878k290518k351542k078873j551495r09939
$$ y = [46240651, 50622501, 54483410, 57607440, 59852479, 61183639, 61688946, 61569018, 61096256, 60552413, 60166454, 60074769, 60314268, 60843053, 61570882, 62380660, 63135178, 63676955, 63831281, 63419088, 62284817, 60339251, 57603179, 54226313, 50462179, 46604458, 42916498, 39589323, 36741146, 34444803, 32757839, 31734526, 31415515, 31808730, 32877011, 34533307, 36636597, 38991726, 41362498, 43496414, 45150619, 46115110, 46237273, 45448662, 43786536, 41400069, 38537558, 35519347, 32700492, 30418557, 28924152, 28313248, 28499067, 29248943, 30270617, 31296734, 32120741, 32581485, 32537557, 31874252, 30547428, 28632550, 26342032, 23990490, 21911617, 20360122, 19450183]
15146A9450183k89182K29603O19586Q79457J011699J022250R28619P59656N46304
15137B5158175L16109R9398o0510j07352J2280L26491Q24760J463431K185291
15128C0218073K938296L682783M389186N036146N614719O133554O615957P089478
15120G1718192P578703Q105663Q687976R326714R993898J0635588J1191895J1617444
15112A48856073J1885285J1974688J1862338J1536836J1032457J0449048R925361
15105B27522086R573075R417333R382793R325092R080284Q506265P506316O038741
15097B96351985M121379J835388o75865l222700n603859p647663r237679j0313104
15089B65607882j0857902j0899502j0517130r838863r016268q191309p475710
$$ y = [19450183, 19161001, 19390604, 20010190, 20889647, 21901346, 22923596, 23852215, 24611871, 25158175, 25474284, 25573682, 25513172, 25405820, 25418100, 25744591, 26569351, 28032782, 30218073, 33156369, 36839152, 41228338, 46264484, 51879203, 58012757, 64628714, 71718192, 79296895, 87402558, 96090534, 105417248, 115411146, 126046734, 137238629, 148856073, 160741358, 172716046, 184578384, 196115220, 207147677, 217596725, 227522086, 237095161, 246512494, 255895287, 265220379, 274300663, 282806928, 290313244, 296351985, 300473364, 302308752, 301632887, 298410187, 292806328, 285158665, 275920986, 265607882, 254749980, 243850478, 233333348, 223494485, 214478217, 206286908, 198811198]
15082A98811198o943555o624684o495386o479025o469214o369787o127822n740974
15074A47560751n242749m681488m102511l535501k990403k467572j978825j559952
15066A21001750j256977j093716j047522j051749j022266q93162o45980l17559
15058A13672819K3086L18598N55820P60238R56823J128696J206271J098429P49700
15049A20470480J89208m62339j037906j396118j473933j288765q98550l59836
15041A13742241K81787R72465J635856K189143K579077K806859K925053L015792
15033A30148273L166250L446511L889129M475857N142286N802671O381096O828593
15025A69280666P119393P240454P191903O996918O700585O344756N934364N425015
$$ y = [198811198, 191867643, 185242959, 178747573, 172268548, 165799334, 159429547, 153301725, 147560751, 142318002, 137636514, 133534003, 129998502, 127008099, 124540527, 122561702, 121001750, 119744773, 118651057, 117603535, 116551786, 115529520, 114636358, 113990378, 113672819, 113695905, 114014503, 114570323, 115330561, 116287384, 117416080, 118622351, 119720780, 120470480, 120659688, 120197349, 119159443, 117763325, 116289392, 115000627, 114102077, 113742241, 114024028, 114996493, 116632349, 118821492, 121400569, 124207428, 127132481, 130148273, 133314523, 136761034, 140650163, 145126020, 150268306, 156070977, 162452073, 169280666, 176400059, 183640513, 190832416, 197829334, 204529919, 210874675, 216809039, 222234054]
15017B22234054M748347L867806K836227J814315J023687O54145P84265J365201
15009B39328047K267806L350069M499965N641457O722573P706656Q568474R285633
15001B87370680R822725J0115375J0060975R521777Q347212O417513L698699K89252
14993C45644208l563560p493598j1091945j4004393j6008747j7039822j7164989
14986B59277154j6541945j5383958j3931008j2415534j1023845r865677q963946
14979A71151241q269086p690894p132960o520293n820679n056175m293400l612053
14971A22755701l069710k681409k419633k232838k075074j929003j804440j714297
14963A04829297j650201j578919j461212j277254j041569q01496o21476n57785
$$ y = [222234054, 226982401, 230850207, 233686434, 235500749, 236524436, 237178581, 237962846, 239328047, 241595853, 244945922, 249445887, 255087344, 261809917, 269516573, 278085047, 287370680, 297193405, 307308780, 317369755, 326891532, 335238744, 341656257, 345354956, 345644208, 342080648, 334587050, 323495105, 309490712, 293481965, 276442143, 259277154, 242735209, 227351251, 213420243, 201004709, 189980864, 180115187, 171151241, 162882155, 155191261, 148058301, 141538008, 135717329, 130661154, 126367754, 122755701, 119685991, 117004582, 114584949, 112352111, 110277037, 108348034, 106543594, 104829297, 103179096, 101600177, 100138965, 98861711, 97820142, 97018646, 96397170, 95839385]
14955I5839385o32796q22094j062775j278674j409682j432270j366179j269724
14947H6565191j224792j307709j550364j914311k302473k607552k766987k789780
14939G0101223k740776k694646k689222k708221k703973k639345k511131k337112
14931D9076797k128500j882053j597587j295104j009424p69315n84702m53173
14923C9356939l75592l64813m41249o17209q75585j157469j376124j454271j356970
14914C1337657j095939p09094k39465K69159P65751J193007J500278J654217J637837
14905C6313408J446815J093025O09360M2723n67140j209909j910565k709388l621281
14896B9487048m595176n501462o162160o408511o132503n311122m006633k353567
$$ y = [95839385, 95206589, 94384495, 93321720, 92043046, 90633364, 89201094, 87834915, 86565191, 85340399, 84032690, 82482326, 80568015, 78265542, 75657990, 72891003, 70101223, 67360447, 64665801, 61976579, 59268358, 56564385, 53925040, 51413909, 49076797, 46948297, 45066244, 43468657, 42173553, 41164129, 40394814, 39810112, 39356939, 38981347, 38616534, 38175285, 37558076, 36682491, 35525022, 34148898, 32694627, 31337657, 30241718, 29532624, 29293159, 29562318, 30328069, 31521076, 33021354, 34675571, 36313408, 37760223, 38853248, 39462608, 39505331, 38938191, 37728282, 35817717, 33108329, 29487048, 24891872, 19390410, 13228250, 6819739, 687236, -4623886, -8630519, -10984086]
14888a0984086n35533J249223K826654M072606M913330N313925N280231M876414
14880A7012764M229635L497394K809802K225466J729049J267900Q01648L33849
14872C3907507r2932m34852o90454r14892j188501j558866j996552k396775k630936
14863B2002747k619297k380805k029689j717968j551562j527589j535161j420573
14855G220103j070294m60197L44212J218437K014016K580595K779820K512866
14847A7139558J765476O37585o78362j966063l058211l871644m395890m659192
14839I13257m701231m560554m266693l833936l266195k572946j779542r22198
14831b4990038l9366Q25371J613210K253735K691090K912832K952315K859246
$$ y = [-10984086, -11519619, -10270396, -7443742, -3371136, 1542194, 6856119, 12136350, 17012764, 21242399, 24739793, 27549595, 29775061, 31504110, 32772010, 33573658, 33907507, 33814575, 33379723, 32689269, 31774377, 30585876, 29027010, 27030458, 24633683, 22002747, 19383450, 17002645, 14972956, 13254988, 11703426, 10175837, 8640676, 7220103, 6149809, 5689612, 6033824, 7252261, 9266277, 11846872, 14626692, 17139558, 18905034, 19542619, 18864257, 16898194, 13839983, 9968339, 5572449, 913257, -3787974, -8348528, -12615221, -16449157, -19715352, -22288298, -24067840, -24990038, -25029404, -24204033, -22590823, -20337088, -17645998, -14733166, -11780851, -8921605]
14823h921605K664998K375879J997202J554643J084296O05119J10315m11608r51141
14814A08098j471025j915185k219169k318984k164082j736720j069849k50295
14806a3037211O00901J364688J957560K346453K543649K589075K527323K389162
14798C281600K187762J929336J625647J299693R87773P39593O09287O33662Q07053
14789A4101406J070809J329064J482926J464076J257802R14625N44323K85249
14781B2450280K56697N13963J024587J677333K322343K823502L097772L127533
14773C7294010K947807K620890K213026J780930J365865R92666O77320M41067
14765E0333581L14118L16000M28130N91855P43794Q61795R81437J166139J451184
$$ y = [-8921605, -6256607, -3880728, -1883526, -328883, 755413, 1360532, 1470847, 1059239, 108098, -1362927, -3278112, -5497281, -7816265, -9980347, -11717067, -12786916, -13037211, -12436310, -11071622, -9114062, -6767609, -4223960, -1634885, 892438, 3281600, 5469362, 7398698, 9024345, 10324038, 11311811, 12051404, 12660691, 13294353, 14101406, 15172215, 16501279, 17984205, 19448281, 20706083, 21620708, 22165031, 22450280, 22706977, 23220940, 24245527, 25922860, 28245203, 31068705, 34166477, 37294010, 40241817, 42862707, 45075733, 46856663, 48222528, 49215194, 49892514, 50333581, 50647699, 50963699, 51391829, 51983684, 52727478, 53589273, 54570710, 55736849, 57188033]
14756E7188033J802794K121783K289008K223764J922228J457079R40137M69843
14748G0414669R5649j78741l62578m51979m37270l32855j96013j14383j71987
14739F8264512m18948q58354j443627k079487k636856k994677l094721k969762
14731E1768080k719356k450236k223257k036733j849450j623546j356688j083883
14723C6424931q54683p04686o33616n94976n02838k59758K00796Q74840J672319
14714C5622329K439643L013836L281041L210935K856062K323057J732198J182750
14706E5661851P34665M06842J84502K7568j20939l19735o04956r66793j343005
14697E3660000j638066j760387j656093j321157p91017j20714O29065J392384
$$ y = [57188033, 58990827, 61112610, 63401618, 65625382, 67547610, 69004689, 69944826, 70414669, 70510318, 70331577, 69968999, 69517020, 69079750, 68746895, 68550882, 68436499, 68264512, 67845564, 66987210, 65543583, 63464096, 60827240, 57832563, 54737842, 51768080, 49048724, 46598488, 44375231, 42338498, 40489048, 38865502, 37508814, 36424931, 35570248, 34865562, 34231946, 33636970, 33134132, 32874374, 33075170, 33950010, 35622329, 38061972, 41075808, 44356849, 47567784, 50423846, 52746903, 54479101, 55661851, 56396516, 56803358, 56987860, 57015428, 56894489, 56574754, 55969798, 55003005, 53660000, 52021934, 50261547, 48605454, 47284297, 46493280, 46372566, 47001631, 48394015]
14689D8394015K091262K637948K954835L001017K786995K369013J825965J228312
14681F7289362O14313j1654o58293j319370j955439k495266k858801k992067k893877
14672E2718908k616778k240745j836986j443693j061898o65686k19177L05147
14664D2939092R12081J575874K238652K816911L217119L354556L167729K630412
14656F2852426J768299O73066n08214j616814k536079l218956l673773l925729
14648D9814226l987016l855238l532132l039592k420637j732116j039406m15383
14640B9792706O1623L20794L27073J10227k31438n62720p58512p35665m59727
14631B7864361N8278P60626J542784K267667K794036L006737K842115K307619
$$ y = [48394015, 50485277, 53123225, 56078060, 59079077, 61866072, 64235085, 66061050, 67289362, 67903675, 67892021, 67233728, 65914358, 63958919, 61463653, 58604852, 55612785, 52718908, 50102130, 47861385, 46024399, 44580706, 43518808, 42853122, 42633945, 42939092, 43851173, 45427047, 47665699, 50482610, 53699729, 57054285, 60222014, 62852426, 64620725, 65293791, 64785577, 63168763, 60632684, 57413728, 53739955, 49814226, 45827210, 41971972, 38439840, 35400248, 32979611, 31247495, 30208089, 29792706, 29854329, 30175123, 30502196, 30612423, 30380985, 29818265, 29059753, 28324088, 27864361, 27922639, 28683265, 30226049, 32493716, 35287752, 38294489, 41136604, 43444223]
14623D3444223J485909N11325m74464j361925k086548k615923k929757l010101
14615C2962739k845961k446011j849430j125998l62062L63816J002389J537084
14607B7236566J967468K290216K496928K588616K587536K530724K451679K368761
14599D6518494K287985K214158K162237K160405K236270K390770K580367K724749
14591F5275435K737273K559350K178174J620673R37148J94653n17716j089869
14583G3895121j411918j408337j069088m66685K50823Q99741J324852J454728
14575G3469237J313771R86930N67806J29294k69288n62289o82289n95746l36577
14566G4020849l893K76461M01188L24203O4580l12106p27430j118012j442253
$$ y = [43444223, 44930132, 45441457, 44966993, 43605068, 41518520, 38902597, 35972840, 32962739, 30116778, 27670767, 25821337, 24695339, 24333277, 24697093, 25699482, 27236566, 29204034, 31494250, 33991178, 36579794, 39167330, 41698054, 44149733, 46518494, 48806479, 51020637, 53182874, 55343279, 57579549, 59970319, 62550686, 65275435, 68012708, 70572058, 72750232, 74370905, 75308053, 75502706, 74984990, 73895121, 72483203, 71074866, 70005778, 69539093, 69789916, 70689657, 72014509, 73469237, 74783008, 75769938, 76337744, 76467038, 76197750, 75635461, 74953172, 74357426, 74020849, 74016956, 74293417, 74694605, 75018808, 75083388, 74771282, 74043852, 72925840, 71483587]
14557G1483587j670779j780640j765687j653852j509462j409228j403024j482702
14549E8808213j577674j582486j401735r82802l17828N72894J648078K832710
14541E7999370M006009N017502N732564O081116O080718N819189N400854M886550
14533A01023872M271795L520814K622972J619166N82800m13265j311228k063626
14525A09853300k624582k946471k988320k739901k247868j613739r53210l49011
14517I3390198J63208N76564Q92370J113675J245075J290105J250040J129680
14509A01050915R44614P18185M67036J89663j27416m90356q85320j282671j650033
14500I8934617j964496k219389k420895k574532k672198k691995k612483k430799
$$ y = [71483587, 69812808, 68032168, 66266481, 64612629, 63103167, 61693939, 60290915, 58808213, 57230539, 55648053, 54246318, 53263516, 52945688, 53518582, 55166660, 57999370, 62005379, 67022881, 72755445, 78836561, 84917279, 90736468, 96137322, 101023872, 105295667, 108816481, 111439453, 113058619, 113641419, 113228154, 111916926, 109853300, 107228718, 104282247, 101293927, 98554026, 96306158, 94692419, 93739209, 93390198, 93553406, 94129970, 95022340, 96136015, 97381090, 98671195, 99921235, 101050915, 101995529, 102713714, 103180750, 103370413, 103242997, 102752641, 101867321, 100584650, 98934617, 96970121, 94750732, 92329837, 89755305, 87083107, 84391112, 81778629, 79347830]
14492G9347830k171731j884109j629043j463849j425881j524339j744372k058354
14484F5446152k436620k854714l298511l767710m273395m823682n399881n938917
14476C2652722o340560o500823o352152n888735n169810m304328l422688k644070
14468g970444k049373j664932j460051j360820j276097j124458q51924m37580
14460a8195679J08884P51785J435631K096452K676955L136561L450137L599800
14452i39474L568712L342685K918609K311463J552489O83979k39579j148685j968642
14443A0081557k640786l136112l449227l581801l532042l295608k871855k271303
14435a4697177j525032o90422J57071R43432J606819K088610K323640K256023
$$ y = [79347830, 77176099, 75291990, 73662947, 72199098, 70773217, 69248878, 67504506, 65446152, 63009532, 60154818, 56856307, 53088597, 48815202, 43991520, 38591639, 32652722, 26312162, 19811339, 13459187, 7570452, 2400642, -1903686, -5326374, -7970444, -10019817, -11684749, -13144800, -14505620, -15781717, -16906175, -17758099, -18195679, -18086795, -17335010, -15899379, -13802927, -11125972, -7989411, -4539274, -939474, 2629238, 5971923, 8890532, 11201995, 12754484, 13438463, 13198884, 12050199, 10081557, 7440771, 4304659, 855432, -2726369, -6258411, -9554019, -12425874, -14697177, -16222209, -16912631, -16755560, -15812128, -14205309, -12116699, -9793059, -7537036]
14427g537036J877378J255548N28397j33565n74311o91471m60006O2670P51439
14418d920957J446195J995125K293594K302407K040682J563548R40784K47452
14410G908830m36121j030694j480618j780234j978879k152159k354682k585895
14402e890452k790872k890857k820144k549527k090134j482471p83125o3124N84215
14393b0776491J051277J259741J217061J035450Q89909R43129J285265J915612
14385a1179047K759979L700278M600808N331404N788910N911689N685768N148923
14377B7748712M395063L567892K830150K311488K059373K021292K067925K044612
14369D9046507J829891J380927P47215M4247n96557j071395j324923j353736j201811
$$ y = [-7537036, -5659658, -4404110, -3875713, -4009278, -4583589, -5275060, -5735066, -5672396, -4920957, -3474762, -1479637, 813957, 3116364, 5157046, 6720594, 7661378, 7908830, 7472709, 6442015, 4961397, 3181163, 1202284, -949875, -3304557, -5890452, -8681324, -11572181, -14392325, -16941852, -19031986, -20514457, -21297582, -21360706, -20776491, -19725214, -18465473, -17248412, -16212962, -15323053, -14379924, -13094659, -11179047, -8419068, -4718790, -117982, 5213422, 11002332, 16914021, 22599789, 27748712, 32143775, 35711667, 38541817, 40853305, 42912678, 44933970, 47001895, 49046507, 50876398, 52257325, 53004540, 53048787, 52452230, 51380835, 50055912, 48702176, 47500365]
14360D7500365r47644o79313m61903l12342j99599p6459P5823K25375L09027K73877
14350D5707207J06536j64130m82158p85533j024660j169883j205434j120116r07428
14341C8954401n73643j40844L61202R05364J467795K020042K525505K948171L265834
14332E1733827L473183L571768L558935L426614L169617K798163K347481J874441
14324G5954029J438102J077922Q07624O25359N24621M94530N13206N46188N56668
14315H2538249N22476M47528L57186K76875K08510J26512R19j71795l60021n20653
14305H3425786o35025p26494q45972j038029j311583j627909j906816k053510
14297G3280448k003686j762810j408580j050139p68606n74826m08689j79169J79490
$$ y = [47500365, 46552721, 45873408, 45411505, 45099163, 44899564, 44823105, 44898928, 45124303, 45433330, 45707207, 45813743, 45649613, 45167455, 44381922, 43357262, 42187379, 40981945, 39861829, 38954401, 38380758, 38239914, 38601116, 39506480, 40974275, 42994317, 45519822, 48467993, 51733827, 55207010, 58778778, 62337713, 65764327, 68933944, 71732107, 74079588, 75954029, 77392131, 78470053, 79277677, 79903036, 80427657, 80922187, 81435393, 81981581, 82538249, 83060725, 83508253, 83865439, 84142314, 84350824, 84477336, 84478255, 84306460, 83946439, 83425786, 82790761, 82064267, 81218295, 80180266, 78868683, 77240774, 75333958, 73280448, 71276762, 69513952, 68105372, 67055233, 66286627, 65711801, 65303112, 65123943, 65303433]
14288F5303433O65892J203924J671666J949262J958548J679186J145681M35703
14280G6013295l44757j079168j663133k029976k168215k117888j946355j720437
14272F2943366j490986j290500j134934j025189r49543q90548q39814q13495q46878
14263E3661479r57233j100788j168794j039990o57463p4206N63755J078324J320522
14254E1625606J204694P17324q9308j113732k226630l291385m183436m804316
14246C7838817n083711m980474m500177l716377k762172j789435r29490k78245
14238A3798736J05843K09129P1056k25479n88137r54454j306782j652844j992526
14229G464542k298419k517035k581041k426849k018736j373954n74202K46513
$$ y = [65303433, 65969325, 67173249, 68844915, 70794177, 72752725, 74431911, 75577592, 76013295, 75668538, 74589370, 72926237, 70896261, 68728046, 66610158, 64663803, 62943366, 61452380, 60161880, 59026946, 58001757, 57052214, 56161666, 55321852, 54508357, 53661479, 52704246, 51603458, 50434664, 49394674, 48737211, 48663005, 49226760, 50305084, 51625606, 52830300, 53547624, 53458316, 52344584, 50117954, 46826569, 42643133, 37838817, 32755106, 27774632, 23274455, 19558078, 16795906, 15006471, 14076981, 13798736, 13904579, 14113708, 14184764, 13959285, 13371148, 12416694, 11109912, 9457068, 7464542, 5166123, 2649088, 68047, -2358802, -4377538, -5751492, -6325694, -6079181]
14221f079181R33326J351097J425668J174080P07202J95441j92612l52519k81107
14212a118605p2356J32343K23886J93372J44522K40476O15795J303945K219703
14203C883081L198527M058951M653183M895374M771229M334333L695463L006583
14195C6496724K430206K088084K008323K109422K241613K262555K101394J779977
14187E3518298J389464J040853Q13321P20469P07140O77655N39214K35256k45047
14178E9396623q74873j601132k353060l050709l615395l979633m096332l951715
14170C5873774l578558l051396k453917j841180j230663o25975m4931M74403Q89310
14161B4410867J168787J295390J259340J061906P29470L20421q7987m22419o26838
$$ y = [-6079181, -5145855, -3794758, -2369090, -1195010, -487808, -292367, -484979, -837498, -1118605, -1190961, -1058618, -834732, -641360, -496838, -256362, 359433, 1663378, 3883081, 7081608, 11140559, 15793742, 20689116, 25460345, 29794678, 33490141, 36496724, 38926930, 41015014, 43023337, 45132759, 47374372, 49636927, 51738321, 53518298, 54907762, 55948615, 56761936, 57482405, 58189545, 58867200, 59406414, 59641670, 59396623, 58521750, 56920618, 54567558, 51516849, 47901454, 43921821, 39825489, 35873774, 32295216, 29243820, 26789903, 24948723, 23718060, 23092085, 23047154, 23521557, 24410867, 25579654, 26875044, 28134384, 29196290, 29925760, 30246181, 30158194, 29735775, 29108937]
14152B9108937o63999n17788k03618K20722O58664J001623J169454J139874R49003
14143C2862872O68780L80715J56156L8363K3948N7746N7627l5907k13726l89002
14133C3607572m42785l05414j7664K80463M30627L48192O1740l18375o70380r20348
14123C2053628j060146j129341j185227j276056j419919j595972j757189j858943
14115B0770835j882215j835850j742235j622283j488304j341861j174373r75021
14107H708693p47245n20686l41008k38048j97034j60740o7616R8489K84255L91663
14097G210723L37704J03474k63739o85922j086996j400008j561569j513692j215676
14088g5701o57266J33444J089464K111504L078080L857453M327749M409192M094742
$$ y = [29108937, 28444938, 27927150, 27723532, 27944254, 28602918, 29604541, 30773995, 31913869, 32862872, 33531652, 33912367, 34068523, 34106886, 34130834, 34188580, 34246207, 34210300, 33996574, 33607572, 33164787, 32859373, 32841709, 33122172, 33552799, 33900991, 33962731, 33644356, 32973976, 32053628, 30993482, 29864141, 28678914, 27402858, 25982939, 24386967, 22629778, 20770835, 18888620, 17052770, 15310535, 13688252, 12199948, 10858087, 9683714, 8708693, 7961448, 7440762, 7099754, 6861706, 6664672, 6503932, 6436316, 6534805, 6819060, 7210723, 7548427, 7651901, 7388162, 6702240, 5615244, 4215236, 2653667, 1139975, -75701, -732967, -599523, 489941, 2601445, 5679525, 9536978, 13864727, 18273919, 22368661]
14079B2368661L456653K622356J734930R17135K47367k48729n86472p95203q94977
14070B8821721q91454p84324n76483k77876R5130N20677R67133J382850J689799
14061C0947173J794503J618147J130671L68083n76297j578699k513615l274788
14053B7915178l790723m037614m042025l863252l561223l171657k704124k156572
14045E87988j528408q24894o0736P31850J497878K163035K642845K856731K750387
14036A0816676K321250J632459Q04613j2833o77990j086750j191147j006477o05844
14027A0993957r7282M13609Q56587J203232J446224J575784J578335J455640J237299
14018B0663385R67808O80713L85281P4827k53010n79131q61213j053026j137066
$$ y = [22368661, 25825314, 28447670, 30182600, 31099735, 31347102, 31098373, 30511901, 29716698, 28821721, 27930267, 27145943, 26569460, 26291584, 26386714, 26907391, 27874524, 29257374, 30947173, 32741676, 34359823, 35490494, 35858577, 35282280, 33703581, 31189966, 27915178, 24124455, 20086841, 16044816, 12181564, 8620341, 5448684, 2744560, 587988, -940420, -1765314, -1826050, -1094200, 403678, 2566713, 5209558, 8066289, 10816676, 13137926, 14770385, 15574998, 15562165, 14884175, 13797425, 12606278, 11599801, 10993957, 10896675, 11310284, 12166871, 13370103, 14816327, 16392111, 17970446, 19426086, 20663385, 21631193, 22311906, 22697187, 22772014, 22519004, 21939873, 21078660, 20025634, 18888568]
14009A8888568j149387j178785j340741j739272k426889l368504m424395n375034
14001b114439n990763o112622n699185m823354l638717k338608j114222j12850
13993c1944760N93654J016618J231118J339840J436757J584013J804560K083247
13985b0854953K370849K593588K670744K539459K182708J645169J017242L92683
13977e442511j63767o12353r15468j034302r53029o98920l30134J00475N75044
13968i474965J112690J743756K473498L259110M014580M636488N029293N116040
13960A7910490M840431M177251L155624J874889M88745q39844j983428k868928
13952B6755230l471698l803806l907538l846745l687718l477963l239747k980998
$$ y = [18888568, 17739181, 16560396, 15219655, 13480383, 11053494, 7684990, 3260595, -2114439, -8105202, -14217824, -19917009, -24740363, -28379080, -30717688, -31831910, -31944760, -31351106, -30334488, -29103370, -27763530, -26326773, -24742760, -22938200, -20854953, -18484104, -15890516, -13219772, -10680313, -8497605, -6852436, -5835194, -5442511, -5606278, -6218631, -7134099, -8168401, -9121430, -9820350, -10150484, -10050009, -9474965, -8362275, -6618519, -4145021, -885911, 3128669, 7765157, 12794450, 17910490, 22750921, 26928172, 30083796, 31958685, 32447430, 31607586, 29624158, 26755230, 23283532, 19479726, 15572188, 11725443, 8037725, 4559762, 1320015, -1660983]
13944a660983k707277k420755k111585j755811j325355q05026k07082M24924J025139
13935a1543811J525749J884257K105358K241246K366191K538259K770037L026402
13927F913688L251039L402817L474919L485201L451501L374494L239969L038314
13919C3631942K786742K532255K324903K179130K057344J893777J642463J312535
13911E0361091R65054O77538N04630M58261N09471O01265O65341O42692N05377
13902E5890720K68074k4247l30500o44120r91168j393704j830639k236787k546487
13893D6161142k739050k841223k891641k907492k877722k777606k588993k311919
13885B4225496j959584j544158j074042n72488r9168K54849M04444L12600M879
$$ y = [-1660983, -4368260, -6789015, -8900600, -10656411, -11981766, -12786792, -12993874, -12568950, -11543811, -10018062, -8133805, -6028447, -3787201, -1421010, 1117249, 3887286, 6913688, 10164727, 13567544, 17042463, 20527664, 23979165, 27353659, 30593628, 33631942, 36418684, 38950939, 41275842, 43454972, 45512316, 47406093, 49048556, 50361091, 51326145, 52003683, 52508313, 52966574, 53476045, 54077310, 54742651, 55385343, 55890720, 56158794, 56134547, 55804047, 55159927, 54168759, 52775055, 50944416, 48707629, 46161142, 43422092, 40580869, 37689228, 34781736, 31904014, 29126408, 26537415, 24225496, 22265912, 20721754, 19647712, 19075224, 18976056, 19230905, 19635349, 19947949, 19952828]
13876A9952828m48825r62253j449817j834576k059469k102185j982476j756846
13868G356381j505010j309043j224744j257931j365876j486833j575379j617528
13860c985963j619987j587145j504206j341436j081476p48541m11193j55796n3891
13851a2489634j41971m13867q21749j286484j715738k023064k143366k045527
13843b3081400j740593j278700p32975j79605L16623P12164R93356J178757J309182
13834b2503191J429539J570803J736744J901107K021130K060294K001032J838758
13826g943784J570123J193174P21768K00989k93270o78720r02878r62561q91803
13817g986962p36199n38886l38876j67474l9374N3087J35999K41662L94905O05962
$$ y = [19952828, 19504003, 18541750, 17091933, 15257357, 13197888, 11095703, 9113227, 7356381, 5851371, 4542328, 3317584, 2059653, 693777, -793056, -2368435, -3985963, -5605950, -7193095, -8697301, -10038737, -11120213, -11868754, -12279947, -12435743, -12489634, -12631605, -13045472, -13867221, -15153705, -16869443, -18892507, -21035873, -23081400, -24821993, -26100693, -26833668, -27013273, -26696650, -25984486, -24991130, -23812373, -22503191, -21073652, -19502849, -17766105, -15864998, -13843868, -11783574, -9782542, -7943784, -6373661, -5180487, -4458719, -4257730, -4551000, -5229720, -6132598, -7095159, -7986962, -8723161, -9262047, -9600923, -9768397, -9807771, -9754684, -9618685, -9377023, -8982118, -8376156]
13807h376156Q73194J188861J536959J880704K152437K264564K147912J799232
13799E467707J302781Q01180M27923K46968K38711L32272M53983N62420O55967
13790A0489912P54916Q74377J006269J116429J153089J064052Q18838M26255o3202
13781A7640935n75234j045178j447479j796502k115583k398797k592437k607884
13773C061841k362532j830594j075356k42500M83473R39763J038622P94686L17699
13764A125102k24372o58367q60051p92060n08908j26630K26726M57671N34365
13755h26524M87845L94095L47785M30662O75651J039760J407165J630637J594495
13746G181571J266771P12572O3097n38013r78922j200282j201636j043237q35982
$$ y = [-8376156, -7502962, -6314101, -4777142, -2896438, -744001, 1520563, 3668475, 5467707, 6770488, 7571668, 7999591, 8246559, 8485270, 8817542, 9271525, 9833945, 10489912, 11244828, 12119205, 13125474, 14241903, 15394992, 16459044, 17277882, 17704137, 17640935, 17065701, 16020523, 14573044, 12776542, 10660959, 8262162, 5669725, 3061841, 699309, -1131285, -2206641, -2449141, -1965668, -1025905, 12717, 807403, 1125102, 900730, 242363, -617688, -1409748, -1918656, -2045286, -1818560, -1360889, -826524, -338679, 55416, 403201, 833863, 1509514, 2549274, 3956439, 5587076, 7181571, 8448342, 9160914, 9224011, 8685998, 7707076, 6506794, 5305158, 4261921, 3425939]
13737C425939p08332p57255j006582j392931j786064k037953k041501j769304
13729h073983j272218o44359K0555O58076J234980J728830K105128K312483K300562
13720C70054K049526J593539J023586M62153J6428k65146m03506m59289m87010
13711C900335n06182n02816m51949l44508k03856q1675l2550q0536j97971l11976
13701A186316l39615k31560Q949L44634P33927J141356J533785J887311K205117
13692H470220K520169K869886L264301L675630M050534M327014M446639M368009
13684C7992402M082993L623593L050336K429723J814566J234202O97107K04202
13676E5129124k38968o25756r65519j295715j673859k149468k728526l350561
$$ y = [3425939, 2717607, 1960352, 953770, -439161, -2225225, -4263178, -6304679, -8073983, -9346201, -9990560, -9970005, -9311929, -8076949, -6348119, -4242991, -1930508, 370054, 2419580, 4013119, 5036705, 5498858, 5515286, 5250140, 4846634, 4387345, 3900335, 3394153, 2891337, 2439388, 2094880, 1891024, 1809349, 1776799, 1696263, 1498292, 1186316, 846701, 615141, 624090, 968724, 1702651, 2844007, 4377792, 6265103, 8470220, 10990389, 13860275, 17124576, 20800206, 24850740, 29177754, 33624393, 37992402, 42075395, 45698988, 48749324, 51179047, 52993613, 54227815, 54924922, 55129124, 54890156, 54264400, 53298881, 52003166, 50329307, 48179839, 45451313, 42100752]
13668D2100752l897797m240054m294045m062611l630809l122863k647058k259541
13660A3945974j961647j722766j509050j299458j081251q35998n37925j71396
13652D826483K50010O81669J063904J342825J485245J483210J347358J095890
13644A3576594P53451L63218p928k91967m60121n45419o22552p56569r56793j165918
13634I885996j289221j244950j006033o11027j43874L00728O48495Q62668R43160
13625H345942R12011P98212O31622M41891K53765P8937q7305k56012m22258n49171
13615A0147634n79861m74321k40438O8302L84215O58178Q71645J028045J140683
13606A3004082J230113J325132J452982J618753J793202J926074J977100J940001
$$ y = [42100752, 38202955, 33962901, 29668856, 25606245, 21975436, 18852573, 16205515, 13945974, 11984327, 10261561, 8752511, 7453053, 6371802, 5535804, 4997879, 4826483, 5076493, 5758162, 6822066, 8164891, 9650136, 11133346, 12480704, 13576594, 14330045, 14693263, 14685335, 14393368, 13933247, 13387828, 12765276, 12008707, 11051914, 9885996, 8596775, 7351825, 6345792, 5734765, 5590891, 5891619, 6540114, 7402782, 8345942, 9257953, 10056165, 10687787, 11129678, 11383443, 11462380, 11375075, 11119063, 10696805, 10147634, 9567773, 9093452, 8853014, 8921316, 9305531, 9963709, 10835354, 11863399, 13004082, 14234195, 15559327, 17012309, 18631062, 20424264, 22350338, 24327438, 26267439]
13598B6267439J845075J744100J685344J686803J723760J746388J721277J668762
13590D0088948J667516J817910K182034K735820L363930L902958M208357M208080
13582F4175553L918571L420203K807509K144050J451576P36632K7038o12878j095178
13573G6973076j336406j289346r72486m84148J7757L71834M74378L05532r0931
13564G3969260o47600j297953j974755k598713l077437l321003l267138k903706
13556E4880955k277728j488024o67250M0848N05807O30717L67108k66017j160898
13547E0565518k124982k930962l394135l434116l089427k482125j758107j040504
13539C0311160m14118P2281M02204N83448O30464N49448L44993M5708k80314n43127
$$ y = [26267439, 28112514, 29856614, 31541958, 33228761, 34952521, 36698909, 38420186, 40088948, 41756464, 43574374, 45756408, 48492228, 51856158, 55759116, 59967473, 64175553, 68094124, 71514327, 74321836, 76465886, 77917462, 78654094, 78681132, 78068254, 76973076, 75636670, 74347324, 73374838, 72890690, 72908447, 73280281, 73754659, 74060191, 73969260, 73321660, 72023707, 70048952, 67450239, 64372802, 61051799, 57784661, 54880955, 52603227, 51115203, 50447953, 50488801, 50994608, 51625325, 51992433, 51726416, 50565518, 48440536, 45509574, 42115439, 38681323, 35591896, 33109771, 31351664, 30311160, 29897042, 29969323, 30371527, 30954975, 31585439, 32134887, 32479880, 32525588, 32245274, 31702147]
13529C1702147o69293o28135m30230j10502K83807O93089J043048J254914J270167
13520C4409012J073295O94110J91181l65451r03480j358803j694777j918210k072535
13511B8054342k208316k354860k515162k682589k857172l042900l229884l381870
13503E781589l442665l355161l076734k584952j883469j016214p9466P88927J449263
13494g418882J808535J851147J640996J299159R63993P44349O85061P62620R10449
13485C247427J053453J130560J100616R41601O54431K72150j39062n00388p54369
13476G006419q86960r21681q94739q34255p57410o78572o13821n78057n79375
13467B61549o13107o57433o76076o31451n02226k95066m5316J92078L57554M04301
$$ y = [31702147, 31032854, 30404719, 29974489, 29863987, 30147794, 30840883, 31883931, 33138845, 34409012, 35482307, 36176417, 36367598, 36002147, 35098667, 33739864, 32045087, 30126877, 28054342, 25846026, 23491166, 20976004, 18293415, 15436243, 12393343, 9163459, 5781589, 2338924, -1016237, -4092971, -6677923, -8561392, -9577606, -9657072, -8868145, -7418882, -5610347, -3759200, -2118204, -819045, 144948, 889297, 1574358, 2336978, 3247427, 4300880, 5431440, 6532056, 7473657, 8128088, 8400238, 8261176, 7760788, 7006419, 6119459, 5197778, 4303039, 3468784, 2711374, 2032802, 1418981, 840924, 261549, -351558, -1008991, -1685067, -2316518, -2818744, -3113810, -3159126, -2967048, -2609494, -2205193]
13457b205193L16068J21555j05314k68355k87511j30703J76782N64093R38517
13448h80061J213903J334739J283649J070465P18992K66577k28926o90123j034147
13439C055068j192737j128268q39587l58688K54312R12760J506416J916393K045729
13430F171398J854903J384337P50093J10487l86224o50990o72800m96499j82006
13421G882699K18211O52514J057440J361925J506725J463669J243514Q89172M59023
13412A6734892J0720m07051p56803j012919j161467j199639j137121r99398q29206
13403I242008o82344o16142o71255q53081j126272j430223j703865j899202j977385
13394a717761j901135j640990j197686o20371M418N91411J090086J484495J767436
$$ y = [-2205193, -1889125, -1767570, -1872884, -2141239, -2428750, -2559453, -2382671, -1818578, -880061, 333842, 1668581, 2952230, 4022695, 4741687, 5008264, 4779338, 4089215, 3055068, 1862331, 734063, -105524, -464212, -209900, 702860, 2209276, 4125669, 6171398, 8026301, 9410638, 10160731, 10271218, 9884994, 9234004, 8561204, 8064705, 7882699, 8100910, 8753424, 9810864, 11172789, 12679514, 14143183, 15386697, 16275869, 16734892, 16745612, 16338561, 15581758, 14568839, 13407372, 12207733, 11070612, 10071214, 9242008, 8559664, 7943522, 7272267, 6419186, 5292914, 3862691, 2158826, 259624, -1717761, -3618896, -5259886, -6457572, -7077943, -7073525, -6482114, -5392028, -3907533, -2140097]
13385b140097J920765J919601J749517J417683R52241L94579k11384q30363j440156
13376C732386k022375k547609k976477l283184l476317l585912l621929l547296
13368b1328713l299458k844449k213646j491630p68997j00953M97982J027297
13360c0522567J472540J800370J975471J984104J851265J642841J449532J356895
13352a6989549J412952J608397J880148K136423K291993K300950K173923J969207
13344a215556J759108J590717J467919J365466J257973J137028J008147Q81609
13336I252411P70902O96519O84077P50582Q84302J033760J120615J075362Q74503
13327A7143033N55292K03015p6316j84974o0043L04698Q48485J455343J993134
$$ y = [-2140097, -219332, 1700269, 3449786, 4867469, 5819710, 6214289, 6002905, 5172542, 3732386, 1710011, -837598, -3814075, -7097259, -10573576, -14159488, -17781417, -21328713, -24628171, -27472620, -29686266, -31177896, -31946893, -32047846, -31549864, -30522567, -29050027, -27249657, -25274186, -23290082, -21438817, -19795976, -18346444, -16989549, -15576597, -13968200, -12088052, -9951629, -7659636, -5358686, -3184763, -1215556, 543552, 2134269, 3602188, 4967654, 6225627, 7362655, 8370802, 9252411, 10023313, 10719832, 11403909, 12154491, 13038793, 14072553, 15193168, 16268530, 17143033, 17698325, 17901340, 17825024, 17640050, 17580007, 17884705, 18733190, 20188533, 22181667]
13318B2181667K366053K547450K569168K479985K307418K045183J667246J158443
13310C9322613N45776q8829o25575r46726r79649p23408k46786L41324R31822
13301C7530562J441949J814966K000674J941767J585969R17626j7903j119052
13293D6096558k259760l323620m217406m868452n227464n279996n046750m562218
13285A1310892l847977k907185j751489m44541Q75277K024352K846642L278349
13277A1384320L356523L173358K819603K357229J827877J274423P48713K98918
13269B7240964m6113k77448l95590m05371l20398j66953J9608K04183L62993M90943
13259B6706818N97282O88586P53997P70075P20411O07653M46687K51266L0704
$$ y = [22181667, 24547720, 27095170, 29664338, 32144323, 34451741, 36496924, 38164170, 39322613, 39868389, 39779560, 39153985, 38207259, 37227610, 36504202, 36257416, 36598740, 37530562, 38972511, 40787477, 42788151, 44729918, 46315887, 47233513, 47215610, 46096558, 43836798, 40513178, 36295772, 31427320, 26199856, 20919860, 15873110, 11310892, 7462915, 4555730, 2804241, 2359700, 3234977, 5259329, 8105971, 11384320, 14740843, 17914201, 20733804, 23091033, 24918910, 26193333, 26942046, 27240964, 27194851, 26917403, 26521813, 26116442, 25796044, 25629091, 25648699, 25852882, 26215875, 26706818, 27304100, 27992686, 28746683, 29516758, 30237169, 30844822, 31291509, 31542775, 31573479]
13250C1573479k02842m28652o19392p46921p90952p55636o87667o70764p82645
13241B5888008j040048j376288j669748j802678j711656j401113r20777l32631
13233A5633069L09378R61424J578893K101564K449927K545481K345854J866060
13225B9791650J170311L51216m80809j202721j699118j897803j798557j479174
13217B2754995j078459p60793o71976r04644j483821k364878l438166m550936
13209G501322n549743o320029o795681o938983o718395o109056n112806l771918
13201c9815289k161094l74020J470012L204600M615688N487038N673891N159680
13193a6739494M064463K608335J054125l47508j400190j990240k098012j785580
$$ y = [31573479, 31370637, 30941985, 30322593, 29575672, 28784720, 28029084, 27341417, 26670653, 25888008, 24847960, 23471672, 21801924, 19999246, 18287590, 16886477, 15965700, 15633069, 15942447, 16903871, 18482764, 20584328, 23034255, 25579736, 27925590, 29791650, 30961961, 31313177, 30832368, 29629647, 27930529, 26032726, 24234169, 22754995, 21676536, 20915743, 20243767, 19339123, 17855302, 15490424, 12052258, 7501322, 1951579, -4368450, -11164131, -18103114, -24821509, -30930565, -36043371, -39815289, -41976383, -42350403, -40880391, -37675791, -33060103, -27573065, -21899174, -16739494, -12675031, -10066696, -9012571, -9360079, -10760269, -12750509, -14848521, -16634101]
13185a6634101j166274l75448M45878J163025J668289J907849J899230J725178
13177i366374J502367J337597J292860J376685J562655J817753K118849K448101
13169D090493K774583L040361L170326L107454K847180K438596J948321J416673
13161B4833987Q42346K06141m88927j192980j815084k255866k453017k417283
13153A5259317k233916k021549j873120j819298j832115j852048j814781j670171
13145A42319j395260r99636n21333j6531M53738Q38881J111858J270637J324031
13136B208704J274365J113631Q31428M20598j19973p71017j467209k087496k486763
13127a083732k557823k281818j735180j057273m03504R7923L75671M22691K81168
$$ y = [-16634101, -17800375, -18175823, -17729945, -16566920, -14898631, -12990782, -11091552, -9366374, -7864007, -6526410, -5233550, -3856865, -2294210, -476457, 1642392, 4090493, 6865076, 9905437, 13075763, 16183217, 19030397, 21468993, 23417314, 24833987, 25676333, 25882474, 25393547, 24200567, 22385483, 20129617, 17676600, 15259317, 13025401, 11003852, 9130732, 7311434, 5479319, 3627271, 1812490, 142319, -1252941, -2252577, -2773910, -2790441, -2336703, -1497822, -385964, 884673, 2208704, 3483069, 4596700, 5428128, 5848726, 5728753, 4957736, 3490527, 1403031, -1083732, -3641555, -5923373, -7658553, -8715826, -9119330, -9021407, -8645736, -8223045, -7941877]
13118g941877J8407k90343n68231p41977p54817n80992k27505K77164Q90673J551407
13108h368091K173399K658389K921864K916303K642237K150696J541820R54674
13100I591291N37542M00998N79500J029449J660731K368531L043487L574559L867247
13091B6653335L870514L587228L060952K358417J567028Q00804J88816j65322
13083D1921772k30106o0839K32509N38167P75544Q94586Q61995O58917K92948
13074D5885493j90907p16753j205899j612134j938901k224930k509664k802184
13066C2684121l070626l256769l310328l225786l056581k891804k808285k829244
13058H234698k912967k973944k923092k707091k329154j844755j337603q85720
$$ y = [-7941877, -7923470, -8213813, -8782044, -9524021, -10278838, -10859830, -11087335, -10810171, -9919498, -8368091, -6194692, -3536303, -614439, 2301864, 4944101, 7094797, 8636617, 9591291, 10128833, 10529831, 11109331, 12138780, 13799511, 16168042, 19211529, 22786088, 26653335, 30523849, 34111077, 37172029, 39530446, 41097474, 41898278, 42087094, 41921772, 41691666, 41630827, 41863336, 42401503, 43177047, 44071633, 44933628, 45592545, 45885493, 45694586, 44977833, 43771934, 42159800, 40220899, 37995969, 35486305, 32684121, 29613495, 26356726, 23046398, 19820612, 16764031, 13872227, 11063942, 8234698, 5321731, 2347787, -575305, -3282396, -5611550, -7456305, -8793908, -9679628]
13050i679628n29053k52209Q607L37267P99232J405608K093143K732653L169183
13041H4803L280960L027756K456297J658013P16051l13753j382373k419366l326856
13032C781532m000494m361115m375040m052179l429953k559087j499216l21266
13024b0816818Q89377K032603K999258L686088M018652L971725L575383K904283
13016C260551K056422J131689K22181n81167j176584j453092j317971p42786K00806
13007A600049J344638K469175L366301L893448M004384L751977L265706K711359
12999B6407037K240874J943318J815292J769339J682874J463169J088779O05947
12991C9016629R6207l52284o57131p49864n90497j81725M29155J160982J911089
$$ y = [-9679628, -10208681, -10460890, -10452283, -10115016, -9315784, -7910176, -5817033, -3084380, 84803, 3365763, 6393519, 8849816, 10507829, 11223880, 10910127, 9527754, 7108388, 3781532, -218962, -4580077, -8955117, -13007296, -16437249, -18996336, -20495552, -20816818, -19927441, -17894838, -14895580, -11209492, -7190840, -3219115, 356268, 3260551, 5316973, 6448662, 6670843, 6089676, 4913092, 3460000, 2142029, 1399243, 1600049, 2944687, 5413862, 8780163, 12673611, 16677995, 20429972, 23695678, 26407037, 28647911, 30591229, 32406521, 34175860, 35858734, 37321903, 38410682, 39016629, 39112836, 38760552, 38103421, 37353557, 36763060, 36581335, 37010490, 38171472, 40082561]
12982D0082561K562660K995105L109084K861036K284085J477696N74596k94342
12974E5652481j029526j586564j982983k273871k506521k686588k779247k738908
12966C8068273k542368k205705j782706j353378j006509q12323p89326q87389
12958B6688569j009303j066244j030107r40680q61177q21512p97000p33676n91934
12949A8836936l75026j29910P2557J62823Q9387j74397o23510j211124j846411
12940A4801325k412147k799071k939614k822347k482367j980490j385849p64368
12932b784928j70902L51535P64372J027962J109994J004229P40343L71886m9029
12923B365462m90068r38004j382267j799062k153054k414616k570482k614722
$$ y = [40082561, 42645221, 45640326, 48749410, 51610446, 53894531, 55372227, 55946823, 55652481, 54622955, 53036391, 51053408, 48779537, 46273016, 43586428, 40807181, 38068273, 35525905, 33320200, 31537494, 30184116, 29177607, 28365284, 27575958, 26688569, 25679266, 24613022, 23582915, 22642235, 21781058, 20959546, 20162546, 19428870, 18836936, 18461910, 18332000, 18404557, 18567380, 18656767, 18482370, 17858860, 16647736, 14801325, 12389178, 9590107, 6650493, 3828146, 1345779, -634711, -2020560, -2784928, -2955830, -2604295, -1839923, -811961, 298033, 1302262, 2042605, 2414491, 2365462, 1875394, 937390, -444877, -2243939, -4396993, -6811609, -9382091, -11996813]
12915a1996813k533116k301305j902338j355099p37094j79996J73250K30671p747
12906b0609587m56570r87044j473768j827069k009825k038857j969061j868006
12898c3239787j796172j797067j888537k052722k235859k366256k380705k242014
12890d9999119j944119j514682j015560n27300j13018K16655N08105Q31885J232776
12881e2324377J692627K130357K445095K577222K545012K435286K363537K432590
12873c3702651K704563L184246L810025M457292M965990N194709N078922M654435
12865C47531M027189L312713K589089J886241J201373N20572j61442q22558j399985
12856A1500723j794915j904153j670346j122133l72338M30256J161234J749951
$$ y = [-11996813, -14529929, -16831234, -18733572, -20088671, -20825765, -21005761, -20832511, -20601840, -20609587, -21066157, -22053201, -23526969, -25354038, -27363863, -29402720, -31371781, -33239787, -35035959, -36833026, -38721563, -40774285, -43010144, -45376400, -47757105, -49999119, -51943238, -53457920, -54473480, -55000780, -55113798, -54897143, -54389038, -53557153, -52324377, -50631750, -48501393, -46056298, -43479076, -40934064, -38498778, -36135241, -33702651, -30998088, -27813842, -24003817, -19546525, -14580535, -9385826, -4306904, 347531, 4374720, 7687433, 10276522, 12162763, 13364136, 13884708, 13723266, 12900708, 11500723, 9705808, 7801655, 6131309, 5009176, 4636838, 5067094, 6228328, 7978279]
12848G978279K166114K388811K390795K150394J677725J030254L03954l90746
12840A9695580r51063j298690j400203j289866j073702q96296q83876j099967
12832A0801917j532750k102468k676507l098358l233620l011317k434272j561151
12824h848526m83989O88610J849350K911600L817711M529473N011012N222051
12816A4697292N130047M733068M075002L238283K316339J385044M91742l35646
12808C5731171j070898j679292k124721k388515k482399k442959k312243k121300
12800A9108844j887201j617979j315703r76595n93377j65593K81426O81673R37177
12791A4452672R52588O72927J01815p00095j624893k535199l296977l818858m073613
$$ y = [7978279, 10144393, 12533204, 14923999, 17074393, 18752118, 19782372, 20086326, 19695580, 18744517, 17445827, 16045624, 14755758, 13682056, 12785760, 11901884, 10801917, 9269167, 7166699, 4490192, 1391834, -1841786, -4853103, -7287375, -8848526, -9332515, -8643905, -6794555, -3882955, -65244, 4464229, 9475241, 14697292, 19827339, 24560407, 28635409, 31873692, 34190031, 35575075, 36066817, 35731171, 34660273, 32980981, 30856260, 28467745, 25985346, 23542387, 21230144, 19108844, 17221643, 15603664, 14287961, 13311366, 12717989, 12552396, 12833822, 13515495, 14452672, 15405260, 16078187, 16180002, 15479907, 13855014, 11319815, 8022838, 4203980, 130367]
12782A30367m088621l918364l622253l257131k873094k499047k125309j706955
12774b3960407j198161n98809J9249N28867Q05439P94917N49095K06903o1386
12765b2914293j13072J27937O58368J405029K247683L049092L692027M117933
12757g729296M348958M473582M593300M755146M915424M965226M798771M372180
12749B9493291L719133K931294K126314J413457Q60685M76125K16868K0806j55315
12740D1102658l07913l83624l09657m3097L93357R09031J371420J646866J640574
12731D6019615J318073P00456j53126j157753k209286l196308m019256m604491
12723C2697924m904570m893694m574422l996054l264260k524415j923107j566499
$$ y = [130367, -3958254, -7876618, -11498871, -14756002, -17629096, -20128143, -22253452, -23960407, -25158568, -25757377, -25738128, -25209261, -24403822, -23608905, -23059810, -22852907, -22914293, -23027365, -22899428, -22241060, -20836031, -18588348, -15539256, -11847229, -7729296, -3380338, 1093244, 5686544, 10441690, 15357114, 20322340, 25121111, 29493291, 33212424, 36143718, 38270032, 39683489, 40544174, 41020299, 41237167, 41257973, 41102658, 40794745, 40411121, 40101464, 40058367, 40451724, 41360755, 42732175, 44379041, 46019615, 47337688, 48038144, 47885018, 46727265, 44517979, 41321671, 37302415, 32697924, 27793354, 22899660, 18325238, 14329184, 11064924, 8540509, 6617402, 5050903]
12715E050903j491846j661331j982054k347062k676664k934689l114870l217183
12707a4374796l232786l141490k921199k565490k096447j563497j034034n81854
12699c1511593k68102j14993r1322j26475j43099q3008Q6465L76458P73725J227845
12689b9874099J645860J914680J950929J748873J388242R93543O78699N16149
12681a9037124N36733P41343J107090J584262K093878K540731K841563K946533
12673d644991K837057K512626J992300J330839O17926n8357o55594j184108j671127
12664A076571k118640k490715k732654k797350k656037k295033j717555r58642
12656a6690055r6701P58708J502039K069020K455734K712105K913980L126643
$$ y = [5050903, 3559057, 1897726, -84328, -2431390, -5108054, -8042743, -11157613, -14374796, -17607582, -20749072, -23670271, -26235761, -28332208, -29895705, -30929739, -31511593, -31779695, -31894688, -31986010, -32112485, -32255584, -32338592, -32252127, -31875669, -31101944, -29874099, -28228239, -26313559, -24362630, -22613757, -21225515, -20231972, -19553273, -19037124, -18500391, -17759048, -16651958, -15067696, -12973818, -10433087, -7591524, -4644991, -1807934, 704692, 2696992, 4027831, 4645757, 4587400, 3931806, 2747698, 1076571, -1042069, -3532784, -6265438, -9062788, -11718825, -14013858, -15731413, -16690055, -16786756, -16028048, -14526009, -12456989, -10001255, -7289150, -4375170, -1248527]
12648a248527L376853L642721L858440L929374L758040L280793K504894J524476
12640B4627064M96331m20478j128446j618727j945889k171682k318655k363827
12632A3155691k272063k038703j705384j340572j008225p49418n78228m83232
12624B979866m33733l90301l15334j85837j0272J64160K68598K46684Q2009j97154
12614B208686n34066q69419j166094j422925j670641j951992k293403k676859
12606a0376713l027679l234601l193846k845205k184957j272140k37491P28633
12598b5643999J429781J735658J626838J190854N85877l687m11105n29307l39870
12589b0358960Q6122O18232J114188J462547J603288J526952J264776Q74759M21433
$$ y = [-1248527, 2128326, 5771047, 9629487, 13558861, 17316901, 20597694, 23102588, 24627064, 25123395, 24702917, 23574471, 21955744, 20009855, 17838173, 15519518, 13155691, 10883628, 8844925, 7139541, 5798969, 4790744, 4041326, 3463098, 2979866, 2546133, 2155832, 1840498, 1654661, 1644389, 1808549, 2077147, 2323831, 2405840, 2208686, 1674620, 805201, -360893, -1783818, -3454459, -5406451, -7699854, -10376713, -13404392, -16638993, -19832839, -22678044, -24863001, -26135141, -26372632, -25643999, -24214218, -22478560, -20851722, -19660868, -19074991, -19078678, -19489783, -20019090, -20358960, -20272838, -19654606, -18540418, -17077871, -15474583, -13947631, -12682855, -11808096, -11386663]
12580a1386663m2548m79491q55973j131106j251096j152174p77527j11586P85271
12571a6402893J775300K688189L383701L791102L909239L780461L459724K990389
12563I375212K392294J672229Q58881L5561o68468j134028j314928j260159j085517
12554H871077r22818q75783r89014j230738j501967j679615j675020j477222j161006
12545b642106q55672o88729p35519j001231j434582j952841k461949k870358l102038
12536a7745025l110628k890907k482630j963227j427630r59710o07651l75176
12528c1562584k31077j29228k7211J03877K77562M91974P27435R45832J098720
$$ y = [-11386663, -11429211, -11908702, -12764675, -13895781, -15146877, -16299051, -17076578, -17188164, -16402893, -14627593, -11939404, -8555703, -4764601, -855362, 2925099, 6384823, 9375212, 11767506, 13439735, 14298616, 14334177, 13665709, 12531681, 11216753, 9956594, 8871077, 7948259, 7072476, 6083462, 4852724, 3350757, 1671142, -3878, -1481100, -2642106, -3497778, -4186507, -4922026, -5923257, -7357839, -9310680, -11772629, -14642987, -17745025, -20855653, -23746560, -26229190, -28192417, -29620047, -30579757, -31187408, -31562584, -31793661, -31922889, -31950100, -31846223, -31568661, -31076687, -30349252, -29403420, -28304700]
$$ [...]
##END NTUPLES=NMR SPECTRUM
##END=
