##TITLE=31P ikalashn
DE-78_TFA2
18.12.2024
##JCAMPDX= 6.0         $$ Bruker NMR JCAMP-DX V2.0
##DATA TYPE= NMR SPECTRUM
##DATA CLASS= NTUPLES
##ORIGIN= UXNMR, Bruker Analytische Messtechnik GmbH
##OWNER= root
$$ TOPSPIN		Version 1.3
$$ 2024-12-18 16:05:00.140 +0400  Irina@DPX200
$$ Compression mode = diff/dup
##.OBSERVE FREQUENCY= 81.01967998063
##.OBSERVE NUCLEUS= ^31P
##.ACQUISITION MODE= SIMULTANEOUS
##.ACQUISITION SCHEME= undefined
##.AVERAGES= 64
##.DIGITISER RES= 17
##SPECTROMETER/DATA SYSTEM= spect
##.PULSE SEQUENCE= zgpg
##.SOLVENT NAME= DMSO
##.SHIFT REFERENCE= INTERNAL, DMSO, 1, 298.5841
##AUDIT TRAIL= $$ (NUMBER, WHEN, WHO, WHERE, WHAT)
$$ ##TITLE= Audit trail, TOPSPIN		Version 1.3
$$ ##JCAMPDX= 5.01
$$ ##ORIGIN= Bruker BioSpin GmbH
$$ ##OWNER= Irina
$$ $$ F:/spectra/data/iren/nmr/P31dec/1/pdata/1/auditp.txt
$$ ##AUDIT TRAIL=  $$ (NUMBER, WHEN, WHO, WHERE, VERSION, WHAT)
(   1,<2024-12-18 16:04:05.296 +0400>,<Irina>,<DPX200>,<TOPSPIN 1.3>,
      <created by zg
	started at 2024-12-18 16:02:21.843 +0400,
	POWCHK disabled, PULCHK disabled
       configuration hash MD5:
       BE 6D 3F 07 2A EA 11 49 91 17 2B D3 AF B3 58 0D
       data hash MD5: 32K
       AB 60 69 FD D2 AF C5 0C 41 F0 8F 31 1E DC 71 B3>)
(   2,<2024-12-18 16:04:08.734 +0400>,<Irina>,<DPX200>,<TOPSPIN 1.3>,
      <Start of raw data processing
       efp BC_mod = 2 LB = 12 FT_mod = 6 PKNL = 1 PHC0 = 33.51816 PHC1 = -56.6977 SI = 32K 
       data hash MD5: 32K
       1B 85 0C C3 6B B1 B4 20 A5 D4 76 72 E4 33 F7 94>)
(   3,<2024-12-18 16:04:21.546 +0400>,<Irina>,<DPX200>,<TOPSPIN 1.3>,
      <apk 
       data hash MD5: 32K
       F0 3A BE 59 E4 B9 8A B3 34 55 0B 2C CC F8 C8 AF>)
(   4,<2024-12-18 16:04:24.125 +0400>,<Irina>,<DPX200>,<TOPSPIN 1.3>,
      <abs n ABSG = 5 
       data hash MD5: 32K
       55 35 45 8C A9 78 1F C8 39 EF F9 C2 C8 65 55 5A>)
(   5,<2024-12-18 16:04:38.531 +0400>,<Irina>,<DPX200>,<TOPSPIN 1.3>,
      <pk fgphup PHC0 = -12.41655 PHC1 = 14.4 
       data hash MD5: 32K
       B7 E6 52 F0 5F C5 EC 07 CC D9 D1 3B E6 D0 2E E4>)
(   6,<2024-12-18 16:04:39.984 +0400>,<Irina>,<DPX200>,<TOPSPIN 1.3>,
      <abs n ABSG = 5 
       data hash MD5: 32K
       80 9B 22 19 5E BC 7B 24 3F 81 D4 B4 05 3F 88 01>)
$$ ##END=
$$ 
$$ $$ hash MD5
$$ $$ 78 5B DB CD FC 83 A0 CF 27 E3 C2 77 77 98 A1 4B
##$RELAX= 
##$RELAX= 
##$RELAX= 
##$RELAX= 
##$RELAX= 
##$RELAX= 
##$RELAX= 
##$RELAX= 
##$RELAX= 
##$RELAX= 
##$RELAX= 
$$ Bruker specific parameters
$$ --------------------------
##$DU= <F:/spectra>
##$EXPNO= 1
##$NAME= <P31dec>
##$PROCNO= 1
##$TYPE= <nmr>
##$USER= <iren>
##$AMP= (0..31)
100 100 100 100 100 100 100 100 100 100 100 100 100 100 100 100 100 100 
100 100 100 100 100 100 100 100 100 100 100 100 100 100 
##$ANAVPT= -1
##$AQSEQ= 0
##$AQ_mod= 1
##$AUNM= <au_zg>
##$AUTOPOS= <>
##$BF1= 81.014009
##$BF2= 200.13
##$BF3= 200.13
##$BF4= 200.13
##$BF5= 200.13
##$BF6= 200.13
##$BF7= 200.13
##$BF8= 200.13
##$BYTORDA= 1
##$CFDGTYP= 0
##$CFRGTYP= 5
##$CHEMSTR= <none>
$$ [...]
##$SW_h= 37037.037037037
##$TD= 32768
##$TD0= 1
##$TE= 300
##$TE2= 300
##$TE3= 300
##$TEG= 300
##$TL= (0..7)
0 120 53 12 22 120 120 120 
##$TP= (0..7)
150 150 150 150 150 150 150 150 
##$TP07= 0
##$TPNAME0= <>
##$TPNAME1= <>
##$TPNAME2= <>
##$TPNAME3= <>
##$TPNAME4= <>
##$TPNAME5= <>
##$TPNAME6= <>
##$TPNAME7= <>
##$TPOAL= (0..7)
0.5 0.5 0.5 0.5 0.5 0.5 0.5 0.5 
##$TPOFFS= (0..7)
0 0 0 0 0 0 0 0 
##$TUNHIN= 0
##$TUNHOUT= 0
##$TUNXOUT= 0
##$USERA1= <user>
##$USERA2= <user>
##$USERA3= <user>
##$USERA4= <user>
##$USERA5= <user>
##$V9= 5
##$VALIST= <valist>
##$VCLIST= <CCCCCCCCCCCCCCC>
##$VD= 0
##$VDLIST= <DDDDDDDDDDDDDDD>
##$VPLIST= <PPPPPPPPPPPPPPP>
##$VTLIST= <TTTTTTTTTTTTTTT>
##$WBST= 1024
##$WBSW= 4
##$XGAIN= (0..3)
0 0 0 0 
##$XL= 0
##$YL= 0
##$YMAX_a= 709
##$YMIN_a= -5515
##$ZGOPTNS= <>
##$ZL1= 120
##$ZL2= 120
##$ZL3= 120
##$ZL4= 120
##$ABSF1= 298.5841
##$ABSF2= -158.5842
##$ABSG= 5
##$ABSL= 5
##$ALPHA= 0
##$AQORDER= 0
##$ASSFAC= 0
##$ASSFACI= 0
##$ASSFACX= 0
##$ASSWID= 0
##$AUNMP= <proc_1d>
##$AXLEFT= 0
##$AXRIGHT= 0
##$AXTYPE= 0
##$AXUNIT= <>
##$AZFE= 0.1
##$AZFW= 0.5
##$BCFW= 0
##$BC_mod= 2
##$BYTORDP= 0
##$COROFFS= 0
##$CY= 12.5935478210449
##$DATMOD= 1
##$DC= 0
##$DFILT= <>
##$DTYPP= 0
##$F1P= 47.1127640792319
##$F2P= -24.0371245302204
##$FCOR= 0.5
##$FTSIZE= 32768
##$FT_mod= 6
##$GAMMA= 0
##$GB= 0
##$INTBC= 1
##$INTSCL= 7.269226e-011
##$ISEN= 30
##$LB= 12
##$LEV0= 0
##$LPBIN= 0
##$MAXI= 12.09355
##$MC2= 0
##$MEAN= 0
##$ME_mod= 0
##$MI= 0.7550151
##$NCOEF= 0
##$NC_proc= -14
##$NLEV= 6
##$NOISF1= 298.5841
##$NOISF2= 270.0111
##$NSP= 0
##$NTH_PI= 0
##$NZP= 0
##$OFFSET= 298.5841
##$PC= 1.4
##$PHC0= 77.51611
##$PHC1= -50.59658
##$PH_mod= 1
##$PKNL= yes
##$PPARMOD= 0
##$PPDIAG= 0
##$PPIPTYP= 0
##$PPMPNUM= 100
##$PPRESOL= 1
##$PSCAL= 0
##$PSIGN= 0
##$REVERSE= no
##$SF= 81.014009
##$SI= 32768
##$SIGF1= 270.0111
##$SIGF2= -158.5842
##$SINO= 77.54984
##$SIOLD= 32768
##$SREGLST= <31P.CDCl3>
##$SSB= 0
##$STSI= 32768
##$STSR= 0
##$SW_p= 37037.037037037
##$SYMM= 0
##$S_DEV= 0
##$TDeff= 32768
##$TDoff= 0
##$TI= <>
##$TILT= no
##$TM1= 0
##$TM2= 0
##$TOPLEV= 0
##$USERP1= <user>
##$USERP2= <user>
##$USERP3= <user>
##$USERP4= <user>
##$USERP5= <user>
##$WDW= 1
##$XDIM= 32768
##$YMAX_p= 569948001
##$YMIN_p= -57155433
$$ End of Bruker specific parameters
$$ ---------------------------------
##NTUPLES= NMR SPECTRUM
##VAR_NAME=  FREQUENCY,     SPECTRUM/REAL,   SPECTRUM/IMAG
##SYMBOL=    X,             R,               I
##VAR_TYPE=  INDEPENDENT,   DEPENDENT,       DEPENDENT
##VAR_FORM=  AFFN,          ASDF,            ASDF
##VAR_DIM=   32768,         32768,           32768
##UNITS=     HZ,            ARBITRARY UNITS, ARBITRARY UNITS
##FACTOR=    1.13031516577767, 1,            1
##FIRST=     37037.037037037, 9807016,       19063110
##LAST=      0,             -40701277,       -8071518
##MIN=       0,             -57155433,       0
##MAX=       37037.037037037, 569948001,     0
$$ Real data points
##PAGE= N=1
##DATA TABLE= (X++(R..R)), XYDATA
$$ [...]
17484A3247009j32790p62818j696337k753283l567541l770327l196461j972708
17476d605256m85451Q23345J716098K173424K235275J965604J499190R85783N05950
17467F813962R7439j77229k44050j19180L4786J2915k54469o38896r15714r00511
17457C709053n46179m8192K02425j1543m55151o85041n07336j01221K33559L28801
17447B119175J76327j54031n66834r42100j130843j032653p23965m34457l34858
17438c024239m05818n29286o27061p00479p54639o87931l76662R1751M51365N65088
17428e997911N47066N78928P17999Q80473R74410J031715J182561J510165J951879
17419C377285K339008K499754K347207J960513J568238J338936J220471J070197
$$ plain form
17484 13247009 13114219 12351401 10655064 7901781 4334240 563913 -2632548 -4605256
17476 -4605256 -5090707 -4267362 -2551264 -377840 1857435 3823039 5322229 6308012 6813962
17467 6813962 6911401 6734172 6490122 6370942 6405728 6418643 6164174 5525278 4609564 3709053
17457 3709053 3162874 3114682 3317107 3305564 2850413 2165372 1658036 1556815 1790374 2119175
17447 2119175 2295502 2141471 1574637 632537 -498306 -1530959 -2254924 -2689381 -3024239
17438 -3024239 -3430057 -3959343 -4586404 -5286883 -6041522 -6729453 -7106115 -7014364 -6562999 -5997911
17428 -5997911 -5450845 -4871917 -4153918 -3273445 -2299035 -1267320 -84759 1425406 3377285
17419 3377285 5716293 8216047 10563254 12523767 14092005 15430941 16651412 17721609
17411A7721609Q28005N01109J19355k61830n95967r01079j257401j695409k079538
17402A2378854k182919j912384j418197r73388p51112o96788o05502l44276l0307
17393C463981N4836k30143p10807j029344r03398k58185P89985J987830L030562
17384F195317L652356L678360L117138K238098J429747R21692O79412N25569L16980
17375B2754669M0295k24311m14372n66540q15559j317073k105871l016983l819352
17366A0514903m392240m706893m723831m426554l899236l225584k380687j319290
17358a8559412n9854J306108K571154L448992L734363L407897K626546J668803
17350A44597Q36852L17295R2562J9756j1276p0348k55447o36186j169953j732244
$$ plain form
17411 17721609 18549614 19050723 19170078 18908248 18312281 17411202 16153801 14458392 12378854
17402 12378854 10195935 8283551 6865354 5891966 5140854 4444066 3838564 3494288 3463981
17393 3463981 3518817 3288674 2577867 1548523 645125 386940 1176925 3164755 6195317
17384 6195317 9847673 13526033 16643171 18881269 20311016 21232708 21912120 22437689 22754669
17375 22754669 22794964 22570653 22156281 21589741 20774182 19457109 17351238 14334255 10514903
17366 10514903 6122663 1415770 -3308061 -7734615 -11633851 -14859435 -17240122 -18559412
17358 -18559412 -18619266 -17313158 -14742004 -11293012 -7558649 -4150752 -1524206 144597
17350 144597 981449 1298744 1391306 1411062 1399786 1329438 1073991 437805 -732148 -2464392
17340b464392k170883k343347k186885j739967j128376n99000m14324n38588n71243
17331a4157005j14740R34735K402828L894883M887009M973692M112064K594915
17323I528381Q18957q42157k087065k805435l113315l146550k852172k125071
17315f624427j070765O32P74155J126809J211113J317752J606677J964854K165542
17306B472342K158850K075995J981048J825952J607754J404711J285527J245562
17298A6057741J199397J012553N88758k4171o37970j054705j202147j167106j095311
17289A3677039j053480r90413q25451n30363j17044L88416R05450J244806J222855
17280A3921815Q52878L17233j93369n54382p29857p93535q43484q38749o38826
$$ plain form
17340 -2464392 -4635275 -6978622 -9165507 -10905474 -12033850 -12632850 -13047174 -13585762 -14157005
17331 -14157005 -14271745 -13337010 -10934182 -7039299 -2152290 2821402 6933466 9528381
17323 9528381 10347338 9505181 7418116 4612681 1499366 -1647184 -4499356 -6624427
17315 -6624427 -7695192 -7694560 -6920405 -5793596 -4582483 -3264731 -1658054 306800 2472342
17306 2472342 4631192 6707187 8688235 10514187 12121941 13526652 14812179 16057741
17298 16057741 17257138 18269691 18858449 18834278 18196308 17141603 15939456 14772350 13677039
17289 13677039 12623559 11633146 10807695 10277332 10160288 10548704 11454154 12698960 13921815
17280 13921815 14774693 15091926 14898557 14344175 13614318 12820783 11977299 11138550 10499724
17271A0499724k43117J67411M30954N23976N26650N29868N47659N36220M44941
17262A3964286J86106l22062r99213j582798j815067j620788j118221m99595Q4674
17253F277322N54416Q75138J057292J122670J006051N72723k01859j133925j961256
17244H168572k542153k889542l056441l081706k972661k644930j979278j006292
17236a2004431N2715R78323J720579K359606K965878L512204L869229L890835
17228G344938L540287K898137K087850J259806N50321l2803o08697j245119j836509
17219A3958211k178793k136345j754524j234498p81059m57246k26724j03484j39279
17210D946259l13055n28574o57233n56475j41032N38363J324014K040479K565175
$$ plain form
17271 10499724 10256607 10424018 10854972 11378948 11905598 12435466 12983125 13519345 13964286
17262 13964286 14150392 13828330 12829117 11246319 9431252 7810464 6692243 6192648 6277322
17253 6277322 6831738 7706876 8764168 9886838 10892889 11465612 11263753 10129828 8168572
17244 8168572 5626419 2736877 -319564 -3401270 -6373931 -9018861 -10998139 -12004431
17236 -12004431 -11951716 -10973393 -9252814 -6893208 -3927330 -415126 3454103 7344938
17228 7344938 10885225 13783362 15871212 17131018 17681339 17648536 17039839 15794720 13958211
17219 13958211 11779418 9643073 7888549 6654051 5872992 5415746 5189022 5085538 4946259
17210 4946259 4633204 4104630 3447397 2890922 2749890 3288253 4612267 6652746 9217921
17201I217921K861779K919966K664331K021145J059465j4319r77476j698666k137219
17192A5916927k271410k090199j657231j137921p32707n79044o86996r19796j043423
17183D798200q50411l23639K88878O52001O84425O43004Q12272J262810J903521
17174I871061K573437L073571L225539K941246K258592J343620M52544j57577
17166B5582033l74499l40083l31383m97793p86671j092318j360345j547751j572577
17157A7678613j318696p13244J53664J023028J608561J754338J521909J116195
17149B2824368O62672J38091m76594j099711j605879j921847k052656k021062
17141A4447382j796023j323640o30031J53505Q40098J243282J289222J116331
$$ plain form
17201 9217921 12079700 14999666 17663997 19685142 20744607 20730288 19752812 18054146 15916927
17192 15916927 13645517 11555318 9898087 8760166 8027459 7448415 6761419 5841623 4798200
17183 4798200 3947789 3624150 3913028 4565029 5249454 5892458 6704730 7967540 9871061
17174 9871061 12444498 15518069 18743608 21684854 23943446 25287066 25739610 25582033
17166 25582033 25207534 24867451 24536068 24038275 23251604 22159286 20798941 19251190 17678613
17157 17678613 16359917 15646673 15800337 16823365 18431926 20186264 21708173 22824368
17149 22824368 23487040 23625131 23148537 22048826 20442947 18521100 16468444 14447382
17141 14447382 12651359 11327719 10697688 10851193 11691291 12934573 14223795 15340126
17133A5340126R80229J046631J281310J502683J561686J466429J298156J101013
17125B5578263Q89121O64492M19269J39231j85192n22070p87736q98093q30084
17116B4467201o30419l50392L058M03731P26324P90049N02715n6296o96316j227967
17106B3931688j516085j469653j038243k67039O13367J241858J401941J213089
17098B4110923R77746Q59029P36404L58255l75056j279787k020983k337083k186022
17089A8843426j745739j279487r88592r29048r78303r22061o56675k79119O3818
17080A1128220L22907M67909M14521J39234k66032p09220j172702j649748k081609
17071F593480k382233k457246k191549j522142o02183J88256M97736K62651k80456
$$ plain form
17133 15340126 16320355 17366986 18648296 20150979 21712665 23179094 24477250 25578263
17125 25578263 26467384 27131876 27551145 27690376 27505184 26983114 26195378 25297285 24467201
17116 24467201 23836782 23486390 23489448 23893179 24619503 25409552 25912267 25855971 25159655 23931688
17106 23931688 22415603 20945950 19907707 19640668 20254035 21495893 22897834 24110923
17098 24110923 25088669 25947698 26684102 27042357 26667301 25387514 23366531 21029448 18843426
17089 18843426 17097687 15818200 14829608 13900560 12922257 12000196 11343521 11064402 11128220
17080 11128220 11451127 11919036 12333557 12472791 12206759 11497539 10324837 8675089 6593480
17071 6593480 4211247 1754001 -437548 -1959690 -2561873 -2373617 -1875881 -1613230 -1893686
17062a893686q30851j246121j510258j606965j498838j168426o55509k1467P50105
17053i682016J725736K811979L617740L672565K857149J544943L03793m70758
17045F381131o86908m98906k11592j35142l83806q17941j178739j255054j028564
17036A84479o73039l46837m7040L24329Q14937J339803J705302J695757J204726
17027F202417L54959n33012j113832j235237j048318q45371p75456p28873m49097
17018a71820K49402J311295K452491L352818L835376L891740L605548L082781
17010B1609631K412504J642298P75702k14638j320008k378373l091053l228290
17002A6207773k771589j890382q74777j0991N74346R19161J101131J144945J027060
$$ plain form
17062 -1893686 -2724537 -3970658 -5480916 -7087881 -8586719 -9755145 -10410654 -10432121 -9682016
17053 -9682016 -7956280 -5144301 -1526561 2146004 5003153 6548096 6851889 6381131
17045 6381131 5694223 5195317 4983725 4848583 4464777 3646836 2468097 1213043 184479
17036 184479 -488560 -835397 -882437 -558108 256829 1596632 3301934 4997691 6202417
17027 6202417 6557376 6024364 4910532 3675295 2626977 1781606 1006150 277277 -171820
17018 -171820 77582 1388877 3841368 7194186 11029562 14921302 18526850 21609631
17010 21609631 24022135 25664433 26440135 26225497 24905489 22527116 19436063 16207773
17002 16207773 13436184 11545802 10671025 10660034 11234380 12153541 13254672 14399617 15426677
16993A5426677P92908O15914O22642P38771P89217O81737M78324L14667K79945
16984B0740802L96330O28562Q22265P18154J37594q61012k015005l018899l668997
16975A3879794l869639l570690k793476j693259n45918L54908Q63417J063414
16967C688551J167269J348954J626160J883564K016016K011843J925372J802864
16959A7470593J663022J523414J311161Q21030o7513j184179k151396k631098
16951A6755034k507768j949467j294029q09199n59630m50058l44203j85332l2726
16942H622622O2130J69439L55876M85346L04972k53987j011609j758297k364903
16933D611589k703425k650602k186446j396711m02369O48290J508732J853627
$$ plain form
16993 15426677 16219585 16835499 17458141 18196912 18986129 19667866 20146190 20460857 20740802
16984 20740802 21137132 21765694 22587959 23306113 23443707 22582695 20567690 17548791 13879794
16975 13879794 10010155 6439465 3645989 1952730 1406812 1761720 2625137 3688551
16967 3688551 4855820 6204774 7830934 9714498 11730514 13742357 15667729 17470593
16959 17470593 19133615 20657029 21968190 22789220 22721707 21537528 19386132 16755034
16951 16755034 14247266 12297799 11003770 10194571 9634941 9184883 8840680 8655348 8622622
16942 8622622 8684752 8854191 9210067 9695413 10000385 9746398 8734789 6976492 4611589
16933 4611589 1908164 -742438 -2928884 -4325595 -4727964 -4079674 -2570942 -717315
16925g17315J511676O55720l33028j133139j571794j618713j386269r77822k92209
16916e862893Q11262K122506L077589L203130K478136J289677J20031p10589j092777
16907E436072j101260r52197q92254j084844j531898k032556k285247k103273
16899f547457j528055p71486o2562M95186R21214J223197J301948R98505K76976
16890c692534n96227j135821j007950l22149M50401Q16954N51962k45818j228455
16881f409637j924529k033249j701248j348721j193042j092653q36469m12737
16873a6952285m479J52053p7152o05105j128971j307052r71648j75525R09201
16864b0160963K059578L031520L637162L811657L609199L160485K608512K055658
$$ plain form
16925 -717315 794361 1450081 1117053 -16086 -1587880 -3206593 -4592862 -5570684 -5862893
16916 -5862893 -5051631 -2929125 148464 3351594 5829730 7119407 7239438 6528849 5436072
16907 5436072 4334812 3382615 2490361 1405517 -126381 -2158937 -4444184 -6547457
16899 -6547457 -8075512 -8846998 -8909560 -8414374 -7493160 -6269963 -4968015 -3969510 -3692534
16890 -3692534 -4288761 -5424582 -6432532 -6754681 -6304280 -5487326 -4935364 -5181182 -6409637
16881 -6409637 -8334166 -10367415 -12068663 -13417384 -14610426 -15703079 -16539548 -16952285
16873 -16952285 -16956764 -16804711 -16881863 -17486968 -18615939 -19922991 -20894639 -21070164 -20160963
16864 -20160963 -18101385 -15069865 -11432703 -7621046 -4011847 -851362 1757150 3812808
16856C812808J553935J099037O47303J56523m37027j194194k022182k635711k765430
16847a784938k368119j607758p35489j5411L92287N26562M83281K46490k13864
16838e076959p85291j241261j381412j168064p52209l25153J6700K58537M44700
16829a0010412O83800J070111J579586K024911K127949J757642J106752N51132
16821H91471L32734M20489O19872P19689N76485J86049l08622p33886j004137
16812A700144j145815j257923j404530j534505j580749j592318j648639j656487
16804a0120822j354162n47595O85073J998690K994881L504939L673298L714576
16796D548878L658059L375952K758130J828846P70764j90135r28963j380363j473991
$$ plain form
16856 3812808 5366743 6465780 7113083 7269606 6832579 5638385 3616203 980492 -1784938
16847 -1784938 -4153057 -5760815 -6496304 -6511715 -6119428 -5592866 -5109585 -4863095 -5076959
16838 -5076959 -5862250 -7103511 -8484923 -9652987 -10405196 -10730349 -10713649 -10455112 -10010412
16829 -10010412 -9326612 -8256501 -6676915 -4652004 -2524055 -766413 340339 891471
16821 891471 1224205 1644694 2264566 2984255 3560740 3746789 3438167 2704281 1700144
16812 1700144 554329 -703594 -2108124 -3642629 -5223378 -6815696 -8464335 -10120822
16804 -10120822 -11474984 -12022579 -11337506 -9338816 -6343935 -2838996 834302 4548878
16796 4548878 8206937 11582889 14341019 16169865 16940629 16750494 15821531 14441168 12967177
16787A2967177j241745r07106p49766q68472j075578j023894n10129L42756J195397
16778H128640J683465J544445P21200n87918j989481l075907l632624l645318
16770h53498l143832k198968j035011L0288P46378J019787R06645N20901r030
16761d016340m66419n40501m1132Q50814J639077J905478J614625J023244L91100
16752B359946j85197p43966j344362j968347k501172k816049k876234k770636
16744a2846017k664112k627651k518643k143691j500342p64987j25048L16278
16736b4874213N76008P86805J080121J449313J776529J967296K022409K001206
16728a3214526J938839J826593J698083J653628J729393J863933K027322K245708
$$ plain form
16787 12967177 11725432 10818326 10068560 9200088 8124510 7100616 6590487 6933243 8128640
16778 8128640 9812105 11356550 12077750 11489832 9500351 6424444 2791820 -853498
16770 -853498 -3997330 -6196298 -7231309 -7201021 -6454643 -5434856 -4528211 -4007310 -4016340
16761 -4016340 -4482759 -5023260 -5064392 -4213578 -2574501 -669023 945602 1968846 2359946
16752 2359946 2174749 1430783 86421 -1881926 -4383098 -7199147 -10075381 -12846017
16744 -12846017 -15510129 -18137780 -20656423 -22800114 -24300456 -25065443 -25190491 -24874213
16736 -24874213 -24298205 -23511400 -22431279 -20981966 -19205437 -17238141 -15215732 -13214526
16728 -13214526 -11275687 -9449094 -7751011 -6097383 -4367990 -2504057 -476735 1768973
16720A768973K474471K568174K438372K126342J647374R02734j68581j429227
16712A2328632k575386l296608l393398k834208j834662q28628j95047o514p6064
16703b711883j74563j80159q4902N4158J31841K8652k98387p62630j194331j418126
16693f610330j303773q17863j05586N05169P03397M21693j90942r24245j565964
16684i888444j954501k055204j921054j586485j087047n96500l67717m16474m36703
16675b0310129j25707N18715J211379J613988J592578J284661R56434Q54487J091724
16666a1311870J524372J789798J553062P67029k53378j037136j279639r81377
16658i229139l50451L56302R47620J349876J559993J536506J195150N44048k42358
$$ plain form
16720 1768973 4243444 6811618 9249990 11376332 13023706 13926440 13757859 12328632
16712 12328632 9753246 6456638 3063240 229032 -1605630 -2434258 -2629305 -2635819 -2711883
16703 -2711883 -2886446 -3066605 -3151507 -3097349 -2965508 -2936856 -3235243 -3997873 -5192204 -6610330
16693 -6610330 -7914103 -8731966 -8837552 -8332383 -7628986 -7207293 -7398235 -8322480 -9888444
16684 -9888444 -11842945 -13898149 -15819203 -17405688 -18492735 -19089235 -19456952 -19873426 -20310129
16675 -20310129 -20435836 -19917121 -18705742 -17091754 -15499176 -14214515 -13258081 -12403594 -11311870
16666 -11311870 -9787498 -7997700 -6444638 -5677609 -5930987 -6968123 -8247762 -9229139
16658 -9229139 -9579590 -9223288 -8275668 -6925792 -5365799 -3829293 -2634143 -2090095 -2332453
16649b332453r21532j332664j481064j509449j553719j636421j670778j517882
16641a3955962j135647p02007n08561p21929j213035j600788j514625q19768L45157
16632b1827165J623501K564613K829855K355835J411709M84670q0303l25693m71213
16623a1434191o16981p73014r53873j124160j225424j247655j146167q05099k30819
16614a9557383L16286N10064K19523m49924j276544k048468k609454k798603k421684
16605c0116187j394949Q6565J623033K833892L485700L568651L304184K954320
16597a3654791K580651K014197J046985l11370j724654k699132k892552k311578
16589a7952244j268816j92970N34030P11838M58721J45796R8467L94631Q95707
$$ plain form
16649 -2332453 -3253985 -4586649 -6067713 -7577162 -9130881 -10767302 -12438080 -13955962
16641 -13955962 -15091609 -15793616 -16302177 -17024106 -18237141 -19837929 -21352554 -22172322 -21827165
16632 -21827165 -20203664 -17639051 -14809196 -12453361 -11041652 -10556982 -10637285 -10962978 -11434191
16623 -11434191 -12051172 -12824186 -13778059 -14902219 -16127643 -17375298 -18521465 -19326564 -19557383
16614 -19557383 -19241097 -18731033 -18511510 -18961434 -20237978 -22286446 -24895900 -27694503 -30116187
16605 -30116187 -31511136 -31424571 -29801538 -26967646 -23481946 -19913295 -16609111 -13654791
16597 -13654791 -11074140 -9059943 -8012958 -8324328 -10048982 -12748114 -15640666 -17952244
16589 -17952244 -19221060 -19414030 -18880000 -18168162 -17709441 -17563645 -17465178 -17070547 -16174840
16580a6174840J403966J828072K175953K375339K224190J589718N73963n28712
16572d532351j383671j776237j676399j176167m01035N24128J420444J989718
16564g011570J916486J153022N6275q86179j421875j568167j402813r53450k67079
16555a0385350N04756J171731J660602J958841J928122J413876N32609l27873
16547a542686q09735q10340m16880K37373R78523J547551J649955J129534J24678
16538B087973r75211j755324j996954j737947j161755m40753L14180R81518J374411
16529c309862J329472Q72040K49094k46679n09084o43758p22324o38849k89117
16520c909067K27291O11662N78732J74960j68393o5352L90519P33003N87465o3194
$$ plain form
16580 -16174840 -14770874 -12942802 -10766849 -8391510 -6167320 -4577602 -4003639 -4532351
16572 -4532351 -5916022 -7692259 -9368658 -10544825 -10945860 -10421732 -9001288 -7011570
16564 -7011570 -5095084 -3942062 -3885787 -4771966 -6193841 -7762008 -9164821 -10118271 -10385350
16555 -10385350 -9880594 -8708863 -7048261 -5089420 -3161298 -1747422 -1214813 -1542686
16547 -1542686 -2352421 -3162761 -3579641 -3342268 -2363745 -816194 833761 1963295 2087973
16538 2087973 1112762 -642562 -2639516 -4377463 -5539218 -5979971 -5665791 -4684273 -3309862
16529 -3309862 -1980390 -1108350 -859256 -1105935 -1615019 -2258777 -2981101 -3619950 -3909067
16520 -3909067 -3681776 -3070114 -2491382 -2316422 -2484815 -2550167 -2159648 -1426645 -839180 -902374
16510i02374j009302k031769k930516l462121l366241k490938r27030R74873K751044
16501a3394374M028674M651419M633019M012011K835939J261923m27802j910198
16493E690611k931695l400861l412802l170468k876383k643884k453879k231476
16485a7430837j950708j609222j149516m99845L08485J113587J715057J981655
16477a7521344J901581J609175J391153J541601K080762K696028L038743L005945
16469b56356K726168K354598J949069J503806R88677L52411m89883j640118l001984
16460D486388m041580m104404l145890j829785q39576l83653k95551l40000l87304
16451a0881355l72792k11351J38038N93951J018406J299246J335553J037363M03580
$$ plain form
16510 -902374 -1911676 -3943445 -6873961 -10336082 -13702323 -16193261 -17120291 -16145418 -13394374
16501 -13394374 -9365700 -4714281 -81262 3930749 6766688 8028611 7600809 5690611
16493 5690611 2758916 -641945 -4054747 -7225215 -10101598 -12745482 -15199361 -17430837
16485 -17430837 -19381545 -20990767 -22140283 -22640128 -22331643 -21218056 -19502999 -17521344
16477 -17521344 -15619763 -14010588 -12619435 -11077834 -8997072 -6301044 -3262301 -256356
16469 -256356 2469812 4824410 6773479 8277285 9265962 9618373 9128490 7488372 4486388
16460 4486388 444808 -3659596 -6805486 -8635271 -9474847 -9858500 -10154051 -10494051 -10881355
16451 -10881355 -11254147 -11465498 -11327460 -10733509 -9715103 -8415857 -7080304 -6042941 -5639361
16442e639361m62610j424946k297312k804754k764919k299528j689868j067761
16434b0451059m21532J44933L69607Q9613n75824j313451j827892k027420k069021
16425b8082046k190589k474948k762640k799625k482917j935217j344152p64519
16417d4836653j44895M50566P87437O86839K28007k88733n60577n27863m47603
16408d4653475o40131j068801j259784p27397N79723K229484L584980M154426
16400c7800975L836476K916016J801162P52531j65763r61468j611770k032631
16392c3266422k023186j303116K17524K238938M278824O058230P543214Q526393
16384g729601Q367027O529253L338984j43545k912165m480184m859650m371486
$$ plain form
16442 -5639361 -6101971 -7526917 -9824229 -12628983 -15393902 -17693430 -19383298 -20451059
16434 -20451059 -20872591 -20727658 -20358051 -20268438 -20844262 -22157713 -23985605 -26013025 -28082046
16425 -28082046 -30272635 -32747583 -35510223 -38309848 -40792765 -42727982 -44072134 -44836653
16417 -44836653 -44981548 -44530982 -43743545 -43056706 -42828699 -43117432 -43678009 -44205872 -44653475
16408 -44653475 -45293606 -46362407 -47622191 -48349588 -47769865 -45540381 -41955401 -37800975
16400 -37800975 -33964499 -31048483 -29247321 -28494790 -28660553 -29622021 -31233791 -33266422
16392 -33266422 -35289608 -36592724 -36375200 -34136262 -29857438 -23799208 -16255994 -7729601
16384 -7729601 637426 7166679 10505663 10362118 7449953 2969769 -1889881 -6261367
16376f261367l429420k405895j575374j060262q36418p98352p84979o38739l40091
16367a8130897k7070J51554J63105P5282j9320l2654J22076M91689J002930J479780
16357a4723525J798164J999118K218266K511638K774637K855219K732500K554646
16349D720663K483008K529429K598009K590097K391926J860085Q94977m62842
16341A9605352j963509l148759l512881k836241j402738J84767J401720J999046
16333A0326757J937669J306251L15978p04167j407727j613975j419956j095427
16325G645403q45918p62615r40557j441495k144198k740154k896126k481974j686047
16316h293681q35003j22378M70431J102365J935193L017129M250727N356695N879815
$$ plain form
16376 -6261367 -9690787 -12096682 -13672056 -14732318 -15568736 -16367088 -17152067 -17790806 -18130897
16367 -18130897 -18157967 -18006413 -17843308 -17768026 -17787346 -17820000 -17697924 -17206235 -16203305 -14723525
16357 -14723525 -12925361 -10926243 -8707977 -6196339 -3421702 -566483 2166017 4720663
16349 4720663 7203671 9733100 12331109 14921206 17313132 19173217 20068194 19605352
16341 19605352 17641843 14493084 10980203 8143962 6741224 6925991 8327711 10326757
16333 10326757 12264426 13570677 13886655 13182488 11774761 10160786 8740830 7645403
16325 7645403 6799485 6036870 5096313 3654818 1510620 -1229534 -4125660 -6607634 -8293681
16316 -8293681 -9128684 -9251062 -8780631 -7678266 -5743073 -2725944 1524783 6881478 12761293
16307A2761293N474938M289221K844407J567883O04933r3788o54723j155235j571692
16298B4067237j855728j947416j751460j266473o87967k88079k03822l35191m72585
16289A5258516n45337o73051r86440j497433k105367k641023k903720k734922
16281A171223k163800j452013q90034n89965n18637o08510p76266r38680j039395
16272g806077j037113r33394p91853o38167l77379J19087Q78701J815834K787569
16263e982792L627629M176091M334903M127484L664203L019025K168311J031961
16255B0166815m43732k185651l941634n306271n816656n231068l842171k341994
16247h942362j319673r36529r50351r42109n97222Q6419Q13675J265146J377071
$$ plain form
16307 12761293 18236231 22525452 25369859 26937742 27542675 27448887 26794164 25638929 24067237
16298 24067237 22211509 20264093 18512633 17246160 16558193 16270114 16066292 15731101 15258516
16289 15258516 14713179 14040128 13053688 11556255 9450888 6809865 3906145 1171223
16281 1171223 -992577 -2444590 -3334624 -3924589 -4443226 -5051736 -5828002 -6766682 -7806077
16272 -7806077 -8843190 -9776584 -10568437 -11206604 -11583983 -11464896 -10586195 -8770361 -5982792
16263 -5982792 -2355163 1820928 6155831 10283315 13947518 16966543 19134854 20166815
16255 20166815 19723083 17537432 13595798 8289527 2472871 -2758197 -6600368 -8942362
16247 -8942362 -10262035 -11198564 -12148915 -13091024 -13688246 -13601827 -12788152 -11523006 -10145935
16238a0145935J322991J266780J201984R62830L10883q82311k402983l666523
16230a2032284m033851l274268j724474J0711J464497K494847L201547L714497
16222a0178778M092018M375000M601268M730051M635736M240235L611801K867220
16214B2974551K023979J034689l6212r53757j495165j672381j766328k134156
16206A7975220k954551m122139n314595o163661o462300o262345n780107n217471
16198b4301949m660749m077991l355665k373781j100704L37342J623928K344536
16190c5565033K279612J626279Q01955P7474m91128q91918j052650q62575k66428
16181c4344412O56220J737174K842027L904142M875172N717792O367048O673714
$$ plain form
16238 -10145935 -8822944 -7556164 -6354180 -5391350 -5080467 -5962778 -8365761 -12032284
16230 -12032284 -16066135 -19340403 -21064877 -21054166 -19589669 -17094822 -13893275 -10178778
16222 -10178778 -6086760 -1711760 2889508 7619559 12255295 16495530 20107331 22974551
16214 22974551 24998530 26033219 25997007 25043250 23548085 21875704 20109376 17975220
16206 17975220 15020669 10898530 5583935 -579726 -7042026 -13304371 -19084478 -24301949
16198 -24301949 -28962698 -33040689 -36396354 -38770135 -39870839 -39533497 -37909569 -35565033
16190 -35565033 -33285421 -31659142 -30857187 -30779713 -31270841 -32162759 -33215409 -34077984 -34344412
16181 -34344412 -33688192 -31951018 -29108991 -25204849 -20329677 -14611885 -8244837 -1571123
16173a571123O499913N853033M887969L817595K805955J863140Q28313m60505
16165B4524290j943455l282658m038352l945086l052980j686179l07493O96545
16157F964632J180038J238984J124534J065999J070143R68960P10011M76916M60463
16148A5260680O32146Q37118R97695J117301J207401J298502J410021J465875
16140B4226739J347886J060209P43017M90435J91333m05414j409257k610915l626544
16131B0007489m161208m149011l726524l133096k597307k193330j781494j167236
16123b901717l40729M43812Q44071P25685K84557r3133n9881N08421J459432K497241
16113C367759L370831L936767M080032L693467K814561J704752P03340L4108k27071
$$ plain form
16173 -1571123 4928790 10781823 15669792 19487387 22293342 24156482 24984795 24524290
16165 24524290 22580835 19298177 15259825 11314739 8261759 6575580 6268087 6964632
16157 6964632 8144670 9383654 10508188 11574187 12644330 13613290 14323301 14800217 15260680
16148 15260680 15892826 16729944 17727639 18844940 20052341 21350843 22760864 24226739
16140 24226739 25574625 26634834 27377851 27868286 28059619 27654205 26244948 23634033 20007489
16131 20007489 15846281 11697270 7970746 4837650 2240343 47013 -1734481 -2901717
16123 -2901717 -3242446 -2798634 -1954563 -1228878 -944321 -1037454 -1097335 -588914 870518 3367759
16113 3367759 6738590 10675357 14755389 18448856 21263417 22968169 23671509 23705617 23478546
16104B3478546r5899L22056P95229J037572Q94545M21597j89948p11715r71222
16095B4980761r06298n69248j18876K43174L96052L61100K53084K02412K85089
16086B5127250M43001N21526M65603M00447M41716N47091O29614O37495M75892
16077B9689635M7337n99902j273797j760435j938597j844663j618984j384619
16069A9315975j202563j099959j078280j117276j197773j317933j494483j702129
16061I105579j803968j617898j108024m74668J3408K44130L02559L38512L82639
16052E382269L05622K6375l15887m66961k44675L44356J074943J641671J859545
16043I607258J711649J276892O32103k12825j227716k250312l063356l543771
$$ plain form
16104 23478546 23382647 23704703 24499932 25537504 26432049 26853646 26663698 25951983 24980761
16095 24980761 24074463 23505215 23386339 23629513 24025565 24386665 24639749 24842161 25127250
16086 25127250 25570251 26091777 26557380 26957827 27399543 27946634 28576248 29213743 29689635
16077 29689635 29736972 29137070 27863273 26102838 24164241 22319578 20700594 19315975
16069 19315975 18113412 17013453 15935173 14817897 13620124 12302191 10807708 9105579
16061 9105579 7301611 5683713 4575689 4101021 4114429 4358559 4661118 4999630 5382269
16052 5382269 5687891 5714266 5398379 4931418 4686743 5031099 6106042 7747713 9607258
16043 9607258 11318907 12595799 13227902 13015077 11787361 9537049 6473693 2929922
16035B929922l684620l477923k842236j769751m72125P44625J690500K337847
16027d543761K724866K880598K860564K802381K867816L061325L158528K934143
16019A8746460K430751J905889J566790J421949J270995Q04270j77825j630811
16011B6338468l295870m790796n743492n925970n333796m209975k958737j922919
16003g843087j188635o25195o9163N82563J285830J771661J757388J302775Q40152
15994b185711Q07930J314542K145897K984721L602484L900659L832159L334495
15986A9737176K367421J037454l63547j505959k232082k617690k819551k883067
15978A0720155k729408k315272j732565j135021o15484j62575K93834P95275J286834
$$ plain form
16035 2929922 -754698 -4232621 -7074857 -8844608 -9316733 -8572108 -6881608 -4543761
16027 -4543761 -1818895 1061703 3922267 6724648 9592464 12653789 15812317 18746460
16019 18746460 21177211 23083100 24649890 26071839 27342834 28147104 27969279 26338468
16011 26338468 23042598 18251802 12508310 6582340 1248544 -2961431 -5920168 -7843087
16003 -7843087 -9031722 -9656917 -9726080 -9143517 -7857687 -6086026 -4328638 -3025863 -2185711
15994 -2185711 -1377781 -63239 2082658 5067379 8669863 12570522 16402681 19737176
15986 19737176 22104597 23142051 22778504 21272545 19040463 16422773 13603222 10720155
15978 10720155 7990747 5675475 3942910 2807889 2192405 2029830 2323664 3118939 4405773
15969D405773J652421J818847J789797J615658J373204J175348J132669J225330
15961A6189047J301390J273789J185744J061857Q37244M33534j49154p91853j311403
15952B0030195j573147j560145j344964r94900n13031J21110Q35102J381326J461394
15943A7842940J030582L90443j33931m75508p31636r72190j172156j247595j146847
15934A3384102q63873l74256L39599J212348K048783K533566K421991J774121
15926B2476381Q98903P9384n74782j080794j492068j820941j984726j846154j352933
15917A3302270o78632j88811j59293n17309r12266j037432q65644n86678l40245
15908H015960o3111L63563Q80799J277001J430486J428899J424914J431265J317294
$$ plain form
15969 4405773 6058194 7877041 9666838 11282496 12655700 13831048 14963717 16189047
15961 16189047 17490437 18764226 19949970 21011827 21849071 22282605 22133451 21341598 20030195
15952 20030195 18457048 16896903 15551939 14557039 14044008 14165118 15000220 16381546 17842940
15943 17842940 18873522 19263965 19130034 18654526 17922890 16950700 15778544 14530949 13384102
15934 13384102 12520229 12145973 12485572 13697920 15746703 18280269 20702260 22476381
15926 22476381 23375284 23454668 22879886 21799092 20307024 18486083 16501357 14655203 13302270
15917 13302270 12623638 12434827 12275534 11758225 10845959 9808527 8942883 8356205 8015960
15908 8015960 7952849 8316412 9197211 10474212 11904698 13333597 14758511 16189776 17507070
15899A7507070R81040M73879k2851l54182n58804q37526j345022k047378k760666
15890A1035560l305178l588803l549293l118668k313263j285547k29561O78103
15882e676650J226532J200876N60046m44179j390745j983688k226854k351218
15874a1085880k580883k890983l045897k898601k497373j932007j234050l91432
15866b8557106O19519J804357L104081M398631N578709O539157P086873O936528
15858G510749N891914M111917K162465O92256K237p7890P3556K19491L74421O13301
15848B1574417Q20632P18679J29552q66215j992809k965526l608096l784170l365852
15839F660612k406523j248548l03299K70056N84967P86741R09317R30266Q65963
$$ plain form
15899 17507070 18488110 18961989 18939138 18584956 18026152 17188626 15843604 13796226 11035560
15890 11035560 7730382 4141579 592286 -2526382 -4839645 -6125192 -6354753 -5676650
15882 -5676650 -4450118 -3249242 -2689196 -3133375 -4524120 -6507808 -8734662 -11085880
15874 -11085880 -13666763 -16557746 -19603643 -22502244 -24999617 -26931624 -28165674 -28557106
15866 -28557106 -27937587 -26133230 -23029149 -18630518 -13051809 -6512652 574221 7510749
15858 7510749 13402663 17514580 19677045 20369301 20371538 20293648 20367204 20586695 20961116 21574417
15848 21574417 22395049 23113728 23243280 22377065 20384256 17418730 13810634 10026464 6660612
15839 6660612 4254089 3005541 2702242 2972298 3557265 4344006 5253323 6183589 7049552
15830G049552Q03924Q21885Q66645P85160M86415j634n93367j187240j719872
15821G311468k204298k637700k926903k984575k797815k359015j688988r80687
15813a1268513n92002p84062j426278k036041k174235j770887j097122n06066
15805b1655206j79260p1365q8628k25058m79194p17015o86612k27274N29516J222947
15795b2577149J515101J271754O15114j23040n83124n87808j99434L83274R71109
15786a9314203J447042J753543J883006J851809J666350J365830J092109J026308
15778g228206J239544J646222K039676K113702J634745P04401k78337r20377j044178
15769i2808p28549k59548Q3992K96693O33615J269524J986221K304197J961011
$$ plain form
15830 7049552 7853476 8675361 9542006 10327166 10813581 10811947 10218580 9031340 7311468
15821 7311468 5107170 2469470 -457433 -3442008 -6239823 -8598838 -10287826 -11268513
15813 -11268513 -11860515 -12644577 -14070855 -16106896 -18281131 -20052018 -21149140 -21655206
15805 -21655206 -21834466 -21905831 -21994459 -22219517 -22698711 -23415726 -24102338 -24329612 -23800096 -22577149
15795 -22577149 -21062048 -19790294 -19175180 -19298220 -19881344 -20469152 -20668586 -20285312 -19314203
15786 -19314203 -17867161 -16113618 -14230612 -12378803 -10712453 -9346623 -8254514 -7228206
15778 -7228206 -5988662 -4342440 -2302764 -189062 1445683 2150084 1871747 951370 -92808
15769 -92808 -821357 -1080905 -996913 -700220 -66605 1202919 3189140 5493337 7454348
15760G454348J149962K70386l93929p42134q18476p37470n65444l12263k8982
15751E275998J75557K60012L51983O01691Q96392R06772N25219M5172j82865p7687
15741H778244J91028M19576N97668R02857J418490J958146K227537K066991J518480
15732B0079017P67438N2965m14125m93481j45076M98413J105143J344700J156630
15723B3951624P15696J98176k86644o16128o75078m72349j65434K9719m8427m23635
15713B2207520r88860j629294k306587k990025l575101l921677l936812l587537
15705g28373k880653j891260p67281L58840J428746K400600L175335L610847L632257
15696H339058L324403K860974K332697J690204Q50528j93856j361456k508579
$$ plain form
15760 7454348 8604310 8874696 8480767 7738633 6920157 6182687 5617243 5304980 5275998
15751 5275998 5451555 5711567 6063550 6665241 7561633 8468405 8993624 9038796 8855931 8778244
15741 8778244 8969272 9388848 9986516 10889373 12307863 14266009 16493546 18560537 20079017
15732 20079017 20846455 20899420 20485295 19991814 19846738 20345151 21450294 22794994 23951624
15723 23951624 24667320 24865496 24578852 23962724 23287646 22815297 22649863 22679582 22631155 22207520
15713 22207520 21218660 19589366 17282779 14292754 10717653 6795976 2859164 -728373
15705 -728373 -3609026 -5500286 -6267567 -5908727 -4479981 -2079381 1095954 4706801 8339058
15696 8339058 11663461 14524435 16857132 18547336 19397864 19204008 17842552 15333973
15688A5333973l454187m034931m181745l936916l406896k754116k210691j992212
15680a0637721k108951k291722k193785j656750p58107L20210J378400K204896
15672a5743530K624930K602342K270989J828098J417695J119898R79940J010572
15664a889066J193639J510747J932405K326877K437092K014101J020803k77291
15656A0269307j459722k193961k377775k104081j500323o80861J40878O49032
15648G42494N95476l0780r45733j709169j974182j627934p98860J94176R33601
15639d620911J039647L54423r40105k431005l693898m403280m397181l805667
15631b2897977l007834k284040j596093q20609p8481L01467J69717j56253j07949
$$ plain form
15688 15333973 11879786 7844855 3663110 -273806 -3680702 -6434818 -8645509 -10637721
15680 -10637721 -12746672 -15038394 -17232179 -18888929 -19647036 -19326826 -17948426 -15743530
15672 -15743530 -13118600 -10516258 -8245269 -6417171 -4999476 -3879578 -2899638 -1889066
15664 -1889066 -695427 815320 2747725 5074602 7511694 9525795 10546598 10269307
15656 10269307 8809585 6615624 4237849 2133768 633445 -47416 93462 742494
15648 742494 1337970 1307190 361457 -1347712 -3321894 -4949828 -5748688 -5554512 -4620911
15639 -4620911 -3581264 -3226841 -4166946 -6597951 -10291849 -14695129 -19092310 -22897977
15631 -22897977 -25905811 -28189851 -29785944 -30606553 -30685034 -30383567 -30213850 -30370103 -30478052
15622c0478052O35259J917519L270726M247794M693546M746861M592364M298798
15614b075185L884395L382258K827640K231433J539985O61177l88927j407876
15606A0654900k126915k341735j976235j175384k82737M16531Q99864J281506
15598E349795J556439J575835J251543O88878R8295l47104n49251m93834k87418
15589H843178j33160j95574m71083p66034q07363m59479J82033Q84011J343925
15580H420454J307061Q22451K72461J7235J02161L50330N93788P24788O74126
15571A3284855M54596J40101j95836m91981p20754r08999j087390j244006j418230
15562G812356j765998k378620l100946l601321l598613l086762k355298j740509
$$ plain form
15622 -30478052 -29842793 -27925274 -24654548 -20406754 -15713208 -10966347 -6373983 -2075185
15614 -2075185 1809210 5191468 8019108 10250541 11790526 12451703 12062776 10654900
15606 10654900 8527985 6186250 4210015 3034631 2751894 3168425 4068289 5349795
15598 5349795 6906234 8482069 9733612 10422490 10520785 10173681 9624430 9130596 8843178
15589 8843178 8710018 8514444 8043361 7277327 6469964 6010485 6192518 7076529 8420454
15580 8420454 9727515 10549966 10822427 10839662 10941823 11292153 11885941 12610729 13284855
15571 13284855 13739451 13879552 13683716 13191735 12470981 11561982 10474592 9230586 7812356
15562 7812356 6046358 3667738 566792 -3034529 -6633142 -9719904 -12075202 -13815711
15554a3815711j381868j239281j267895j462635j755995j969276j895789j446102
15546b6234552p26901K3557O11179J041620J476871J998749K462815K664737K585828
15537a4096097K355111K041106J602297R88866J93769p46761j658288k186660
15529a1506657k073739j460580p48333k08578J30824L38689N33611Q96659J556876
15520a2541228K482484L482689M244342M450451M006875L128552K158544J324865
15512A2737574O55238Q9507l77224p38574j095408j570970k119901k554205k761236
15503B264801k737856k421703j709967o64287M38033J269547J639734J530422
15495c91276J001965J34235r26818j931176k594352k720235k288248j433027l36814
$$ plain form
15554 -13815711 -15197579 -16436860 -17704755 -19167390 -20923385 -22892661 -24788450 -26234552
15546 -26234552 -26961453 -26937896 -26326717 -25285097 -23808226 -21809477 -19346662 -16681925 -14096097
15537 -14096097 -11740986 -9699880 -8097583 -7108717 -6914948 -7661709 -9319997 -11506657
15529 -11506657 -13580396 -15040976 -15789309 -15997887 -15867063 -15528374 -14994763 -14098104 -12541228
15520 -12541228 -10058744 -6576055 -2331713 2118738 6125613 9254165 11412709 12737574
15512 12737574 13392812 13482319 13105095 12366521 11271113 9700143 7580242 5026037 2264801
15503 2264801 -473055 -2894758 -4604725 -5269012 -4830979 -3561432 -1921698 -391276
15495 -391276 610689 744924 -181894 -2113070 -4707422 -7427657 -9715905 -11148932 -11485746
15486a1485746Q09249J754338K255205K262381J931898J444978R07162M10061
15478B89526R8962Q5997L64038Q60339J456442J983031K311549K425428K366406
15469A2241718K147096J782331J393275J138278R80590O46628p4660j085295k097274
15460A7072687k855838l238486l271599l059356k680670k183367j655429j241913
15452c113971j053966j077638j149710j013573n28332J56031P32877J003071R33210
15443e112001N69747M567o22262j134187j369821j246493p54897P3451J130095
15434h461801K184201K978518L377630L356372K925944K169058J301964O03587
15426A0435473K35451J42428J42482Q7649r2862m62474j022367j565710j809451
$$ plain form
15486 -11485746 -10676497 -8922159 -6666954 -4404573 -2472675 -1027697 -120535 289526
15478 289526 388488 474485 838523 1698862 3155304 5138335 7449884 9875312 12241718
15469 12241718 14388814 16171145 17564420 18702698 19683288 20329916 20255256 19169961 17072687
15460 17072687 14216849 10978363 7706764 4647408 1966738 -216629 -1872058 -3113971
15452 -3113971 -4167937 -5245575 -6395285 -7408858 -7937190 -7781159 -7048282 -6045211 -5112001
15443 -5112001 -4542254 -4537687 -5159949 -6294136 -7663957 -8910450 -9665347 -9591896 -8461801
15434 -8461801 -6277600 -3299082 78548 3434920 6360864 8529922 9831886 10435473
15426 10435473 10670924 10813352 10955834 11043483 10950621 10488147 9465780 7900070 6090619
15417F090619j710583j487006j312952j130827q19022m39173k06766k55686n44716
15408a816112r55377j339579j534162j460395j152511o70110o6792N64322J078309
15399g352407J368378J461995J476417J512647J588465J628604J545060J303431
15391D532590Q86976K66950n22488j306996j809731j804994j288803n06201K16392
15382a336305O91398Q89414P93740L90919j98115o88863p79614l77810K93568
15373c21668Q43742R85484O77477N2716o97176j352139j701005j655526j310434
15364d478529q48650l75176J49360Q05423J588026K381512K995704L231903K978079
15355H427652K275617J287449K36656o08655j037810j066499q80427o08149k69160
$$ plain form
15417 6090619 4380036 2893030 1580078 449251 -369771 -808944 -1015710 -1271396 -1816112
15408 -1816112 -2771489 -4111068 -5645230 -7105625 -8258136 -8928246 -8995038 -8430716 -7352407
15399 -7352407 -5984029 -4522034 -3045617 -1532970 55495 1684099 3229159 4532590
15391 4532590 5419566 5686516 5164028 3857032 2047301 242307 -1046496 -1552697 -1336305
15382 -1336305 -644907 244507 1038247 1429166 1231051 542188 -237426 -615236 -321668
15373 -321668 522074 1507558 2185035 2237751 1540575 188436 -1512569 -3168095 -4478529
15364 -4478529 -5327179 -5702355 -5552995 -4747572 -3159546 -778034 2217670 5449573 8427652
15355 8427652 10703269 11990718 12227374 11618719 10580909 9514410 8633983 8025834 7756674
15346G756674J05725M34564O58624P66330P20430M28203j50190q47863j316348
15337H556149j298571q45975k16872L47080P18794R01792R88633J021237R02323
15328A1074590N54878J60651Q2593N29492J397401K393442L210213L608910L458685
15319B6470855K812717J968728J328748J082970J059710R20705M62324k77627
15311C5829130j132767j940291k534198k733040k471757j892096j251940p99220
15303B1073821p03154r69105j381263j625792j482817q82046J02896J231868K165997
15294A7530405K638397K559591K010991J239667O24738M47392O29300Q01897O09098
15285B9091476j08152j316764k829769m282388n171242n066416l877681j956694
$$ plain form
15346 7756674 7862399 8296963 8955587 9721917 10442347 10870550 10720360 9872497 8556149
15337 8556149 7257578 6411603 6194731 6541811 7260605 8162397 9151030 10172267 11074590
15328 11074590 11629468 11790119 11872712 12402204 13799605 16193047 19403260 23012170 26470855
15319 26470855 29283572 31252300 32581048 33664018 34723728 35644433 36106757 35829130
15311 35829130 34696363 32756072 30221874 27488834 25017077 23124981 21873041 21073821
15303 21073821 20370667 19401562 18020299 16394507 14911690 14029644 14132540 15364408 17530405
15294 17530405 20168802 22728393 24739384 25979051 26603789 27051181 27680481 28482378 29091476
15285 29091476 28983324 27666560 24836791 20554403 15383161 10316745 6439064 4482370
15277D482370O1368J578171K288573K209113J582454P76685J48022j20595r1618
15268A2914543N4931J89725K41616J87412Q8457N4963J90110N52963J100265J686646
15258A7261631K090494K024707J293643J4076j412788k543011l094132l004558
15250A2630062k373607j369579j88179R77127K001167K816323L341981L477968
15242B1313263L129177K266831J012496m02922j733283k705626l047705k665254
15234A7166977j768987p68794m9448J68478j22906p26118j348943j743816j747354
15225I059089j310854n86363J34734O54715R78748J227839J526883J926115K355990
15216A5966896K655830K691763K460465K069992J654890J317412J104654J006439
$$ plain form
15277 4482370 4543738 6121909 8410482 10619595 12202049 12978734 13126756 13006161 12914543
15268 12914543 12969474 13159199 13400815 13588227 13676684 13731647 13921757 14474720 15574985 17261631
15258 17261631 19352125 21376832 22670475 22684551 21271763 18728752 15634620 12630062
15250 12630062 10256455 8886876 8698697 9675824 11676991 14493314 17835295 21313263
15242 21313263 24442440 26709271 27721767 27318845 25585562 22879936 19832231 17166977
15234 17166977 15397990 14629196 14579748 14748226 14625320 13899202 12550259 10806443 9059089
15225 9059089 7748235 7161872 7296606 7951321 8930069 10157908 11684791 13610906 15966896
15216 15966896 18622726 21314489 23774954 25844946 27499836 28817248 29921902 30928341
15208C0928341R49649P97977M40893p4169n48925p85355p46434n78512m63043
15199B9920422m62188n09950n12867l89009m0617N80863J351851J989791K247310
15190C4175606K110352J785742J499012J350768J346057J432349J480800J328639
15182D6509325Q56689j552j240495k695635m042319m927411n114317m574048l497896
15173B1272341k204221r85885l7908M86491M54481j32026j046802j928505k456983
15164A3420983k466082j997898j278222n59500N3725N97107J070659J360918J365025
15155A1566715J151328R62455R72970J080508J036822O93103J08221m69888p62901
15146A6339333o25743q6181O63933J372986J929962K387722K729025K758209K343243
$$ plain form
15208 30928341 31877990 32675967 33116860 33042691 32493766 31708411 30961977 30383465 29920422
15199 29920422 29458234 28948284 28435417 28046408 28005791 28586654 29938505 31928296 34175606
15190 34175606 36285958 38071700 39570712 40921480 42267537 43699886 45180686 46509325
15182 46509325 47366014 47364462 46123967 43428332 39386013 34458602 29344285 24770237 21272341
15173 21272341 19068120 18082235 18044327 18530818 18985299 18853273 17806471 15877966 13420983
15164 13420983 10954901 8957003 7678781 7119281 7173006 7770113 8840772 10201690 11566715
15155 11566715 12718043 13680498 14653468 15733976 16770798 17463901 17572122 17102234 16339333
15146 16339333 15713590 15627409 16291342 17664328 19594290 21982012 24711037 27469246 29812489
15137B9812489J613785Q36467K24423j31476k23336m8463L67966Q52914J076681
15128C4381450P44069j98636j519501k793277l572804l588415k801283j324508
15120A9327095N39387K236925L178063L134042K397395J528269R90041R34310
15112C4265527J170152J356158J269393R11078M72642K21969K68166M27562M41604
15103D0804251K66569N1395p7133j02487l8755J25128L80749P18334J218155J964487
15093D5310693K808165L380524L396749K842280J928911R43488N0401p46257j414747
15084E8500207j787542j695354j166291m37322K38302P23431R62008R60945Q04554
15075E7102938N67776K69362m5262k57197k31361J01042P07596J466321K179421
$$ plain form
15137 29812489 31426274 32262741 32487164 32355688 32132352 32083889 32451855 33304769 34381450
15128 34381450 35125519 34926883 33407382 30614105 27041301 23452886 20651603 19327095
15120 19327095 19866482 22103407 25281470 28415512 30812907 32341176 33331217 34265527
15112 34265527 35435679 36791837 38061230 38972308 39444950 39666919 39935085 40362647 40804251
15103 40804251 41070820 41122215 41045082 40942595 40903840 41028968 41409717 42128051 43346206 45310693
15093 45310693 48118858 51499382 54896131 57738411 59667322 60610810 60661211 59914954 58500207
15084 58500207 56712665 55017311 53851020 53413698 53652000 54375431 55337439 56298384 57102938
15075 57102938 57670714 57940076 57894814 57637617 57406256 57507298 58214894 59681215 61860636
15066F1860636K626774K642771K139023J135741j80956j489228k468565k891926
15058F3374270k603068j555730L1509J672739K885086L465661L535891L406693
15050G4213051L340415L314816L090811K550053J828379J135685O19731L45168
15042I0438109K35739J29367j3251m0539K05499O92810J269795J887411K587229
15033I7392169L307179L875648M202116M382195M587820M887007N171537N235895
15025A33041566M964047M451331L924362L571550L437045L428882L435342L403760
15017A63657885L311409L191588L163987L314575L553909L618032L272875K567687
15009A89651947J810059J253145Q89792N85560L34758K98669N89261J125510J772700
$$ plain form
15066 61860636 64487410 67130181 69269204 70404945 70223989 68734761 66266196 63374270
15058 63374270 60771202 59215472 59246981 60919720 63804806 67270467 70806358 74213051
15050 74213051 77553466 80868282 83959093 86509146 88337525 89473210 90092941 90438109
15042 90438109 90673848 90803215 90789964 90749425 90954924 91647734 92917529 94804940 97392169
15033 97392169 100699348 104574996 108777112 113159307 117747127 122634134 127805671 133041566
15025 133041566 138005613 142456944 146381306 149952856 153389901 156818783 160254125 163657885
15017 163657885 166969294 170160882 173324869 176639444 180193353 183811385 187084260 189651947
15009 189651947 191462006 192715151 193604943 194190503 194525261 194823930 195413191 196538701 198311401
15000A98311401K543600L594179N050402O852257Q778192J0623770J2343005J4061126
14992B62157932J5986023J8265748K0887363K3732441K6726181K9834132L2843228
14985D30433048L5114210L5453432L2305202K4474113J2167996k441484j5995898
14978E51510619k5681578l0412167l0766671k8212535k4249360j9892709j5641981
14971C76653618j1633478p756937l854583N1853L750126P071693J0129621J3260432
14963C87672345J6650739K0000094K2454149K2775993J9768572J2897576K876804
14956E05096272q200003j7609110k3298195k4703521k2559289j8134222j2577703
14949C78014229o668698q84130M417531Q812254J1651832J2046494R136297K676184
$$ plain form
15000 198311401 200855001 204449180 209499582 216351839 225130031 235753801 248096806 262157932
14992 262157932 278143955 296409703 317297066 341029507 367755688 397589820 430433048
14985 430433048 465547258 501000690 533305892 557780005 569948001 567506517 551510619
14978 551510619 525829041 495416874 464650203 436437668 412188308 392295599 376653618
14971 376653618 365020140 357263203 353408620 353460473 357210599 364282292 374411913 387672345
14963 387672345 404323084 424323178 446777327 469553320 489321892 502219468 505096272
14956 505096272 496896269 479287159 455988964 431285443 408726154 390591932 378014229
14949 378014229 371345531 370461401 374878932 383691186 395343018 407389512 416525809 419201993
14941D19201993o383697j5986731k3947026k9022772l1176459l1069295k9438416
14934B52177597k6798040k3486228j9815104j6141002j2864425j0281681q360139
14927A34430978o788377n265860l685432k111155o09411Q82421K426570L930946
14919A23210680N279336O471685P535332Q397216Q846773Q554956P168717M557859
14911A80022554J104162k320790m805749n879970n570895m144670j937906O67682
14903A57134418L312409N761835P993788J0259350J2957607J6316339K0179762
14896B33915508K4051687K7252094K9041253K8707288K5721042J9864900J1190795
14889C99744567J77261j1792356k2464146k9754217l2894618l2599484l0304768
$$ plain form
14941 419201993 412818296 396831565 372884539 343861767 312685308 281616013 252177597
14934 252177597 225379557 201893329 182078225 165937223 153072798 142791117 134430978
14927 134430978 127642601 122376741 118691309 116580154 115970743 116853164 119279734 123210680
14919 123210680 128490016 134961701 142497033 150894249 159741022 168295978 175464695 180022554
14911 180022554 181126716 178805926 174000177 168120207 162549312 158404642 156466736 157134418
14903 157134418 160446827 166208662 174202450 184461800 197419407 213735746 233915508
14896 233915508 257967195 285219289 314260542 342967830 368688872 388553772 399744567
14889 399744567 399921828 388129472 365665326 335911109 303016491 270417007 240112239
14882B40112239k7312316k4373690k1668056j9059946j6453642j3900605j1494948
14875A05849036r317556p440943n928950m814687m075459l641493l448739l486296
14867F3694913l732466m001187l953559l361139k294254j009883K63414J397506
14859D7003345K273936K709740K547420J794049O47003o12364j755707k647468
14851E1959954l207794l396128l239911k847189k349010j847104j403672j030482
14843C2638664o90665k99435K43989R47368J665359K205074K462944K458340K311121
14834D3942759K150629J957257J550943P97546k52984j452846k633502l547895
14826D2511907l898180l507548k496426j314112m83878k71159o28556j346802
$$ plain form
14882 240112239 212799923 188426233 166758177 147698231 131244589 117343984 105849036
14875 105849036 96531480 89090537 83161587 78346900 74271441 70629948 67181209 63694913
14867 63694913 59962447 55961260 52007701 48646562 46352308 45342425 45605839 47003345
14859 47003345 49277281 51987021 54534441 56328490 56975493 56363129 54607422 51959954
14851 51959954 48752160 45356032 42116121 39268932 36919922 35072818 33669146 32638664
14843 32638664 31947999 31648564 31892553 32839921 34505280 36710354 39173298 41631638 43942759
14834 43942759 46093388 48050645 49601588 50399134 50146150 48693304 46059802 42511907
14826 42511907 38613727 35106179 32609753 31295641 30811763 30540604 29912048 28565246
14818B8565246k166359k842669l254306l457044l515677l312395k657346j581920
14810E777530m24044M04619P23597O84957N92212O40878Q34779J080895J307036
14801A1622459J491647J617796J606821J343348Q21788K02091l21218o40358p17986
14792A7026388n60851k48571Q7339L26981L85847K37932m5008l50909o26891q36092
14782A5396165r01216q38674q13255r13411j030545j032388q92814o44715l37978
14773G991169n1049J25601J57142J18205J16038J35975O8474j18904l53621n39860
14763G649170n80224l90834L5844O04637J207424J803290K355470K765457K926379
14754A8376613K783480K329803J595035O52333l31968j069824j282902r21389
$$ plain form
14818 28565246 26398887 23556218 20301912 16844868 13329191 10016796 7359450 5777530
14810 5777530 5353486 5758105 6481702 7166659 7758871 8399749 9234528 10315423 11622459
14801 11622459 13114106 14731902 16338723 17682071 18503859 18705950 18384732 17744374 17026388
14792 17026388 16465537 16216966 16304305 16631286 17017133 17255065 17210057 16859148 16232257 15396165
14782 15396165 14494949 13656275 12843020 11929609 10899064 9866676 8973862 8329147 7991169
14773 7991169 7940120 8065721 8222863 8341068 8457106 8593081 8661555 8542651 8189030 7649170
14763 7649170 7068946 6678112 6713956 7318593 8526017 10329307 12684777 15450234 18376613
14754 18376613 21160093 23489896 25084931 25737264 25405296 24335472 23052570 22131181
14746B2131181k27449M22415P38708O49906K93470j13288m30940o68850r33956
14737B1861197j289215j651834j872438j918510j941672k108545k363148k415145
14729F300690j987108j091309l7557Q57523J476149J818293J871295J604102J029086
14720A1841164K74299m09176q06467r34926j000361j145784j276572j114865m39798
14711D987514O73894J849882K672735K976399K895655K662765K366887J967703
14703B3053434J487111J012548N39561o0254r21611k036656l168639l947805m137660
14694A1820029l817128l250983k611593j911540j177889n81282l17731l56884
14686b205001l97611j44746M26264J097769J632447J964106K166644K272449K208816
$$ plain form
14746 22131181 21903732 22326147 23064855 23714761 24008231 23894943 23464003 22795153 21861197
14737 21861197 20571982 18920148 17047710 15129200 13187528 11078983 8715835 6300690
14729 6300690 4313582 3222273 3184716 4042239 5518388 7336681 9207976 10812078 11841164
14720 11841164 12115463 11706287 10899820 9964894 8964533 7818749 6542177 5427312 4987514
14711 4987514 5661408 7511290 10184025 13160424 16056079 18718844 21085731 23053434
14703 23053434 24540545 25553093 26092654 26032400 25110789 23074133 19905494 15957689 11820029
14694 11820029 8002901 4751918 2140325 228785 -949104 -1530386 -1848117 -2205001
14686 -2205001 -2602612 -2747358 -2321094 -1223325 409122 2373228 4539872 6812321 9021137
14677I021137J910434J480023J208749J351253J861660K409591K655563K469930
14669B4368340J940781J270760O74739L16148K81376N34062Q86214J102179J065639
14660C2440238Q63471P09121P25294Q19023Q41771P92273P62555P74570P60187
14651C9488503O45445L95149K2038m22518r04198j441815k073456k788049l488660
14642B9432439m034110m286705m119028l470389k418427j175426k4106P81799
14634A0686047J106700R78372N80988J48621j85254m13713n91968q16765j233048
14625A0259980j961429k904345l686487l944482l602690k805244j724265m79186
14617a0848148Q41859K141731L299114M159591M549911M380459L745351K856252
$$ plain form
14677 9021137 10931571 12411594 13620343 14971596 16833256 19242847 21898410 24368340
14669 24368340 26309121 27579881 28254620 28570768 28852144 29386206 30272420 31374599 32440238
14660 32440238 33303709 34012830 34738124 35557147 36398918 37191191 37953746 38728316 39488503
14651 39488503 40133948 40529097 40551135 40128617 39224419 37782604 35709148 32921099 29432439
14642 29432439 25398329 21111624 16992596 13522207 11103780 9928354 9904248 10686047
14634 10686047 11792747 12771119 13352107 13500728 13315474 12901761 12309793 11493028 10259980
14625 10259980 8298551 5394206 1707719 -2236763 -5839453 -8644697 -10368962 -10848148
14617 -10848148 -10006289 -7864558 -4565444 -405853 4144058 8524517 12269868 15126120
14609A5126120J915337J103533N81853M11682N24684Q03932J154767J500933J777449
14600B4900290J953312K021221J971516J821516J617009J380661J113570Q40712
14592C7619807O24767N47535O66902R60502J339454J715683K008130K132127K061765
14583D9676672J871611J657710J415401J089717P70188O46561P18727P53294N93633
14574E9193514L71848L42361N68644Q25408P95201L41145m14012j186418j676588
14565E9161103j759687j579193j373172j209627r37980l94123M04411J315825
14557E3627557K213335K948053L311412L225195K930349K870981L356228M329183
14549G8812293N445317O354792O907880P109632O955556O419969N608376M761938
$$ plain form
14609 15126120 17041457 18144990 18726843 19138525 19663209 20467141 21621908 23122841 24900290
14600 24900290 26853602 28874823 30846339 32667855 34284864 35665525 36779095 37619807
14592 37619807 38244574 38792109 39459011 40419513 41758967 43474650 45482780 47614907 49676672
14583 49676672 51548283 53205993 54621394 55711111 56481299 57127860 57846587 58599881 59193514
14574 59193514 59565362 59907723 60476367 61301775 62096976 62438121 62024109 60837691 59161103
14565 59161103 57401416 55822223 54449051 53239424 52301444 51907321 52311732 53627557
14557 53627557 55840892 58788945 62100357 65325552 68255901 71126882 74483110 78812293
14549 78812293 84257610 90612402 97520282 104629914 111585470 118005439 123613815 128375753
14541A28375753L971672K964884J316610j122258m032157o803593q854747r856578
14533A05959586r830644r105091q071091o903242n578802m134943k771830j712786
14525E7851157j025811o18154l85875k76318k00857L0545O31666J684721L069277
14516F0760351M539675N852224O847789P521744Q058630Q737826R747836J1031477
14508A23097552J2242993J2856314J2384239J0573792P495790L535475p23447
14501A81462708m711992q068133j0686173j2620321j3864433j4239978j3610398
14494A03661280j2115037j0131204q073721o183005m466140k867921j443914l25623
14486E8054715L89187O85853O60861M78925K77796J37034P4803M5002j9839j72186
$$ plain form
14541 128375753 132347425 135312309 136628919 135506661 131474504 124670911 115816164 105959586
14533 105959586 96128942 87023851 78952760 72049518 66470716 62335773 59563943 57851157
14525 57851157 56825346 56207192 55821317 55544999 55344142 55374687 56006353 57691074 60760351
14516 60760351 65300026 71152250 78000039 85521783 93580413 102318239 112066075 123097552
14508 123097552 135340545 148196859 160581098 171154890 178650680 182186155 181462708
14501 181462708 176750716 168682583 157996410 145376089 131511656 117271678 103661280
14494 103661280 91546243 81415039 73341318 67158313 62692173 59824252 58380338 58054715
14486 58054715 58443902 59129755 59790616 60269541 60547337 60684371 60759174 60804176 60784337 60612151
14476F0612151m54792q96675j481708k114273k602278k743069k508966k095044
14468D5715346j739891j527614j364106j132087q23134m54075P0355Q37024J654839
14459D1236657K069441J706350N70392q98461k054560k505349k357820j966481
14451C5800169j607365j460426j635340k036692k353671k342158k074819j836741
14443B0452957j793729j813413j647324j241062p82065m78910l92289m50295n43455
14434A1310415o12391o59099o47792m33225Q7919P70527J321586J585529J615920
14425A4339389J552880J530193J593097J664636J676540J674830J716142J754456
14417B7502163J701698J543012J362214J231181J116446R64802P86675O16518
$$ plain form
14476 60612151 60157359 59260684 57778976 55664703 53062425 50319356 47810390 45715346
14468 45715346 43975455 42447841 41083735 39951648 39128514 38674439 38744794 39581818 41236657
14459 41236657 43306098 45012448 45582840 44684379 42629819 40124470 37766650 35800169
14451 35800169 34192804 32732378 31097038 29060346 26706675 24364517 22289698 20452957
14443 20452957 18659228 16845815 15198491 13957429 13175364 12696454 12304165 11853870 11310415
14434 11310415 10698024 10038925 9391133 8957908 9045827 9816354 11137940 12723469 14339389
14425 14339389 15892269 17422462 19015559 20680195 22356735 24031565 25747707 27502163
14417 27502163 29203861 30746873 32109087 33340268 34456714 35421516 36208191 36824709
14409C6824709M71490L06785J6111m33118r56339j512409k175764k983637l776393
14400B5781435m240985m118828l369872k211105j046544k48361R3089K28245N43068
14391A1410142J224654K111023K822975K961799K295027R32142o86315k041043
14383B1030404k797552k872793k345957j367537j23645J173461K320296L157325
14375A8174002L547742L415811K860274K140831J495759R67534M21064k58358
14367C2764659j009392j650207k080635k358912k531556k508213k188233j595215
14359A6842296q35597q680P63100J242078J167277M99734m87905j390329j931044
14350A5860930k051276j829778j443726j134153j070436j289041j755399k368942
$$ plain form
14409 36824709 37296199 37602984 37619095 37185977 36229638 34717229 32541465 29557828 25781435
14400 25781435 21540450 17421622 14051750 11840645 10794101 10545740 10638829 10867074 11410142
14391 11410142 12634796 14745819 17568794 20530593 22825620 23757762 23071447 21030404
14383 21030404 18232852 15360059 13014102 11646565 11522920 12696381 15016677 18174002
14375 18174002 21721744 25137555 27997829 30138660 31634419 32601953 33023017 32764659
14367 32764659 31755267 30105060 28024425 25665513 23133957 20625744 18437511 16842296
14359 16842296 16006699 15998019 16761119 18003197 19170474 19670208 19182303 17791974 15860930
14350 15860930 13809654 11979876 10536150 9401997 8331561 7042520 5287121 2918179
14342B918179k947322l295985l295352k945663k344258j620069r08892l42348
14334a4781710M174J76997L52602P10715J251627J778312K088425K117674J898983
14325d402201J536108J208804J047924J011353R47612P37848L63504q9803m59705
14316A901444n88794m29754k9600N77754J355080K131989K618836K617332K195813
14307A2350100J661659J355895J439510J851660K368590K669540K528708K040535
14299B8266197J567529J413446J569583J754448J635558J046360Q6237r95857
14291C6343501k063333l162191m296400n258363n739404n549170m753581l667379
14283A853680k676170k007174j668257j563196j585823j615351j483253r90741
$$ plain form
14342 2918179 -29143 -3325128 -6620480 -9566143 -11910401 -13530470 -14439362 -14781710
14334 -14781710 -14777536 -14600539 -14247937 -13537222 -12285595 -10507283 -8418858 -6301184 -4402201
14325 -4402201 -2866093 -1657289 -609365 401988 1349600 2087448 2450952 2361149 1901444
14316 1901444 1312650 882896 853296 1431050 2786130 4918119 7536955 10154287 12350100
14307 12350100 14011759 15367654 16807164 18658824 21027414 23696954 26225662 28266197
14299 28266197 29833726 31247172 32816755 34571203 36206761 37253121 37339358 36343501
14291 36343501 34280168 31117977 26821577 21563214 15823810 10274640 5521059 1853680
14283 1853680 -822490 -2829664 -4497921 -6061117 -7646940 -9262291 -10745544 -11736285
14275a1736285l2493J249400K470667L258152L508335L354418K983883K574598
14267G630675K326725K397750K728513K999087K843007K131609J040980j19793
14259B3978553j057111j558588j583240j244377o94982r0375M48419Q93086J241643
14250B0333028J403575J285590R60499N88997K45799j00616n46714j169650j894196
14241B1106312k510430k859500k934724k810073k540086k123038j543368q24125
14233B960968K2220J026944K161675L259485M090740M461492M269433L593324
14225B5846281K730264K068299J890988K246488K889273L336676L116367K048741
14217D6173377L32117j585208l223402m234860m479241m070056l294424k371381
$$ plain form
14275 -11736285 -11768778 -10519378 -8048711 -4790559 -1282224 2072194 5056077 7630675
14267 7630675 9957400 12355150 15083663 18082750 20925757 23057366 24098346 23978553
14259 23978553 22921442 21362854 19779614 18535237 17840255 17749880 18198299 19091385 20333028
14250 20333028 21736603 23022193 23982692 24571689 24817488 24716872 24170158 23000508 21106312
14241 21106312 18595882 15736382 12801658 9991585 7451499 5328461 3785093 2960968
14233 2960968 2983188 4010132 6171807 9431292 13522032 17983524 22252957 25846281
14225 25846281 28576545 30644844 32535832 34782320 37671593 41008269 44124636 46173377
14217 46173377 46505494 44920286 41696884 37462024 32982783 28912727 25618303 23246922
14209B3246922j358794l21878N84607J221201J496931J338792P72464R75o89268
14200B6291952j096918j204612j166769j169222j271438j397232j464176j489482
14192A6032103j552672j700852j933635k192797k351091k316734k141492j978441
14184a35611j924616j924715j878812j792204j777251j964191k346094k641259
14176a6384753k442494j614319m68156M99410R95545J100548J139882J389615
14168a5784722J864217K373527K732258K872591K825920K667706K462790K243967
14160D258254K061074K036745K321185K912358L527470L775148L473737K770146
14152B7136117J992461J407897J106713J031390J007505Q23569M29240j7167l89941
$$ plain form
14209 23246922 21888128 21566250 22150857 23372058 24868989 26207781 26980245 26981220 26291952
14200 26291952 25195034 23990422 22823653 21654431 20382993 18985761 17521585 16032103
14192 16032103 14479431 12778579 10844944 8652147 6301056 3984322 1842830 -135611
14184 -135611 -2060227 -3984942 -5863754 -7655958 -9433209 -11397400 -13743494 -16384753
14176 -16384753 -18827247 -20441566 -20909722 -20410312 -19414767 -18314219 -17174337 -15784722
14168 -15784722 -13920505 -11546978 -8814720 -5942129 -3116209 -448503 2014287 4258254
14160 4258254 6319328 8356073 10677258 13589616 17117086 20892234 24365971 27136117
14152 27136117 29128578 30536475 31643188 32674578 33682083 34505652 34934892 34917725 34527784
14143C4527784p52802j206069j717844k152110k348789k178440j619226p90056
14135B1762448Q9602P36204Q91461N17304j39519p46839j077444j041654o86171
14126B0305392j91389K13162L65103J90339k77348q62188j395330j861660k274009
14117A4212072k555792k634909k520728k273581j959214j616638j290836j086833
14109a726459j061665j084367r41323n45926L1339O79798J307985J811835K048927
14100E20144J875362J263107L75634n39006j319286j927007k377545k712390l014441
14091g855428l334285l583305l585737l244174k605421j770796p91992K91401
14083b6479737J309028J974058K187685K252239K571076L157189L602984L509680
$$ plain form
14143 34527784 33774982 32568913 30851069 28698959 26350170 24171730 22552504 21762448
14135 21762448 21852050 22588254 23479715 23997019 23857500 23110661 22033217 20991563 20305392
14126 20305392 20114003 20327165 20692268 20882607 20605259 19743071 18347741 16486081 14212072
14117 14212072 11656280 9021371 6500643 4227062 2267848 651210 -639626 -1726459
14109 -1726459 -2788124 -3872491 -4813814 -5359740 -5328401 -4648603 -3340618 -1528783 520144
14100 520144 2395506 3658613 4034247 3495241 2175955 248948 -2128597 -4840987 -7855428
14091 -7855428 -11189713 -14773018 -18358755 -21602929 -24208350 -25979146 -26771138 -26479737
14083 -26479737 -25170709 -23196651 -21008966 -18756727 -16185651 -13028462 -9425478 -5915798
14075e915798K837269J888529J061328N97772M91280N78090O78695O87136N91229
14066C495530M08361J32147k28704o27868j003127j244324j155832n75306M17493
14057c81630J478775K254597K597912K522865K113149J519089R04642L66255m2367
14048A3333287k80993l90037m97408p09782j043508j456075j904524k323404k554790
14039B172766k425749j950572j367395r55036q47577r74013j105210r97099n64081
14030i013966R5956Q30093J497424J916243J890377J379502N58243l24159j038425
14021b208712j387987j308432r61754o10124l73346j85851N1598L53173O13085
14012f018350O75289M94882K30789J51505L95292Q20395J146554J213479J062643
$$ plain form
14075 -5915798 -3078529 -1190000 -128672 469100 960380 1538470 2217165 2904301 3495530
14066 3495530 3903891 4036038 3807334 3179466 2176339 932015 -223817 -799123 -381630
14057 -381630 1097145 3351742 5949654 8472519 10585668 12104757 13009399 13375654 13333287
14048 13333287 13052294 12662257 12164849 11455067 10411559 8955484 7050960 4727556 2172766
14039 2172766 -252983 -2203555 -3570950 -4525986 -5373563 -6347576 -7452786 -8449885 -9013966
14030 -9013966 -8918010 -8087917 -6590493 -4674250 -2783873 -1404371 -846128 -1170287 -2208712
14021 -2208712 -3596699 -4905131 -5866885 -6477009 -6850355 -7036206 -6984608 -6631435 -6018350
14012 -6018350 -5343061 -4848179 -4617390 -4465885 -4070593 -3250198 -2103644 -890165 172478
14003A72478Q25688O07995M65745M10749M09969M23622M52984N08102N33588M39176
13993E250096K17342n2222l25571o48561j072155j541713j893788j939095j542166
13984c547833p14723L38973J331039K033132K310263K132204J599886Q88806K03110
13975F574857k25942k46210P7487N18030Q79578J050450R13710L85103m13844
13966I513219j156235j574649j656718j518028j203055p41952k87107n8176j91766
13957A125533o52126j242888j744087k078274k300964k420830k305157j847602
13949a3466395j221241q63700j100142j783611k376627k379872j676046n55821
13941b5423455M65949R71015R59817Q15246R10515J309722J832636K301087K656834
$$ plain form
14003 172478 998166 1606161 2071906 2482655 2892624 3316246 3769230 4277332 4810920 5250096
13993 5250096 5467438 5415216 5089645 4441084 3368929 1827216 -66572 -2005667 -3547833
13984 -3547833 -4262556 -3923583 -2592544 -559412 1750851 3883055 5482941 6371747 6574857
13975 6574857 6348915 6102705 6180192 6698222 7577800 8628250 9541960 9927063 9513219
13966 9513219 8356984 6782335 5125617 3607589 2404534 1662582 1375475 1317299 1125533
13957 1125533 473407 -769481 -2513568 -4591842 -6892806 -9313636 -11618793 -13466395
13949 -13466395 -14687636 -15551336 -16651478 -18435089 -20811716 -23191588 -24867634 -25423455
13941 -25423455 -24957506 -23986491 -23026674 -22211428 -21300913 -19991191 -18158555 -15857468 -13200634
13932a3200634K909301L041544L000181K798614K588364K558997K752452L004648
13924I453467L082607K856094K318140J498988M36738p62859j867388k570763
13916A4445024k691697k332889j779361j242492p66581l57078q4566k2813j65486
13907E002061m13047n86987n27659k54527L4575J54050P5665r9480k67779l93651
13897B723221m68923m70414m05603l57685m26734o31650q77473r93459q20092
13888b728812l15535M10127J179815J840595K288615K474942K371808J926446
13880I448001J147381K01056o75298j270776j441513j236745r17120o93072n03621
13871D058293j45197M45677J147777J818586K392056K848804L136033L135753
$$ plain form
13932 -13200634 -10291333 -7249789 -4249608 -1450994 1137370 3696367 6448819 9453467
13924 9453467 12536074 15392168 17710308 19209296 19646034 18883175 17015787 14445024
13916 14445024 11753327 9420438 7641077 6398585 5632004 5274926 5190360 5167547 5002061
13907 5002061 4589014 4002027 3474368 3219841 3254416 3408466 3484131 3384651 3116872 2723221
13897 2723221 2254298 1783884 1378281 1020596 593862 -37788 -915261 -1908720 -2728812
13888 -2728812 -3044347 -2634220 -1454405 386190 2674805 5149747 7521555 9448001
13880 9448001 10595382 10796438 10121140 8850364 7408851 6172106 5254986 4561914 4058293
13871 4058293 3913096 4358773 5506550 7325136 9717192 12565996 15702029 18837782
13863A8837782K744982K062534J462637J315110J632445K021273J931567J047785
13855C3056115m37717j931591k853108k983762k489770j676596p34112K78276
13847B0227735J240387J880498J939494J379208L78992p82951j783827k293331
13839B2186205k118467j381195m62723K76408O67826O75491L23224k51135p83516
13830A9132118j072532j163512j255107j456694j709457j894834j910746j692555
13822F976681j281032q42637n70071n68520p98833j071861j163813j017667p60696
13813a098449n26077l89191m13394o09693r45976j466024k235301l126954l784822
13804a4595881l847705l192259j938029k70312J632869L501554M977353N800443
$$ plain form
13863 18837782 21582764 23645298 25107935 26423045 28055490 30076763 32008330 33056115
13855 33056115 32618398 30686807 27833699 24849937 22360167 20683571 19949459 20227735
13847 20227735 21468122 23348620 25288114 26667322 27046314 26263363 24479536 22186205
13839 22186205 20067738 18686543 18223820 18500228 19168054 19843545 20166769 19915634 19132118
13830 19132118 18059586 16896074 15640967 14184273 12474816 10579982 8669236 6976681
13822 6976681 5695649 4853012 4282941 3714421 2915588 1843727 679914 -337753 -1098449
13813 -1098449 -1624526 -2013717 -2427111 -3036804 -3982780 -5448804 -7684105 -10811059 -14595881
13804 -14595881 -18443586 -21635845 -23573874 -23844186 -22211317 -18709763 -13732410 -7931967
13796g931967N928663N473995M583524L403776K095190Q11099l04427j044082
13788A3015771j147307n23663N53136J551767J968318J535509L01990j362539
13780A5892982k886818l769468l821466l207730k280396j360886o66107l37651
13772b437540l81294o03478p44385o42814k77511K07234N09842L54223k40255
13763d255978r02795j188484r33113l34630K62487N92927N56016K23042k08037
13754f188565n01229m60775k4898O59246J331226J807178K026851J959833J556774
13745B165641Q41299J5023o20470q78329q08824n89738l35592n1199K98646O94961
13735G31418J013468J104224R35653O52127M55476M20986M61537M28976K29846
$$ plain form
13796 -7931967 -2003304 3470691 8054215 11457991 13553181 14364280 14059853 13015771
13788 13015771 11868464 11344801 11897937 13449704 15418022 16953531 17255521 15892982
13780 15892982 13006164 9236696 5415230 2207500 -72896 -1433782 -2099889 -2437540
13772 -2437540 -2818834 -3422312 -4166697 -4809511 -5087022 -4879788 -4369946 -4015723 -4255978
13763 -4255978 -5158773 -6347257 -7280370 -7615000 -7352513 -6759586 -6203570 -5980528 -6188565
13754 -6188565 -6689794 -7150569 -7175467 -6516221 -5184995 -3377817 -1350966 608867 2165641
13745 2165641 3006940 3021963 2401493 1523164 714340 124602 -210990 -262189 36457 731418
13735 731418 1744886 2849110 3784763 4436890 4892366 5313352 5774889 6203865 6433711
13726F433711j19938n28349q70892j037798j026018r64459j005814j192877j437032
13717a749466j637766j796780j944053k015402j936363j733858j453337j069453
13709a5336478n36599J36813Q76885J547381J984438K084165J838193J303911
13701f101291N92318j34673o92103r03611o67456l0020Q08335J586301K119122
13692c423078K304629K055579J417526O96617K57227K06693L82903N92950P88423
13683E279469J046229J425628J869789K233680K377184K251410J927731J579375
13675A9990495J430096J583935J862818J944273J658133J080430M34227l8569
13667B9945838k09989j04530K01046O41978J174713J763885K262684K388787J988553
$$ plain form
13726 6433711 6313773 5785424 4914532 3876734 2850716 1886257 880443 -312434 -1749466
13717 -1749466 -3387232 -5184012 -7128065 -9143467 -11079830 -12813688 -14267025 -15336478
13709 -15336478 -15873077 -15736264 -14859379 -13311998 -11327560 -9243395 -7405202 -6101291
13701 -6101291 -5508973 -5643646 -6335749 -7239360 -7906816 -7936836 -7128501 -5542200 -3423078
13692 -3423078 -1118449 937130 2354656 3051273 3308500 3515193 3898096 4491046 5279469
13683 5279469 6325698 7751326 9621115 11854795 14231979 16483389 18411120 19990495
13675 19990495 21420591 23004526 24867344 26811617 28469750 29550180 29984407 29945838
13667 29945838 29735849 29631319 29832365 30474343 31649056 33412941 35675625 38064412 40052965
13658D0052965J224881M28946j04681k25399o9L31765N33870N16631L37835Q5601
13648D3182345j99360n10001q28532j106303j343633j646031k097564k613226
13640C2837695k966966k931797k415649j537215o28816j22344k76572r29645j580918
13631A9447773j798833j558498j202359j104173j354587j751583k011694j901634
13623F764412j264758j06747J332737K691366L647863L993005L673384K825014
13615B3556276J716788N90592m32834j291049j923291k297899k403137k187244
13607A5328202j579132n80117P09504K120215L426923M392292M870306M856820
13599C3545013M444357L750791K860811J866709R69256M05976K23401K10815J10403
$$ plain form
13658 40052965 41277846 41706792 41602111 41376712 41376643 41708408 42242278 42758909 43096744 43182345
13648 43182345 42982985 42472984 41644452 40538149 39194516 37548485 35450921 32837695
13640 32837695 29870729 26938932 24523283 22986068 22357252 22234908 21958336 21028691 19447773
13631 19447773 17648940 16090442 14888083 13783910 12429323 10677740 8666046 6764412
13623 6764412 5499654 5392907 6725644 9417010 13064873 17057878 20731262 23556276
13615 23556276 25273064 25863656 25430822 24139773 22216482 19918583 17515446 15328202
13607 15328202 13749070 13168953 13878457 15998672 19425595 23817887 28688193 33545013
13599 33545013 37989370 41740161 44600972 46467681 47436937 47842913 48066314 48277129 48387532
13590D8387532j69878n71580j005211j417830j771755j975420j924954j642768
13582C7908136j297434j059337r67559r50333r29238q67256p77700p31344q15425
13573B9512510j083465j545894k112312k548792k631963k367181j982643j725849
13565A3514411j699684j833773j973723j999774j866892j572742j123376n47800
13557H96647L5738M53563O80204Q85295J163164J361100J301891R99097N32737
13548H309436o2218o90791j154746j295812j156025r72518r86453j214693j423841
13539f47661j346388r19174l52399L3875O8403j82116n23747p40428o45541j98372
13529e453548M22056R71997J357503J626263J778242J666026J125115K39329n86533
$$ plain form
13590 48387532 48217654 47646074 46640863 45223033 43451278 41475858 39550904 37908136
13582 37908136 36610702 35551365 34583806 33633473 32704235 31836979 31059279 30327935 29512510
13573 29512510 28429045 26883151 24770839 22222047 19590084 17222903 15240260 13514411
13565 13514411 11814727 9980954 8007231 6007457 4140565 2567823 1444447 896647
13557 896647 932385 1385948 2066152 2951447 4114611 5475711 6777602 7776699 8309436
13548 8309436 8247218 7556427 6401681 5105869 3949844 2977326 1990873 776180 -647661
13539 -647661 -1994049 -2913223 -3265622 -3231747 -3163344 -3345460 -3869207 -4609635 -5255176 -5453548
13529 -5453548 -5031492 -4059495 -2701992 -1075729 702513 2368539 3493654 3732983 3146450
13520C146450r33982o76432M9080J004580J972231K848266L622771M252087M595265
13511A9880316M486882L847288K719973J299776q4195j147846j812654k145428
13503B7044112k220064k094581j846697j592854j473010j530906j619846j556816
13495A3109338j347041j176049j210376j409395j517828j230203m10574P36549
13487E544421J749315K261676K238445J884280J440902J060983Q00629O58961
13479A7639612N56669L57770J0772l83302o82379q22582p99226o27048l66756
13470A4883530j22205K0464L3467l5682o4082O1764L54925P40863J100173J304305
13460A8277522J278932J055940P64302N78794O31121Q91609J165567J247796J032953
$$ plain form
13520 3146450 2212468 1536036 1585116 2589696 4561927 7410193 11032964 15285051 19880316
13511 19880316 24367198 28214486 30934459 32234235 32150040 31002194 29189540 27044112
13503 27044112 24824048 22729467 20882770 19289916 17816906 16286000 14666154 13109338
13495 13109338 11762297 10586248 9375872 7966477 6448649 5218446 4807872 5544421
13487 5544421 7293736 9555412 11793857 13678137 15119039 16180022 16980651 17639612
13479 17639612 18196281 18554051 18564823 18181521 17499142 16676560 15877334 15250286 14883530
13470 14883530 14761325 14781789 14815256 14779574 14715492 14777256 15132181 15873044 16973217 18277522
13460 18277522 19556454 20612394 21376696 21955490 22586611 23478220 24643787 25891583 26924536
13451B6924536N16142k05454r14108j304415j152719n19525K59812P91355Q37891
13442B5233515M25801j75326o02221o20884l02980Q338q102l47805p19982r27317
13432B1963037j097926j440790j919039k312894k491333k504906k470470k460012
13424E265667k471216k423086k233379j934040j633099j383338j161404r40494
13416h914389p25975n15860k54631J38749O76672J229696J590862J699414J770913
13407c304549K092201K692219L265312L456179L199553K689555K088272J438954
13399A7617696Q23379L96567K04575J19423L1959q1012l26339q95900j835224
13390A6055124k917613l794379m246274m279373m063198l816036l648708l449258
$$ plain form
13451 26924536 27440678 27235224 26321116 25016701 23863982 23344457 23604269 24395624 25233515
13442 25233515 25659316 25483990 24881769 24260885 23957905 23966243 23958141 23610336 22890354 21963037
13432 21963037 20865111 19424321 17505282 15192388 12701055 10196149 7725679 5265667
13424 5265667 2794451 371365 -1862014 -3796054 -5429153 -6812491 -7973895 -8914389
13416 -8914389 -9640364 -10156224 -10410855 -10272106 -9595434 -8365738 -6774876 -5075462 -3304549
13407 -3304549 -1212348 1479871 4745183 8201362 11400915 14090470 16178742 17617696
13399 17617696 18441075 18837642 19042217 19161640 19193599 19112587 18786248 17890348 16055124
13390 16055124 13137511 9343132 5096858 817485 -3245713 -7061749 -10710457 -14159715
13382a4159715k973333k108959j023771o0135M58724L90077j50723q39661j316936
13373b1784432j370124r76269k60600N49395J204970J517094J383399Q01194j28864
13364a9064237j201758k076015k388372k040535j300235n74115r5994J83887M54169
13355b8103205Q37987J297985J680232J854540J826621J754301J881808K352589
13347a4617142L016403L487327L456096K927550K124457J232552L00533o17647
13339A310129j270942j307828o20750N20094J695104K613866L187614L439977
13331I567264L421879L168295K690686K006661J150507J73153q14448j595783
13323A9768214j891667j498834m41155R68025K202576K754241K425576J444653
$$ plain form
13382 -14159715 -17133048 -19242007 -20265778 -20325913 -19867189 -19477112 -19627835 -20467496 -21784432
13373 -21784432 -23154556 -24130825 -24391425 -23842030 -22637060 -21119966 -19736567 -18935373 -19064237
13364 -19064237 -20265995 -22342010 -24730382 -26770917 -28071152 -28645267 -28741261 -28557374 -28103205
13355 -28103205 -27265218 -25967233 -24287001 -22432461 -20605840 -18851539 -16969731 -14617142
13347 -14617142 -11600739 -8113412 -4657316 -1729766 394691 1627243 1927776 1310129
13339 1310129 39187 -1268641 -1889391 -1369297 325807 2939673 6127287 9567264
13331 9567264 12989143 16157438 18848124 20854785 22005292 22178445 21363997 19768214
13323 19768214 17876547 16377713 15936558 16904583 19107159 21861400 24286976 25731629
13315B5731629L00892n65277j033038j317939j690173k225349k842797l394447
13307A2963501l630477l272100k238703p61289P47279J930118K651376K974207
13299A1363912K988790K753137K414193K172384K057043J948781J872185K117127
13291B9687552L036673M748904O994434R245274J0902716J1403704J0334834P664056
13283I4018147L882928j60471l645091o117164p560757q229796q435280q384130
13275E5368386q099907p486324o508677n284572m000655k812334j785009q71476
13267A8519432J5549Q41572J358304J285893O30102k57829r37508j187852j139747
13258A9127916j118568j328851j699166j992237k022561j790753j430978j044231
$$ plain form
13315 25731629 26032521 25467244 24434206 23116267 21426094 19200745 16357948 12963501
13307 12963501 9333024 6060924 3822221 3060932 3808211 5738329 8389705 11363912
13299 11363912 14352702 17105839 19520032 21692416 23749459 25698240 27570425 29687552
13291 29687552 32724225 37473129 44467563 53712837 64615553 76019257 86354091 94018147
13283 94018147 97901075 97740604 94095513 87978349 80417592 72187796 63752516 55368386
13275 55368386 47268479 39782155 33273478 27988906 23988251 21175917 19390908 18519432
13267 18519432 18534981 19376553 20734857 22020750 22650852 22393023 21455515 20267663 19127916
13258 19127916 18009348 16680497 14981331 12989094 10966533 9175780 7744802 6700571
13250F700571o25128j25848M67766J085296J577307J843075J940678J983608J961156
13241A6808481J769183J389028R36154N50880K92862J30253J7908m7449q4847
13232B1762453j82543m32890q15083j161306j298952j195991q85933l54275M14687
13223A5850167J350305K281719K980666L244252L045944K611864K218246J913899
13215C5497062J533457R36950J60097o36745j283746j645641j629849j211652
13207C1719933m77726L41897R82005J332856J448986J433312J408105J449598
13199C9638966J444737J153782M82446l96972j222138j906353k531190l033760
13191C3629518l120096k614654j711240p98507j49995J84088K59033J21762j51983
$$ plain form
13250 6700571 6075443 5949595 6417361 7502657 9079964 10923039 12863717 14847325 16808481
13241 16808481 18577664 19966692 20902846 21453726 21746588 21876841 21894749 21847300 21762453
13232 21762453 21579910 21147020 20331937 19170631 17871679 16675688 15789755 15435480 15850167
13223 15850167 17200472 19482191 22462857 25707109 28753053 31364917 33583163 35497062
13215 35497062 37030519 37967469 38127566 37490821 36207075 34561434 32931585 31719933
13207 31719933 31242207 31584104 32566109 33898965 35347951 36781263 38189368 39638966
13199 39638966 41083703 42237485 42719931 42322959 41100821 39194468 36663278 33629518
13191 33629518 30509422 27894768 26183528 25385021 25235026 25419114 25678147 25799909 25647926
13182B5647926l70924k68530K81140J080094J721047J902320J604721J013088
13174C2610882L39131k58297o34176o58427l18464K21264P15151J001127J108492
13165C4126683J248849J674775K501348L633550M832077N874742O719833P522701
13157F8134558Q465518R582280J0783715J1989202J3127103J4047585J4526638
13150A50656599J4259668J2752570R445096M202507k335078q941505j4369761
13143A65670096j7856520j9248723j8865701j7316544j5264196j3182117j1299447
13136E2636848r716785q463091p490190o746078o202902n793725n431343n046971
13128b254237m552386l828873k812967j634075n89091J38026N98910Q59325R21441
$$ plain form
13182 25647926 25277002 25008472 25289612 26369706 28090753 29993073 31597794 32610882
13174 32610882 32950013 32691716 32057540 31399113 31080649 31301913 32017064 33018191 34126683
13165 34126683 35375532 37050307 39551655 43185205 48017282 53892024 60611857 68134558
13157 68134558 76600076 86182356 96966071 108955273 122082376 136129961 150656599
13150 150656599 164916267 177668837 187113933 191316440 188981362 180039857 165670096
13143 165670096 147813576 128564853 109699152 92382608 77118412 63936295 52636848
13136 52636848 42920063 34456972 26966782 20220704 14017802 8224077 2792734 -2254237
13128 -2254237 -6806623 -10635496 -13448463 -15082538 -15671629 -15533603 -14934693 -14075368 -13153927
13119a3153927Q72331Q20624P13160L99188j72022q81535j501817j828394j769721
13110a6502113j332789o05804K60489J121248J890597K520874K968114L191104
13102f488280L154202K861749K431384K092021K034368K207357K305760K019166
13094A2617727J249042J17831j063679j882366k082059j764632j285128r33568
13086D973168p34898n66774l70164j89040p4378j417Q4863J63172J90465K34749
13076C709746M12870P31336J053080J133938P07619k89520j570771k663785l216036
13067H477l182557k765608k170295j466047p12768j14031R4962j18558n58671
13058a0985096r71809j189277j144173q31232k87262M17319J197885J957015K574974
$$ plain form
13119 -13153927 -12281596 -11460972 -10747812 -10348624 -10520646 -11402181 -12903998 -14732392 -16502113
13110 -16502113 -17834902 -18440706 -18180217 -17058969 -15168372 -12647498 -9679384 -6488280
13102 -6488280 -3334078 -472329 1959055 4051076 6085444 8292801 10598561 12617727
13094 12617727 13866769 13984600 12920921 11038555 8956496 7191864 5906736 4973168
13086 4973168 4238270 3671496 3301332 3112292 3037914 3036497 3121360 3284532 3474997 3709746
13076 3709746 4122616 4853952 5907032 7040970 7748589 7459069 5888298 3224513 8477
13067 8477 -3174080 -5939688 -8109983 -9576030 -10288798 -10402829 -10307867 -10426425 -10985096
13058 -10985096 -11956905 -13146182 -14290355 -15121587 -15408849 -14991530 -13793645 -11836630 -9261656
13049i261656K959710L088973K964801K611225K101841J465641O34739m13144
13041F152130j515585k352964k632627k300324j588974r03434o16131q18839j268254
13032g845002j605749j580548j142135m42182K48517P17952R67936J138405J262375
13023h280431J214108R29049N39712K41766J10031J08250K19125M50598P33111
13014c734681R10071Q71646O89943N94381Q15158J425874K258557K968680L232891
13005A0032520K937981K245950J436187O38361j68317q99723j278577j091258
12997A3853124m71788K00045O42098P87428O64977K93801l34587j184111k108906
12988A2342081k932801l549044l862048l727673l045540j884436n12997P00285
$$ plain form
13049 -9261656 -6301946 -3212973 -248172 2363053 4464894 5930535 6565274 6152130
13041 6152130 4636545 2283581 -349046 -2649370 -4238344 -5141778 -5757909 -6576748 -7845002
13032 -7845002 -9450751 -11031299 -12173434 -12615616 -12367099 -11649147 -10681211 -9542806 -8280431
13023 -8280431 -7066323 -6137274 -5597562 -5355796 -5245765 -5137515 -4918390 -4467792 -3734681
13014 -3734681 -2824610 -1952964 -1263021 -668640 146518 1572392 3830949 6799629 10032520
13005 10032520 12970501 15216451 16652638 17290999 17122682 16222959 14944382 13853124
12997 13853124 13381336 13581381 14223479 15010907 15675884 15969685 15635098 14450987 12342081
12988 12342081 9409280 5860236 1998188 -1729485 -4775025 -6659461 -7172458 -6472173
12980f472173J477420J794145J857347J894863J988516K085015K077638J854901
12972H557672J361859P25915K58072J59413K62214K02097j93573p96774j384943
12963I151952j827211k111198k264270k261252k072333j787662j576765j480937
12955f229676j332310r31234k45257N83782J349669J862149J978049J626384Q58877
12946d79567j39867j148761j992365k535208k696988k496631k065297j597864
12938a5152548j250860j107577j164639j285004j277612j017149m54975L40303
12930b2370061J101266J460587J221692N26752k83354r83134j578564k114373
12922b3019189k467273k400769j771949o12194R40807K669500M258023N363602
$$ plain form
12980 -6472173 -4994753 -3200608 -1343261 551602 2540118 4625133 6702771 8557672
12972 8557672 9919531 10645446 10903518 11062931 11325145 11527242 11333669 10536895 9151952
12963 9151952 7324741 5213543 2949273 688021 -1384312 -3171974 -4748739 -6229676
12955 -6229676 -7561986 -8493220 -8738477 -8154695 -6805026 -4942877 -2964828 -1338444 -479567
12946 -479567 -619434 -1768195 -3760560 -6295768 -8992756 -11489387 -13554684 -15152548
12938 -15152548 -16403408 -17510985 -18675624 -19960628 -21238240 -22255389 -22710364 -22370061
12930 -22370061 -21268795 -19808208 -18586516 -18059764 -18343118 -19326252 -20904816 -23019189
12922 -23019189 -25486462 -27887231 -29659180 -30271374 -29330567 -26661067 -22403044 -17039442
12914a7039442N741707N322463M205681K620007R27083m21855j061948q90733
12906e97037j39904O89537J082106P96852q5465j309154k559646l515750l937307
12897i575768l761217l124669k300377j503846p12936K42679J396908K472033
12889a6867193L000611K665743J562325J67040r48459j422561j251160p76081
12881a3869735m47978m57798o46819p71803p26451n48346l54922k33232p7761
12872a8134845L74698J192739K006832K282502J779818O33796q70246k406227
12864a3140933l592047m080478l721915k646816j203792K22912J353918K064110
12856b4745041K444803K755019L184121L728420M313973M849370N117197M791084
$$ plain form
12914 -17039442 -11297735 -5975272 -1769591 850416 1777499 1355644 293696 -597037
12906 -597037 -736941 -47404 1034702 1831554 1746089 436935 -2122711 -5638461 -9575768
12897 -9575768 -13336985 -16461654 -18762031 -20265877 -20978813 -20736134 -19339226 -16867193
12889 -16867193 -13866582 -11200839 -9638514 -9471474 -10419933 -11842494 -13093654 -13869735
12881 -13869735 -14317713 -14775511 -15422330 -16194133 -16920584 -17468930 -17823852 -18057084 -18134845
12872 -18134845 -17760147 -16567408 -14560576 -12278074 -10498256 -9864460 -10734706 -13140933
12864 -13140933 -16732980 -20813458 -24535373 -27182189 -28385981 -28163069 -26809151 -24745041
12856 -24745041 -22300238 -19545219 -16361098 -12632678 -8318705 -3469335 1647862 6438946
12848F438946L658037J816766l50410k382599l911195m707369m704084m023904
12840h165812k926920j694733n29374M31511R90416R16838J79252r55352k086077
12831a3840251k851100l019861k577098j727938p89478n0390L38813M02193K54178
12822b3860932k5990m35132r75593j515014j747531j412899n74510L99098J160891
12813b8987612J639889J932707K046371J861721J320557N60580j73491p01690
12805b0500968r92074j197495j601240k341287l141405l466825l036313k104811
12797c8382418j192160o11108l00794l7976K72409N29065O13192N25798K96609
12788c8287383q1759n30528q47006q37216m06706M28547J536326K718381L810577
$$ plain form
12848 6438946 10096983 11913749 11563339 9180740 5269545 562176 -4141908 -8165812
12840 -8165812 -11092732 -12787465 -13316839 -12885328 -11894912 -10978074 -10798822 -11754174 -13840251
12831 -13840251 -16691351 -19711212 -22288310 -24016248 -24805726 -24856116 -24517303 -24115110 -23860932
12822 -23860932 -23886922 -24322054 -25297647 -26812661 -28560192 -29973091 -30547601 -30148503 -28987612
12813 -28987612 -27347723 -25415016 -23368645 -21506924 -20186367 -19625787 -19799278 -20500968
12805 -20500968 -21493042 -22690537 -24291777 -26633064 -29774469 -33241294 -36277607 -38382418
12797 -38382418 -39574578 -40185686 -40486480 -40524456 -40252047 -39722982 -39109790 -38583992 -38287383
12788 -38287383 -38369142 -38899670 -39746676 -40583892 -40990598 -40562051 -39025725 -36307344 -32496767
12779c2496767M671332N114372M990579M312623L246783K040361R38170Q8870
12771g093677m64225p07640o19275k21583L18248P19634Q14682O69611M30055
12762f154170J23312l39613j012010j817044k582278l118642l273507k989371
12754b1163323k374030j686551j188090r65671r13012q83188q14570p16323o08980
12745c1313738n09738m51241m51276m60366m10553l00944j82786q6839k8015p3229
12735c4268725l13021p07787j025503j009298n90039P5934P50747J240705J415448
12726c4431539J297050J141451J258191J737211K396396K928537L099861K879687
12718a7693155K418817J929253J564580J337955J133634Q32412M33621Q4409K3348
$$ plain form
12779 -32496767 -27825435 -22711063 -17720484 -13407861 -10161078 -8120717 -7182547 -7093677
12771 -7093677 -7557902 -8265542 -8884817 -9106400 -8788152 -8068518 -7253836 -6584225 -6154170
12762 -6154170 -6030858 -6370471 -7382481 -9199525 -11781803 -14900445 -18173952 -21163323
12754 -21163323 -23537353 -25223904 -26411994 -27377665 -28290677 -29173865 -29988435 -30704758 -31313738
12745 -31313738 -31823476 -32274717 -32725993 -33186359 -33596912 -33897856 -34080642 -34167481 -34195496 -34268725
12735 -34268725 -34581746 -35289533 -36315036 -37324334 -37914373 -37838439 -37087692 -35846987 -34431539
12726 -34431539 -33134489 -31993038 -30734847 -28997636 -26601240 -23672703 -20572842 -17693155
12718 -17693155 -15274338 -13345085 -11780505 -10442550 -9308916 -8476504 -8042883 -7958474 -7935126
12709g935126M39773J296036K266373K890734K863943K236939J352348N92337
12701F003357J70112J03074K95671O16944R56723J232316J363371J288809R84639
12692A3015016M31366l93537j443426k550541l509223m199533m570317m510728
12684g730923l826135k438711o04300J160508K400806K945600K872730K419750
12676b800675J914132J606484J551992J657846J731617J532509R51593J82860
12668H328358l60613l35165L07711J278235K084837K308933J877935J115498M46193
12659A7051922L6248k09454l94079n50935p60059j137833j713943k395058k991098
12650F935711l294206l232192k892145k374875j780898j306115j152056j280707
$$ plain form
12709 -7935126 -7495353 -6199317 -3932944 -1042210 1821733 4058672 5411020 6003357
12701 6003357 6173469 6276543 6572214 7189158 8145881 9378197 10741568 12030377 13015016
12692 13015016 13446382 13052845 11609419 9058878 5549655 1350122 -3220195 -7730923
12684 -7730923 -11557058 -13995769 -14600069 -13439561 -11038755 -8093155 -5220425 -2800675
12676 -2800675 -886543 719941 2271933 3929779 5661396 7193905 8145498 8328358
12668 8328358 7967745 7632580 7940291 9218526 11303363 13612296 15490231 16605729 17051922
12659 17051922 17088170 16878716 16484637 15933702 15173643 14035810 12321867 9926809 6935711
12650 6935711 3641505 409313 -2482832 -4857707 -6638605 -7944720 -9096776 -10377483
12642a0377483j368458j110879n28354O7128L48111J85462l27157r51511j445142
12633a5508283j704605j762121j677625j481932j174554p38673j74177M57226
12625b3764744J027695J420781J628715J779691K015600K311307K476915K372239
12617h731801K090117J875122J859699J923870J818058J388239O66955j84999
12609B705260r50433j417312j473429j159184o12728j6589M30407O06591N43677
12600a343740L81483K63783K47280K63903J57553k06476p91126j330005j516038
12591c873383j284709q30120l61294M8231L58984M45747J93623l53012j020687
12582f676620j647298k146279k462280k564249k502253k390822k338593k383267
$$ plain form
12642 -10377483 -11745941 -12856820 -13385174 -13318046 -12969935 -12784473 -13111630 -14063141 -15508283
12633 -15508283 -17212888 -18975009 -20652634 -22134566 -23309120 -24047793 -24221970 -23764744
12625 -23764744 -22737049 -21316268 -19687553 -17907862 -15892262 -13580955 -11104040 -8731801
12617 -8731801 -6641684 -4766562 -2906863 -982993 835065 2223304 2890259 2705260
12609 2705260 1754827 337515 -1135914 -2295098 -2907826 -2924415 -2494008 -1887417 -1343740
12600 -1343740 -962257 -698474 -451194 -187291 -29738 -236214 -1027340 -2357345 -3873383
12591 -3873383 -5158092 -5988212 -6349506 -6301275 -5942291 -5496544 -5302921 -5655933 -6676620
12582 -6676620 -8323918 -10470197 -12932477 -15496726 -17998979 -20389801 -22728394 -25111661
12574b5111661k422784k266060j828183j221725o24239j28229K51434M62458L94903
12565c2494086N0565l30449m33812j77136K21425N08498O73345Q91513J280804
12556b9809333J852534K581295L336364L858237L975700L761134L368843K815315
12548d259911J998528R15841j91276r77680j280106j249417j186798j247491j367924
12539h846234j462346j573968j811726k223051k758019l286587l633750l682461
12531b9278142l425160k864136j941347o64683P45466J968331K803144L223571
12523b9432956L314266L192773K961169K723623K617227K756656L078524L278538
12515e510180L024177K244441J172777J50048n97249j070116j456835j946218
$$ plain form
12574 -25111661 -27534445 -29800505 -31628688 -32850413 -33474652 -33602881 -33351447 -32888989 -32494086
12565 -32494086 -32443521 -32773970 -33207782 -33384918 -33163493 -32654995 -31981650 -31090137 -29809333
12556 -29809333 -27956799 -25375504 -22039140 -18180903 -14205203 -10444069 -7075226 -4259911
12548 -4259911 -2261383 -1345542 -1536818 -2514498 -3794604 -5044021 -6230819 -7478310 -8846234
12539 -8846234 -10308580 -11882548 -13694274 -15917325 -18675344 -21961931 -25595681 -29278142
12531 -29278142 -32703302 -35567438 -37508785 -38173468 -37428002 -35459671 -32656527 -29432956
12523 -29432956 -26118690 -22925917 -19964748 -17241125 -14623898 -11867242 -8788718 -5510180
12515 -5510180 -2486003 -241562 931215 1081263 484014 -586102 -2042937 -3989155
$$ [...]
##END NTUPLES=NMR SPECTRUM
##END=
