##TITLE=31P ikalashn
DE-78_DMSO
22.11.2024
##JCAMPDX= 6.0         $$ Bruker NMR JCAMP-DX V2.0
##DATA TYPE= NMR SPECTRUM
##DATA CLASS= NTUPLES
##ORIGIN= UXNMR, Bruker Analytische Messtechnik GmbH
##OWNER= root
$$ TOPSPIN		Version 1.3
$$ 2024-11-22 15:13:41.359 +0400  Irina@DPX200
$$ Compression mode = diff/dup
##.OBSERVE FREQUENCY= 81.01967998063
##.OBSERVE NUCLEUS= ^31P
##.ACQUISITION MODE= SIMULTANEOUS
##.ACQUISITION SCHEME= undefined
##.AVERAGES= 96
##.DIGITISER RES= 17
##SPECTROMETER/DATA SYSTEM= spect
##.PULSE SEQUENCE= zgpg
##.SOLVENT NAME= DMSO
##.SHIFT REFERENCE= INTERNAL, DMSO, 1, 298.5841
##AUDIT TRAIL= $$ (NUMBER, WHEN, WHO, WHERE, WHAT)
$$ ##TITLE= Audit trail, TOPSPIN		Version 1.3
$$ ##JCAMPDX= 5.01
$$ ##ORIGIN= Bruker BioSpin GmbH
$$ ##OWNER= Irina
$$ $$ F:/spectra/data/iren/nmr/P31dec/1/pdata/1/auditp.txt
$$ ##AUDIT TRAIL=  $$ (NUMBER, WHEN, WHO, WHERE, VERSION, WHAT)
(   1,<2024-11-22 15:13:09.468 +0400>,<Irina>,<DPX200>,<TOPSPIN 1.3>,
      <created by zg
	started at 2024-11-22 15:10:37.796 +0400,
	POWCHK disabled, PULCHK disabled
       terminated by command 'halt'
       configuration hash MD5:
       BE 6D 3F 07 2A EA 11 49 91 17 2B D3 AF B3 58 0D
       data hash MD5: 32K
       6A E1 29 62 A8 54 AD 31 2D A3 AA AC C6 98 C4 DC>)
(   2,<2024-11-22 15:13:09.984 +0400>,<Irina>,<DPX200>,<TOPSPIN 1.3>,
      <Start of raw data processing
       efp BC_mod = 2 LB = 10 FT_mod = 6 PKNL = 1 PHC0 = 269.8655 PHC1 = 34.2881 SI = 32K 
       data hash MD5: 32K
       DE 18 A3 AC BB 27 FF A7 B8 8C 41 F2 9C 2B 0C 54>)
(   3,<2024-11-22 15:13:12.281 +0400>,<Irina>,<DPX200>,<TOPSPIN 1.3>,
      <apk 
       data hash MD5: 32K
       50 79 07 8C 41 A3 45 DD 32 2A DE 4C 11 7A 53 46>)
(   4,<2024-11-22 15:13:16.578 +0400>,<Irina>,<DPX200>,<TOPSPIN 1.3>,
      <abs n ABSG = 5 
       data hash MD5: 32K
       7D B0 44 C1 80 5F 69 B2 C1 E0 B4 F7 30 FD A5 62>)
(   5,<2024-11-22 15:13:27.609 +0400>,<Irina>,<DPX200>,<TOPSPIN 1.3>,
      <pk fgphup PHC0 = 11 PHC1 = 0 
       data hash MD5: 32K
       72 E7 9A 80 F7 3C 5F 11 57 65 C6 A4 14 7D A9 3E>)
$$ ##END=
$$ 
$$ $$ hash MD5
$$ $$ B1 FF 0E 78 2A 0E 7D 59 77 05 77 DA E0 22 82 E9
##$RELAX= 
##$RELAX= 
##$RELAX= 
##$RELAX= 
##$RELAX= 
##$RELAX= 
##$RELAX= 
##$RELAX= 
##$RELAX= 
##$RELAX= 
##$RELAX= 
$$ Bruker specific parameters
$$ --------------------------
##$DU= <F:/spectra>
##$EXPNO= 1
##$NAME= <P31dec>
##$PROCNO= 1
##$TYPE= <nmr>
##$USER= <iren>
##$AMP= (0..31)
100 100 100 100 100 100 100 100 100 100 100 100 100 100 100 100 100 100 
100 100 100 100 100 100 100 100 100 100 100 100 100 100 
##$ANAVPT= -1
##$AQSEQ= 0
##$AQ_mod= 1
##$AUNM= <au_zg>
##$AUTOPOS= <>
##$BF1= 81.014009
##$BF2= 200.13
##$BF3= 200.13
##$BF4= 200.13
##$BF5= 200.13
##$BF6= 200.13
##$BF7= 200.13
##$BF8= 200.13
##$BYTORDA= 1
##$CFDGTYP= 0
##$CFRGTYP= 5
##$CHEMSTR= <none>
##$CNST= (0..63)
1 1 145 1 1 1 1 1 1 1 1 1 1 1 1 1 1 1 1 1 1 1 1 1 1 1 1 1 1 1 1 1 1 1 
1 1 1 1 1 1 1 1 1 1 1 1 1 1 1 1 1 1 1 1 1 1 1 1 1 1 1 1 1 1 
$$ [...]
##$SW_h= 37037.037037037
##$TD= 32768
##$TD0= 1
##$TE= 300
##$TE2= 300
##$TE3= 300
##$TEG= 300
##$TL= (0..7)
0 120 53 12 22 120 120 120 
##$TP= (0..7)
150 150 150 150 150 150 150 150 
##$TP07= 0
##$TPNAME0= <>
##$TPNAME1= <>
##$TPNAME2= <>
##$TPNAME3= <>
##$TPNAME4= <>
##$TPNAME5= <>
##$TPNAME6= <>
##$TPNAME7= <>
##$TPOAL= (0..7)
0.5 0.5 0.5 0.5 0.5 0.5 0.5 0.5 
##$TPOFFS= (0..7)
0 0 0 0 0 0 0 0 
##$TUNHIN= 0
##$TUNHOUT= 0
##$TUNXOUT= 0
##$USERA1= <user>
##$USERA2= <user>
##$USERA3= <user>
##$USERA4= <user>
##$USERA5= <user>
##$V9= 5
##$VALIST= <valist>
##$VCLIST= <CCCCCCCCCCCCCCC>
##$VD= 0
##$VDLIST= <DDDDDDDDDDDDDDD>
##$VPLIST= <PPPPPPPPPPPPPPP>
##$VTLIST= <TTTTTTTTTTTTTTT>
##$WBST= 1024
##$WBSW= 4
##$XGAIN= (0..3)
0 0 0 0 
##$XL= 0
##$YL= 0
##$YMAX_a= 8298
##$YMIN_a= -1351
##$ZGOPTNS= <>
##$ZL1= 120
##$ZL2= 120
##$ZL3= 120
##$ZL4= 120
##$ABSF1= 298.5841
##$ABSF2= -158.5842
##$ABSG= 5
##$ABSL= 5
##$ALPHA= 0
##$AQORDER= 0
##$ASSFAC= 0
##$ASSFACI= 0
##$ASSFACX= 0
##$ASSWID= 0
##$AUNMP= <proc_1d>
##$AXLEFT= 0
##$AXRIGHT= 0
##$AXTYPE= 0
##$AXUNIT= <>
##$AZFE= 0.1
##$AZFW= 0.5
##$BCFW= 0
##$BC_mod= 2
##$BYTORDP= 0
##$COROFFS= 0
##$CY= 12.5935478210449
##$DATMOD= 1
##$DC= 0
##$DFILT= <>
##$DTYPP= 0
##$F1P= 47.1127640792319
##$F2P= -24.0371245302204
##$FCOR= 0.5
##$FTSIZE= 32768
##$FT_mod= 6
##$GAMMA= 0
##$GB= 0
##$INTBC= 1
##$INTSCL= 7.269226e-011
##$ISEN= 30
##$LB= 10
##$LEV0= 0
##$LPBIN= 0
##$MAXI= 12.09355
##$MC2= 0
##$MEAN= 0
##$ME_mod= 0
##$MI= 0.7550151
##$NCOEF= 0
##$NC_proc= -13
##$NLEV= 6
##$NOISF1= 298.5841
##$NOISF2= 270.0111
##$NSP= 0
##$NTH_PI= 0
##$NZP= 0
##$OFFSET= 298.5841
##$PC= 1.4
##$PHC0= 231.749
##$PHC1= 40.07378
##$PH_mod= 1
##$PKNL= yes
##$PPARMOD= 0
##$PPDIAG= 0
##$PPIPTYP= 0
##$PPMPNUM= 100
##$PPRESOL= 1
##$PSCAL= 0
##$PSIGN= 0
##$REVERSE= no
##$SF= 81.014009
##$SI= 32768
##$SIGF1= 270.0111
##$SIGF2= -158.5842
##$SINO= 77.54984
##$SIOLD= 32768
##$SREGLST= <31P.CDCl3>
##$SSB= 0
##$STSI= 32768
##$STSR= 0
##$SW_p= 37037.037037037
##$SYMM= 0
##$S_DEV= 0
##$TDeff= 32768
##$TDoff= 0
##$TI= <>
##$TILT= no
##$TM1= 0
##$TM2= 0
##$TOPLEV= 0
##$USERP1= <user>
##$USERP2= <user>
##$USERP3= <user>
##$USERP4= <user>
##$USERP5= <user>
##$WDW= 1
##$XDIM= 32768
##$YMAX_p= 342438671
##$YMIN_p= -53466668
$$ End of Bruker specific parameters
$$ ---------------------------------
##NTUPLES= NMR SPECTRUM
##VAR_NAME=  FREQUENCY,     SPECTRUM/REAL,   SPECTRUM/IMAG
##SYMBOL=    X,             R,               I
##VAR_TYPE=  INDEPENDENT,   DEPENDENT,       DEPENDENT
##VAR_FORM=  AFFN,          ASDF,            ASDF
##VAR_DIM=   32768,         32768,           32768
##UNITS=     HZ,            ARBITRARY UNITS, ARBITRARY UNITS
##FACTOR=    1.13031516577767, 1,            1
##FIRST=     37037.037037037, 1573735,       -19954669
##LAST=      0,             1934901,         -25813887
##MIN=       0,             -53466668,       0
##MAX=       37037.037037037, 342438671,     0
$$ Real data points
##PAGE= N=1
##DATA TABLE= (X++(R..R)), XYDATA
$$ [...]
17542e610900Q4226J371620J987231J823271J239411O26156K35641K76841P65165
17533B798662J383857J798180J981362K048309J981884J696763J222210P09089
17525A5620316L39127J75439O0912k09178n89293p84437n85247j18946L16990
17516A4225683N47303O27004P32078Q10280N70437q5634r17760j603942j984256
17507A2921193k094361k079832k053964k003624j868757j573884j011189k15306
17499B0276M79922O43092J35865p80557j660776k114570k057555j695946j154763
17490h185012n06246K4834K91402M34941O31525Q33533Q91741P75600O09681N29109
17480c668892M91637L02703o0419l88759o41757j028541j595788j986656j720215
$$ plain form
17542 -5610900 -5526674 -4155054 -2167823 -344552 894859 1521015 1756656 2033497 2798662
17533 2798662 4182519 5980699 7962061 10010370 11992254 13689017 14911227 15620316
17525 15620316 15959443 16134882 16195794 15986616 15397323 14612886 14027639 13908693 14225683
17516 14225683 14772986 15399990 16132068 16942348 17512785 17427151 16509391 14905449 12921193
17507 12921193 10826832 8747000 6693036 4689412 2820655 1246771 235582 20276
17499 20276 500198 1143290 1279155 498598 -1162178 -3276748 -5334303 -7030249 -8185012
17490 -8185012 -8691258 -8666424 -8375022 -7940081 -7308556 -6475023 -5583282 -4807682 -4198001 -3668892
17480 -3668892 -3177255 -2874552 -2934971 -3323730 -3965487 -4994028 -6589816 -8576472 -10296687
17471a0296687o53814Q69908K241897K925186K682131J635994K64368p35475j001169
17462b067661q00887n52189l82581k47376j68935j35735j6285J72606K33656J42440
17452c822947Q8596J28194J06127J1750L7226K31132M85668Q07478J315863J991901
17442A380988K591488K797595K519415K074606J883407J996525K145454K084599
17434A9474077J708852J053247K00022p73527j699678k442488l112862l846378
17426A0561265m380779m137363k908646j221570K03057J056477J427661J608265
17418B208367J868732K170107K296604K201300K030367J859662J580386J145251
17410A7360776P05569L89171J92650J21852J60179J41552j31267o83690j324651
$$ plain form
17471 -10296687 -10950501 -10080593 -7838696 -4913510 -2231379 -595385 -331017 -1066492 -2067661
17462 -2067661 -2868548 -3420737 -3803318 -4050694 -4219629 -4355364 -4371649 -4199043 -3965387 -3822947
17452 -3822947 -3734351 -3606157 -3500030 -3488280 -3451054 -3219922 -2734254 -1926776 -610913 1380988
17442 1380988 3972476 6770071 9289486 11364092 13247499 15244024 17389478 19474077
17434 19474077 21182929 22236176 22436198 21662671 19962993 17520505 14407643 10561265
17426 10561265 6180486 2043123 -865523 -2087093 -1884036 -827559 600102 2208367
17418 2208367 4077099 6247206 8543810 10745110 12775477 14635139 16215525 17360776
17410 17360776 18066345 18455516 18648166 18770018 18930197 19071749 18940482 18256792 16932141
17401A6932141j779750j922606j778305j448530j221508j389682j789933j952633
17393C649194j672637j154725o67182k77035N2591K78902K40732j09428m37024
17384i6612k87270L61828J221007K206038L300190M142885M278305L596109K321938
17375B1044418Q08161o59146j924758k806532l039107k448374j212885J48256
17367I910033J151949J585751J484711J023700L22462n83554j516139k119207
17359A1259706k174141j846677j406363q83990k40717L82815Q46825J174699J479798
17350H591955J902992K398456K678548K549285K098790J592316J259003J051427
17342B4122772O84399m7718j079466k140061k947398l367262l370597k982255
$$ plain form
17401 16932141 15152391 13229785 11451480 10002950 8781442 7391760 5601827 3649194
17393 3649194 1976557 821832 154650 -122385 -69794 209108 449840 340412 -96612
17384 -96612 -383882 -22054 1198953 3404991 6705181 10848066 15126371 18722480 21044418
17375 21044418 21852579 21193433 19268675 16462143 13423036 10974662 9761777 9910033
17367 9910033 11061982 12647733 14132444 15156144 15478606 14895052 13378913 11259706
17359 11259706 9085565 7238888 5832525 4948535 4707818 5090633 5937458 7112157 8591955
17350 8591955 10494947 12893403 15571951 18121236 20220026 21812342 23071345 24122772
17342 24122772 24807171 24759453 23679987 21539926 18592528 15225266 11854669 8872414
17334H872414k301265j419944l59053Q08421J781366K128851J724071Q93382N8729
17325A2186972m65075n20142j95691L05071P32272P60656L17685k14134l52402
17316A2555212R4559R08382J585724J563423N90665r81699k516091l537072l807494
17307F455609l342532k478380j721541j389032j394383j340675q63924P0460J170619
17298d833779K045945K463460K445460K139734J634151R77515L04450k31375o67996
17289F277565j185100j781334k264675k541520k582441k258551j481973m16923
17281h234952M75787P03601L02295o4792J28227O98595J152314J215050Q40607
17272b783268K27992j39509L5136M73301P63610Q95949J034522J113471J001080
$$ plain form
17334 8872414 6571149 5151205 4792152 5600573 7381939 9510790 11234861 12128243 12186972
17325 12186972 11721897 11201755 11006064 11311135 12043407 12804063 13121748 12907614 12555212
17316 12555212 12649771 13558153 15143877 16707300 17297965 16316266 13800175 10263103 6455609
17307 6455609 3113077 634697 -1086844 -2475876 -3870259 -5210934 -6074858 -6004398 -4833779
17298 -4833779 -2787834 -324374 2121086 4260820 5894971 6872486 7176936 6945561 6277565
17289 6277565 5092465 3311131 1046456 -1495064 -4077505 -6336056 -7818029 -8234952
17281 -8234952 -7759165 -7055564 -6753269 -6818061 -6689834 -5991239 -4838925 -3623875 -2783268
17272 -2783268 -2555276 -2694785 -2659649 -2186348 -1422738 -526789 507733 1621204 2622284
17263B622284P11655K86432k12817o09665p24139n54704k12690K78787Q60455
17254B445598J211269R72390J77013o90654j122689j021117o11780m5836O38403
17245A952597J316698J813065J981752J745802J148505L10866n70228j197417
17237H501640j429829j406290j186300p00109j19915J91904Q1379k71727n82330
17228C078423p34761q96814j256127j617379j517062p36582L82386J173088J275408
17219h49420Q57920K30539l22573m97348j55622N31768J174346J452650J386994
17210C809254J227010J094369R57419Q69316Q92539Q79702N96773M9221m50317
17201I925286o42836n93518m72944l62049l41409m81420o96108p76909n75706
$$ plain form
17263 2622284 3333939 3620371 3407554 2797889 2073750 1519046 1306356 1585143 2445598
17254 2445598 3656867 4629257 4806270 4115616 2992927 1971810 1360030 1314194 1952597
17245 1952597 3269295 5082360 7064112 8809914 9958419 10269285 9699057 8501640
17237 8501640 7071811 5665521 4479221 3779112 3659197 3851101 3932480 3660753 3078423
17228 3078423 2343662 1446848 190721 -1426658 -2943720 -3680302 -3297916 -2124828 -849420
17219 -849420 8500 239039 -83534 -580882 -736504 -204736 969610 2422260 3809254
17210 3809254 5036264 6130633 7088052 7957368 8849907 9729609 10326382 10375603 9925286
17201 9925286 9282450 8688932 8215988 7853939 7512530 7031110 6335002 5558093 4982387
17192D982387j00164N04306J027483J307050J290680R48544K32356p54333j694804
17183G743505k274913k402991k190234j766091j169334m76076O0775J94549r4552
17174b375362n90752r31784q43755l53280K88183P85463Q72794M79062j39388
17165b808819n71601o42500n59240o34877r56538j279143j249860p37691K6229
17156i414040O53983Q87821O88130K14725j95609k24055J29335O22451J005321
17147e631938J067851P91172L23138k58876q91381j474648j910988k026454j686427
17138a1698551r80803j58564N52468R71335J002803P79070N87217P29667J364139
17129f851219K344916L304388L841839L793691L395647K968220K594509K166721
$$ plain form
17192 4982387 4882223 5386529 6414012 7721062 9011742 9960286 10192642 9438309 7743505
17183 7743505 5468592 3065601 875367 -890724 -2060058 -2536134 -2475359 -2280810 -2375362
17174 -2375362 -2966114 -3897898 -4741653 -5094933 -4806750 -4021287 -3148493 -2669431 -2808819
17165 -2808819 -3380420 -4022920 -4582160 -5217037 -6173575 -7452718 -8702578 -9440269 -9414040
17156 -9414040 -8760057 -7872236 -7184106 -6969381 -7164990 -7389045 -7259710 -6637259 -5631938
17147 -5631938 -4564087 -3772915 -3449777 -3708653 -4600034 -6074682 -7985670 -10012124 -11698551
17138 -11698551 -12679354 -12837918 -12285450 -11314115 -10311312 -9532242 -8945025 -8215358 -6851219
17129 -6851219 -4506303 -1201915 2639924 6433615 9829262 12797482 15391991 17558712
17121A7558712J494858M61678p73199j836556k407855k339403j740852j017662
17113I399721o40561p90995j191915j332768r51712j93378O21411J102705Q83493
17104F906001j45161j705712l213076m039794l908136k987944j663206l63687
17096a1120715O14331J314794J926035K423086K614755K433070K075884J785127
17088D066367J571182J306505R19923M27563j21526o95456j206097j419706j170466
17079C678289o41444j99243k1679j59719o33478j235089j570135j414299q58324
17070c055121j51739M95481J065579J660469K239466K556040K369412J772323
17062H951910J208064R86444R24431O13067r3255j005802j806406k232296k210539
$$ plain form
17121 17558712 19053570 19515248 18742049 16905493 14497638 12158235 10417383 9399721
17113 9399721 8759160 7968165 6776250 5443482 4491770 4298392 4919803 6022508 6906001
17104 6906001 6760840 5055128 1842052 -2197742 -6105878 -9093822 -10757028 -11120715
17096 -11120715 -10506384 -9191590 -7265555 -4842469 -2227714 205356 2281240 4066367
17088 4066367 5637549 6944054 7863977 8291540 8170014 7474558 6268461 4848755 3678289
17079 3678289 3036845 2837602 2815923 2656204 2022726 787637 -782498 -2196797 -3055121
17070 -3055121 -3206860 -2711379 -1645800 14669 2254135 4810175 7179587 8951910
17062 8951910 10159974 11146418 12070849 12683916 12590661 11584859 9778453 7546157 5335618
17053E335618j837896j233878m73223L16870Q70633R36707O23390M39409P13727
17044E691357J201808J493177J403231R73456M30496L2779n9648J28929K82626
17035A1578211L293p74724j689863k302178k386026j913606r84191K19488J437455
17026C187859K267407K363159J764519Q73358K02874M9008K74698M78427M02325
17017A1863634J67176J01516M44111J186761K084856K766570K827757K185479
17009B3627860J324760P81877O20440O15879N50595K69051k96518j115328j953567
17000B4425049k461326k523350k300540j953923j467111q39542l58000l16790
16992A2204467o27431r58883j121905j195095j243082j155101p68989j3855R09723
$$ plain form
17053 5335618 3497722 2263844 1790621 2107491 2978124 3914831 4538221 4977630 5691357
17044 5691357 6893165 8386342 9789573 10763029 11193525 11226304 11166656 11295585 11578211
17035 11578211 11581504 10806780 9116917 6814739 4428713 2515107 1530916 1750404 3187859
17026 3187859 5455266 7818425 9582944 10456302 10659176 10708184 10982882 11461309 11863634
17017 11863634 12030810 12132326 12576437 13763198 15848054 18614624 21442381 23627860
17009 23627860 24952620 25734497 26354937 26970816 27521411 27790462 27493944 26378616 24425049
17000 24425049 21963723 19440373 17139833 15185910 13718799 12879257 12521257 12204467
16992 12204467 11577036 10618153 9496248 8301153 7058071 5902970 5133981 5120126 6029849
16983F029849J571561J747377J606463J436941J370041J403398J463233J421368
16975A8050231J184638P05681j4925q18930j470950j761413j563771r93912l22869
16966A2993780K34159N67240O91824P01375O57369O30463P04406R34129J351128
16957A9465873J796013J968377J781629J327600N82591l72446j085473j201740
16949B4262424r16432o89077p88158j107825j287669j093779o17132j23533J05381
16940A7744200k18728j202925k512810l605138m181757m170281l593652k631423
16932d372514j520593m13191N71416J339487J878494K136512J985964J453930
16924C059505Q66727O46634Q98384J273568J414961J355531J199875Q25987J73667
$$ plain form
16983 6029849 7601410 9348787 10955250 12392191 13762232 15165630 16628863 18050231
16975 18050231 19234869 19940550 19925625 19106695 17635745 15874332 14310561 13316649 12993780
16966 12993780 13227939 13795179 14487003 15188378 15845747 16476210 17180616 18114745 19465873
16957 19465873 21261886 23230263 25011892 26339492 26922083 26549637 25464164 24262424
16949 24262424 23345992 22656915 21868757 20760932 19473263 18379484 17762352 17638819 17744200
16940 17744200 17525472 16322547 13809737 10204599 6022842 1852561 -1741091 -4372514
16932 -4372514 -5893107 -6306298 -5734882 -4395395 -2516901 -380389 1605575 3059505
16924 3059505 3926232 4572866 5471250 6744818 8159779 9515310 10715185 11541172 11714839
16915A1714839o16396j431365k225207k882694l260174l325147l165662k864480
16907h056286k385019j671965q84800l31320j40350j35599p2370J12331L32702
16898a3232676M90035N86713P30095R87361J253230J327112J134206Q11984N63237
16889e348703M01354Q5107n33110j211964j521032j167558j88231R71457J795759
16880f716921K093869J916357J437266R55736O88761N65296L39797j65278r51407
16871A63476j839736k507226k741162k604252k245719j811075j398093r45570
16863a5929357m64172j50551j22690l08080n04618m86768j25630M84357J004916
16854a6602593J130192R21050O72350M43752P2248m34965q27669r14195o32038
$$ plain form
16915 11714839 11098443 9667078 7441871 4559177 1299003 -2026144 -5191806 -8056286
16907 -8056286 -10441305 -12113270 -12998070 -13329390 -13469740 -13605339 -13677709 -13565378 -13232676
16898 -13232676 -12742641 -12155928 -11425833 -10438472 -9185242 -7858130 -6723924 -5911940 -5348703
16889 -5348703 -4947349 -4862242 -5395352 -6607316 -8128348 -9295906 -9484137 -8512680 -6716921
16880 -6716921 -4623052 -2706695 -1269429 -313693 375068 940364 1280161 1114883 163476
16871 163476 -1676260 -4183486 -6924648 -9528900 -11774619 -13585694 -14983787 -15929357
16863 -15929357 -16393529 -16544080 -16666770 -16974850 -17479468 -17966236 -18091866 -17607509 -16602593
16854 -16602593 -15472401 -14551351 -13879001 -13435249 -13363001 -13797966 -14625635 -15539830 -16171868
16845a6171868J01036J181884K188892K775872K888000K490322J608761O43185
16837b293916M9747q9350N8971L32028O29870Q87351J050352J053554Q67880N36498
16827C082985J51736j87019m62251p11431q95907r26085q51536r31391j374321
16818c105220k045072k493698k323682j555420n59892K73580P73112R69513R68651
16809i098128Q90129Q10223O93191M83335K61960J30845K3673k88702q82924j437718
16799h414116j546300j189515o85183j92074L48559Q28959J009306Q33473M45193
16790h561698N5595j68071j43587J80466Q43940J789939K705401L152286K962980
16781B817251K298997J450476P93264O26622Q49420J069254R82721M46797m07000
$$ plain form
16845 -16171868 -16070832 -14888948 -12700056 -9924184 -7036184 -4545862 -2937101 -2293916
16837 -2293916 -2244169 -2333519 -2274548 -1942520 -1312650 -425299 625053 1678607 2546487 3082985
16827 3082985 3234721 3047702 2585451 1874020 978113 52028 -799508 -1730899 -3105220
16818 -3105220 -5150292 -7643990 -9967672 -11523092 -12082984 -11809404 -11036292 -10066779 -9098128
16809 -9098128 -8207999 -7397776 -6704585 -6221250 -5959290 -5828445 -5804772 -6093474 -6976398 -8414116
16799 -8414116 -9960416 -11149931 -11835114 -12027188 -11678629 -10849670 -9840364 -9006891 -8561698
16790 -8561698 -8506103 -8674174 -8817761 -8637295 -7793355 -6003416 -3298015 -145729 2817251
16781 2817251 5116248 6566724 7359988 7986610 8836030 9905284 10888005 11334802 10927802
16772A0927802j047309r86848k50567P04901J340351J420906J159199R49484R83031
16763A5200950J184125J461329J745837J878819J677620J098053K77186n15158
16755B4008761j029842j327244j669377k126952k539955k740991k718042k620728
16747G235630k508182k204958j597314q18579L3976R67944J758312K087238J952111
16738F906178J582980J230729J014417Q47838P09845P18221Q71246J085436J309545
16729A6276435J453431J385293J126159R63058J143308J530518J643311J140710
16721B6662223K67298m08652o21590n52920l99853j81852J23044N12396Q64241
16712B6264335J016529R62525P02452J11490p13704j353243j642048j883742k313333
$$ plain form
16772 10927802 9880493 8893645 8643078 9347979 10688330 12109236 13268435 14217919 15200950
16763 15200950 16385075 17846404 19592241 21471060 23148680 24246733 24523919 24008761
16755 24008761 22978919 21651675 19982298 17855346 15315391 12574400 9856358 7235630
16747 7235630 4727448 2522490 925176 106597 140573 1108517 2866829 4954067 6906178
16738 6906178 8489158 9719887 10734304 11582142 12291987 13010208 13881454 14966890 16276435
16729 16276435 17729866 19115159 20241318 21204376 22347684 23878202 25521513 26662223
16721 26662223 26929521 26520869 25899279 25346359 24946506 24764654 24887698 25400094 26264335
16712 26264335 27280864 28243389 28945841 29057331 28343627 26990384 25348336 23464594 21151261
16703B1151261k862251l396112l704737l498698k742392j764206r22359l04386
16695A956120K09523O24850P70047O20211L14890j19616o91639j196326j269046
16686A219014p51596N126L92493K00935k54346o53272r32877j018514p52158j35487
16676b680682P44725J749341K501577K546075J753258M47930p79095j314580q65692
16667D102857J77671R93547J095279O32974j0956o07084j091073j382120j318165
16658B592930q49934k01747L20096M83210J71894l64458n91750j98836O41100
16649B002505J436520J705698J292072M89792k00334n52761p14804q51893r42579
16640C664216q14324j89644J093873K603641L423162L030021J760952M30963l11811
$$ plain form
16703 21151261 18289010 14892898 11188161 7689463 4947071 3182865 2260506 1956120
16695 1956120 2165643 2790493 3560540 4180751 4495641 4376025 3684386 2488060 1219014
16686 1219014 467418 472544 865037 1065972 811626 158354 -774523 -1793037 -2545195 -2680682
16676 -2680682 -1935957 -186616 2314961 4861036 6614294 7062224 6283129 4968549 4102857
16667 4102857 4280528 5274075 6369354 7002328 6991372 6384288 5293215 3911095 2592930
16658 2592930 1742996 1541249 1861345 2344555 2516449 2151991 1560241 1361405 2002505
16649 2002505 3439025 5144723 6436795 6926587 6726253 6173492 5458688 4606795 3664216
16640 3664216 2849892 2660248 3754121 6357762 9780924 12810945 14571897 15002860 14691049
16631A4691049l75887k36714m33901r46803j263717r97153l23085K51257M86824
16622A0851870M70345L03434J1419l39044n40415l10351M19497J272213J763688
16613A3902656J786636J563517J318216J099260P65521Q7390j034496k475700
16605A7013000l937180m954970n148140m580489l620451k578053j579688o75432
16597a0061403N7849N19507O18723M32550K54355L16597O24153J017774J249036
16588d970859J045959K95695p58981j734921k369311k479875k063207j446745
16580a4482245j036345r51567r10642n46357K16918J288885K536575L677182M404861
16571e802735M516968L883050K619251J235058K98594k120K38684R63970J990280
$$ plain form
16631 14691049 14315162 14078448 13644547 12697744 11434027 10436874 10113789 10365046 10851870
16622 10851870 11322215 11625649 11637068 11298024 10757609 10447258 10866755 12138968 13902656
16613 13902656 15689292 17252809 18571025 19670285 20435806 20523196 19488700 17013000
16605 17013000 13075820 8120850 2972710 -1607779 -5228230 -7806283 -9385971 -10061403
16597 -10061403 -10003554 -9484047 -8865324 -8432774 -8178419 -7861822 -7237669 -6219895 -4970859
16588 -4970859 -3924900 -3629205 -4388186 -6123107 -8492418 -10972293 -13035500 -14482245
16580 -14482245 -15518590 -16470157 -17380799 -17927156 -17710238 -16421353 -13884778 -10207596 -5802735
16571 -5802735 -1285767 2597283 5216534 6451592 6750186 6748066 6986750 7950720 9941000
16562I941000K815091K957971K348398J361779M80775l6904j64656m6270O9633
16553A9726817Q6316J27303K20488K15840P697l87809q78597j269084j316293
16544A6532678j024182p39491p53565j016909j312627j485536j455888j214281
16536G530199p77488j54742M90218R29432J096707R72648N28717j61591r27140
16527I526960j573740k004187k173521j997082j488793r13292o22337o35937o40958
16518b522887m22293n7184K80190N84659R19148J233976J505941J796752K101744
16509E420046K185445J686715O02189n34783j158775j179107q97044n91612l30718
16500E202356j58026k01156m24358n57645m20412j23734R9403J21402j05510n88097
$$ plain form
16562 9941000 12756091 15714062 18062460 19424239 19905014 19868110 19703454 19657184 19726817
16553 19726817 19813133 19940436 20160924 20376764 20384461 19996652 19118055 17848971 16532678
16544 16532678 15508496 14769005 14015440 12998531 11685904 10200368 8744480 7530199
16536 7530199 6752711 6597969 7088187 8017619 9114326 10086974 10615691 10454100 9526960
16527 9526960 7953220 5949033 3775512 1778430 289637 -623655 -1245992 -1881929 -2522887
16518 -2522887 -2945180 -3002364 -2722174 -2137515 -1218367 15609 1521550 3318302 5420046
16509 5420046 7605491 9292206 9894395 9359612 8200837 7021730 6124686 5533074 5202356
16500 5202356 5044330 4843174 4418816 3861171 3440759 3317025 3416428 3537830 3432320 2844223
16490B844223j094819j262559r60350k75635O61152J652859K337947K326435J610215
16481G839468O97344P6414k76392n65397p41355o94319m63054j07211M21699J069434
16471G256631J505707J467573J136604R51761J056375J190456J149253Q97592
16463A6611952J97563j431357m026034o496084p277074n994816l623219j337611
16455a3376680J40685P06711O79703M89122M32523O07129J018958J618310K197991
16446e485548K393404J992207J277061Q14209R17343J459399K057664K362091
16438G787830K265955J913257J551044J304705J167563J197734J421091J653793
16430B0262972J631607J249557O85210K83626J62247Q0856j73908o73954j516939
$$ plain form
16490 2844223 1749404 486845 -473505 -749140 -87988 1564871 3902818 6229253 7839468
16481 7839468 8536812 8613226 8336834 7771437 7030082 6335763 5872709 5765498 6187197 7256631
16471 7256631 8762338 10229911 11366515 12318276 13374651 14565107 15714360 16611952
16463 16611952 16809515 15378158 11352124 4856040 -2421034 -8415850 -12039069 -13376680
16455 -13376680 -13235995 -12529284 -11849581 -11360459 -10927936 -10320807 -9301849 -7683539 -5485548
16446 -5485548 -3092144 -1099937 177124 991333 1908676 3368075 5425739 7787830
16438 7787830 10053785 11967042 13518086 14822791 15990354 17188088 18609179 20262972
16430 20262972 21894579 23144136 23829346 24112972 24275219 24356075 24182167 23508213 21991274
16421B1991274k588330l418715l569673k972895j939168r08156k02138N3248l8715
16412F406732k58460n40442j035106j767105k351319k333497j691307p72234Q5467
16403d257271O88126R08309O52814m622o80488r00048o40130m22028o58328j213512
16393f527178j735830k014753j854819j039230K81075J593652K663669L885907
16385d747507N658018P481298Q230077P281393M962985K170710m5024r14761n14279
16376B9562910K75737O49102M77863J2962o05258j300557j905511k320059k533643
16367B2313546k503653k111647j298689l93670l7914n32199j523883k475782l020168
16358H415941k890602k092810j098524m30635j73874q9168j6340L7356J16748
$$ plain form
16421 21991274 19402944 15984229 12414556 9441661 7502493 6594337 6392199 6445447 6406732
16412 6406732 6148272 5607830 4572724 2805619 454300 -1879197 -3570504 -4342738 -4257271
16403 -4257271 -3569145 -2660836 -2008022 -2012644 -2693132 -3593180 -4233310 -4655338 -5313666 -6527178
16393 -6527178 -8263008 -10277761 -12132580 -13171810 -12890735 -11297083 -8633414 -4747507
16385 -4747507 910511 8391809 16621886 23903279 28866264 31036974 30991950 30077189 29562910
16376 29562910 29838647 30487749 30965612 30978574 30373316 29072759 27167248 24847189 22313546
16367 22313546 19809893 17698246 16399557 16005887 15967973 15435774 13911891 11436109 8415941
16358 8415941 5525339 3432529 2334005 1903370 1729496 1640328 1623988 1661344 1778092
16349A778092K86688M53588M32626Q2503n94694j456746k359224l115999l427745
16340g920911k972844j608829L09329K013101K881413K820253K285992J867120
16332c25376J725736J592037J235510O43326j58311j116723k068904k825212l216552
16323d514469l150473k754063k234245j671839j157361q53964q59199j165336
16315a8360949j676433k205710k562471k655979k405814j442899Q34800M283990
16307b6191465P332554Q441322P713541O199277M647488L269522K116599J305605
16299A4834443P94175M25911K96975N26667Q45931Q39745M25218k14930r44390
16290A7829745j686351k342763k771068k839544k571447k208775j992236j828995
$$ plain form
16349 1778092 2064780 2518368 2950994 3033497 2438803 982057 -1377167 -4493166 -7920911
16340 -7920911 -10893755 -12502584 -12193255 -10180154 -7298741 -4478488 -2192496 -325376
16332 -325376 1400360 2992397 4227907 4871233 4712922 3596199 1527295 -1297917 -4514469
16323 -4514469 -7664942 -10419005 -12653250 -14325089 -15482450 -16336414 -17195613 -18360949
16315 -18360949 -20037382 -22243092 -24805563 -27461542 -29867356 -31310255 -30475455 -26191465
16307 -26191465 -18858911 -10417589 -2704048 3495229 8142717 11412239 13528838 14834443
16299 14834443 15628618 16054529 16351504 16878171 17724102 18563847 18989065 18774135 17829745
16290 17829745 16143394 13800631 11029563 8190019 5618572 3409797 1417561 -411434
16282d11434j378371n62640K44453N63855K53698k41584k28307M81151J354398
16273G5219J831365J913296J889844J863081J740348J420728Q73900J64857n46153
16264A1226485j031505j121198q64541m50736k0320L64441O51406Q02249P77884
16255A0334165M47356k37621r05748r77224k92729P55089J764854K570412K941656
16246A6400210K691055J969810J091442L51339k4541j50069m61035j097683j644058
16237A9126470j769597j667428j632664j674071j688442j657496j554737j243760
16229F238275o41775L4038L50093R4791m60387q60931r05318p78924p59238q77669
16219A432955r58451q17851m44171m3739J58719J42113R3023K44568N89579Q94251
$$ plain form
16282 -411434 -1789805 -2352445 -2107992 -1544137 -1290439 -1532023 -1760330 -1279179 75219
16273 75219 1906584 3819880 5709724 7572805 9313153 10733881 11607781 11772638 11226485
16264 11226485 10194980 9073782 8209241 7758505 7738185 8102626 8754032 9556281 10334165
16255 10334165 10781521 10543900 9638152 8660928 8368199 9123288 10888142 13458554 16400210
16246 16400210 19091265 21061075 22152517 22503856 22479315 22329246 21868211 20770528 19126470
16237 19126470 17356873 15689445 14056781 12382710 10694268 9036772 7482035 6238275
16229 6238275 5596500 5630538 5980631 6075422 5615035 4754104 3848786 3069862 2310624 1432955
16219 1432955 474504 -343347 -787518 -831257 -672538 -530425 -437402 -192834 396745 1290996
16209A290996J054634J189765J477567J873501J993936J505922N82095l07142
16201A0661274q65804j041270q63043l40290M76474J299403J601381J071948K8055
16192A2028128q41045j125129r23747n28656j28500K17288M87499N71450K94188
16183A0051476l60669j111621j551624j597628j534649j520769j356612q24878
16175A93026o8211N14950O45276L85570K9750j85330j91718n2377K1506k11463
16165A080979o91014j051506r63812m08773L29149R72205J425380J609741J452321
16156C754670J086278P68781O46191O93039P37045N71593K09491j62353m46673
16147G858062n37793k22524N44274J583399K600706L139030K838888J862357P79555
$$ plain form
16209 1290996 2345630 3535395 5012962 6886463 8880399 10386321 10968416 10661274
16201 10661274 9795470 8754200 7891157 7550867 8027341 9326744 10928125 12000073 12028128
16192 12028128 11187083 10061954 9138207 8609551 8481051 8698339 9185838 9757288 10051476
16183 10051476 9690807 8579186 7027562 5429934 3895285 2374516 1017904 193026
16175 193026 124815 639765 1285041 1670611 1700361 1515031 1323313 1270936 1292442 1080979
16165 1080979 389965 -661541 -1625353 -2034126 -1704977 -732772 692608 2302349 3754670
16156 3754670 4840948 5609729 6255920 6948959 7686004 8257597 8467088 8304735 7858062
16147 7858062 7320269 7097745 7642019 9225418 11826124 14965154 17804042 19666399 20445954
16138B0445954M752m80493q81991j275013j561897j594936j268520o57928j44213
16129A2585715p3896l15991m65149l24159k0673K09885K05956r2272p11074j623962
16119I374380k525254k859991k342121j330751m87001j71267l33537q03921j440588
16110b920051j996241k164269j846196j128434j40588Q95473J754087K367141
16102e179078K701173K689483K408132K042850J725183J521651J356767J006397
16094A0272558M32027r1101l99828o37967r20228j080130q98006m22828N2386
16085F306883K72111J90280j25254n33467p62602n85726j08293L33752M90982
16076E478666K75249k27350o84483p47673m41893q1070J56431L16300M35198M91689
$$ plain form
16138 20445954 20450706 19970213 19088222 17813209 16251312 14656376 13387856 12729928 12585715
16129 12585715 12511819 12195828 11730679 11406520 11385847 11595732 11801688 11709416 10998342 9374380
16119 9374380 6849126 3989135 1647014 316263 -170738 -342005 -675542 -1479463 -2920051
16110 -2920051 -4916292 -7080561 -8926757 -10055191 -10195779 -9300306 -7546219 -5179078
16102 -5179078 -2477905 211578 2619710 4662560 6387743 7909394 9266161 10272558
16094 10272558 10704585 10613484 10213656 9575689 8655461 7575331 6677325 6254497 6306883
16085 6306883 6578994 6769274 6644020 6110553 5347951 4762225 4653932 4987684 5478666
16076 5478666 5753915 5526565 4842082 4094409 3652516 3571446 3727877 4044177 4479375 4971064
16066D971064N40346O66133P07960L12956o11647j678076k307836k260402j684434
16057a343936p95824K59957J284896J950957K006916J472053O35053n910m6934
16048E417228L80922O60583L57242l25936q82857r81863o36768j24858L71531
16039D235224R01350J363356J529714J462693J317292J040722O00229J26224k94361
16030A2282443o68536r80121j120263r97166p64298o35016n65411m11177r2224
16021F048231L53488O31165M12938l47369j430903k431891k900276k634938j883035
16012d182590j126621p31674p28875p69895m27821L77977J247815J666024J528126
16003c147534J177229R13790O85418L28782l9426o5585L79551R90304J320131
$$ plain form
16066 4971064 5511410 6177543 6885503 7198459 6586812 4908736 2600900 340498 -1343936
16057 -1343936 -2139760 -1879803 -594907 1356050 3362966 4835019 5470072 5464162 5417228
16048 5417228 5798150 6458733 6815975 6490039 5607182 4625319 3988551 3863693 4235224
16039 4235224 5136574 6499930 8029644 9492337 10809629 11850351 12450580 12576804 12282443
16030 12282443 11613907 10633786 9513523 8516357 7752059 7117043 6551632 6140455 6048231
16021 6048231 6401719 7032884 7445822 7098453 5667550 3235659 335383 -2299555 -4182590
16012 -4182590 -5309211 -6040885 -6769760 -7539655 -7967476 -7589499 -6341684 -4675660 -3147534
16003 -3147534 -1970305 -1056515 -371097 -42315 -81741 -147326 232225 1222529 2542660
15994B542660J165185O71642J25542k64496l83986j75987L20009J063164K115030
15985G178763L346048M127176L693360J934913l69540k218733l109521l097334
15977A1485132k503740j656786q29628l19375l30299p90277j317571j423146j000395
15968A313915n02251m39607r27431j800951k746011l243561k871723j791563o08481
15959a3617664K88844R80036J554358J772459J480564J020725P95248P72158Q28045
15950d125227J073931J486230J706371J436715P42489j01709p90641j059797q97186
15941e28824n94885m33350m08307l47991j94726o1312Q845J46852M11899O79882
15931a321917Q09128P20434M47523J14338k37098o26762j041471j422095j575502
$$ plain form
15994 2542660 3707845 4379487 4505029 4240533 3856547 3680560 4000569 5063733 7178763
15985 7178763 10524811 14651987 18345347 20280260 19910720 17691987 14582466 11485132
15977 11485132 8981392 7324606 6494978 6175603 5845304 5055027 3737456 2314310 1313915
15968 1313915 811664 372057 -555374 -2356325 -5102336 -8345897 -11217620 -13009183 -13617664
15959 -13617664 -13328820 -12348784 -10794426 -9021967 -7541403 -6520678 -5725430 -4953272 -4125227
15950 -4125227 -3051296 -1565066 141305 1578020 2320509 2218800 1428159 368362 -528824
15941 -528824 -1123709 -1557059 -1965366 -2313357 -2508083 -2569395 -2560550 -2413698 -2001799 -1321917
15931 -1321917 -512789 207645 655168 769506 532408 -94354 -1135825 -2557920 -4133422
15922d133422j223502m25361K92014N55051O43804R68290J395445J515986J187750
15913G76055O40913K31405N6705j8308o1563j89928o09113j296645j872607j956529
15903d299615j545234r24344l83596p226K68994L84871J45596n65184j623056
15894h548794k721572l533099l706455k990716j544220J04957J558689K718435
15886a8662775L477532L663929L259665K516975J894924J726836J972321K368933
15878B218340K595986K473819K136071J752570J288731P02428N7627o39883j459107
15869A1126582k344647l070410l446589l379627k733527j569877l53361L93892
15861e377564M78604J17396k77820l89433j31922L63364Q99530J414383J978989
$$ plain form
15922 -4133422 -5356924 -5782285 -5490271 -4935220 -4291416 -3323126 -1927681 -411695 776055
15913 776055 1416968 1648373 1705078 1686770 1625207 1435279 826166 -470479 -2343086 -4299615
15903 -4299615 -5844849 -6769193 -7152789 -7160015 -6891021 -6506150 -6360554 -6925738 -8548794
15894 -8548794 -11270366 -14803465 -18509920 -21500636 -23044856 -22939899 -21381210 -18662775
15886 -18662775 -15185243 -11521314 -8261649 -5744674 -3849750 -2122914 -150593 2218340
15878 2218340 4814326 7288145 9424216 11176786 12465517 13167945 13225572 12585689 11126582
15869 11126582 8781935 5711525 2264936 -1114691 -3848218 -5418095 -5771456 -5377564
15861 -5377564 -4898960 -4781564 -5059384 -5448817 -5580739 -5217375 -4317845 -2903462 -924473
15852i24473K522526K678324K128115J064239K0713p15177j212450j625602k029490
15843A906725k401305k661913k648087k218047j489015p35357k0099Q18658J721991
15834g726449K390815K710919K729369K405310J660637N86180n03388j250391
15826C003002j489523j291275q36945k51570M53974J363525K496641L528120L930501
15817A0906450L548949K804369K185650J750435J261075O07011j7457l34861l86907
15808B2324714n11361r53531j571442j898571j661117j107401o64619m82845m69968
15799A3003859n28804n51093m74891l70151l28565m81455q84398j401198j876495
15790F106809k177334k130928j632809p47898L41447J260989J544642J024529
$$ plain form
15852 -924473 1598053 4276377 6404492 7468731 7489444 6774267 5561817 3936215 1906725
15843 1906725 -494580 -3156493 -5804580 -8022627 -9511642 -10246999 -10267098 -9448440 -7726449
15834 -7726449 -5335634 -2624715 104654 2509964 4170601 4756781 4253393 3003002
15826 3003002 1513479 222204 -614741 -866311 -412337 951188 3447829 6975949 10906450
15817 10906450 14455399 17259768 19445418 21195853 22456928 23063939 23046482 22711621 22324714
15808 22324714 21813353 20859822 19288380 17389809 15728692 14621291 13956672 13473827 13003859
15799 13003859 12475055 11923962 11449071 11078920 10750355 10268900 9384502 7983304 6106809
15790 6106809 3929475 1798547 165738 -582160 -240713 1020276 2564918 3589447
15782C589447J1965q68597j177606r68551n13892L1040O81112J391267J934491
15773D110676K134049J969829J495189Q06040M294q24520j555509j886853j551814
15764D701381p22930J04465N39083N40665L81645L94500P45536J371433K042172
15755A0097950K510151K627926K358614J755478R29756O4846n54264p77331q08018
15746A8205108r98100j457980k030895k466970k575536k388038k022378j496953
15738B768258q61690k66621J41943L87830O84309J106395J436977J492202J351123
15729H240726J143293Q75820N69747L60113L73537N57945P08243O74491M93222
15720A3997137L00601K02969J61863N3966j68116m70748p19847q29287r86107
$$ plain form
15782 3589447 3601412 2732815 1555209 586658 72766 103806 784918 2176185 4110676
15773 4110676 6244725 8214554 9709743 10515783 10520077 9695557 8140048 6253195 4701381
15764 4701381 3978451 4082916 4621999 5162664 5544309 5938809 6684345 8055778 10097950
15755 10097950 12608101 15236027 17594641 19350119 20279875 20344721 19790457 19013126 18205108
15746 18205108 17207008 15749028 13718133 11251163 8675627 6287589 4265211 2768258
15738 2768258 1906568 1639947 1781890 2169720 2854029 3960424 5397401 6889603 8240726
15729 8240726 9384019 10259839 10829586 11189699 11563236 12121181 12829424 13503915 13997137
15720 13997137 14297738 14500707 14662570 14716536 14548420 14077672 13357825 12528538 11542431
15711A1542431j439652k043421k283678j888978j151930n63080m14554o58012
15703A099126r25135q46337l21077M79408J277408J883182K157775J879187Q84304
15694G567841n32406j683808k090608j745991j020697m53548l65839o97624j146984
15685b169664j349445j051672k49084P48215J457376J624121J526826J734267
15677B270940K444560L268255L705998L523430K745342J607017N09994j60188
15669A9915348l90799m72982n29661n19125n23753p07161j073465j418661j491489
15660A2788252j270437j024154r50568r69902q48104l89153L35973J057730J534120
15651A0263757J596663J288342R10061O06049J73027m34211q65089q47748m88834
$$ plain form
15711 11542431 10102779 8059358 5775680 3886702 2734772 2171692 1757138 1099126
15703 1099126 173991 -672346 -993423 -514015 763393 2646575 4804350 6683537 7567841
15694 7567841 7035435 5351627 3261019 1515028 494331 40783 -325056 -1022680 -2169664
15685 -2169664 -3519109 -4570781 -4819865 -4071650 -2614274 -990153 536673 2270940
15677 2270940 4715500 7983755 11689753 15213183 17958525 19565542 20075536 19915348
15669 19915348 19524549 19051567 18521906 18002781 17479028 16771867 15698402 14279741 12788252
15660 12788252 11517815 10493661 9543093 8573191 7725087 7335934 7671907 8729637 10263757
15651 10263757 11860420 13148762 14058823 14664872 14837899 14403688 13538599 12690851 12202017
15642A2202017K616N32874J016810J310882J331826J209061J217851J373456J227714
15633B1425107L64294j096604k493196l095290k717394j838568j161593r68553
15625H418203r84398r03090p62977p53312r00639j096937j196242j043135n72578
15616B04895Q5825N64534N19712N1542l35544k58736J69954N05504M88502L15414
15606B311602L14445N43718Q61998J101469J145239J043769Q96193O52475K86397
15597I157305L6917J82734O85454J262822J712491J980465K006857J679013R18882
15588A9622940k07940j446682k476900l129566l444637l560308l528279l206508
15580a377880k450194j381070l21461M67134Q31099P59221N50806O31145J040464
$$ plain form
15642 12202017 12204633 12737507 13754317 15065199 16397025 17606086 18823937 20197393 21425107
15633 21425107 21789401 20692797 18199601 15104311 12386917 10548349 9386756 8418203
15625 8418203 7433805 6530715 5767738 5014426 4113787 3016850 1820608 777473 204895
15616 204895 290720 855254 1374966 1426508 1090964 832228 1002182 1507686 1996188 2311602
15606 2311602 2626047 3169765 4031763 5133232 6278471 7322240 8218433 8870908 9157305
15597 9157305 9194222 9376956 10062410 11325232 13037723 15018188 17025045 18704058 19622940
15588 19622940 19415000 17968318 15491418 12361852 8917215 5356907 1828628 -1377880
15580 -1377880 -3828074 -5209144 -5530605 -5063471 -4232372 -3473151 -2922345 -2291200 -1250736
15571a250736J352698J180981O55712L01021M64926J155940K208587L204378L504758
15562A2778265K887780J857992J007443N42847L28263p379o88545j424050j737644
15553A5544972j527376j068330o82062m97074m50235n01361o34399p32989p09320
15544H741826n57176l08666j04665k1809R3657K95338M12738M82083P23057J141348
15534A0897731J516577J605807J357315Q95034K75139m63823j134851j486863
15526A3462066j402064j081552q39565p22383o38515o15998p27499r53994j142412
15517E338084j101204q20183m86031j57615K45230N95774O16069J93336m75437
15508C948023r96373j024630m14209O22954J609707K243251K454389K107254J133343
$$ plain form
15571 -1250736 101962 1282943 1938655 2239676 2704602 3860542 6069129 9273507 12778265
15562 12778265 15666045 17524037 18531480 19074327 19402590 19395211 18706666 17282616 15544972
15553 15544972 14017596 12949266 12267204 11770130 11319895 10818534 10184135 9451146 8741826
15544 8741826 8184650 7875984 7771319 7749510 7843167 8138505 8551243 9033326 9756383 10897731
15534 10897731 12414308 14020115 15377430 16272464 16547603 16083780 14948929 13462066
15526 13462066 12060002 10978450 10138885 9416502 8777987 8161989 7434490 6480496 5338084
15517 5338084 4236880 3416697 2930666 2773051 3018281 3614055 4230124 4423460 3948023
15508 3948023 2951650 1927020 1512811 2135765 3745472 5988723 8443112 10550366 11683709
15499A1683709j09960j112726j707457j969150j972237j846653j750417j652992
15491d37883j386902r29382m17492k6712O5489j35196l49314k99219k5631K48128
15481c694114M55779N42235L34648j27012n01348m77175k9657N16182P19370M88495
15471a772597J24934k030K36216N85267O45443L48773K39973R94601K472559L698178
15461G571317L965048L505832L009875K791276K588167K087216J365607P93568
15453B7677906O37985Q41616J214618J601195J821753J752020J434030J003046
15445C7984169N72885J45206l54981q89883j316896j654891k040954k470302k722893
15436B7251460k484520j708863q14503l59290o15107j379155k109608k293458
$$ plain form
15499 11683709 11573749 10461023 8753566 6784416 4812179 2965526 1215109 -437883
15491 -437883 -1824785 -2754167 -3171659 -3198371 -3132882 -3268078 -3617392 -3916611 -3942242 -3694114
15481 -3694114 -3238335 -2696100 -2361452 -2488464 -2989812 -3466987 -3496644 -2980462 -2261092 -1772597
15471 -1772597 -1647663 -1649693 -1413477 -828210 -182767 166006 405979 1400580 3873139 7571317
15461 7571317 11536365 15042197 18052072 20843348 23431515 25518731 26884338 27677906
15453 27677906 28315891 29157507 30372125 31973320 33795073 35547093 36981123 37984169
15445 37984169 38557054 38702260 38347279 37457396 36140500 34485609 32444655 29974353 27251460
15436 27251460 24766940 23058077 22243574 21884284 21269177 19890022 17780414 15486956
15428A5486956j750460p03081L60802J021828J228111J219884J258224J435203
15420A9557467J652596J686075J240206K38975j038045k200965k875336k797167
15412A5463806k011662q63919J89340O56690K65776o84629j508963j703456j286470
15403H516513p12430l39382q7259J83749L72218L30767R5077k35175p13663j369636
15393F040779j998381k312546k085199j315351m08614J67875L82808N00031O05384
15384d23214N80939L83548O4312l11864o61313q52275p81288n07257j49417J81475
15374b476354L11290J46250r2192n3291L27294P77220R55529P66784L77103k3465
15364A016168l07316l85949k38331K7507J41660j23739o27195j000776j000082
$$ plain form
15428 15486956 13736496 13033415 13394217 14416045 15644156 16864040 18122264 19557467
15420 19557467 21210063 22896138 24136344 24375319 23337274 21136309 18260973 15463806
15412 15463806 13452144 12588225 12777565 13434255 13700031 13015402 11506439 9802983 8516513
15403 8516513 7804083 7464701 7377442 7561191 7933409 8264176 8359253 8124078 7410415 6040779
15393 6040779 4042398 1729852 -355347 -1670698 -2079312 -1911437 -1528629 -1028598 -423214
15384 -423214 157725 541273 605585 293721 -367592 -1219867 -2001155 -2508412 -2657829 -2476354
15374 -2476354 -2165064 -2018814 -2111006 -2164297 -1837003 -1059783 -104254 662530 1039633 1016168
15364 1016168 708852 322903 84572 112079 253739 130000 -497195 -1497971 -2498053
15355b498053n79556J37069Q32239J080458O75259j66755j034552j630804j787465
15346d972160j459599q43809k41250K70322Q94853J824537K872579L594049L826155
15337E765677L769480L561456L118770K275078R53624o20226j937603k487321
15329A4398935k090932j059461J0994N91694M01138l99871j171537j366541j020639
15320H293780m40690J73761O11337P21745O82247P67395R89420J195817J205009
15311A4199821Q44789J46999n05864n97219m5962O63105J009354Q76571N60929
15302A7152523M75441O92942P58391J03713j217139k423102k826974k366290j417776
15293H931729m33086L02140O81187P36983O15297M72148M04898L99003L73944
$$ plain form
15355 -2498053 -3077609 -2940540 -2108301 -1027843 -352584 -519339 -1553891 -3184695 -4972160
15346 -4972160 -6431759 -7275568 -7516818 -7246496 -6351643 -4527106 -1654527 1939522 5765677
15337 5765677 9535157 13096613 16215383 18490461 19444085 18823859 16886256 14398935
15329 14398935 12308003 11248542 11259536 11851230 12252368 11852497 10680960 9314419 8293780
15320 8293780 7853090 8026851 8638188 9359933 10042180 10809575 11798995 12994812 14199821
15311 14199821 15044610 15191609 14685745 14088526 14042564 14705669 15715023 16591594 17152523
15302 17152523 17627964 18320906 19079297 19183010 17965871 15542769 12715795 10349505 8931729
15293 8931729 8498643 8800783 9481970 10218953 10834250 11306398 11711296 12110299 12484243
15284A2484243L91222O37220J167870J763657K053954J807731J144773M58772
15276B1909442N5153j09817l55330r85435j986829k962577l351933k862697j730081
15267G619896m20061Q03297J890385K768697L286410L298911K757625J814032
15259B3819192P65054n6769l54725j21089K34620K60676m6220l14012k60000R0938
15249B4017665M94804P27923P19250N03009J14823n00963j275926j815190j705405
15240B1279990r30363J44152J096187J679572J889257J909277J933615K046498
15232C1048185K190109K163309J817554J222902M25488o51161j840822k748683
15224C3626881l196245l274539l074464k663594k262324k106612k069529j774451
$$ plain form
15284 12484243 12875465 13512685 14680555 16444212 18498166 20305897 21450670 21909442
15276 21909442 21964595 21854778 21499448 20514013 18527184 15564607 12212674 9349977 7619896
15267 7619896 7199835 8003132 9893517 12662214 15948624 19247535 22005160 23819192
15259 23819192 24584246 24527477 24172752 24051663 24286283 24546959 24500739 24186727 23926727 24017665
15249 24017665 24512469 25240392 25959642 26462651 26577474 26076511 24800585 22985395 21279990
15240 21279990 20349627 20493779 21589966 23269538 25158795 27068072 29001687 31048185
15232 31048185 33238294 35401603 37219157 38442059 38867547 38216386 36375564 33626881
15224 33626881 30430636 27156097 24081633 21418039 19155715 17049103 14979574 13205123
15216A3205123r79814K05593J352603K131898K559571K749881K743686K550393
15208B6518934K189459J721101J223399P55607M14482K75896J79598j65033q13863
15199C2299580j520044j918494j737267j011279j02268N68398R17005J176689
15191B8672320J386513J250789N64191m09593j111526j368007j594095j997839
15183B5392753k162824j830470j365148j161358j208084j282275j222087j053752
15175A4106755q17458m28446R1067N10883N85495K70403k20808p03532j191041
15166A2203318j614506j719762j397001r09340p30585j153735j929210k410878
15158C38301k199733j420307l33805R12858K199557L334762L947701L790397L080520
$$ plain form
15216 13205123 12225309 12430902 13783505 15915403 18474974 21224855 23968541 26518934
15208 26518934 28708393 30429494 31652893 32408500 32822982 33098878 33278476 33113443 32299580
15199 32299580 30779536 28861042 27123775 26112496 26010228 26578626 27495631 28672320
15191 28672320 30058833 31309622 31873813 31464220 30352694 28984687 27390592 25392753
15183 25392753 23229929 21399459 20034311 18872953 17664869 16382594 15160507 14106755
15175 14106755 13289297 12860851 12951918 13462801 14048296 14318699 14097891 13394359 12203318
15166 12203318 10588812 8869050 7472049 6562709 5832124 4678389 2749179 338301
15158 338301 -1861432 -3281739 -3615544 -2702686 -503129 2831633 6779334 10569731 13650251
15149A3650251K264062J661587J376612J346219J384049J286275J004613O96332
15141B4670000N64034O08533O50800M96594k6477q38516j468743j537535j139864
15132B1978826n40076J34667P16630R20188P25421L89449M6019l00473o06391
15123B3464260p94322q30519o95915l11663L02842R20785J410480J853194K170094
15114B7489236K069834J507867Q33145L68612O0217l71178r84156j392590j124348
15105B8456639j43801J067372J946339K330348K391409K260484J899607J264435
15097D1472832M81613j79923n65522p47291p67532n75797l24271l45442o80386
15088C7768281r42861q20659m29733j23418j28087l93861q06814j320963j834123
$$ plain form
15149 13650251 15914313 17575900 18952512 20298731 21682780 22969055 23973668 24670000
15141 24670000 25234034 25842567 26493367 26989961 26963484 26124968 24656225 23118690 21978826
15132 21978826 21438750 21573417 22290047 23210235 23935656 24325105 24371124 24070651 23464260
15123 23464260 22669938 21839419 21143504 20831841 21134683 22055468 23465948 25319142 27489236
15114 27489236 29559070 31066937 31900082 32268694 32328911 31957733 30973577 29580987 28456639
15105 28456639 28312838 29380210 31326549 33656897 36048306 38308790 40208397 41472832
15097 41472832 41954445 41774522 41209000 40461709 39694177 39118380 38794109 38448667 37768281
15088 37768281 36825420 36004761 35575028 35451610 35323523 34929662 34122848 32801885 30967762
15079C0967762k215680k332079j983060j116355p5784O68078J055635J413904
15071B6382421J995043K722293L337852L741072M007534M194428M180871L687863
15063E4249377K647335J359065K13163n63439r41983r90938p43007k13838M13447
15054E5429182Q08291P90525N81345N72086P30136N24447l63473j509269k153949
15045E5409321j979055j262059m63169J77313O97357J222260J799635K304592
15037E7906195K579141K605341K376686J853468J182876O94162N98003Q59389
15029G0655261J272616J676981K170062K827057L375300L411631K762135J689725
15021H9840768Q38933P04039J161627J803170K385303K813923L112408L378459
$$ plain form
15079 30967762 28752082 26420003 24436943 23320588 23244804 23912882 24968517 26382421
15071 26382421 28377464 31099757 34437609 38178681 42186215 46380643 50561514 54249377
15063 54249377 56896712 58255777 58468940 57905501 56963518 55972580 55229573 55015735 55429182
15054 55429182 56237473 57027998 57609343 58181429 58911565 59436012 59072539 57563270 55409321
15045 55409321 53430266 52168207 51705038 51882351 52579708 53801968 55601603 57906195
15037 57906195 60485336 63090677 65467363 67320831 68503707 69197869 69795872 70655261
15029 70655261 71927877 73604858 75774920 78601977 81977277 85388908 88151043 89840768
15021 89840768 90679701 91383740 92545367 94348537 96733840 99547763 102660171 106038630
15013A06038630L552999L442806K946980K208829J625292J568423K020931K533948
15005A25938838K606106K138354J451899R16707P34041R27955J350340J789538
14997A37853778K199794K792174L804108N134885O378770P241187P809298Q387272
14989A81601266R093138R749299J0325884J1214492J2756024J4763563J6559828
14982B66063494J7349847J6757265J4950345J2235699Q840537N041243J200241
14975C42438671k367285n415199p652160q857172r146892q977249q728522q368529
14967B82925663p767546o984082n922293m273165k000208O04342L263388N774134
14959B65620233P799240R000622R308768Q817005P684118O091918M062444J523717
$$ plain form
15013 106038630 109591629 113034435 115981415 118190244 119815536 121383959 123404890 125938838
15005 125938838 128544944 130683298 132135197 133051904 133785945 134713900 136064240 137853778
14997 137853778 140053572 142845746 146649854 151784739 158163509 165404696 173213994 181601266
14989 181601266 190694404 200443703 210769587 221984079 234740103 249503666 266063494
14982 266063494 283413341 300170606 315120951 327356650 336197187 341238430 342438671
14975 342438671 340071386 334656187 327004027 318146855 308999963 300022714 291294192 282925663
14967 282925663 275158117 268174035 262251742 257978577 255978369 256582711 259846099 265620233
14959 265620233 273419473 282420095 291728863 300545868 308229986 314321904 318384348 319908065
14951C19908065j398254m188878o051659o522700o026227n397149m905593m147925
14943B81269680k628303k42801K508900M800614N935440N466919L282178j92785
14935C00199842m090586p616029j0337404j2074672j2834642j2895719j2679637
14928B27671153j2457436j2321497j2230546j1965568j1201316r804222p987330
14921A49703238o029729m107996k358671q40371M67807J506971K115995K306906
14913A42764150K409857K820297L608034M378596M669331M377324L591406K328705
14905A70947700O64881j199783l021415m409755m867780m128770k427487l59691
14897A51197900J566832L243908M822366O399348P983003R476162J0630182J1245172
$$ plain form
14951 319908065 318509811 314320933 308269274 301746574 295720347 290323198 285417605 281269680
14943 281269680 278641377 278398576 280907476 285708090 291643530 297110449 300392627 300199842
14935 300199842 296109256 288493227 278155823 266081151 253246509 240350790 227671153
14928 227671153 215213717 202892220 190661674 178696106 167494790 157690568 149703238
14921 149703238 143673509 139565513 137206842 136366471 136834278 138341249 140457244 142764150
14913 142764150 145174007 147994304 151602338 155980934 160650265 165027589 168618995 170947700
14905 170947700 171612581 170412798 167391383 162981628 158113848 153985078 151557591 151197900
14897 151197900 152764732 156008640 160831006 167230354 175213357 184689519 195319701 206564873
14889B06564873J1200210J0278795Q354642N595759K202141j694107n837532r862625
14881B26802156j3323426j5776834j7119453j7571678j7251587j6168557j4542954
14874A15047667j2728538j0944102r291027p851080o697444n840504n125976m222310
14866E2346686k842637j052058P86427K299800L162424L075909K053611N70502
14858F0400664q26076j837044k429626k766061k944806k899909k676042k485925
14850D1535175k370824k041756j137330K92869J692615K504719K487948J762373
14842D4725789P81656O5190j09741J56041N16492O79961O01715N42849Q09865
14833D8769817J299798J567882J308134O04323k15147q08240j028292j047010
$$ plain form
14889 206564873 217765083 228043878 236398520 241994279 244196420 242502313 236664781 226802156
14881 226802156 213478730 197701896 180582443 163010765 145759178 129590621 115047667
14874 115047667 102319129 91375027 82084000 74232920 67535476 61694972 56568996 52346686
14866 52346686 49504049 48451991 49238418 51538218 54700642 57776551 59830162 60400664
14858 60400664 59574588 57737544 55307918 52541857 49597051 46697142 44021100 41535175
14850 41535175 39164351 37122595 35985265 36278134 37970749 40475468 42963416 44725789
14842 44725789 45507445 45572635 45462894 45618935 46135427 46815388 47417103 47959952 48769817
14833 48769817 50069615 51637497 52945631 53549954 53334807 52526567 51498275 50451265
14825E0451265j069014r66709m53048M96018J545658K305818K675871K665955
14817E7651814K149378J086770l25005j778565k958080l720455m073502l966472
14809D4065883l395892k625006k066411j930220k081690k186886j949385j336854
14801B6493539o34176k08555k55971o87735j205955j519564j499185j176342o14511
14792A8691545R9713Q63014J609497K144664K132903J435462L07125p10692j069187
14783B5504044o71624O443L73836K18151j85525m81346o55866q62876j079885
14774B2165352j167067j005404n40907Q9160N45696N71446K81043J27793M30092
14765B1497204R88113J337404J235456P63814J72568k75322m53876m30030l90212
$$ plain form
14825 50451265 49382251 48415542 47962494 48458512 50004170 52309988 54985859 57651814
14817 57651814 59801192 60887962 60562957 58784392 55826312 52105857 48032355 44065883
14809 44065883 40669991 38044985 35978574 34048354 31966664 29779778 27830393 26493539
14801 26493539 25859363 25650808 25394837 24707102 23501147 21981583 20482398 19306056 18691545
14792 18691545 18791258 19654272 21263769 23408433 25541336 26976798 27283923 26573231 25504044
14783 25504044 24832420 24838863 25212699 25430850 25245325 24763979 24108113 23245237 22165352
14774 22165352 20998285 19992881 19451974 19541134 20086830 20658276 20939319 21067112 21497204
14765 21497204 22485317 23822721 25058177 25821991 25994559 25719237 25265361 24835331 24445119
14756B4445119m43569m94246m48480l46516k51231k44364m00375o40094q19910
14747B0356334r29212j049745j184327j233978j133183q72421m77226n2341L08174
14738A3732075O41710R79992J288933J598664J901229K009962J815863J646890
14730B5615318K047656L009845L762209L646219K885801K213783K058117K284375
14722D7523323K476707K278735J622900O64915m49133j574079k527070l135340
14714D6880958l242590k789358k006753j334987r88052q40834p39155n22270R2700
14705C4509659J149000K163905K541434K108675J181795K66938l48465p56061
14697D2816880j099549j223178q80223j23090O72244J068057Q05345J4271p40920
$$ plain form
14756 24445119 24001550 23507304 23058824 22712308 22461077 22216713 21816338 21176244 20356334
14747 20356334 19427122 18377377 17193050 15959072 14825889 13953468 13476242 13423901 13732075
14738 13732075 14373785 15353777 16642710 18241374 20142603 22152565 23968428 25615318
14730 25615318 27662974 30672819 34435028 38081247 40967048 43180831 45238948 47523323
14722 47523323 50000030 52278765 53901665 54566580 54117447 52543368 50016298 46880958
14714 46880958 43638368 40849010 38842257 37507270 36519218 35678384 34939229 34416959 34509659
14705 34509659 35658659 37822564 40363998 42472673 43654468 43921406 43572941 42816880
14697 42816880 41717331 40494153 39613930 39490840 40163084 41231141 42036486 42050757 41309837
14688D1309837r59788o82112k77942j06034l85578j060157j789843k201369k130531
14679C1716483j626268q56667j7593P84963J468952J943199K187690K129673J619397
14670C9349829O65483m85606j512514k172319k330371j960077j227797m32510
14662B9894118J49628L41047P1112n62049j219926j510095j307310p88998k25902
14653B4841625J33763J37593j25607m12925n77242o06010m66831n9010N87616
14644B3452972J265731J888770K539785L178386L487639L138222K191873R90335
14636D2133713j90621j203331k022303k578797k701729k439081k053052j599220
14628B7345579q93229k210O82926R91100J104572J208918J294220J175763P00477
$$ plain form
14688 41309837 40350049 39667937 39389995 39283961 38898383 37838226 36048383 33847014 31716483
14679 31716483 30090215 29233548 29215955 30000918 31469870 33413069 35600759 37730432 39349829
14670 39349829 40015312 39529706 38017192 35844873 33514502 31554425 30326628 29894118
14662 29894118 30043746 30384793 30455905 29893856 28673930 27163835 25856525 25067527 24841625
14653 24841625 24975388 25112981 24987374 24574449 23997207 23391197 22924366 22865356 23452972
14644 23452972 24718703 26607473 29147258 32325644 35813283 38951505 41143378 42133713
14636 42133713 41943092 40739761 38717458 36138661 33436932 30997851 28944799 27345579
14628 27345579 26452350 26450140 27133066 28124166 29228738 30437656 31731876 32907639 33608116
14619C3608116l8513o92263r22587o70141r4330O69539J588287K554936L323734
14610C9326778L609358L239661K319253J114897r9927j039896j607365j943467
14602D4919292k013438j568574p02162k257M2216m47661r42619j114214j109242
14593C7061341j312313j872845k467996k642123k312817j855733j721175j994179
14585B0882160k336599k337857j888176j240502o93228l07215R065L22500O32315
14576A3042463R26581J210404J437400J613698J894517K328961K750222K991435
14568B8195681L020240K867926K524201K012992J427267P54447j04234j025622
14560C9672898j621857j677187j392412j105489r03656o00204j10137K83831J76352
$$ plain form
14619 33608116 33569603 32877340 31954753 31284612 31190282 31859821 33448108 36003044 39326778
14610 39326778 42936136 46175797 48495050 49609947 49510020 48470124 46862759 44919292
14602 44919292 42905854 41337280 40635118 40632861 40675077 40227416 39284797 38170583 37061341
14593 37061341 35749028 33876183 31408187 28766064 26453247 24597514 22876339 20882160
14585 20882160 18545561 16207704 14319528 13079026 12385798 12078583 12087648 12410148 13042463
14576 13042463 13969044 15179448 16616848 18230546 20125063 22454024 25204246 28195681
14568 28195681 31215921 34083847 36608048 38621040 40048307 40802754 40698520 39672898
14560 39672898 38051041 36373854 34981442 33875953 32972297 32372093 32261956 32545787 32722139
14551C2722139m15927r33767q98860l67875L61637J164566K099325K999581L323012
14542D0053831K795397J764156P55715J46915J21911N79039J122145J453445J728221
14533E0520775K188427K639990K614255J968387J053558L11198j02173k91068
14525F0903349l51962l01493j85682j29631k29267l06443M1527J035511K366518
14516F2842427L374888L659620L343358K770394K219131J806610J466020J105881
14508H2588329Q48332R71720J498506K058060K342365K388205K282052K056596
14500I7034165J873989J955394K418545L207199M044191M615314M866118M987815
14492A25002730N148744N352715N542608N673062N672128N498103N217984M833090
$$ plain form
14551 32722139 32306212 31372445 30473585 30105710 30467347 31631913 33731238 36730819 40053831
14542 40053831 42849228 44613384 45369099 45516014 45637925 46216964 47339109 48792554 50520775
14533 50520775 52709202 55349192 57963447 59931834 60985392 61296590 61194417 60903349
14525 60903349 60551387 60249894 60064212 59934581 59705314 59398871 59440398 60475909 62842427
14516 62842427 66217315 69876935 73220293 75990687 78209818 80016428 81482448 82588329
14508 82588329 83436661 84408381 85906887 87964947 90307312 92695517 94977569 97034165
14500 97034165 98908154 100863548 103282093 106489292 110533483 115148797 120014915 125002730
14492 125002730 130151474 135504189 141046797 146719859 152391987 157890090 163108074 167941164
14484A67941164M201220L399953K741516K333114K000462J565128J001919L73712
14476A85558188l11462j129922k164042l428979m765793n780698o042923n462550
14468A56471819m458522l532100k720783j741728n59816M71669J081501J482653
14460A46494693K101674L051223M084561M921048N400677N478971N275985M812106
14452A81620938L794804K021579k44113k605128m877082o841132q192966q901055
14444A55775845r202483r290544r125008q533944p567578o531427n703768n211292
14436I4609801m992060m807020m387001l648442k763501j917779j055653K6869
14428G1065214J339878K501825K905951K163272M80603j386230k667657l062756
$$ plain form
14484 167941164 172142384 175542337 178283853 180616967 182617429 184182557 185184476 185558188
14476 185558188 185246726 184116804 181952762 178523783 173757990 167977292 161934369 156471819
14468 156471819 152013297 148481197 145760414 144018686 143458870 143930539 145012040 146494693
14460 146494693 148596367 151647590 155732151 160653199 166053876 171532847 176808832 181620938
14452 181620938 185415742 187437321 187193208 184588080 179710998 172869866 164676900 155775845
14444 155775845 146573362 137282818 128157810 119623866 112056288 105524861 99821093 94609801
14436 94609801 89617741 84810721 80423720 76775278 74011777 72093998 71038345 71065214
14428 71065214 72405092 74906917 77812868 79976140 80456743 79070513 76402856 73340100
14420G3340100k804555k416668k303971k499331k698588k522730j782177n07692
14412E5804388J031373K370474L179988L356716K868254J757610K60127j240219
14404F9388711k481886l399710l969739m120566l882249l416614k810040k108960
14396D3198947j511143j278609j549180k150044k506848k166330j376954o99957
14388B9959882l70606k24758M7202N09085Q52952P39626J33082p11562j470380
14379B9464523j903930j873763j385728o61805j883M35790N35966K21490l45375
14370B4485285p34789n36562J94422J006609J672555K358793L145351L763180
14362C5354844L822947L137464J822410L08649p69601j067551r01219p55455o39982
$$ plain form
14420 73340100 70535545 68118877 65814906 63315575 60616987 58094257 56312080 55804388
14412 55804388 56835761 59206235 62386223 65742939 68611193 70368803 70628930 69388711
14404 69388711 66906825 63507115 59537376 55416810 51534561 48117947 45307907 43198947
14396 43198947 41687804 40409195 38860015 36709971 34203123 32036793 30659839 29959882
14388 29959882 29589276 29364518 29411720 29920805 30773757 31513383 31646465 30934903 29464523
14379 29464523 27560593 25686830 24301102 23639297 23637414 24073204 24609170 24830660 24485285
14370 24485285 23750496 23213934 23408356 24414965 26087520 28446313 31591664 35354844
14362 35354844 39177791 42315255 44137665 44446314 43676713 42609162 41707943 40952488 40312506
14353D0312506l44439K4553K13350K15741J49383l0900m45358j068896j691783
14344C7334157k184931k710975l367302l779331l445563k400145j185212l24271
14336A7936427J969q2417m09504q33557j132450j170418j077319j024838r67471
14327A1240422p84260m19285K01336J011358J573314J408537O16348r5348k42552
14318A4509870J431L97995R37629J544950J987837K112756J988203J732754J357831
14309B6571256R25575P17806R06414J198022J093517M85149j09440p0765O11908
14300C2329442J319030J482358J181469R46184J087356J527665K026786K306947
14292D4207237K224351J882864J388044O55349l29697j304806j854591j777278
$$ plain form
14353 40312506 39968067 39992620 40205970 40421711 40571094 40540194 40094836 39025940 37334157
14344 37334157 35149226 32438251 29070949 25291618 21846055 19445910 18260698 17936427
14336 17936427 17938396 17855979 17446475 16612918 15480468 14310050 13232731 12207893 11240422
14327 11240422 10456162 10036877 10238213 11249571 12822885 14231422 14847770 14752422 14509870
14318 14509870 14511301 14909296 15846925 17391875 19379712 21492468 23480671 25213425 26571256
14309 26571256 27496831 28214637 29121051 30319073 31412590 31897739 31788299 31717534 32329442
14300 32329442 33648472 35130830 36312299 37258483 38345839 39873504 41900290 44207237
14292 44207237 46431588 48314452 49702496 50357845 50028148 48723342 46868751 45091473
14284D5091473j380369j275833j752249k535282l269513l731112l712344l188568
14276B4246203k368053j495199p67705k45235K21412P77497J433283K106434K586516
14267B6495153K618979K212489J703935J428378J445298J520246J391462J075342
14259C9891282P44715N21681M12816K62872j20754p87196j545145k066301k111724
14250C5202246j632608q32894j54126M5621k79297r83858j816754k352777k238251
14241B4957302j639059j044181o68783l87324q3096J87447K64476J26250O2106
14232B1775138L41275P81091J040015J063248R88789R82921J157770J433481J522205
14223C1085933J268902Q57309N47988M63418O53117J066084J362533J092220J63408
$$ plain form
14284 45091473 43711104 42435271 40683022 38147740 34878227 31147115 27434771 24246203
14276 24246203 21878150 20382951 19615246 19370011 19591423 20368920 21802203 23908637 26495153
14267 26495153 29114132 31326621 33030556 34458934 35904232 37424478 38815940 39891282
14259 39891282 40635997 41157678 41570494 41833366 41712612 40925416 39380271 37313970 35202246
14250 35202246 33569638 32736744 32582618 32628239 32348942 31365084 29548330 27195553 24957302
14241 24957302 23318243 22274062 21605279 21217955 21134859 21322306 21586782 21713032 21775138
14232 21775138 22116413 22897504 23937519 25000767 25989556 26972477 28130247 29563728 31085933
14223 31085933 32354835 33212144 33760132 34223550 34876667 35942751 37305284 38397504 38560912
14214C8560912j063859k042863k293788j613725k25206J268957K180366K130721
14206C6901515J245663O6973p95704j059809p45929l6292P19687J251484J615172
14197C9162760J934067K031778J685999J063845M95663J2910n31043j015997j112812
14188D3727170p87600m97045p15381j381268k061715k542790k897691l144958
14180B9698722l163119k840211k236340j654640j441182j681508k217701k799957
14172A1664064l160605l116340k598090j744600r30522l76558N4601N32115J089934
14163A413999J730143K419001L008813L300917L164165K625079J847760J007037
14155B0516914K87293n0257K25825J019463J935537K569636K610538J954383Q10655
$$ plain form
14214 38560912 37497053 35454190 33160402 31546677 31321471 32590428 34770794 36901515
14206 36901515 38147178 38214151 37418447 36358638 35612709 35576417 36296104 37547588 39162760
14197 39162760 41096827 43128605 44814604 45878449 46374112 46387022 45855979 44839982 43727170
14188 43727170 42939570 42442525 41727144 40345876 38284161 35741371 32843680 29698722
14180 29698722 26535603 23695392 21459052 19804412 18363230 16681722 14464021 11664064
14172 11664064 8503459 5387119 2789029 1044429 113907 -262651 -208050 324065 1413999
14163 1413999 3144142 5563143 8571956 11872873 15037038 17662117 19509877 20516914
14155 20516914 20804207 20753950 20979775 21999238 23934775 26504411 29114949 31069332 31879987
14146C1879987l34427r36026q60936n16795l22526l51184m91913o70370r15125
14137B6480685j186484j288936j178499j073176j076606j016693o78974l153Q81199
14128A9859363J681448K104122K108606J887142J534709J003830M46390J55925
14120C0781535K43577O49898J188774J598965J693330J419693R45881N39166K58765
14111C9319584L5928n6126J24102M74968O70721N30647J24013l89161q13341r69911
14101C9051424q55011p29017q06661r28656q71735p57827q58417j261472j890475
14092C0092153k544085k937909k889494k430120j857481j667026k066494k629094
14084A1070450k733599k186609j291442n09504p4345J52390M13841Q58731J517597
$$ plain form
14146 31879987 31545560 30609534 29748598 29231803 28909277 28558093 28066180 27395810 26480685
14137 26480685 25294201 24005265 22826766 21753590 20676984 19660291 18981317 18978164 19859363
14128 19859363 21540811 23644933 25753539 27640681 29175390 30179220 30625610 30781535
14120 30781535 31025112 31675010 32863784 34462749 36156079 37575772 38521653 39060819 39319584
14111 39319584 39355512 39299386 39423488 39898456 40569177 41099824 41223837 40834676 40021335 39051424
14101 39051424 38196413 37467396 36660735 35732079 34860344 34102517 33244100 31982628 30092153
14092 30092153 27548068 24610159 21720665 19290545 17433064 15766038 13699544 11070450
14084 11070450 8336851 6150242 4858800 4349296 4274951 4427341 4841182 5699913 7217510
14075G217510K154621K372812K075563J541141R91450M72217M8742k83748p14104
14066A5876204j394725k284259l169191l797030m039659l837606l106054j873839
14058g626159m36854P59694J456579J788846K034372K288994K532232K695438
14050E493142K550014J866848P48373l86254j130255j377929j292814r83072l63613
14041E124440N23980J276473J497606J184760N68702j01317n72418p05521n46026
14032H250679k07397J66196L78647L10571J5077m27741r92082j518433j676280
14023D299237j338518p69901k29618K89749P70571J021649R46848P87827Q31387
14014F609231J067687J430565J937190K406821K434112J776012O19076m94759
$$ plain form
14075 7217510 9372131 11744943 13820506 15361647 16353097 16825314 16874056 16590308 15876204
14066 15876204 14481479 12197220 9028029 5230999 1191340 -2646266 -5752320 -7626159
14058 -7626159 -8063013 -7303319 -5846740 -4057894 -2023522 265472 2797704 5493142
14050 5493142 8043156 9910004 10658377 10272123 9141868 7763939 6471125 5488053 5124440
14041 5124440 5648420 6924893 8422499 9607259 10175961 10074644 9502226 8796705 8250679
14032 8250679 8043282 8209478 8588125 8898696 8913773 8486032 7493950 5975517 4299237
14023 4299237 2960719 2190818 1961200 2250949 3021520 4043169 4990017 5777844 6609231
14014 6609231 7676918 9107483 11044673 13451494 15885606 17661618 18280694 17785935
14006A7785935r33817m47668N49444J393686J721357J631515J472936J398541
13998B4571929J238452Q35098K71061k54700o62143r17880q36260l03061L71042
13989B4313538N86477K3935j002930j884579k285134k333633k334101k235415
13981A2848158j681112p41578q3240k36010j061184j974924k385684k003924r42476
13972A738026M68085J809127K680387L006029L070244L130162L190716L065953
13964B2158729K586759J790878Q30943j08381p55360r60565q93753q00177p20908
13955B3128165n92779l93096j33084J08050J53330q9122m67831o96214n78617
13946B0438802j05335N63557J138118J434214J495029J391922J166576R81466
$$ plain form
14006 17785935 16852118 16404450 16953894 18347580 20068937 21700452 23173388 24571929
13998 24571929 25810381 26645479 26916540 26661840 25999697 25081817 24245557 23942496 24313538
13989 24313538 24900015 24923950 23921020 22036441 19751307 17417674 15083573 12848158
13981 12848158 11167046 10425468 10342228 10106218 9045034 7070110 4684426 2680502 1738026
13972 1738026 2206111 4015238 6695625 9701654 12771898 15902060 19092776 22158729
13964 22158729 24745488 26536366 27367309 27258928 26503568 25543003 24649250 23849073 23128165
13955 23128165 22535386 22142290 22009206 22117256 22270586 22181464 21713633 21017419 20438802
13946 20438802 20333467 20897024 22035142 23469356 24964385 26356307 27522883 28504349
13938B8504349R38731Q18266K91874o40000j405162j221121M7090J615694K579329
13929C1529050K617087J891522P37383m87767j442127j877946j693050r59001
13921C0315151j4905O98419J063315J223707J155501P29534N0611o33752j243077
13912C3344504j817316k268811k359867j965853j269921n35994J05901N54865
13904B3787508P03129N75457M38110N31022O61695M73418k0672l91505j10366
13895B6647796R97287K569594L967049M648525M403433L401139K133391J178119
13887D9946333P54786N87709L57443N9038j36903j51553o9701k8587q3916j69950
13877E1064699j88365j46881j37157k14739l83018m68245k10017L44712R67495
$$ plain form
13938 28504349 29443080 30261346 30553220 29913220 28508058 27286937 27334027 28949721 31529050
13929 31529050 34146137 36037659 36775042 36287275 34845148 32967202 31274152 30315151
13921 30315151 30300246 30998665 32061980 33285687 34441188 35170722 35221333 34587581 33344504
13912 33344504 31527188 29258377 26898510 24932657 23662736 23126742 23232643 23787508
13904 23787508 24490637 25066094 25504204 26035226 26696921 27170339 27149667 26758162 26647796
13895 26647796 27645083 30214677 34181726 38830251 43233684 46634823 48768214 49946333
13887 49946333 50701119 51288828 51646271 51705309 51568406 51416853 51347152 51318565 51234649 51064699
13877 51064699 50876334 50729453 50592296 50377557 49994539 49526294 49316277 49660989 50628484
13868E0628484J649097K459930L281912L933703M384257M702497M846156M663359
13860H0549395M117121L422573K922721K737789K584007K152925J549958J084339
13852A01120828Q11114N29643K5692p69552j640510k176918k163908j726031j080403
13843I2929955l35881M41840J075269J264342Q05153j86889j303740k105820k419512
13834I0164717k431551k571670l154761m082375n000999n616442n745721n224165
13826E6337033m093503k870332k182686j993653j573164m63114R60778K060602
13818D6181961K505216K247574J420167K41167j022575k087691k812402l229670
13810D3443747l433431l479697l366844l025929k343162j322267k27761N49389
$$ plain form
13868 50628484 52277581 54737511 58019423 61953126 66337383 71039880 75886036 80549395
13860 80549395 84666516 88089089 91011810 93749599 96333606 98486531 100036489 101120828
13852 101120828 101931942 102461585 102487277 101717725 100077215 97900297 95736389 94010358 92929955
13843 92929955 92594074 93035914 94111183 95375525 96180678 95993789 94690049 92584229 90164717
13834 90164717 87733166 85161496 82006735 77924360 72923361 67306919 61561198 56337033
13826 56337033 52243530 49373198 47190512 45196859 43623695 43160581 44121359 46181961
13818 46181961 48687177 50934751 52354918 52596085 51573510 49485819 46673417 43443747
13810 43443747 40010316 36530619 33163775 30137846 27794684 26472417 26244656 26794045
13802B6794045P18596K43249o22835j483480k066741k371691k457588k278566
13794A6474989j862983j376900r35850o24069o40698j072234j618931j848341
13786F494983j642814j238238r09980o70301k97987L53343J171378J829203J918117
13777G007704J215187n0319j309217k090883k280509j929823j153595j79870Q10884
13768C9559J710581K344637K533290K242010J587639P81541R5326j69470J78822
13759A1343935J024137K003806K651006K536623J651747N04208m07761r81730
13751B0325971j320061j432674j246672q50771m97803k66824OL03504L38732m9639
13741A5303769o04916r35501q71612n78879k83607k6709K89894P37738J157576
$$ plain form
13802 26794045 27512641 27755890 27133055 25649575 23582834 21211143 18753555 16474989
13794 16474989 14612006 13235106 12299256 11675187 11034489 9962255 8343324 6494983
13786 6494983 4852169 3613931 2703951 2033650 1735663 2089006 3260384 5089587 7007704
13777 7007704 8222891 8172572 6863355 4772472 2491963 562140 -591455 -771325 39559
13768 39559 1750140 4094777 6628067 8870077 10457716 11239257 11334583 11165113 11343935
13759 11343935 12368072 14371878 17022884 19559507 21211254 21715462 21307701 20325971
13751 20325971 19005910 17573236 16326564 15475793 14977990 14711166 14711172 15014676 15353408 15303769
13741 15303769 14698853 13763352 12891740 12312861 12029254 12002545 12292439 13030177 14187753
13732A4187753J203157O26905n07514j758038k521049k541177k113254j802423
13724D774360k025559k641800l099664l143155k971200k755776k448262j920336
13716a6231392j129204k20790N55963J039395J194404J012601N49367N0520p7607
13707a3256743M18917J337774K287856L119535L831396M341622M416638L820023
13699A0317018K579244R34442p40129j929443k176579j416422k07121O82540R70456
13690I014006Q67253O28738L35812m0682m41947o83905n82867o9096P41219J566127
13680A1334658K007428J838984J300789Q24645N38038K34144j89811n18544n86750
13671A6783581o46807j063514j832358k627722l004264k693897j842325p81051
$$ plain form
13732 14187753 15390910 16017815 15510301 13752263 11231214 8690037 6576783 4774360
13724 4774360 2748801 107001 -2992663 -6135818 -9107018 -11862794 -14311056 -16231392
13716 -16231392 -17360596 -17581386 -17025423 -15986028 -14791624 -13779023 -13229656 -13179136 -13256743
13707 -13256743 -12837826 -11500052 -9212196 -6092661 -2261265 2080357 6496995 10317018
13699 10317018 12896262 13830704 13090575 11161132 8984553 7568131 7361010 8043550 9014006
13690 9014006 9881259 10509997 10845809 10805127 10363180 9679275 9096408 9027312 9768531 11334658
13680 11334658 13342086 15181070 16481859 17306504 17844542 18078686 17888875 17370331 16783581
13671 16783581 16136774 15073260 13240902 10613180 7608916 4915019 3072694 2291643
13663B291643K03504R26891J371282J585604J616514J622120J805898K179945
13655A3603401K491171K442915K012705J427575Q72842M48175K25273J21682n3011
13646B3592728k60257k63815j9797J89697N8921l23797n90761m77710K3447O93418
13636B2622074J185276J224811R04792O50136P70840J103274J219845J005948
13628C0686996P59821O80608O88780P26735P58495N92047P1322o34535j170163
13619C3160106j377399j388131j369051j295327j087890r30517j124663j677394
13611B2909734k243073k318479j607228l24352R92580J989462K700465L272587
13603B5371696L654594L778507L837508L981263L949726L423645K558092J777442
$$ plain form
13663 2291643 2495147 3422038 4793320 6378924 7995438 9617558 11423456 13603401
13655 13603401 16094572 18537487 20550192 21977767 22850609 23298784 23524057 23645739 23592728
13646 23592728 23332471 23068656 23048859 23238556 23297477 22973680 22382919 21905209 21928656 22622074
13636 22622074 23807350 25032161 25936953 26587089 27357929 28461203 29681048 30686996
13628 30686996 31446817 32127425 32816205 33542940 34301435 34893482 34964804 34330269 33160106
13619 33160106 31782707 30394576 29025525 27730198 26642308 25711791 24587128 22909734
13611 22909734 20666661 18348182 16740954 16416602 17409182 19398644 22099109 25371696
13603 25371696 29026290 32804797 36642305 40623568 44573294 47996939 50555031 52332473
13595E2332473J163046L96257p01678j817973k411609k359402k155295k229421
13587D2216398k419936k371925k062354j705361j391484j127182j123754j633369
13579B8381033k430863k850269k365130j078200K98590J066240J074918P00839
13571B2797158M46342O07111J107106J532290J443398P41172k37284j001409j233566
13562B6202318r32772l60775J65492M60430O14958Q87708J221016J206134O89121
13553C0153630j7885m76812n20500m14608n08404q85930j427806j947605k295143
13544B1658937k414720k332233k125811j891922j651072j300240p83309k00081
13536H959549L24484P58549J115861J294898J155281Q64659P70632R37516J097106
$$ plain form
13595 52332473 53495519 53891776 53190098 51372125 48960516 46601114 44445819 42216398
13587 42216398 39796462 37424537 35362183 33656822 32265338 31138156 30014402 28381033
13579 28381033 25950170 23099901 20734771 19656571 19955161 21021401 22096319 22797158
13571 22797158 23243500 23850611 24957717 26490007 27933405 28674577 28437293 27435884 26202318
13562 26202318 25269546 24908771 25074263 25534693 26149651 27037359 28258375 29464509 30153630
13553 30153630 30135745 29658933 29138433 28723825 28215421 27329491 25901685 23954080 21658937
13544 21658937 19244217 16911984 14786173 12894251 11243179 9942939 9159630 8959549
13536 8959549 9284033 10042582 11158443 12453341 13608622 14473281 15243913 16181429 17278535
13527A7278535J034010Q91883Q94647R34418P29594K48987k97784p72806j170843
13518A9770641j428411j477103j451744j554303j768018j876240j752450j458943
13510G003429j116891q14603o07311n66776q07305j328877j838198j919147j481159
13501c476838r19177o73351p86782r41634p48858O120J164719K247018K784756
13492a344027K604018J822851O88030m65979j309055j744824j925271j999607
13484c673864j953672j748715j433898j050477o93920o26302r93977j570289k036895
13475a5782009k263101k214073j915929j481044r56700k67029O00019J540889
13467b2738977K455111L259749L894458M302516M466038M492611M439809M092980
$$ plain form
13527 17278535 18312545 19204428 20099075 21033493 21763087 22012074 21714290 20941484 19770641
13518 19770641 18342230 16865127 15413383 13859080 12091062 10214822 8462372 7003429
13510 7003429 5886538 5071935 4464624 3897848 3090543 1761666 -76532 -1995679 -3476838
13501 -3476838 -4396015 -5069366 -5856148 -6797782 -7546640 -7540520 -6375801 -4128783 -1344027
13492 -1344027 1259991 3082842 3770872 3304893 1995838 251014 -1674257 -3673864
13484 -3673864 -5627536 -7376251 -8810149 -9860626 -10554546 -11180848 -12174825 -13745114 -15782009
13475 -15782009 -18045110 -20259183 -22175112 -23656156 -24612856 -24879885 -24279866 -22738977
13467 -22738977 -20283866 -17024117 -13129659 -8827143 -4361105 131506 4571315 8664295
13459H664295L063284J263399p35342k076514k351208j797493r17146j79059J21886
13450E056102n5429n39050j055400j357932j336093j058498p35978n67626n46223
13441b196127m68743j26818N55432J448484K149676K198511J471895K66174r81473
13432D317011j937680k429030k490859k280586j767572q05258M50276J567118
13424e376580K237489K443697K299074J973224J691293J526899J287590Q44779
13416H927465M58706M47072P30686R70980R36365O63106L96183L29756M02536
13407A4262855N05230P37778J179336J633271J893848J911731J600763R35229
13399B4660041K01209k01462j22245K30441M41704K55920k19653p92523j447233
$$ plain form
13459 8664295 11727579 12990978 12255636 10179122 7827914 6030421 5113275 4934216 5056102
13450 5056102 5000673 4461623 3406223 2048291 712198 -346300 -1082278 -1649904 -2196127
13441 -2196127 -2664870 -2791688 -2236256 -787772 1361904 3560415 5032310 5298484 4317011
13432 4317011 2379331 -49699 -2540558 -4821144 -6588716 -7393974 -6943698 -5376580
13424 -5376580 -3139091 -695394 1603680 3576904 5268197 6795096 8082686 8927465
13416 8927465 9386171 9833243 10563929 11534909 12471274 13134380 13530563 13860319 14262855
13407 14262855 14768085 15505863 16685199 18318470 20212318 22124049 23724812 24660041
13399 24660041 24861250 24659788 24537543 24767984 25209688 25465608 25245955 24453432 23006199
13390B3006199k128065k505298k214883j257739n8431Q84996J371546J534381
13382A8632706J602519J615027J416053Q90231N7852r58847j915492k436388k250928
13373A6652733j466038m89946L23371Q41706J007898P78302K25663l62368n88810
13364A6922511l15601J33753L16167R7045l90256r32496j372671j729613k115408
13355A0613431k548471k888545k943505k590982j745320m26997J094290K427346
13347I91247L191591L090769K199061J023202O8757m43844n27272k91006J75595
13338I478100P38138J101504R56818M00141K4239K51817P46115Q22582J75649
13329A4695103r73522k053677k464083k151387j667052j471923j521464j473422
$$ plain form
13390 23006199 20878134 18372836 16157953 14900214 14841783 15726779 17098325 18632706
13382 18632706 20235225 21850252 23266305 24156536 24214388 23255541 21340049 18903661 16652733
13373 16652733 15186695 14696749 15020120 15861826 16869724 17648026 17873689 17511321 16922511
13364 16922511 16606910 16740663 17056830 17153875 16763619 15831123 14458452 12728839 10613431
13355 10613431 8064960 5176415 2232910 -358072 -2103392 -2530389 -1436099 991247
13347 991247 4182838 7273607 9472668 10495870 10564627 10120783 9593511 9302505 9478100
13338 9478100 10216238 11317742 12274560 12674701 12698940 12950757 13696872 14519454 14695103
13329 14695103 13721581 11667904 9203821 7052434 5385382 3913459 2391995 918573
13321I18573j023765j92325O07578J022654J062025Q09237L57372q8365m56030
13312C016954q77398j364392j696928j652209j191383m00040O13262J584636K173497
13303B05999K301892K116394J826812J609856J467559J294049J038975O99981
13295A2561517K69291j90497n35003p15353q45120j062268j384771j665955j714245
13286D717596j461808r78844l79374J87816O05377Q68619R83378R16482P44226
13277F203468O92890Q95540J217381J369172J257573J137906J275453J637280
13269A5686663J980913K096876J946887J639943J235725O30838k25972j067413
13261B3924460j495224j364994p41409J71647R56683J337790J504861J745027
$$ plain form
13321 918573 -105192 -297517 310061 1332715 2394740 3203977 3561349 3472984 3016954
13312 3016954 2139556 775164 -921764 -2573973 -3765356 -4165396 -3552134 -1967498 205999
13303 205999 2507891 4624285 6451097 8060953 9528512 10822561 11861536 12561517
13295 12561517 12830808 12640311 12105308 11389955 10544835 9482567 8097796 6431841 4717596
13286 4717596 3255788 2276944 1897570 2085386 2690763 3559382 4542760 5459242 6203468
13277 6203468 6896358 7791898 9009279 10378451 11636024 12773930 14049383 15686663
13269 15686663 17667576 19764452 21711339 23351282 24587007 25217845 24991873 23924460
13261 23924460 22429236 21064242 20322833 20494480 21451163 22788953 24293814 26038841
13253B6038841K021819K153256K083650J779963J183085M56010j07905n48707
13245C5060012j119509j717266j856574j288196m11472J05467m7295p16402j516634
13236B6492131k058155k224777k201478k161818k026339j629893r58448p8462
13228A3152761Q86296J561043J498676P42803j80025q96308j424856j788377j781445
13219A1770568j280526m97682K86122R32488J300896J362744J436548J827892
13211A7139050K411101K792716K647521K000250J269473P97444M90383J36845
13203B9684783k70924o06627q70141j231536j703766k024744j932137j380875
13195A9664033o29754j31203p3236k10402k59683j24374J91038N82000P80764
$$ plain form
13253 26038841 28060660 30213916 32297566 34077529 35260614 35716624 35608719 35060012
13245 35060012 33940503 32223237 30366663 29078467 28666995 28772462 28725167 28008765 26492131
13236 26492131 24433976 22209199 20007721 17845903 15819564 14189671 13231223 13152761
13228 13152761 14039057 15600100 17098776 17841579 17661554 16765246 15340390 13552013 11770568
13219 11770568 10490042 9992360 10278482 11210970 12511866 13874610 15311158 17139050
13211 17139050 19550151 22342867 24990388 26990638 28260111 29057555 29547938 29684783
13203 29684783 29413859 28807232 27937091 26705555 25001789 22977045 21044908 19664033
13195 19664033 19034279 18903076 18829840 18619438 18359755 18235381 18426419 19008419 19789183
13186A9789183M80298l40406j252913j685101j318106j46174J490444K930019
13178A9947244L597103L355049K500033J533280P48198J08743m07767p61632j094778
13169B9525473j609330k255387k775759k964461k738344k165629j497930r51811
13161A2566822n07371k05290l45256j049258j920872k385440k209757j590140
13153B353438q12885K4919R35819J846971K517182K724287K495277J987206J315418
13144A5387632N58911j56860n46752l70670K42381Q53118J099075R75272P41157
13135A8783264O45051P10117P20059M93184J23375j60566k41595j71754q1388
13126B0819747q9273l65682j058859k028011k835887l023165k449019j369689
$$ plain form
13186 19789183 20269481 19929075 18676162 16991061 15672955 15526781 17017225 19947244
13178 19947244 23544347 26899396 29399429 30932709 31680907 31789650 31381883 30620251 29525473
13169 29525473 27916143 25660756 22884997 19920536 17182192 15016563 13518633 12566822
13161 12566822 12059451 11854161 11508905 10459647 8538775 6153335 3943578 2353438
13153 2353438 1540553 1565472 2501291 4348262 6865444 9589731 12085008 14072214 15387632
13144 15387632 15946543 15789683 15242931 14872261 15114642 15967760 17066835 18042107 18783264
13135 18783264 19428315 20138432 20858491 21351675 21475050 21314484 21072889 20901135 20819747
13126 20819747 20730474 20364792 19305933 17277922 14442035 11418870 8969851 7600162
13118G600162j98512P56098J369179J597828J453619J072449O83736M70639M49013
13109A5254211O13163J025237J529444J656984J085188M6940r86722j848667k539265
13100A5836513k840438k452078j396689j69889N44236K89806q65313k275645l161892
13091C508611l093236k050260m06438J224828K348755K802277K650448K059466
13083I044451J304077O07957n3000q39298j683750k195473k132394j646268q29424
13074A576878L17107J418583J923807J734047J163473M69873k41860q64049j242671
13065F255188j313549j206369j084053r15530o18619k69611k615J60852L25956
13056A331650M46749K86431k21874q10609j063694p21504J90553J410658K530041
$$ plain form
13118 7600162 7401650 8157748 9526927 11124755 12578374 13650823 14334559 14805198 15254211
13109 15254211 15867374 16892611 18422055 20079039 21164227 21211167 20224445 18375778 15836513
13100 15836513 12996075 10543997 9147308 8977419 9521655 9811461 8946148 6670503 3508611
13091 3508611 415375 -1634885 -2041323 -816495 1532260 4334537 6984985 9044451
13083 9044451 10348528 10956485 10903485 10064187 8380437 6184964 4052570 2406302 1576878
13074 1576878 1893985 3312568 5236375 6970422 8133895 8603768 8361908 7497859 6255188
13065 6255188 4941639 3735270 2651217 1735687 1117068 847457 844842 1005694 1331650
13056 1331650 1778399 2064830 1842956 1032347 -31347 -752851 -562298 848360 3378401
13047C378401L240433L539387L622872L701505L853243L885875L446465K370546
13039C1038727Q50179o75187j788614k391484k619976k453419j719901n11331
13031A9728994P30125J524446J674032J394617J063133Q94028Q75396Q27739N10441
13022B9222951j27810p89213j028302n65723M67598J598718K428690K845633K857733
13013C6910275K419851J577434N60373m57962j461991k403569l117014l379857
13005C0647540l007423k085248j082575n42584p07370j404315k165822k475941
12997A7176262k142194j483688r08834n35747l36326l33545n16114p03502o88222
12988I528090m84957l36584m91541r54778j493603j877151j989992j671930p24009
$$ plain form
13047 3378401 6618834 10158221 13781093 17482598 21335841 25221716 28668181 31038727
13039 31038727 31888906 31213719 29425105 27033621 24413645 21960226 20240325 19728994
13031 19728994 20459119 21983565 23657597 25052214 26115347 27009375 27884771 28712510 29222951
13022 29222951 29095141 28305928 27277626 26711903 27179501 28778219 31206909 34052542 36910275
13013 36910275 39330126 40907560 41467933 41009971 39547980 37144411 34027397 30647540
13005 30647540 27640117 25554869 24472294 23929710 23222340 21818025 19652203 17176262
12997 17176262 15034068 13550380 12641546 12105799 11769473 11435928 10919814 10216312 9528090
12988 9528090 9043133 8706549 8215008 7260230 5766627 3889476 1899484 227554 -496455
12979d96455O92431J965299K558248K397042J728697R26151L82476K58415L87925
12970A0800229N51598O30042M93547M2613n43770q02191m40915K63572P00630
12961A1695355M81983k89142j105057j385976q52348L32512J641158K567034L045997
12952A6131516L246678L125484K591817J959045J774263K175048K719984K878386
12944C6602221K546556K026947J543800R87826K55976n55317j389342k223876
12936C9794791k943447l440828l677655l720849l785578m070553m484037m658803
12928I013041m173576k808168q34514J078135K387277K948351K838410K232923
12920A2681879J391371N59934n3369l05531k53338j70183l44479q17152j351150
$$ plain form
12979 -496455 195976 2161275 4719523 7116565 8845262 9771413 10153889 10412304 10800229
12970 10800229 11351827 11981869 12475416 12518029 11974259 11172068 10731153 10994725 11695355
12961 11695355 12177338 11888196 10783139 9397163 8544815 8877327 10518485 13085519 16131516
12952 16131516 19378194 22503678 25095495 27054540 28828803 31003851 33723835 36602221
12944 36602221 39148777 41175724 42719524 43707350 43963326 43408009 42018667 39794791
12936 39794791 36851344 33410516 29732861 26012012 22226434 18155881 13671844 9013041
12928 9013041 4839465 2031297 1196783 2274918 4662195 7610546 10448956 12681879
12920 12681879 14073250 14633184 14579815 14274284 14020946 13850763 13506284 12689132 11337982
12911A1337982j785539k210371k676636l008141k985579k609676k097715j649887
12903g685562j263249q15836l81225r7424K25353R16627J903380K634574K705199
12894a858163K250968J550137O61718l54422j151732j362428r75387j97685P94534
12885f42460J828032K617785K852054K371586J299803P5398p52946q98680n69211
12876H181361k33443k02785n35340j070900j472232j385615p07579K78464J080601
12867C932532J287461P34819m12555j558960k006775j646650r74395m80833l01251
12858a426607l22516m47445o89303j034986j273266j181853q03346k60573L38444
12849g101451Q40658J280500J878244K658382L294784L464648L196833K665366
$$ plain form
12911 11337982 9552443 7342072 4665436 1657295 -1328284 -3937960 -6035675 -7685562
12903 -7685562 -8948811 -9764647 -10145872 -10243296 -10017943 -9101316 -7197936 -4563362 -1858163
12894 -1858163 392805 1942942 2604660 2250238 1098506 -263922 -1239309 -1436994 -642460
12885 -642460 1185572 3803357 6655411 9026997 10326800 10402198 9649252 8750572 8181361
12876 8181361 7947918 7745133 7209793 6138893 4666661 3281046 2573467 2851931 3932532
12867 3932532 5219993 5954812 5542257 3983297 1976522 329872 -644523 -1125356 -1426607
12858 -1426607 -1749123 -2196568 -2885871 -3920857 -5194123 -6375976 -7179322 -7439895 -7101451
12849 -7101451 -6260793 -4980293 -3102049 -443667 2851117 6315765 9512598 12177964
12841A2177964J857585O66954p66656j987866k471574j924668n17488J121949
12833H156200K340618K844588K709537K230533J671359J125315N59417j01649
12825B1535918q21569j408658j749884j957299k138983k218099k076942j730332
12817G434152j346254j089428r04963n32620K03955J191102K048691K438473K449590
12808A1892698K430300K531517K640962K638131K509603K195883J502040L02171
12800B8643305j231785k695864l753408m366792m567197m235100l379476k228607
12792B185076j129706m15115m7557K59502M79211L35151j32106n68082p31559
12783B34815o47141m40774j83968N3468K65534O03375J228641K054209K624526
$$ plain form
12841 12177964 14035549 14702503 13935847 11947981 9476407 7551739 7034251 8156200
12833 8156200 10496818 13341406 16050943 18281476 19952835 21078150 21637567 21535918
12825 21535918 20714349 19305691 17555807 15598508 13459525 11241426 9164484 7434152
12817 7434152 6087898 4998470 4093507 3560887 3764842 4955944 7004635 9443108 11892698
12808 11892698 14322998 16854515 19495477 22133608 24643211 26839094 28341134 28643305
12800 28643305 27411520 24715656 20962248 16595456 12028259 7793159 4413683 2185076
12792 2185076 1055370 640255 592698 852200 1331411 1666562 1534456 966374 234815
12783 234815 -412326 -853100 -1037068 -983600 -718066 -114691 1113950 3168159 5792685
12774E792685K488165J702135O62919l26944j026582j258004j049421n41615J42420
12765F585758Q35888J248345J123866M80978l75161j030066j248551j101073p96328
12756E723656m93802k21285R249J65634K94074M33187N48369O37539P61965Q90936
12746H749522Q23155M03950l09098j119243j750992j948014j721265j260503p28727
12737A138785l91073n37324j099239j609743j647999j132756k61965O88289J487818
12728c365207J901087J783066J272712O70106K08183J3946J14717M14627P68122
12719C781359J073060J334436J553834J553926J257639R38588Q15875Q29596R47838
12710A4086151J174670J327510J258252J107926J086869J316385J768298K078070
$$ plain form
12774 5792685 8280850 9982985 10645904 10318960 9292378 8034374 6984953 6443338 6585758
12765 6585758 7421646 8669991 9793857 10274835 9899674 8869608 7621057 6519984 5723656
12756 5723656 5229854 5008569 5017818 5183452 5477526 5910713 6459082 7096621 7858586 8749522
12746 8749522 9572677 9976627 9667529 8548286 6797294 4849280 3128015 1867512 1138785
12737 1138785 747712 210388 -888851 -2498594 -4146593 -5279349 -5541314 -4853025 -3365207
12728 -3365207 -1464120 318946 1591658 2261764 2469947 2483893 2598610 3013237 3781359
12719 3781359 4854419 6188855 7742689 9296615 10554254 11492842 12308717 13138313 14086151
12710 14086151 15260821 16588331 17846583 18954509 20041378 21357763 23126061 25204131
12702B5204131J727478N27411j198083k846717l944153m364202m183070l476387
12694G446408k328224q78050O80968J990388K627624K528426J969270J127664
12686A5164474P6358r65846j748528k210699k428757k415860k045676j235534
12678B189932k13639O30238J093987J256924J308070J285127J087487P60561N63219
12669I961906O19169P71432Q79465R33557Q65721N28126K6476k23603M2534O48248
12659A5053031J090121R00425j6107j294913k290050k459266j744125n10601P71770
12650I500285J649960J839451J267530l0472j764866l313233m052116l835025
12642A261514l087054k374874j919063j605636j302272r50054m67395K63227J190346
$$ plain form
12702 25204131 26931609 27459020 26260937 23414220 19470067 15105865 10922795 7446408
12694 7446408 5118184 4240134 4921102 6911490 9539114 12067540 14036810 15164474
12686 15164474 15240832 14274986 12526458 10315759 7887002 5471142 3425466 2189932
12678 2189932 1976293 2606531 3700518 4957442 6265512 7550639 8638126 9398687 9961906
12669 9961906 10581075 11352507 12231972 13165529 14031250 14559376 14585852 14362249 14404783 15053031
12659 15053031 16143152 17043577 17027470 15732557 13442507 10983241 9239116 8728515 9500285
12650 9500285 11150245 12989696 14257226 14226754 12461888 9148655 5096539 1261514
12642 1261514 -1825540 -4200414 -6119477 -7725113 -9027385 -9977439 -10444834 -10181607 -8991261
12633h991261J989298K364464K371999K255437K126793J996713J863547J604879
12625G581869J032357J37006q21525j470238j651097j562123j468549j341592
12617D36108r30735k32716M07062O93879O54104N75216O85926Q84215R71218J002722
12607E146999J045766R03995M18214k48336p30267p33877k71921K73365M30935
12598F234873L9132o82409j320014j510935j132958l84936K09025J98415k65010
12589A385183o48102o29287k38835K12267L78900K62159K0749l53262q39939j174595
12579a624762j078919o71399l02764J2367M29793Q08390Q91320P10896M72589
12570c52489J95002p9856j22940J64460O05740Q82021P84379M14646J07908J49142
$$ plain form
12633 -8991261 -7001963 -4637499 -2265500 -10063 2116730 4113443 5976990 7581869
12625 7581869 8614226 8751232 7929707 6459469 4808372 3246249 1777700 436108
12617 436108 -494627 -727343 -320281 373598 1027702 1602918 2288844 3173059 4144277 5146999
12607 5146999 6192765 7096760 7514974 7266638 6536371 5802494 5530573 5803938 6234873
12598 6234873 6274005 5591596 4271582 2760647 1627689 1242753 1451778 1650193 1385183
12589 1385183 737081 107794 -131041 81226 460126 722285 743034 389772 -450167 -1624762
12579 -1624762 -2703681 -3375080 -3677844 -3665477 -3235684 -2427294 -1535974 -825078 -352489
12570 -352489 -157487 -237343 -360283 -195823 409917 1291938 2076317 2490963 2598871 2748013
12560B748013N52634J101349J582510J941145K208352K318028K131612J682070
12552A6265713J201678Q91509P48437O52343M92983J57490l81703r46904j321549
12543A7759997j452839j285330p16144L2164N28951N91867K61478k94917p80047
12534A4645180r69676r03212p87521p56912o74910l05741K22621N00647L63197
12525A1333673j8877m29400p72208j029284j179036j195305j068354q13578m54514
12516D373117l7139L24185N29654N12597K02080l82364j052171j516096j554925
12507A398938j189871o51386j69264J47082L52178N61599P55257P64045M02205
12498B370783m04664j458147k261846k323656j580546m99952L85352R09920J179934
$$ plain form
12560 2748013 3300647 4401996 5984506 7925651 10134003 12452031 14583643 16265713
12552 16265713 17467391 18358900 19107337 19759680 20252663 20410153 20028450 19081546 17759997
12543 17759997 16307158 15021828 14305684 14337848 14866799 15458666 15720144 15425227 14645180
12534 14645180 13675504 12772292 11984771 11227859 10552949 10247208 10469829 10970476 11333673
12525 11333673 11314796 10885396 10113188 9083904 7904868 6709563 5641209 4827631 4373117
12516 4373117 4335978 4660163 5189817 5702414 5904494 5522130 4469959 2953863 1398938
12507 1398938 209067 -442319 -611583 -464501 -112323 449276 1204533 1968578 2370783
12498 2370783 1966119 507972 -1753874 -4077530 -5658076 -6158028 -5772676 -4862756 -3682822
12489c682822J378725J638805J889690J948232J716633J253351P26215K47508
12481G116337k17104o35725q07788p07037n88184n91433n63183l94713k28114
12472B383056k01980k95544m34497n59816o19673n44275k46823K59978Q13655
12463E54081J280526J712345K229309K726890K881812K523630J769979Q32598
$$ plain form
12489 -3682822 -2304097 -665292 1224398 3172630 4889263 6142614 6868829 7116337
12481 7116337 6899233 6263508 5455720 4748683 4160499 3569066 3005883 2611170 2383056
12472 2383056 2181076 1885532 1451035 891219 271546 -272729 -519552 -259574 554081
12463 554081 1834607 3546952 5776261 8503151 11384963 13908593 15678572 16511170
$$ [...]
##END NTUPLES=NMR SPECTRUM
##END=
