##TITLE=31P ikalashn
DE-78 rm_1d(nlock)
19.11.2024
##JCAMPDX= 6.0         $$ Bruker NMR JCAMP-DX V2.0
##DATA TYPE= NMR SPECTRUM
##DATA CLASS= NTUPLES
##ORIGIN= UXNMR, Bruker Analytische Messtechnik GmbH
##OWNER= root
$$ TOPSPIN		Version 1.3
$$ 2024-11-19 10:42:12.000 +0400  Irina@DPX200
$$ Compression mode = diff/dup
##.OBSERVE FREQUENCY= 81.01967998063
##.OBSERVE NUCLEUS= ^31P
##.ACQUISITION MODE= SIMULTANEOUS
##.ACQUISITION SCHEME= undefined
##.AVERAGES= 64
##.DIGITISER RES= 17
##SPECTROMETER/DATA SYSTEM= spect
##.PULSE SEQUENCE= zgpg
##.SOLVENT NAME= DMSO
##.SHIFT REFERENCE= INTERNAL, DMSO, 1, 298.5841
##AUDIT TRAIL= $$ (NUMBER, WHEN, WHO, WHERE, WHAT)
$$ ##TITLE= Audit trail, TOPSPIN		Version 1.3
$$ ##JCAMPDX= 5.01
$$ ##ORIGIN= Bruker BioSpin GmbH
$$ ##OWNER= Irina
$$ $$ F:/spectra/data/iren/nmr/P31dec/1/pdata/1/auditp.txt
$$ ##AUDIT TRAIL=  $$ (NUMBER, WHEN, WHO, WHERE, VERSION, WHAT)
(   1,<2024-11-19 10:40:09.578 +0400>,<Irina>,<DPX200>,<TOPSPIN 1.3>,
      <acquisition in progress>)
(   2,<2024-11-19 10:41:52.937 +0400>,<Irina>,<DPX200>,<TOPSPIN 1.3>,
      <Start of raw data processing
       efp BC_mod = 2 LB = 12 FT_mod = 6 PKNL = 1 PHC0 = 243.7383 PHC1 = -21.9452 SI = 32K 
       data hash MD5: 32K
       3D B7 85 51 00 71 2A FB 97 07 7A 51 F1 B9 26 A3>)
(   3,<2024-11-19 10:41:55.359 +0400>,<Irina>,<DPX200>,<TOPSPIN 1.3>,
      <apk 
       data hash MD5: 32K
       27 EA A2 C4 E6 B5 45 37 DA B6 4D 75 FE 7B BD 6B>)
(   4,<2024-11-19 10:41:57.500 +0400>,<Irina>,<DPX200>,<TOPSPIN 1.3>,
      <abs n ABSG = 5 
       data hash MD5: 32K
       08 DA 4A E8 F6 5C B2 34 B3 5C EE ED B0 31 47 FC>)
$$ ##END=
$$ 
$$ $$ hash MD5
$$ $$ 0F 80 CD DF 9D 13 33 85 03 93 82 19 9A 63 59 01
##$RELAX= 
##$RELAX= 
##$RELAX= 
##$RELAX= 
##$RELAX= 
##$RELAX= 
##$RELAX= 
##$RELAX= 
##$RELAX= 
##$RELAX= 
##$RELAX= 
$$ Bruker specific parameters
$$ --------------------------
##$DU= <F:/spectra>
##$EXPNO= 1
##$NAME= <P31dec>
##$PROCNO= 1
##$TYPE= <nmr>
##$USER= <iren>
##$AMP= (0..31)
100 100 100 100 100 100 100 100 100 100 100 100 100 100 100 100 100 100 
100 100 100 100 100 100 100 100 100 100 100 100 100 100 
##$ANAVPT= -1
##$AQSEQ= 0
##$AQ_mod= 1
##$AUNM= <au_zg>
##$AUTOPOS= <>
##$BF1= 81.014009
##$BF2= 200.13
##$BF3= 200.13
##$BF4= 200.13
##$BF5= 200.13
##$BF6= 200.13
##$BF7= 200.13
##$BF8= 200.13
##$BYTORDA= 1
##$CFDGTYP= 0
##$CFRGTYP= 5
##$CHEMSTR= <none>
##$CNST= (0..63)
1 1 145 1 1 1 1 1 1 1 1 1 1 1 1 1 1 1 1 1 1 1 1 1 1 1 1 1 1 1 1 1 1 1 
1 1 1 1 1 1 1 1 1 1 1 1 1 1 1 1 1 1 1 1 1 1 1 1 1 1 1 1 1 1 
##$CPDPRG= <waltz16>
##$CPDPRG1= <>
##$CPDPRG2= <waltz16>
##$CPDPRG3= <>
##$CPDPRG4= <mlev>
##$CPDPRG5= <mlev>
##$CPDPRG6= <mlev>
##$CPDPRG7= <mlev>
##$CPDPRG8= <mlev>
##$CPDPRGB= <>
##$CPDPRGT= <>
##$D= (0..63)
0 1 0 0 0 0 0 0 0 0.06 0 0.03 2e-005 3e-006 0 0 0.0002 0 0 0 0 0 0 0 0 
0 0 0 0 0 0 0 0 0 0 0 0 0 0 0 0 0 0 0 0 0 0 0 0 0 0 0 0 0 0 0 0 0 0 0 
0 0 0 0 
##$DATE= 1731998508
##$DBL= (0..7)
120 120 120 11 120 120 24 19 
##$DBP= (0..7)
$$ [...]
##$SW_h= 37037.037037037
##$TD= 32768
##$TD0= 1
##$TE= 300
##$TE2= 300
##$TE3= 300
##$TEG= 300
##$TL= (0..7)
0 120 53 12 22 120 120 120 
##$TP= (0..7)
150 150 150 150 150 150 150 150 
##$TP07= 0
##$TPNAME0= <>
##$TPNAME1= <>
##$TPNAME2= <>
##$TPNAME3= <>
##$TPNAME4= <>
##$TPNAME5= <>
##$TPNAME6= <>
##$TPNAME7= <>
##$TPOAL= (0..7)
0.5 0.5 0.5 0.5 0.5 0.5 0.5 0.5 
##$TPOFFS= (0..7)
0 0 0 0 0 0 0 0 
##$TUNHIN= 0
##$TUNHOUT= 0
##$TUNXOUT= 0
##$USERA1= <user>
##$USERA2= <user>
##$USERA3= <user>
##$USERA4= <user>
##$USERA5= <user>
##$V9= 5
##$VALIST= <valist>
##$VCLIST= <CCCCCCCCCCCCCCC>
##$VD= 0
##$VDLIST= <DDDDDDDDDDDDDDD>
##$VPLIST= <PPPPPPPPPPPPPPP>
##$VTLIST= <TTTTTTTTTTTTTTT>
##$WBST= 1024
##$WBSW= 4
##$XGAIN= (0..3)
0 0 0 0 
##$XL= 0
##$YL= 0
##$YMAX_a= 7521
##$YMIN_a= -9102
##$ZGOPTNS= <>
##$ZL1= 120
##$ZL2= 120
##$ZL3= 120
##$ZL4= 120
##$ABSF1= 298.5841
##$ABSF2= -158.5842
##$ABSG= 5
##$ABSL= 5
##$ALPHA= 0
##$AQORDER= 0
##$ASSFAC= 0
##$ASSFACI= 0
##$ASSFACX= 0
##$ASSWID= 0
##$AUNMP= <proc_1d>
##$AXLEFT= 0
##$AXRIGHT= 0
##$AXTYPE= 0
##$AXUNIT= <>
##$AZFE= 0.1
##$AZFW= 0.5
##$BCFW= 0
##$BC_mod= 2
##$BYTORDP= 0
##$COROFFS= 0
##$CY= 12.5935478210449
##$DATMOD= 1
##$DC= 0
##$DFILT= <>
##$DTYPP= 0
##$F1P= 47.1127640792319
##$F2P= -24.0371245302204
##$FCOR= 0.5
##$FTSIZE= 32768
##$FT_mod= 6
##$GAMMA= 0
##$GB= 0
##$INTBC= 1
##$INTSCL= 7.269226e-011
##$ISEN= 30
##$LB= 12
##$LEV0= 0
##$LPBIN= 0
##$MAXI= 12.09355
##$MC2= 0
##$MEAN= 0
##$ME_mod= 0
##$MI= 0.7550151
##$NCOEF= 0
##$NC_proc= -13
##$NLEV= 6
##$NOISF1= 298.5841
##$NOISF2= 270.0111
##$NSP= 0
##$NTH_PI= 0
##$NZP= 0
##$OFFSET= 298.5841
##$PC= 1.4
##$PHC0= 200.6313
##$PHC1= 41.23299
##$PH_mod= 1
##$PKNL= yes
##$PPARMOD= 0
##$PPDIAG= 0
##$PPIPTYP= 0
##$PPMPNUM= 100
##$PPRESOL= 1
##$PSCAL= 0
##$PSIGN= 0
##$REVERSE= no
##$SF= 81.014009
##$SI= 32768
##$SIGF1= 270.0111
##$SIGF2= -158.5842
##$SINO= 77.54984
##$SIOLD= 32768
##$SREGLST= <31P.CDCl3>
##$SSB= 0
##$STSI= 32768
##$STSR= 0
##$SW_p= 37037.037037037
##$SYMM= 0
##$S_DEV= 0
##$TDeff= 32768
##$TDoff= 0
##$TI= <>
##$TILT= no
##$TM1= 0
##$TM2= 0
##$TOPLEV= 0
##$USERP1= <user>
##$USERP2= <user>
##$USERP3= <user>
##$USERP4= <user>
##$USERP5= <user>
##$WDW= 1
##$XDIM= 32768
##$YMAX_p= 464125737
##$YMIN_p= -28594957
$$ End of Bruker specific parameters
$$ ---------------------------------
##NTUPLES= NMR SPECTRUM
##VAR_NAME=  FREQUENCY,     SPECTRUM/REAL,   SPECTRUM/IMAG
##SYMBOL=    X,             R,               I
##VAR_TYPE=  INDEPENDENT,   DEPENDENT,       DEPENDENT
##VAR_FORM=  AFFN,          ASDF,            ASDF
##VAR_DIM=   32768,         32768,           32768
##UNITS=     HZ,            ARBITRARY UNITS, ARBITRARY UNITS
##FACTOR=    1.13031516577767, 1,            1
##FIRST=     37037.037037037, -14330990,     29534767
##LAST=      0,             -4001551,        -7697351
##MIN=       0,             -28594957,       0
##MAX=       37037.037037037, 464125737,     0
$$ Real data points
##PAGE= N=1
##DATA TABLE= (X++(R..R)), XYDATA
$$ [...]
17705F282613q94418q37275o13585j95291L16001P44287J000412J143318J285468
$$ 6282613 5388195 4550920 3937335 3742044 4058045 4802332 5802744 6946062 8231530
17696H231530J461162J585785J546830J300338Q59430K67713l82647r59427j336812
$$ 8231530 9692692 11278477 12825307 14125645 14985075 15252788 14870141 13910714 12573902
17687A2573902j442006j296904j030069q06698p10262o99864o74759n47789k82108
$$ 12573902 11131896 9834992 8804923 7998225 7287963 6588099 5913340 5365551 5083443
17678E083443R0073M93353Q58309J126111J234885J152666R28840O73693M73920
$$ 5083443 5173516 5666869 6525178 7651289 8886174 10038840 10967680 11641373 12115293
17669A2115293L41804K40767J27165n3589l61555q06200j319665j781343k062814
$$ 12115293 12457097 12697864 12825029 12771440 12409885 11603685 10284020 8502677 6439863
17660F439863k088064j863799j455288r64178n32585l07847l36602m84241n32318
$$ 6439863 4351799 2488000 1032712 68534 -464051 -771898 -1108500 -1592741 -2125059
17651b125059l84442j15943J47713L23142L93175M06365M12965L96235L19733
$$ -2125059 -2509501 -2625444 -2477731 -2154589 -1761414 -1355049 -942084 -545849 -226116
17642b26116K08326J36789J80442L91089P74519J264762J721780J981901J944044
$$ -226116 -17790 118999 299441 690530 1465049 2729811 4451591 6433492 8377536
17633H377536J617788J107317N49722L9818m02306p91661j115433j319223j361605
$$ 8377536 9995324 11102641 11652363 11692181 11289875 10498214 9382781 8063558 6701953
17624F701953j273354j156142j116849j195973j355953j496774j467237j137980
$$ 6701953 5428599 4272457 3155608 1959635 603682 -893092 -2360329 -3498309
17616c498309n28924J79579P98281J241406J503349J600431J550409J388414J183148
$$ -3498309 -4027233 -3847654 -3049373 -1807967 -304618 1295813 2846222 4234636 5417784
17607E417784J007668Q88730Q00793P05191N67147L60476J19887n4749j04823
$$ 5417784 6425452 7314182 8114975 8820166 9387313 9747789 9867676 9812927 9708104
17598I708104p7284p8994k02753m75534q48852j231580j547100j768437j888302
$$ 9708104 9630820 9551826 9349073 8873539 8024687 6793107 5246007 3477570 1589268
17589A589268j859636j588901j017890k23831N83520J176847J415341J264697
$$ 1589268 -270368 -1859269 -2877159 -3100990 -2517470 -1340623 74718 1339415
17581A339415P85319J35461m35713o76205m95418l1653M84667R25791J312268
$$ 1339415 2124734 2260195 1824482 1148277 652859 621206 1105873 2031664 3343932
17572C343932J700434K065843K289121K240048J867315J210329L70408n18563
$$ 3343932 5044366 7110209 9399330 11639378 13506693 14717022 15087430 14568867
17564A4568867j330891j971283k370826k482520k286622j805408j135802m67082
$$ 14568867 13237976 11266693 8895867 6413347 4126725 2321317 1185515 718433
17556G18433J0208K50326L62854M92949P25571J055865J394671J601212J546023
$$ 718433 728641 978967 1341821 1834770 2560341 3616206 5010877 6612089 8158112
17547H158112J185731O05145K919m01234n05715m02314k94672k98306l44888l16353
$$ 8158112 9343843 9948988 9951907 9550673 9044958 8642644 8347972 8049666 7704778 7388425
17537G388425j99721q2039o6033j93769m21130o77186r03409j020127r41796o52477
$$ 7388425 7188704 7106665 7040632 6846863 6425733 5748547 4845138 3825011 2883215 2230738
17527B230738k29055K32992O86862J083897J303487J198010P32652P9916m93899
$$ 2230738 2001683 2234675 2921537 4005434 5308921 6506931 7239583 7319499 6825600
17518F825600q40380r84834j038908j096531j174968j228698j173982r07283l99787
$$ 6825600 5985220 5000386 3961478 2864947 1689979 461281 -712701 -1619984 -2019771
17509b019771K00280O36750P51216N93714L45824J71984J33296J84246K15624
$$ -2019771 -1819491 -1182741 -431525 162189 508013 679997 813293 997539 1213163
17500A213163J29855j12691m96648r33918j237333j199698p73326j37624M43668
$$ 1213163 1343018 1230327 733679 -200239 -1437572 -2637270 -3410596 -3548220 -3104552
17491c104552P83339P95302M68043j02278p07027j127258j244625j085047p84960
$$ -3104552 -2321213 -1525911 -1057868 -1160146 -1867173 -2994431 -4239056 -5324103 -6109063
17482f109063m93016k74965j05317N1765J87397K49521J37493k41721q47540j489679
$$ -6109063 -6602079 -6877044 -6982361 -6930596 -6743199 -6493678 -6356185 -6597906 -7445446 -8935125
17472h935125j957351k115886j886628j255228l62941M97110J051384J237808
$$ -8935125 -10892476 -13008362 -14894990 -16150218 -16513159 -16016049 -14964665 -13726857
17464a3726857J225159J234001J366350J600867J888427K203005K487483K599609
$$ -13726857 -12501698 -11267697 -9901347 -8300480 -6412053 -4209048 -1721565 878044
17456H78044K392756J873371J235357P03438L38462J0922m22878r37904j345763
$$ 878044 3270800 5144171 6379528 7082966 7421428 7432350 7009472 6071568 4725805
17447D725805j465240j283434r63700p05803n91008n37190m07997j71146Q5156
$$ 4725805 3260565 1977131 1013431 307628 -283380 -820570 -1228567 -1399713 -1314557
17438a314557K70333L70259M10595L91414K96495J36680o9840l41345o95404j088738
$$ -1314557 -1044224 -673965 -263370 128044 424539 561219 491379 150034 -545370 -1634108
17428a634108j440477j682547j775790j720137j535851j220587p65131k10051
$$ -1634108 -3074585 -4757132 -6532922 -8253059 -9788910 -11009497 -11774628 -11984679
17420a1984679L50297Q22222J166894J397501J533918J593703J602579J574189
$$ -11984679 -11634382 -10812160 -9645266 -8247765 -6713847 -5120144 -3517565 -1943376
17412a943376J506596J419555J352690J314475J260600J109908Q07474L98143
$$ -1943376 -436780 982775 2335465 3649940 4910540 6020448 6827922 7226065
17404G226065N909k52794l30404k85392k59293l42821m66146m74590l00862j6370
$$ 7226065 7231974 6979180 6648776 6363384 6104091 5761270 5295124 4820534 4519672 4503302
17394D503302K51732L93602L56432J80711q021p5432K0893J90200K80349J99031
$$ 4503302 4755034 5148636 5505068 5685779 5677758 5602326 5623219 5813419 6093768 6292799
17384F292799k7808l01832n50284p49767q79538r11379q16340n76603k29302J10773
$$ 6292799 6264991 5963159 5412875 4663108 3783570 2872191 2055851 1479248 1249946 1360719
17374A360719K88652K18127k3803k54234l21924j59421K33739P68985J244926
$$ 1360719 1649371 1867498 1843695 1589461 1267537 1108116 1341855 2110840 3355766
17365C355766J434196J227115O99221O2138m80122q51293j088499j265054j449889
$$ 3355766 4789962 6017077 6716298 6778436 6298314 5447021 4358522 3093468 1643579
17356A643579j675991j891108j974626j838879j490826j006804m79525J2527M02789
$$ 1643579 -32412 -1923520 -3898146 -5737025 -7227851 -8234655 -8714180 -8701653 -8298864
17347h298864O30615O69344N59880L88342K34272J46330J47876K28408L26143
$$ -8298864 -7668249 -6998905 -6439025 -6050683 -5816411 -5670081 -5522205 -5293797 -4967654
17338d967654L51212K41657J5283k43493m64994o40604p88751r03224r37639q46061
$$ -4967654 -4616442 -4374785 -4359502 -4602995 -5067989 -5708593 -6497344 -7400568 -8338207 -9184268
17328i184268o42781l85050j04800J98242N23614Q48156J116507J266109J280422
$$ -9184268 -9827049 -10212099 -10316899 -10118657 -9595043 -8746887 -7630380 -6364271 -5083849
17319e083849J207855J110678J019586R48012R14067R20639R32252R07881Q27952
$$ -5083849 -3875994 -2765316 -1745730 -797718 116349 1036988 1969240 2877121 3705073
17310C705073O67838M13479J30467l8888P27J74476K78375J77721o0791k81439
$$ 3705073 4372911 4786390 4916857 4877969 4878696 5053172 5331547 5509268 5448477 5167038
17300E167038m39567o14635q51677j054892j045497p08161q8442O19428J162263
$$ 5167038 4727471 4112836 3261159 2206267 1160770 452609 364167 983595 2145858
17291B145858J345712J126503O25988N6144l92867o30917o79777o41505o20160
$$ 2145858 3491570 4618073 5244061 5300205 4907338 4276421 3596644 2955139 2334979
17282B334979o17412n26404k70784P9306L56430M28331K87924N1825j25636j39821
$$ 2334979 1717567 1191163 920379 999685 1356115 1784446 2072370 2124195 1998559 1858738
17272A858738L5851L48005O68942Q47485Q18727O52615M41975J90748j27875m59706
$$ 1858738 1894589 2242594 2911536 3759021 4577748 5230363 5672338 5863086 5735211 5275505
17262E275505o85546p35423o31685m31050j92251J0356R4587K4809j51849l37614
$$ 5275505 4589959 3854536 3222851 2791801 2599550 2609906 2704493 2729302 2577453 2239839
17252B239839m20384l19097o8819J81931K96320K22289l3766m37423r23950j371363
$$ 2239839 1819455 1500358 1431539 1613470 1909790 2132079 2098313 1660890 736940 -634423
17242f34423j617461j556674j227921q18553n67793o13889q96248j184557j232509
$$ -634423 -2251884 -3808558 -5036479 -5855032 -6422825 -7036714 -7932962 -9117519 -10350028
17233a0350028r63104n15870r7975J87980L62212M75379N53308O00503O08022
$$ -10350028 -11313132 -11829002 -11926977 -11738997 -11376785 -10901406 -10348098 -9747595 -9139573
17224i139573N62784M58197L20132K30600K93523N59670R58513J272557J244406
$$ -9139573 -8576789 -8118592 -7798460 -7567860 -7274337 -6714667 -5756154 -4483597 -3239191
17215c239191Q00603J41025m28226o94625n93491k00970K58915M96657L62564
$$ -3239191 -2438588 -2297563 -2725789 -3420414 -4013905 -4214875 -3955960 -3459303 -3096739
17206c096739k4946l89100n26324m24763k11953m0106l297j00906k46887l30354
$$ -3096739 -3121685 -3510785 -4037109 -4461872 -4673825 -4713931 -4717228 -4818134 -5065021 -5395375
17196e395375k85169j29175L7137J03856N8501L882O8894L17220P21500J168086
$$ -5395375 -5680544 -5809719 -5772582 -5668726 -5610225 -5606343 -5537449 -5220229 -4498729 -3330643
17186c330643J480570J502789J197928O56753M1621m42393o07510m11508j6190
$$ -3330643 -1850073 -347284 850644 1507397 1549018 1106625 499115 87607 71417
17177G1417L12359L78007J60025k32475o83836j122824j485820j679443j606812
$$ 71417 383776 761783 921808 689333 5497 -1117327 -2603147 -4282590 -5889402
17168e889402j254725p36255k32078R7921J88473R9423l3163q4219L629K17257
$$ -5889402 -7144127 -7880382 -8112460 -8014539 -7826066 -7726643 -7759806 -7844025 -7840396 -7623139
17158g623139N07964Q17899J075419J201131J151465R46845O56329L84519K37953
$$ -7623139 -7115175 -6297276 -5221857 -4020726 -2869261 -1922416 -1266087 -881568 -643615
17149f43615K64872M62325Q18727J279334J690557J871378J756693J405997R04668
$$ -643615 -378743 83582 902309 2181643 3872200 5743578 7500271 8906268 9810936
17140I810936L33679k13177o59169r88734j224645j368327j405320j350054j238643
$$ 9810936 10144615 9931438 9272269 8283535 7058890 5690563 4285243 2935189 1696546
17131A696546j086761q69382n39778r0552L96216P77830R36806Q37009N18098
$$ 1696546 609785 -259597 -799375 -889927 -493711 284119 1220925 2057934 2576032
17122B576032O7350m16272q60385j201208j336420j153319o17178J85844J099765
$$ 2576032 2643382 2227110 1366725 165517 -1170903 -2324222 -2941400 -2755556 -1655791
17113a655791J970790K662992L047396L028559K618995J987795J398464J061805
$$ -1655791 314999 2977991 6025387 9053946 11672941 13660736 15059200 16121005
17105A6121005J012618J103502J130435R78614O44646J56229m38027j011159j415324
$$ 16121005 17133623 18237125 19367560 20346174 20990820 21147049 20709022 19697863 18282539
17096A8282539j599343j614870j572477j603811j785003k077984k354299k468395
$$ 18282539 16683196 15068326 13495849 11892038 10107035 8029051 5674752 3206357
17088C206357k323120j905219j285880n79557J08599P07776J191509J582913J909229
$$ 3206357 883237 -1021982 -2307862 -2887419 -2778820 -2071044 -879535 703378 2612607
17079B612607K107635K024876J572890Q52557J10823l95956n41293l80351p4781
$$ 2612607 4720242 6745118 8318008 9170565 9281388 8885432 8344139 7963788 7889007
17070G889007K14417L68902L20195R0603j91120l76779m08312l39648k79157l13847
$$ 7889007 8103424 8472326 8792521 8883124 8692004 8315225 7906913 7567265 7288108 6974261
17060F974261m58426o56892q43365r99452j134434j214644j161490r40688o02733
$$ 6974261 6515835 5858943 5015578 4016126 2881692 1667048 505558 -435130 -1037863
17051a037863k32517R4073L19351M14415M03871L67951L79748M53176N72044P29478
$$ -1037863 -1270380 -1176307 -856956 -442541 -38670 329281 709029 1162205 1734249 2463727
17041B463727R12177J075461J164055J148573J036935Q68330O94760N51758M50323
$$ 2463727 3375904 4451365 5615420 6763993 7800928 8669258 9364018 9915776 10366099
17032A0366099L92064L63361L19236K19871R1180M356q769Q00n9452k15682l64776
$$ 10366099 10758163 11121524 11440760 11660631 11751811 11756167 11747398 11748198 11688746 11473064 11108288
17021A1108288l68749j96582O5627L10504M81317N68365N48308L57783k5943n16497
$$ 11108288 10739539 10542957 10608584 10919088 11400405 11968770 12517078 12874861 12848918 12332421
17011A2332421r70249j261479j310817j107163p30648l35959p6832l0553j79758
$$ 12332421 11362172 10100693 8789876 7682713 6952065 6616106 6539274 6508721 6328963
17002F328963m37170o95358q81311r69267r55135q30214n79431k42056M1753J22244
$$ 6328963 5891793 5196435 4315124 3345857 2390722 1560508 981077 739021 780774 903018
16992I03018l0250l18770o06405p84257p95016o49112m22469k01795l1191P5021
$$ 903018 872768 553998 -52407 -836664 -1631680 -2280792 -2703261 -2905056 -2936247 -2861226
16982b861226R4061k601k14456m79422o85070p46702o90717o49100p52328j007965
$$ -2861226 -2767165 -2769766 -2984222 -3463644 -4148714 -4895416 -5586133 -6235233 -6987561 -7995526
16972g995526j282524j419426j351961j095896o87118j67454L81126Q23284J012924
$$ -7995526 -9278050 -10697476 -12049437 -13145333 -13832451 -13999905 -13618779 -12795495 -11782571
16963a1782571Q69374M30015j53184o54540q47205o30559j25575M02922P23196
$$ -11782571 -10913197 -10483182 -10636366 -11290906 -12138111 -12768670 -12894245 -12491323 -11768127
16954a1768127P55888O09052M90344N25646O82816Q48858R23351Q85203Q15905
$$ -11768127 -11012239 -10403187 -9912843 -9387197 -8704381 -7855523 -6932172 -6046969 -5231064
16945e231064Q14977Q94285R72964R33520O91409K69840j94853n40344o69960
$$ -5231064 -4416087 -3521802 -2548838 -1615318 -923909 -654069 -848922 -1389266 -2059226
16936b059226n70746k83002R3558L94694M63511K43446j93518p02626j153535
$$ -2059226 -2629972 -2912974 -2819416 -2424722 -1961211 -1717765 -1911283 -2613909 -3767444
16927c767444j471039j624857j607992j409197r98515l70190L85956J083968J539641
$$ -3767444 -5238483 -6863340 -8471332 -9880529 -10879044 -11249234 -10863278 -9779310 -8239669
16918h239669J684398J594785J416085J254546J128348R98185Q39366O80648N57228
$$ -8239669 -6555271 -4960486 -3544401 -2289855 -1161507 -163322 676044 1356692 1913920
16909A913920M37266K40295n8575l64175n04034l48697Q1854O15995J039924J241429
$$ 1913920 2351186 2591481 2532906 2168731 1664697 1316000 1397854 2013849 3053773 4295202
16899D295202J253079J135620Q70800M28603j19885o33183j022836j310203j564471
$$ 4295202 5548281 6683901 7554701 7983304 7863419 7230236 6207400 4897197 3332726
16890C332726j794033j903553j772368j370456p89015j88877K80842N55915O46747
$$ 3332726 1538693 -364860 -2137228 -3507684 -4296699 -4485576 -4204734 -3648819 -3002072
16881c002072N59034K74778j90433p44113j225182j467422j400621j090870o74003
$$ -3002072 -2443038 -2168260 -2358693 -3102806 -4327988 -5795410 -7196031 -8286901 -8960904
16872h960904k61424J07404M61591Q53995J280747J658447J906358K010493J996161
$$ -8960904 -9222328 -9114924 -8653333 -7799338 -6518591 -4860144 -2953786 -943293 1052868
16863A052868J885486J701247J488530J298525J151438J033678R22389P99934
$$ 1052868 2938354 4639601 6128131 7426656 8578094 9611772 10534161 11334095
16855A1334095O58256N04883L54555K25037J42014J26189J95025L83012O99890
$$ 11334095 11992351 12497234 12851789 13076826 13218840 13345029 13540054 13923066 14622956
16846A4622956J048070J252524J205456R35285N38624R9226l23973o67974q72595
$$ 14622956 15671026 16923550 18129006 19064291 19602915 19702141 19378168 18710194 17837599
16837A7837599r45613r62541r43097q11340n37712k58417j91409m26801q40341
$$ 17837599 16891986 15929445 14986348 14175008 13637296 13378879 13187470 12760669 11920328
16828A1920328j207310j342580j174486p80982l43224k4709J00936M5257j16903
$$ 11920328 10713018 9370438 8195952 7414970 7071746 7047037 7147973 7193230 7076327
16819G076327k88108m06250m70976n16871n57413n64929n08358l84504k11152
$$ 7076327 6788219 6381969 5910993 5394122 4836709 4271780 3763422 3378918 3167766
16810C167766J396K63086N61691Q17209R10724P68167M34130P6596j08356k7248
$$ 3167766 3169162 3432248 3993939 4811148 5721872 6490039 6924169 7000765 6892409 6865161
16800F865161K48431N48354P52606Q46496Q35457P14753N25017L28767J39634
$$ 6865161 7113592 7661946 8414552 9261048 10096505 10811258 11336275 11665042 11804676
16791A1804676n1542k03745k44321j42374P4396L43966N79535O85666O07435L78700
$$ 11804676 11753134 11549389 11305068 11162694 11237090 11581056 12160591 12846257 13453692 13832392
16781A3832392J07793j01909k11494k62938l85889p37184j342336j986828k312522
$$ 13832392 13940185 13838276 13626782 13363844 12977955 12240771 10898435 8911607 6599085
16772F599085k081635j373374m96668L00503R91472J648937K262223K702979K807789
$$ 6599085 4517450 3144076 2647408 2947911 3939383 5588320 7850543 10553522 13361311
16763A3361311K497796J849804J040357K48827l75619p25265p53315m83804l0085
$$ 13361311 15859107 17708911 18749268 18998095 18622476 17897211 17143896 16660092 16630007
16754A6630007M00672N98360M82716J22740l62976q75259j309199j561652j602879
$$ 16630007 17030679 17629039 18111755 18234495 17871519 16996260 15687061 14125409 12522530
16745A2522530j473562j212932q43829m09408J2968L12268L69910J38273l10799
$$ 12522530 11048968 9836036 8992207 8582799 8595767 8908035 9277945 9416218 9105419
16736I105419q14997j191362j316972j181758q78057n28174k06751O3301K72712
$$ 9105419 8290422 7099060 5782088 4600330 3722273 3194099 2987348 3050649 3323361
16727C323361M38330O26553Q91825J181521J338821J221742Q30263L07099j98411
$$ 3323361 3761691 4388244 5280069 6461590 7800411 9022153 9852416 10159515 9961104
16718I961104o28210r74090j220604j359793j395389j310170j086051p62886m39427
$$ 9961104 9332894 8358804 7138200 5778407 4383018 3072848 1986797 1223911 784484
16709G84484j92070R286K83358P09786J192001J475970J371444R41451M37847
$$ 784484 592414 601700 885058 1594844 2786845 4262815 5634259 6575710 7013557
16700G013557J05200P2067L25872P21229J057003J196145J119627Q90245N73452
$$ 7013557 7118757 7190824 7516696 8237925 9294928 10491073 11610700 12500945 13074397
16691A3074397J67771l46505q78196j226297j235392r23884m64861n3835J91215
$$ 13074397 13242168 12895663 12017467 10791170 9555778 8631894 8167033 8113198 8304413
16682H304413K30520J05223m1974n5433P3766K00609J94740P6033k5781m1833
$$ 8304413 8534933 8640156 8598182 8542749 8616515 8817124 9011864 9087897 9062116 9020283
16672I020283n3187j93237n12424r18997j205443j179115q14573k87671J37454
$$ 9020283 8967096 8773859 8261435 7342438 6136995 4957880 4143307 3855636 3993090
16663C993090K79536J47031r0087k19927r9164K97490Q85235J495573J917880
$$ 3993090 4272626 4419657 4329570 4109643 4010479 4307969 5193204 6688777 8606657
16654H606657J983240J652645J036767L25614l11352p78880j054578j163474j149105
$$ 8606657 10589897 12242542 13279309 13604923 13293571 12514691 11460113 10296639 9147534
16645I147534j058318r28341p69850n75664l50411j37247K191P1533J61053L47766
$$ 9147534 8089216 7160875 6391025 5815361 5464950 5327703 5329894 5401427 5562480 5910246
16635E910246O03038Q01122Q20332O33362K90983j14657m62599o74159p72295
$$ 5910246 6513284 7314406 8134738 8768100 9059083 8944426 8481827 7807668 7035373
16626G035373q15502q11978p48115o29579m36718j29327K73364O77890R70418
$$ 7035373 6219871 5407893 4659778 4030199 3593481 3464154 3737518 4415408 5385826
16617E385826J075020J004026Q53572P24445O54738O18805N73439N15319M64352
$$ 5385826 6460846 7464872 8318444 9042889 9697627 10316432 10889871 11405190 11869542
16608A1869542L81756J64861k32692o89629r84281r97304p83847m67787j67757
$$ 11869542 12251298 12416159 12183467 11493838 10509557 9512253 8728406 8260619 8092862
16599H092862L1898J06144O0344q3325k46420l25655k97490k28595j91209k30406
$$ 8092862 8124760 8230904 8291248 8207923 7961503 7635848 7338358 7109763 6918554 6688148
16589F688148l88404o86751j059449j342351j383003j167606q26847n19785l21387
$$ 6688148 6299744 5612993 4553544 3211193 1828190 660584 -166263 -686048 -1007435
16580a007435k22543j78322j03704J25664N77358J147320J597714J754932J641967
$$ -1007435 -1229978 -1408300 -1512004 -1386340 -808982 338338 1936052 3690984 5332951
16571E332951J407932J161654Q78912N06495J23450j21671j82169j22290m6684
$$ 5332951 6740883 7902537 8781449 9287944 9411394 9289723 9107554 8985264 8938580
16562H938580p2298k65413n53449p52133p28285n18512k71132j20187j27269k70144
$$ 8938580 8866282 8600869 8047420 7295287 6567002 6048490 5777358 5657171 5529902 5259758
16552E259758m49973n43783m74382k46962N0774K88655L79363L60721L78725N38004
$$ 5259758 4809785 4266002 3791620 3544658 3595432 3884087 4263450 4624171 5002896 5540900
16542E540900P66207Q81506P80942N01661J56662j24852k44646j76388J9808K25708
$$ 5540900 6307107 7188613 7969555 8471216 8627878 8503026 8258380 8081992 8101800 8327508
16532H327508L34343L10781J89682L1115j24248l03015n89225j016824j470418
$$ 8327508 8661851 8972632 9162314 9193429 9069181 8766166 8176941 7160117 5689699
16523E689699j707325j499154p76255L39614J590193K625033L082002K797373
$$ 5689699 3982374 2483220 1706965 2046579 3636772 6261805 9343807 12141180
16515A2141180J992996J140266N80414L43136K78551K22085P3476j42552l04934
$$ 12141180 14134176 15274442 15854856 16197992 16476543 16698628 16772104 16629552 16324618
16506A6324618l39309l01411l07792m22017o15271p94100q43045p04417m41827
$$ 16324618 15985309 15683898 15376106 14954089 14338818 13544718 12701673 11997256 11555429
16497A1555429j72396L9841J76580K21226J86941J40114J33996J37105P5397m4932
$$ 11555429 11383033 11422874 11599454 11820680 12007621 12147735 12281731 12418836 12494233 12449301
16487A2449301j16743p6852n314k5435j27090j45687O8002N09538J032044J439825
$$ 12449301 12332558 12255706 12250392 12224957 12097867 11952180 12020182 12529720 13561764 15001589
16477A5001589J615444J595390J511712J470835J472251J404476J125712N77212
$$ 15001589 16617033 18212423 19724135 21194970 22667221 24071697 25197409 25774621
16469B5774621j73075r79177j676722k111840k173132j822649j095241r9757R39296
$$ 25774621 25601546 24622369 22945647 20833807 18660675 16838026 15742785 15643028 16582324
16460A6582324J697715J950519J785154J488460J228215R81983P11567M72928
$$ 16582324 18280039 20230558 22015712 23504172 24732387 25714370 26425937 26898865
16452B6898865L70073M50053O62844R07274J073081J071182Q84189N85169K84045
$$ 26898865 27268938 27718991 28381835 29289109 30362190 31433372 32317561 32902730 33186775
16443C3186775N9570n6650p4682m5445m4898j48756l98961p68346j147622j384732
$$ 33186775 33246345 33189695 33115013 33069568 33024670 32875914 32476953 31708607 30560985 29176253
16433B9176253j389462j219720j061498j121411j475907j950406k215242k088521
$$ 29176253 27786791 26567071 25505573 24384162 22908255 20957849 18742607 16654086
16425A6654086j676697j226429r45956r28124j121427j352054j416403j176767
$$ 16654086 14977389 13750960 12805004 11876880 10755453 9403399 7986996 6810229
16417F810229o36362J9707N16437O70644M78285Q7889k65727l73531j64619K71072
$$ 6810229 6173867 6193574 6710011 7380655 7858940 7946829 7681102 7307571 7142952 7414024
16407G414024P48285J095001J238635J203090J053842Q60461O85596N90708O14395
$$ 7414024 8162309 9257310 10495945 11699035 12752877 13613338 14298934 14889642 15504037
16398A5504037P08932P25249M83684j37000j123212k305540l457786m417279n092843
$$ 15504037 16212969 16938218 17421902 17284902 16161690 13856150 10398364 5981085 888242
16389H88242n414405n310749m730364l674377k175801l12768J687070L462775
$$ 888242 -4526163 -9836912 -14567276 -18241653 -20417454 -20730222 -19043152 -15580377
16381a5580377M701238N252846N129790M477336L529821K560040J825823J479575
$$ -15580377 -10879139 -5626293 -496503 3980833 7510654 10070694 11896517 13376092
16373A3376092J482273J637390J749010J742257J642134J490469J289685J001795
$$ 13376092 14858365 16495755 18244765 19987022 21629156 23119625 24409310 25411105
16365B5411105O06888J52781k70345n76869p14940p05554o58270p22264r82702
$$ 25411105 26017993 26170774 25900429 25323560 24608620 23903066 23244796 22522532 21539830
16356B1539830j391241j802208k055842k073680j926813j774198j714325j713940
$$ 21539830 20148589 18346381 16290539 14216859 12290046 10515848 8801523 7087583
16348G087583j671341j528992j308009j032687o81843k70693J00913L66493N70525
$$ 7087583 5416242 3887250 2579241 1546554 864711 594018 694931 1061424 1631949
16339A631949P57542Q81326Q94512Q38746P76437P04198N82996M01625J96272
$$ 1631949 2389491 3270817 4165329 5004075 5780512 6484710 7067706 7469331 7665603
16330G665603M9898O7032L03175P02894J129306J467265J679118J768991J750300
$$ 7665603 7715501 7782533 8085708 8788602 9917908 11385173 13064291 14833282 16583582
16321A6583582J641246J453840J212392R60532P26039N34238M39715M80871O10758
$$ 16583582 18224828 19678668 20891060 21851592 22577631 23111869 23551584 24032455 24643213
16312B4643213O80280M64965k27208j347887k500133l176526l183275k729496
$$ 24643213 25323493 25788458 25561250 24213363 21713230 18536704 15353429 12623933
16304A2623933k117074j499060r06146l56491R1405L46809L45240J02121k88485
$$ 12623933 10506859 9007799 8101653 7745162 7836567 8183376 8528616 8630737 8342252
16295H342252o84888r35759r28620o40219j59895L38792O72883P38477N67882
$$ 8342252 7657364 6721605 5792985 5152766 4992871 5331663 6004546 6743023 7310905
16286G310905K95168L6363j85142l71272m37943k58908J41986N39717P10548O17901
$$ 7310905 7606073 7642436 7457294 7086022 6648079 6389171 6531157 7070874 7781422 8399323
16276H399323L93983J99397J02489P7950Q2270J14109K29375M79675Q20393J091559
$$ 8399323 8793306 8992703 9095192 9173142 9255412 9369521 9598896 10078571 10898964 11990523
16266A1990523J097405P42696J33557m67906q36948r53744r56847r27795q00069
$$ 11990523 13087928 13830624 13964181 13496275 12659327 11705583 10748736 9820941 9020872
16257I020872n16642j50369K12549O21262J189434J870924K370873K368399J844013
$$ 9020872 8504230 8353861 8566410 9187672 10377106 12248030 14618903 16987302 18831315
16248A8831315J102678M92779J81656J62741L75593P47992J171264J533849J746712
$$ 18831315 19933993 20426772 20608428 20771169 21146762 21894754 23066018 24599867 26346579
16239B6346579J705082J313759O02579k04820p85733r16213n95295k7842N07255
$$ 26346579 28051661 29365420 29967999 29763179 28977446 28061233 27465938 27438096 27945351
16230B7945351Q16622Q57759P13417N34377M57057N20737O41717O68474M82841
$$ 27945351 28761973 29619732 30333149 30867526 31324583 31845320 32487037 33155511 33638352
16221C3638352Q3975m04609q33823j133302j300988j335152j223807r72391o01642
$$ 33638352 33722327 33317718 32483895 31350593 30049605 28714453 27490646 26518255 25916613
16212B5916613j50491K87666N81029O37078M30865k5416o80953j409969k028213
$$ 25916613 25766122 26053788 26634817 27271895 27702760 27677344 26996391 25586422 23558209
16203B3558209k369632k343508j967639j395151q40429m15874p9159K69455O76583
$$ 23558209 21188577 18845069 16877430 15482279 14641850 14225976 14146817 14416272 15092855
16194A5092855J080717J351481J431089J397567J354228J334007J301094J173150
$$ 15092855 16173572 17525053 18956142 20353709 21707937 23041944 24343038 25516188
16186B5516188Q76356M37226j6215l74895o22472p90617r13560j021651j114196
$$ 25516188 26392544 26829770 26813555 26438660 25816188 25025571 24112011 23090360 21976164
16177B1976164j151460j110259j012639q81245p03102m40377o2459M03822Q39160
$$ 21976164 20824704 19714445 18701806 17820561 17117459 16677082 16614623 17018445 17857605
16168A7857605J068272R83194O76674M23496M75466Q56463J360462J754570J959521
$$ 17857605 18925877 19909071 20585745 21009241 21484707 22341170 23701632 25456202 27415723
16159B7415723K033897K069111K119626K166015K135361J974528J670526J223933
$$ 27415723 29449620 31518731 33638357 35804372 37939733 39914261 41584787 42808720
16151D2808720O73346J29860k70240m56523m53190l31940j70656o4167j29154
$$ 42808720 43482066 43611926 43341686 42885163 42431973 42100033 41929377 41865210 41736056
16142D1736056m38817r47246j506549j941703k112935j964740j543470r79168
$$ 41736056 41297239 40349993 38843444 36901741 34788806 32824066 31280596 30301428
16134C0301428m34321l179L48766P08374J088706J414772J607221J607657J354883
$$ 30301428 29867107 29863928 30212694 30921068 32009774 33424546 35031767 36639424 37994307
16125C7994307Q39312J75253m43560q54127r86698q69603n90623k28574J74484
$$ 37994307 38833619 39008872 38565312 37711185 36724487 35854884 35264261 35035687 35210171
16116C5210171N68146Q72750J033283J050878R40656P00757L49980k7204l06773
$$ 35210171 35778317 36651067 37684350 38735228 39675884 40376641 40726621 40699417 40392644
16107D0392644m01699l10979j27226m167o4872l10482o38884r30996j091566j065869
$$ 40392644 39990945 39679966 39552740 39548573 39483701 39173219 38534335 37603339 36511773 35445904
16097C5445904q69764n94764l57312k26054j98175k53880m32335p98640j298177
$$ 35445904 34576140 33981376 33624064 33398010 33199835 32945955 32513620 31714980 30416803
16088C0416803j728890j915586j838210j562889j152920o92263k91567j7008J39595
$$ 30416803 28687913 26772327 24934117 23371228 22218308 21526045 21234478 21217470 21357065
16079B1357065K30773L11457L97239M60749M72950M47510M19099L52244J35776
$$ 21357065 21587838 21899295 22296534 22757283 23230233 23677743 24096842 24449086 24584862
16070B4584862k69844p22756r81762q84991m62468Q7039N31963P44620P36385
$$ 24584862 24315018 23592262 22610500 21725509 21263041 21350080 21882043 22626663 23363048
16061B3363048N97322M08437J87578r6351m53035q22713j091263j144519r37601
$$ 23363048 23960370 24368807 24556385 24460034 24006999 23184286 22093023 20948504 20010903
16052B0010903n20438K4035O18361J133122J396202J315935R28241L23369l96886
$$ 20010903 19490465 19514500 20132861 21265983 22662185 23978120 24906361 25229730 24832844
16043B4832844j092594j610304j868695j883668j706522j359627q48600k37571
$$ 24832844 23740250 22129946 20261251 18377583 16671061 15311434 14462834 14225263
16035A4225263L09221O08206O04688M01156J46207m2459p9537P0728L64578P08759
$$ 14225263 14534484 15142690 15747378 16148534 16294741 16252282 16172745 16243473 16608051 17316810
16025A7316810J023838J257962J367740J328141J158958R04402N94057K66485
$$ 17316810 18340648 19598610 20966350 22294491 23453449 24357851 24951908 25218393
16017B5218393p372j77345k53157k82143l21007m11611n44039o42448o12002m01204
$$ 25218393 25211021 25033676 24780519 24498376 24177369 23765758 23221719 22579271 21967269 21566065
16007B1566065l3139L99520P94007J113956J387858J622180J752296J704142J476021
$$ 21566065 21532926 21932446 22726453 23840409 25228267 26850447 28602743 30306885 31782906
15998C1782906J147850Q17990N15255J81003k13579n46459o10809l15284K28356
$$ 31782906 32930756 33748746 34264001 34445004 34231425 33684966 33074157 32758873 32987229
15989C2987229Q16500J286784J551873J588659J426784J117399P12456K67479
$$ 32987229 33803729 35090513 36642386 38231045 39657829 40775228 41487684 41755163
15981D1755163j80429o25206j037601j329543j412173j273756j014163q05178
$$ 41755163 41574734 40949528 39911927 38582384 37170211 35896455 34882292 34077114
15973C4077114p84050r75322j302818j648428j868303j797699j351226o25506
$$ 34077114 33293064 32317742 31014924 29366496 27498193 25700494 24349268 23723762
15965B3723762J62619Q34641J318325J602304J690515J595062J329448R05163
$$ 23723762 23886381 24721022 26039347 27641651 29332166 30927228 32256676 33161839
15957C3161839L67679j52687m82558n43027m13534k27407n3471Q8974J75805J85462
$$ 33161839 33529518 33376831 32894273 32351246 31937712 31710305 31656834 31745808 31921613 32107075
15947C2107075J39563J13272J68174K86653M13267N44444P29521R76959J203775
$$ 32107075 32246638 32359910 32528084 32814737 33228004 33772448 34501969 35478928 36682703
15938C6682703J304184J257686J155538J115904J172685J228098J118095P64578
$$ 36682703 37986887 39244573 40400111 41516015 42688700 43916798 45034893 45799471
15930D5799471K77291j07949k17615p3088J49045K54770J49958j35964n10841
$$ 45799471 46076762 45968813 45751198 45678110 45827155 46081925 46231883 46095919 45585078
15921D5585078q87398j201125j399846j454059j374687j199153r53715o60474
$$ 45585078 44697680 43496555 42096709 40642650 39267963 38068810 37115095 36454621
15913C6454621l86668k02623j06936r5229k25107n37695r98085j534865k068195
$$ 36454621 36067953 35865330 35758394 35663165 35438058 34900363 33902278 32367413 30299218
15904C0299218k500521k726697k658175k269923j653599r79257l78766J12867
$$ 30299218 27798697 25072000 22413825 20143902 18490303 17511046 17132280 17245147
15896A7245147N19579Q77795J226684J589877J939235K182287K189756J887233
$$ 17245147 17764726 18642521 19869205 21459082 23398317 25580604 27770360 29657593
15888B9657593J347884P48245K39991j03332k54977k06924L987K62199M41117
$$ 29657593 31005477 31753722 31993713 31890381 31635404 31428480 31432467 31694666 32135783
15879C2135783N34846O51597Q46059J012753R61771N79838o0723p39664j246574
$$ 32135783 32670629 33322226 34168285 35181038 36142809 36722647 36661924 35922260 34675686
15870C4675686j475364j405636j086188o32483j89912J21294K41316J64681q1207
$$ 34675686 33200322 31794686 30708498 30076015 29886103 30007397 30248713 30413394 30332187
15861C0332187m18365p00528p82679o11813k39644K09164N82522P76154P74679
$$ 30332187 29913822 29213294 28430615 27818802 27579158 27788322 28370844 29146998 29921677
15852B9921677O16893L51063J2690l87253q46433j322449j701806j830773j584847
$$ 29921677 30538570 30889633 30902323 30515070 29668637 28346188 26644382 24813609 23228762
15843B3228762r48088o4954Q03728J398992J583118J413180J106987Q84032Q05643
$$ 23228762 22280674 22215720 23019448 24418440 26001558 27414738 28521725 29405757 30211400
15834C0211400P93744P90309Q23129R28996J080979J193245J189615J081129R55013
$$ 30211400 31005144 31795453 32618582 33547578 34628557 35821802 37011417 38092546 39047559
15825C9047559Q67730P84327O53678M99422L94625L78244M37432N45221O76530
$$ 39047559 39915289 40699616 41353294 41852716 42247341 42625585 43063017 43608238 44284768
15816D4284768Q03022R02182R68322R90704R31868P40569L71901j79950q14392
$$ 44284768 45087790 45989972 46958294 47948998 48880866 49621435 49993336 49813386 48998994
15807D8998994j301734j427922j193828q12323m98069l03698j63451l3001O0069
$$ 48998994 47697260 46269338 45075510 44263187 43765118 43461420 43297969 43264968 43325037
15798D3325037O8823l8602k90719o91818j162706j531228j619491j378235r51077
$$ 43325037 43393860 43355258 43064539 42372721 41210015 39678787 38059296 36681061 35729984
15789C5729984n94396n26677p97863j221750j459249j243986n48928M33637J418098
$$ 35729984 35135588 34608911 33811048 32589298 31130049 29886063 29337135 29770772 31188870
15780C1188870K130480K373466K118024J552405R51740M91748K12136P8857K9433
$$ 31188870 33319350 35692816 37810840 39363245 40314985 40806733 41018869 41097726 41127159
15771D1127159J2930K8518J17851L08503N35919O21647M07418p2821o10116r98389
$$ 41127159 41140089 41168607 41286458 41594961 42130880 42752527 43159945 43087124 42477008 41478619
15761D1478619j163416j166659j130921j141243j193373j210803j089285p54362
$$ 41478619 40315203 39148544 38017623 36876380 35683007 34472204 33382919 32628557
15753C2628557k10777M48140J063358J471200J603960J532255J370050J173073
$$ 32628557 32417780 32865920 33929278 35400478 37004438 38536693 39906743 41079816
15745D1079816R73601Q47065Q65939R97532J100997J056791Q82748O97803N94460
$$ 41079816 42053417 42900482 43766421 44763953 45864950 46921741 47804489 48502292 49096752
15736D9096752N75246N84635N59059M37518J82626j77174n76318r61104j259291
$$ 49096752 49671998 50256633 50815692 51253210 51435836 51258662 50682344 49721240 48461949
15727D8461949j352930j153617o99476j66254K08585K75307Q9667j66428l65333
$$ 48461949 47109019 45955402 45255926 45089672 45298257 45573564 45663231 45496803 45131470
15718D5131470m71592m59453l03630n8874J26640J25947n2214k80593m48744n69556
$$ 45131470 44659878 44200425 43896795 43837921 43964561 44090508 44038294 43757701 43308957 42739401
15708D2739401p44970j039150j371536j531411j315086o59388K96298J262938
$$ 42739401 41994431 40955281 39583745 38052334 36737248 36077860 36374158 37637096
15700C7637096J995946K436606K637744K606149K294553J759800J213579Q59899
$$ 37637096 39633042 42069648 44707392 47313541 49608094 51367894 52581473 53441372
15692E3441372P54514Q10282Q66429P80414N19161J46506k73798o91822r99507
$$ 53441372 54195886 55006168 55872597 56653011 57172172 57318678 57044880 56353058 55353551
15683E5353551j049996p77303k39542M31270J054108J428873J437406J122458
$$ 55353551 54303555 53526252 53286710 53717980 54772088 56200961 57638367 58760825
15675E8760825O40337J37655l01736o42402r10297j172347j433728j579224j456897
$$ 58760825 59401162 59538817 59237081 58594679 57684382 56512035 55078307 53499083 52042186
15666E2042186j029404m41141P9005L83691M91119N53521P43252J124049J607456
$$ 52042186 51012782 50571641 50650646 51034337 51525456 52078977 52822229 53946278 55553734
15657E5553734J998536K068386J664169Q35617j55735r99054j515372j687664
$$ 55553734 57552270 59620656 61284825 62120442 61964707 60965653 59450281 57762617
15649E7762617j564506j203646p06939k24831J11595K45867J91827k1924l72022
$$ 57762617 56198111 54994465 54287526 54062695 54174290 54420157 54611984 54590060 54218038
15640E4218038p66417j013821r47250n77752p9112L63041O48507P77057Q16585
$$ 54218038 53451621 52437800 51490550 50912798 50833686 51196727 51845234 52622291 53438876
15631E3438876Q32630Q42464Q24790P55630O33258M63380K41671j6159k53697
$$ 53438876 54271506 55113970 55938760 56694390 57327648 57791028 58032699 58016540 57762843
15622E7762843m18257n00026n20537n26887n83112p05948q13813p90297o02118
$$ 57762843 57344586 56844560 56324023 55797136 55214024 54508076 53694263 52903966 52301848
15613E2301848l41165j57321j54185l33481n94653p76673p55428n43172k84503
$$ 52301848 51960683 51803362 51649177 51315696 50721043 49944370 49188942 48645770 48361267
15604D8361267j31767j20452j64067j48854m3966O5098O6302n8958k11324k66380
$$ 48361267 48229500 48109048 47944981 47796127 47752161 47817259 47883561 47824603 47613279 47346899
15594D7346899j87980l5067J18460K22187K35336J53674N6248N5298J72716L01830
$$ 47346899 47158919 47123852 47242312 47464499 47699835 47853509 47909757 47965055 48137771 48439601
15584D8439601L16377K01682N7966K962R7747L41368O85306J015496J159751R79364
$$ 48439601 48755978 48957660 49015626 49018588 49116335 49457703 50143009 51158505 52318256 53297620
15574E3297620M69267j96341p16100q56561o34695k52772J41612N34325R19277
$$ 53297620 53766887 53570546 52854446 51997885 51363190 51110418 51252030 51786355 52705632
15565E2705632J230320J407966J476127J514602J555796J549988J434173J187529
$$ 52705632 53935952 55343918 56820045 58334647 59890443 61440431 62874604 64062133
15557F4062133Q15151L29666k22115p44519j135730j337876j343471j183919r18621
$$ 64062133 64877284 65206950 64984835 64240316 63104586 61766710 60423239 59239320 58320699
15548E8320699o10270k93050M6393M47285R08359J334254J578316J570441J367387
$$ 58320699 57710429 57417379 57463772 57911057 58819416 60153670 61731986 63302427 64669814
15539F4669814J077973P92747N50039K99836o6642n90042j157913j571547j679115
$$ 64669814 65747787 66540534 67090573 67390409 67323767 66733725 65575812 64004265 62325150
15530F2325150j439331r17949k71177K96795O18560O35472M10574J04164j07779
$$ 62325150 60885819 59967870 59696693 59993488 60612048 61247520 61658094 61762258 61654479
15521F1654479j55716r6913k1095R377m7552j87834l18874l06450r3746K32340
$$ 61654479 61498763 61401850 61380755 61390132 61342580 61154746 60835872 60529422 60435676 60668016
15511F0668016N05861O04623M99253K14629k07425o96642j158201j536123j835003
$$ 60668016 61173877 61778500 62277753 62492382 62284957 61588315 60430114 58893991 57058988
15502E7058988k042970k082552j884436j490268j042294o56310l52778j60955
$$ 57058988 55016018 52933466 51049030 49558762 48516468 47860158 47507380 47346425
15494D7346425j89605m82020q65851j053597q71000l55829L17949R65579J459095
$$ 47346425 47156820 46674800 45808949 44755352 43884352 43528523 43846472 44812051 46271146
15485D6271146J750665J869845J875088J822320J780764J799207J851492J881216
$$ 46271146 48021811 49891656 51766744 53589064 55369828 57169035 59020527 60901743
15477F0901743J872098J840504J803331J775393J769798J788363J797198J681992
$$ 60901743 62773841 64614345 66417676 68193069 69962867 71751230 73548428 75230420
15469G5230420J293521O18946j53842p92526j193136j386021j421395j287308
$$ 75230420 76523941 77142887 76989045 76196519 75003383 73617362 72195967 70908659
15461G0908659r40259m04739J74622O01596P47989O14513L22183N1887o4318m0883
$$ 70908659 69968400 69563661 69738283 70339879 71087868 71702381 72024564 72076451 72012133 71971250
15451G1971250j4996j11115l50374o55687q96329r58894q17837n50201k67544
$$ 71971250 71956254 71845139 71494765 70839078 69942749 68983855 68166018 67615817 67348273
15442F7348273k5428J87311L74451M73249L99672J51522j48148l14787k49985
$$ 67348273 67322845 67510156 67884607 68357856 68757528 68909050 68760902 68446115 68196130
15433F8196130k8748J70174J85491n7114n19870j065250j524824j779711j795916
$$ 68196130 68167382 68337556 68523047 68465933 67946063 66880813 65355989 63576278 61780362
15424F1780362j619027j338973j025091o89145l43357p5933k8254k84814p60102
$$ 61780362 60161335 58822362 57797271 57108126 56764769 56688836 56660582 56375768 55615666
15415E5615666j196217j321520j043223m98306P2175M86715O70635O15259L68063
$$ 55615666 54419449 53097929 52054706 51556400 51628575 52115290 52785925 53401184 53769247
15406E3769247N5194j59711j67562N8806M95584J057099J578552J886367J892851
$$ 53769247 53824441 53664730 53497168 53555974 54051558 55108657 56687209 58573576 60466427
15397F0466427J629021J207891P36204K81968n7045j64606l9259J71569K81215
$$ 60466427 62095448 63303339 64039543 64321511 64264466 64099860 64060601 64232170 64513385
15388F4513385J65885j60704n05683o10693l74149O7735M96581Q04187J006228
$$ 64513385 64679270 64518566 64012883 63402190 63028041 63095776 63592357 64396544 65402772
15379F5402772J127215J178032J241610J432327J741630K032090K178584K146172
$$ 65402772 66529987 67708019 68949629 70381956 72123586 74155676 76334260 78480432
15371G8480432J977308J756277J547434J357330J170602J000363Q85355Q49273
$$ 78480432 80457740 82214017 83761451 85118781 86289383 87289746 88175101 89024374
15363H9024374Q76644R08376Q70856P45356N88348M61236L69573K74750J23516
$$ 89024374 89901018 90809394 91680250 92425606 93013954 93475190 93844763 94119513 94243029
15354I4243029j18091m22375p02011q52874q08024n82718k49348J38161N71924
$$ 94243029 94124938 93702563 93000552 92147678 91339654 90756936 90507588 90645749 91217673
15345I1217673J042728J484853J799030J922203J868642J750946J746034J936867
$$ 91217673 92260401 93745254 95544284 97466487 99335129 101086075 102832109 104768976
15337A04768976K189722K278342K097628J714971J276881Q89482N47879J74162
$$ 104768976 106958698 109237040 111334668 113049639 114326520 115216002 115763881 115938043
15329A15938043k63558o86918r51806r14605m98748K21077J005028J571432J759362
$$ 115938043 115674485 114987567 114035761 113121156 112622408 112843485 113848513 115419945 117179307
15320A17179307J594421J225865P93021L50621q5901m73219p17578o99209l81302
$$ 117179307 118773728 119999593 120792614 121143235 121057334 120584115 119866537 119167328 118786026
15311A18786026R4243M87208O43261N84932M55022M12823N52978Q46542J154055
$$ 118786026 118880269 119367477 120010738 120595670 121050692 121463515 122016493 122863035 124017090
15302A24017090J333939J356586J309907J283731J272877J201636J023061P94349
$$ 124017090 125351029 126707615 128017522 129301253 130574130 131775766 132798827 133593176
15294A33593176O24556N46888N01455M46617M19909M68158N69146O26686N41977
$$ 133593176 134217732 134764620 135266075 135712692 136132601 136600759 137169905 137796591 138338568
15285A38338568L13474K8034k35999m33037n24249n02839m38264m35931m98079
$$ 138338568 138652042 138680076 138444077 138011040 137486791 136983952 136545688 136109757 135611678
15276A35611678m71516j98618L09673Q85797J359490J683296J934207K200219
$$ 135611678 135140162 134941544 135251217 136137014 137496504 139179800 141114007 143314226
15268A43314226K473474K669816K749982K789554K900390L116275L368639L508626
$$ 143314226 145787700 148457516 151207498 153997052 156897442 160013717 163382356 166890982
15260A66890982L362176K840326K029992J159266M36661n1879k96424k95278l8735
$$ 166890982 170253158 173093484 175123476 176282742 176719403 176667524 176371100 176075822 176037087
15251A76037087M77660J200794J973473K578465K866548K863044K737034K655538
$$ 176037087 176514747 177715541 179689014 182267479 185134027 187997071 190734105 193389643
15243A93389643K671789K738729K779599K726131K539496K235590J894381J619270
$$ 193389643 196061432 198800161 201579760 204305891 206845387 209080977 210975358 212594628
15235B12594628J459296J410255J496782J766269K198087K685481L100347L339642
$$ 212594628 214053924 215464179 216960961 218727230 220925317 223610798 226711145 230050787
15227B30050787L337547L090639K673426K210377J831478J623013J578655J599249
$$ 230050787 233388334 236478973 239152399 241362776 243194254 244817267 246395922 247995171
15219B47995171J570653J464230J359895J381654J616666K065453K640914L213418
$$ 247995171 249565824 251030054 252389949 253771603 255388269 257453722 260094636 263308054
15211B63308054L663152L905812L904327L659696L186399K538849J854236J297863
$$ 263308054 266971206 270877018 274781345 278441041 281627440 284166289 286020525 287318388
15203B87318388R71869R18806J161327J679363K380053L124849L774593M234114
$$ 287318388 288290257 289209063 290370390 292049753 294429806 297554655 301329248 305563362
15195C05563362M479372M526775M423049M286118M257411M382349M601901M837908
$$ 305563362 310042734 314569509 318992558 323278676 327536087 331918436 336520337 341358245
15187C41358245N034308N140470N100964M873499M454944L911230L380758L012062
$$ 341358245 346392553 351533023 356633987 361507486 365962430 369873660 373254418 376266480
15179C76266480K870274K894786K944841K908449K783563K654031K601643K654765
$$ 376266480 379136754 382031540 384976381 387884830 390668393 393322424 395924067 398578832
15171C98578832K796352K982749L194308L469149L813178M115509M222358M058069
$$ 398578832 401375184 404357933 407552241 411021390 414834568 418950077 423172435 427230504
15163D27230504L669158L209672K873458K782579K920078L155431L304232L213518
$$ 427230504 430899662 434109334 436982792 439765371 442685449 445840880 449145112 452358630
15155D52358630K859276K351511J835048J405256J089778Q52573O31539M09064
$$ 452358630 455217906 457569417 459404465 460809721 461899499 462752072 463383611 463792675
15147D63792675K24491J03127N444j44129l99314p64371j226722j800189k500920
$$ 463792675 464017166 464120293 464125737 463981608 463582294 462817923 461591201 459791012 457290092
15138D57290092l265663l910898m225782m109494l609616k875115k087519j394046
$$ 457290092 454024429 450113531 445887749 441778255 438168639 435293524 433206005 431811959
15130D31811959q77334n89956n89196q90652j386572j854738k094309k056676
$$ 431811959 430934625 430344669 429755473 428864821 427478249 425623511 423529202 421472526
15122D21472526j836434j570515j372880j315005j404696j609344j923360k361341
$$ 421472526 419636092 418065577 416692697 415377692 413972996 412363652 410440292 408078951
15114D08078951k890253l413461l806684l965975l858955l542749l126226k723258
$$ 408078951 405188698 401775237 397968553 394002578 390143623 386600874 383474648 380751390
15106C80751390k415531k226739k156632k235913k477078k774593k933977k817339
$$ 380751390 378335859 376109120 373952488 371716575 369239497 366464904 363530927 360713588
15098C60713588k454696k048056j835820j884176k035166k088566j988697j853968
$$ 360713588 358258892 356210836 354375016 352490840 350455674 348367108 346378411 344524443
15090C44524443j898174k276773k941138l669581m226199m440850m213383l571180
$$ 344524443 342626269 340349496 337408358 333738777 329512578 325071728 320858345 317287165
15082C17287165k720979j948008j426163j152416j064924j153020j408255j724572
$$ 317287165 314566186 312618178 311192015 310039599 308974675 307821655 306413400 304688828
15074C04688828j922620j901835j747811j648498j711029j903212k138314k362294
$$ 304688828 302766208 300864373 299116562 297468064 295757035 293853823 291715509 289353215
15066B89353215k586104k844198l106982l266933l246246l079571k846600k579827
$$ 289353215 286767111 283922913 280815931 277548998 274302752 271223181 268376581 265796754
15058B65796754k307656k128659k146517k342566k571597k682725k615519k403730
$$ 265796754 263489098 261360439 259213922 256871356 254299759 251617034 249001515 246597785
15050B46597785k137435j908812j745978j603461j444378j313812j286884j363070
$$ 246597785 244460350 242551538 240805560 239202099 237757721 236443909 235157025 233793955
15042B33793955j472868j571018j671305j799311j952961k110273k226447k225927
$$ 233793955 232321087 230750069 229078764 227279453 225326492 223216219 220989772 218763845
15034B18763845k061665j793327j560628j467584j504118j583113j638288j653267
$$ 218763845 216702180 214908853 213348225 211880641 210376523 208793410 207155122 205501855
15026B05501855j614593j486404j235278q84454n51229l97232n20605q72089j262063
$$ 205501855 203887262 202400858 201165580 200281126 199729897 199332665 198812060 197939971 196677908
15017A96677908j484931j449512j184299p65241l00292O8574K52804K91147K79730
$$ 196677908 195192977 193743465 192559166 191793925 191493633 191562207 191815011 192106158 192385888
15008A92385888K46056J38741p5110l57999o40451q91887j149348j461616j828495
$$ 192385888 192631944 192770685 192695575 192337576 191697125 190805238 189655890 188194274 186365779
14999A86365779k194878k455238k485274k244760j862856j562978j481291j570558
$$ 186365779 184170901 181715663 179230389 176985629 175122773 173559795 172078504 170507946
14991A70507946j636900j450846q83993j8252Q52733J389609J423095J028763
$$ 170507946 168871046 167420200 166536207 166517955 167370688 168760297 170183392 171212155
14983A71212155M29526j60260o28549r65622j195943j303910j263634j141801
$$ 171212155 171641681 171481421 170852872 169887250 168691307 167387397 166123763 164981962
14975A64981962j082823j170965j359357j545944j686407j806175j916635j967195
$$ 164981962 163899139 162728174 161368817 159822873 158136466 156330291 154413656 152446461
14967A52446461j911306j772902j589945j350565j026271o10759j38686K95395
$$ 152446461 150535155 148762253 147172308 145821743 144795472 144184713 144046027 144341422
14959A44341422N77351O58259N90523N03487N46122P77591J074880J210890J073718
$$ 144341422 144918773 145577032 146167555 146671042 147217164 147994755 149069635 150280525 151354243
14950A51354243P61622M29709J16282k34638o44406j053529j366928j509018j470484
$$ 151354243 152115865 152545574 152661856 152427218 151782812 150729283 149362355 147853337 146382853
14941A46382853j318167j145028j012912r29679q58099p58728o36548n33317m85384
$$ 146382853 145064686 143919658 142906746 141977067 141118968 140360240 139723692 139190375 138704991
14932A38704991m96337n35542n65652n72415n56559n11709m23776k79453q5484
$$ 138704991 138208654 137673112 137107460 136535045 135978486 135466777 135043001 134763548 134678064
14923A34678064J14217K66408L63858M53802N79859P30432Q47345Q58293P01264
$$ 134678064 134792281 135058689 135422547 135876349 136456208 137186640 138033985 138892278 139593542
14914A39593542L50192j51545o57890r47765q45025l47330L52789R89168J371144
$$ 139593542 139943734 139792189 139134299 138186534 137341509 136994179 137346968 138336136 139707280
14905A39707280J430146J199465P89084L21372j33871n40075q49350j034192j142350
$$ 139707280 141137426 142336891 143125975 143447347 143313476 142773401 141924051 140889859 139747509
14896A39747509j265197j445371j647494j818135j937434j993067j947989j780329
$$ 139747509 138482312 137036941 135389447 133571312 131633878 129640811 127692822 125912493
14888A25912493j540298j325397j175019j019943p71599m33435r0822J86083L96623
$$ 125912493 124372195 123046798 121871779 120851836 120080237 119646802 119555980 119742063 120138686
14879A20138686N66772O80108O82345N59432L80788K44962K08082K76195M23479
$$ 120138686 120705458 121385566 122067911 122627343 123008131 123253093 123461175 123737370 124160849
14870A24160849O07880P87876R13468R14111P22994L29747j76003o40691r54909
$$ 124160849 124768729 125556605 126470073 127384184 128107178 128436925 128260922 127620231 126665322
14861A26665322j116324j199496j282555j383549j460154j472082j423305j343896
$$ 126665322 125548998 124349502 123066947 121683398 120223244 118751162 117327857 115983961
14853A15983961j245632j126555j040147j081815j245004j373846j313972j048330
$$ 115983961 114738329 113611774 112571627 111489812 110244808 108870962 107556990 106508660
14845A06508660o82056l52148j25220M3030K23869M08734N29787N67027N66505
$$ 106508660 105826604 105474456 105349236 105392266 105616135 106024869 106554656 107121683 107688188
14836A07688188N56462N06826L91750K55033J79858K05330K86023L31540K94653
$$ 107688188 108244650 108751476 109143226 109398259 109578117 109783447 110069470 110401010 110695663
14827A10695663K31804K62310M42020P01262R24287J054018J114275J128816J035637
$$ 110695663 110927467 111189777 111631797 112333059 113257346 114311364 115425639 116554455 117590092
14818A17590092P49849K89129k32102p01941j066929j314769j432001j416341
$$ 117590092 118339941 118629070 118396968 117695027 116628098 115313329 113881328 112464987
14810A12464987j318705j203829j079359r15170p10102m91946k61266O005K84581
$$ 112464987 111146282 109942453 108863094 107947924 107237822 106745876 106484610 106490615 106775196
14801A06775196M86748N48911M76063L00119O0531k00442m57065o80226q06693
$$ 106775196 107261944 107810855 108286918 108587037 108647568 108447126 107990061 107309835 106503142
14792A06503142p75801o21798m89867n00658o33852p84092q57831p95795n82801
$$ 106503142 105727341 105105543 104615676 104115018 103481166 102697074 101839243 101043448 100460647
14783A00460647k48432J67843O27561J061900J356596J395018J146669P21378
$$ 100460647 100212215 100380058 101007619 102069519 103426115 104821133 105967802 106689180
14775A06689180L02743J925k05131l90249n84620q02353j055246j305749j478998
$$ 106689180 106991923 106993848 106788717 106398468 105813848 105011495 103956249 102650500 101171502
14766A01171502j507161j327433r16794l47436K34188O67671Q59054Q59791Q36738
$$ 101171502 99664341 98336908 97420114 97072678 97306866 97974537 98833591 99693382 100530120
14757A00530120R33903J177456J493715J757400J832543J654416J305137R68321
$$ 100530120 101464023 102641479 104135194 105892594 107725137 109379553 110684690 111653011
14749A11653011P82294P33052O69136M22313m7368o07166j048615j242861j225022
$$ 111653011 112435305 113168357 113837493 114259806 114212438 113605272 112556657 111313796 110088774
14740A10088774j143394j124571j168726j172173j055825q82870q25604r75142
$$ 110088774 108945380 107820809 106652083 105479910 104424085 103541215 102715611 101740469
14732A01740469j238532j458318j551085j500555j306725j004596o89842m63050
$$ 101740469 100501937 99043619 97492534 95991979 94685254 93680658 92990816 92527766
14724I2527766l36502k24815n2536J68374L88785N70097O74986O94090O70557
$$ 92527766 92191264 91966449 91913913 92082287 92471072 93041169 93716155 94410245 95080802
14715I5080802O49945O36037O03848N27577M08234K98193K68864L24953L81031
$$ 95080802 95730747 96366784 96970632 97498209 97906443 98204636 98473500 98798453 99179484
14706I9179484L26007Q7350l16936p56526j069650j168181j039555o95581j79700
$$ 99179484 99505491 99592841 99275905 98519379 97449729 96281548 95241993 94546412 94366712
14697I4366712L95388Q74945J144499J162984R51753O05912K76830R6429J22562
$$ 94366712 94762100 95637045 96781544 97944528 98896281 99502193 99779023 99875452 99998014
14688I9998014L53497P60211J272339J747026J990115J823708J163917Q6642j157136
$$ 99998014 100351511 101111722 102384061 104131087 106121202 107944910 109108827 109195469 108038333
14679A08038333k223286k822895k837580k351529j581001p47483j2581N19402
$$ 108038333 105815047 102992152 100154572 97803043 96222042 95474559 95461978 95981380
14671I5981380P92973Q15818O98285O28182P43192J048249J469805J935032K366356
$$ 95981380 96774353 97590171 98288456 98916638 99659830 100708079 102177884 104112916 106479272
14662A06479272K658741K735572K610428K364852K096852J912170J906338K079630
$$ 106479272 109138013 111873585 114484013 116848865 118945717 120857887 122764225 124843855
14654A24843855K291369K367842K252117K016849J775677J603754J493744J379686
$$ 124843855 127135224 129503066 131755183 133772032 135547709 137151463 138645207 140024893
14646A40024893J220518J038854Q68499P05058N27297L27422J08540j24971l83882
$$ 140024893 141245411 142284265 143152764 143857822 144385119 144712541 144821081 144696110 144312228
14637A44312228o87741j022235j326133j529549j598488j549845j416145j184614
$$ 144312228 143624487 142602252 141276119 139746570 138148082 136598237 135182092 133997478
14629A33997478q02889k66738L28286Q33714J126836J157812R62350O37575L07370
$$ 133997478 133194589 132927851 133256137 134089851 135216687 136374499 137336849 137974424 138281794
14620A38281794R3448N6498J44502K13927R6347l07193r20342j498378j799579
$$ 138281794 138375242 138431740 138576242 138790169 138886516 138579323 137658981 136160603 134361024
14611A34361024j765052j530825j297425j193320j223554j313153j378630j362664
$$ 134361024 132595972 131065147 129767722 128574402 127350848 126037695 124659065 123296401
14603A23296401j226912r52057n72213j91037O7874J42531P3790k7948n9432J6518
$$ 123296401 122069489 121117432 120545219 120354182 120422056 120564587 120638377 120610429 120550997 120567515
14593A20567515J55949K71143L12732L15724L52204M63485O34049P95330Q74474
$$ 120567515 120723464 120994607 121307339 121623063 121975267 122438752 123072801 123868131 124742605
14584A24742605Q63592Q00225O80395M70428J91424r8532m06247q07823j297371
$$ 124742605 125606197 126406422 127086817 127557245 127748669 127650137 127243890 126436067 125138696
14575A25138696j695202j778249j467332q70244j95535L26756M85764J67147n72906
$$ 125138696 123443494 121665245 120197913 119327669 119132134 119458890 119944654 120111801 119538895
14566A19538895j525983k394623k883972k859973k436500j873866j402222j121866
$$ 119538895 118012912 115618289 112734317 109874344 107437844 105563978 104161756 103039890
14558A03039890j028595j091659j271036j468628j531837j361621j000094n89215
$$ 103039890 102011295 100919636 99648600 98179972 96648135 95286514 94286420 93697205
14550I3697205k63487q1838j9766p486J9815J06768K92475N70682Q15690Q43376
$$ 93697205 93433718 93351880 93332114 93324628 93344443 93451211 93743686 94314368 95130058 95973434
14540I5973434N93702K06550j11040k51880k12322j3330K89820N73508P07418
$$ 95973434 96567136 96773686 96662646 96410766 96198444 96185114 96474934 97048442 97755860
14531I7755860O46069M46258K17846O2426K7578P7849J08690L1189j43009l10491
$$ 97755860 98401929 98848187 99066033 99128459 99156037 99233886 99342576 99373765 99230756 98920265
14521I8920265l75924l39311k71658k25863j78338m3111K25341N32731O83789
$$ 98920265 98544341 98205030 97933372 97707509 97529171 97486060 97711401 98244132 98927921
14512I8927921N37780J23502l80005p65556r25701q64705o46188l91154k36822
$$ 98927921 99465701 99589203 99209198 98443642 97517941 96653236 96007048 95615894 95379072
14503I5379072k17515k41388k02294p6152P9458K06120L21284M90186P18170R24269
$$ 95379072 95161557 94920169 94717875 94641723 94721181 94927301 95248585 95738771 96456941 97381210
14493I7381210J033547J034339R53452Q51700Q19292Q98215J044675J209906J380992
$$ 97381210 98414757 99449096 100402548 101254248 102073540 102971755 104016430 105226336 106607328
14484A06607328J514580J521877J359810J112088R45241R36371R81620R32849
$$ 106607328 108121908 109643785 111003595 112115683 113060924 113997295 114978915 115911764
14476A15911764P48557M75759J69621j43864m59866p54763r59702r91147q09301
$$ 115911764 116660321 117136080 117305701 117161837 116701971 115947208 114987506 113996359 113187058
14467A13187058m58537p8830J57045J68521J3613j83422l11581l12851j97496
$$ 113187058 112728521 112649691 112806736 112975257 112988870 112805448 112493867 112181016 111983520
14458A11983520l2950J00694J60000J36191M3236m8365q186K53251O76951J087936
$$ 111983520 111950570 112051264 112211264 112347455 112390691 112342326 112334140 112587391 113264342 114352278
14448A14352278J351423J474756J545138J603363J594256J417502J023823M80581
$$ 114352278 115703701 117178457 118723595 120326958 121921214 123338716 124362539 124843120
14440A24843120m0771l40661k96521M0343M44667O65928N83426K09036l64786
$$ 124843120 124802349 124461688 124165167 124205510 124650177 125316105 125899531 126108567 125743781
14431A25743781r74909j444314j673349j661449j459491j109777o12852N2611
$$ 125743781 124768872 123324558 121651209 119989760 118530269 117420492 116807640 116860251
14423A16860251Q56245J652113K207651K330951K002472J378383O71775O0420
$$ 116860251 117716496 119368609 121576260 123907211 125909683 127288066 127959841 128020261
14415A28020261l56375n91537p23614p91025p75593o86590n86826n19786m80094
$$ 128020261 127663886 127072349 126348735 125557710 124782117 124095527 123508701 122988915 122508821
14406A22508821m69714n14518n93740o00045m27578j12545J69790K84148K64913
$$ 122508821 122039107 121524589 120930849 120330804 119903226 119790681 119960471 120244619 120509532
14397A20509532K46904L26899N08666P19920Q64717Q77630P32926M30476K4451
$$ 120509532 120756436 121083335 121592001 122311921 123176638 124054268 124787194 125217670 125242121
14388A25242121l46953n36567n21159m18405l50429l26726k64831p7003K54393
$$ 125242121 124895168 124358601 123837442 123419037 123068608 122741882 122477051 122400048 122654441
14379A22654441O43944R58565J130491J206063J262971J279587J132311P54990
$$ 122654441 123298385 124256950 125387441 126593504 127856475 129136062 130268373 131023363
14371A31023363K40078k57685o42657q71498r00466o98628l11953J48511O03346
$$ 131023363 131263441 131005756 130363099 129491601 128591135 127892507 127580554 127729065 128332411
14362A28332411J030236J404262J675279J780531J647578J211600M53209n51440
$$ 128332411 129362647 130766909 132442188 134222719 135870297 137081897 137535106 136983666
14354A36983666j604728k450977k901967k907274k528222j879687j107653l98277
$$ 136983666 135378938 132927961 130025994 127118720 124590498 122710811 121603158 121204881
14346A21204881N7078J60925k1862l00343m73346m54997l19722k18602k47004
$$ 121204881 121261959 121422884 121401022 121100679 120627333 120172336 119852614 119634012 119387008
14337A19387008l81788n14142n36918m15221j79389J01909L07281K91818q789
$$ 119387008 119005220 118491078 117954160 117538939 117359550 117461459 117768740 118060558 118051769
14328A18051769n18278j056853j428050j509338j301837r12973m90775j36305
$$ 118051769 117533491 116476638 115048588 113539250 112237413 111324440 110833665 110697360
14320A10697360J46096L97279O19364P59461P46225N42225J81972k54016o83186
$$ 110697360 110843456 111240735 111860099 112619560 113365785 113908010 114089982 113835966 113152780
14311A13152780j035061j279993j451587j614495j815332k056285k286197k423706
$$ 113152780 112117719 110837726 109386139 107771644 105956312 103900027 101613830 99190124
14303I9190124k413898k255619j992233j710609j500936j367212j228243j025618
$$ 99190124 96776226 94520607 92528374 90817765 89316829 87949617 86721374 85695756
14295H5695756p82646n49249l29635r7069J51611M02397O63362R50699J256208
$$ 85695756 84913110 84363861 84034226 83937157 84088768 84491165 85154527 86105226 87361434
14286H7361434J555038J812948J976407J988328J823904J498656J056029N73814
$$ 87361434 88916472 90729420 92705827 94694155 96518059 98016715 99072744 99646558
14278I9646558J60464j02079k19612k75587l57932m86310n90789n74415m20108
$$ 99646558 99807022 99704943 99485331 99209744 98851812 98365502 97774713 97200298 96780190
14269I6780190k23437j06870j20173k26108l43692l90871l30646j97296p0751
$$ 96780190 96556753 96449883 96329710 96103602 95759910 95369039 95038393 94841097 94770346
14260I4770346m6535k13333n91837j088197j565253j942031k172749k178358j879096
$$ 94770346 94723811 94510478 93918641 92830444 91265191 89323160 87150411 84972053 83092957
14251H3092957j278492m75236L75534J112339J635076J938187K045514J926881
$$ 83092957 81814465 81339229 81714763 82827102 84462178 86400365 88445879 90372760
14243I0372760J528003Q72171Q8676o44746j177130j456218j523729j418256j139881
$$ 90372760 91900763 92772934 92861610 92216864 91039734 89583516 88059787 86641531 85501650
14234H5501650p25881k82856P3963K60646K32265J4736l07972o74228j053178
$$ 85501650 84775769 84492913 84566876 84827522 85059787 85074523 84766551 84092323 83039145
14225H3039145j388443j597471j598494j336670q33532k01036M08601Q59678J059533
$$ 83039145 81650702 80053231 78454737 77118067 76284535 76083499 76492100 77351778 78411311
14216G8411311R70942O32157J65367k67144n47027o44931n89204m34465k64687
$$ 78411311 79382253 80014410 80179777 79912633 79365606 78720675 78131471 77697006 77432319
14207G7432319j61791j62638k63473m40569o78922r90973j350652j654450j843620
$$ 77432319 77270528 77107890 76844417 76403848 75724926 74733953 73383301 71728851 69885231
14198F9885231j970357k060512k027278j788004j380741r07982m21598P4499N47105
$$ 69885231 67914874 65854362 63827084 62039080 60658339 59750357 59328759 59403258 59950363
14189E9950363R26254J156806J234848J206597J116934R71540P83309O07154M77804
$$ 59950363 60876617 62033423 63268271 64474868 65591802 66563342 67346651 67953805 68431609
14180F8431609L60627K08873J4793k33877n51386q67744j048490j025627q37897
$$ 68431609 68792236 69001109 69015902 68782025 68230639 67362895 66314405 65288778 64450881
14171F4450881n55921k41835L0913J97678K57405K65791K67976K69166K70781
$$ 64450881 63894960 63653125 63684038 63881716 64139121 64404912 64672888 64942054 65212835
14162F5212835L11518M51635O88835R21475J046733J062658J024318R29307P08032
$$ 65212835 65524353 65975988 66664823 67586298 68633031 69695689 70720007 71649314 72357346
14153G2357346L02808k99721j076801j937046k686192l088871k999466k445009
$$ 72357346 72660154 72360433 71283632 69346586 66660394 63571523 60572057 58127048
14145E8127048j613714p88273k42287q7162j92038l23439l52151k78386j29119
$$ 58127048 56513334 55725061 55482774 55395612 55203574 54880135 54527984 54249598 54120479
14136E4120479Q7738L64982O73693R48763J111989J132402J062518J004931J027205
$$ 54120479 54208217 54573199 55246892 56195655 57307644 58440046 59502564 60507495 61534700
14127F1534700J119947J250668J419541J634390J849840J959302J878050J628633
$$ 61534700 62654647 63905315 65324856 66959246 68809086 70768388 72646438 74275071
14119G4275071J321657J072929R38269Q79440P71624M84321L569n40590r74196
$$ 74275071 75596728 76669657 77607926 78487366 79258990 79743311 79746880 79206290 78232094
14110G8232094j177439j118375q39335m12797Q1284N42053Q59300R63543Q56626
$$ 78232094 77054655 75936280 75096945 74684148 74765432 75307485 76166785 77130328 77986954
14101G7986954N94153K41220j66724o22601j101647j521160j741259j642131j260064
$$ 77986954 78581107 78822327 78655603 78033002 76931355 75410195 73668936 72026805 70766741
14092G0766741q14661n31824m61251n16943o38957q29978j067530j281071j406780
$$ 70766741 69952080 69420256 68959005 68442062 67803105 66973127 65905597 64624526 63217746
14083F3217746j394315j203238q64663n20137l54807m75710q35776j261979j565788
$$ 63217746 61823431 60620193 59755530 59235393 58880586 58404876 57569100 56307121 54741333
14074E4741333j640082j492207j228546r73838p61770n36376k66464J0372K60978
$$ 54741333 53101251 51609044 50380498 49406660 48644890 48108514 47842050 47852422 48113400
14065D8113400M93215O96152P88189O56400K68672k58998p55663j140560j434865
$$ 48113400 48606615 49302767 50090956 50747356 51016028 50757030 50001367 48860807 47425942
14056D7425942j674555j846540j891862j763572j479058j102811o94010k96868
$$ 47425942 45751387 43904847 42012985 40249413 38770355 37667544 36973534 36676666
14048C6676666L1694K35509L19658L53166L75181L35845J70722j04934m02824
$$ 36676666 36708360 36943869 37263527 37616693 37991874 38327719 38498441 38393507 37990683
14039C7990683o14702o52342m89846j74778K12969N98040R29004J187310J363090
$$ 37990683 37375981 36723639 36233793 36059015 36271984 36870024 37799028 38986338 40349428
14030D0349428J426797J356178J203281J073068R85875Q33813N29120J37040j66889
$$ 40349428 41776225 43132403 44335684 45408752 46394627 47228440 47757560 47894600 47727711
14021D7727711k44702j14687M8726L9922k29995p06073j276934j837432k288010
$$ 47727711 47483009 47368322 47417048 47456970 47226975 46520902 45243968 43406536 41118526
14012D1118526k527722k477889k131765j564275q83319j86440M71100J092568
$$ 41118526 38590804 36112915 33981150 32416875 31533556 31347116 31818216 32910784
14004C2910784J691968K219095K568884K670190K535409K229111J802710J260929
$$ 32910784 34602752 36821847 39390731 42060921 44596330 46825441 48628151 49889080
13996D9889080N90786j87214j006163j759618k286398k409229k058986j341214
$$ 49889080 50479866 50292652 49286489 47526871 45240473 42831244 40772258 39431044
13988C9431044m65431L71052J048981J534058J847572K011656J993039J704887
$$ 39431044 38965613 39336665 40385646 41919704 43767276 45778932 47771971 49476858
13980D9476858J101529K78410n65754j262490j733026j952137j941499j804669
$$ 49476858 50578387 50856797 50291043 49028553 47295527 45343390 43401891 41597222
13972D1597222j668032j566501j445584j247608r49178n68877j79701J31185L44455
$$ 41597222 39929190 38362689 36917105 35669497 34720319 34151442 33971741 34102926 34447381
13963C4447381N29634P57664J008195J190944J246483J203196J147927J158087
$$ 34447381 34977015 35734679 36742874 37933818 39180301 40383497 41531424 42689511
13955D2689511J227480J259173J162385R31226O38882L93299K81372L23798M68044
$$ 42689511 43916991 45176164 46338549 47269775 47908657 48301956 48583328 48907126 49375170
13946D9375170O47922Q51881J086140J309905J469926J554839J575523J520284
$$ 49375170 50023092 50874973 51961113 53271018 54740944 56295783 57871306 59391590
13938E9391590J340716R66770L57391m38407j281542j989803k391972k400784
$$ 59391590 60732306 61699076 62056467 61618060 60336518 58346715 55954743 53553959
13930E3553959k049016j453945p87459k58427k4088n6630j47175q0401K10717
$$ 53553959 51504943 50050998 49263539 49005112 48981024 48924394 48777219 48696818 48907535
13921D8907535O10372Q96297Q89553N78775J20684k76332m82375n01779m39404
$$ 48907535 49517907 50414204 51303757 51882532 52003216 51726884 51244509 50742730 50303326
13912E0303326m07468m51768n49792o49288o98563o65048n63821m52546l82486
$$ 50303326 49895858 49444090 48894298 48245010 47546447 46881399 46317578 45865032 45482546
13903D5482546l81710m60478n86169o83419o98534o45723n59746m29535k24684
$$ 45482546 45100836 44640358 44054189 43370770 42672236 42026513 41466767 41037232 40812548
13894D0812548L2153K69351M40792N50074O00243N80762N09951M42110M20670
$$ 40812548 40844701 41114052 41554844 42104918 42705161 43285923 43795874 44237984 44658654
13885D4658654M35888M40769M01270L12992J85200K7402j59104l67383n39863
$$ 44658654 45094542 45535311 45936581 46249573 46434773 46462175 46303071 45935688 45395825
13876D5395825n50639k88272K10165P35586J044709J025779P47256L69646J4823
$$ 45395825 44845186 44556914 44767079 45502665 46547374 47573153 48320409 48690055 48704878
13867D8704878k67891m41281m74684m03836l20425k76959k36173j24128Q7300
$$ 48704878 48436987 47995706 47521022 47117186 46796761 46519802 46283629 46159501 46246801
13858D6246801L62457O62294R91177J354149J694741J909807J930190J788038
$$ 46246801 46609258 47271552 48262729 49616878 51311619 53221426 55151616 56939654
13850E6939654J599606J475201J439113J422199J312952J024074N48053l9852
$$ 56939654 58539260 60014461 61453574 62875773 64188725 65212799 65760852 65721000
13842F5721000o32597j141516j511076j701579j683660j450024j006038l85193
$$ 65721000 65088403 63946887 62435811 60734232 59050572 57600548 56594510 56209317
13834E6209317K94833Q40118J079342R69042O14903J92030j42588k75736j43072
$$ 56209317 56504150 57344268 58423610 59392652 60007555 60199585 60056997 59781261 59638189
13825E9638189K45618Q17697J469228K064752K480910K656410K534551K028333
$$ 59638189 59883807 60701504 62170732 64235484 66716394 69372804 71907355 73935688
13817G3935688J141967Q0102q27543j318573j353108j107952q09723n73808l96393
$$ 73935688 75077655 75157757 74330214 73011641 71658533 70550581 69740858 69167050 68770657
13808F8770657k37892q4756L9113J31226K52509M52690O89537Q47261Q13711N64842
$$ 68770657 68532765 68448009 68487122 68618348 68870857 69323547 70013084 70860345 71674056 72238898
13798G2238898J95740j70930n23006r39695j428740j868308k109375k082681j829260
$$ 72238898 72434638 72263708 71740702 70801007 69372267 67503959 65394584 63311903 61482643
13789F1482643j449058j008310n20895l4766L31340M96474N09776M82808M67337
$$ 61482643 60033585 59025275 58504380 58469614 58800954 59297428 59807204 60290012 60757349
13780F0757349M24262K84061L2836k52656m65796n58913n61950n13244m01691
$$ 60757349 61181611 61465672 61498508 61245852 60780056 60221143 59659193 59145949 58744258
13771E8744258k07498M7322L38950P05004J218722J890183K599782L120486L223056
$$ 58744258 58536760 58584082 58923032 59628036 60846758 62736941 65336723 68457209 71680265
13762G1680265K823537K049414J140118K99158l60244q12464j122142j402417
$$ 71680265 74503802 76553216 77693334 77992492 77632248 76819784 75697642 74295225
13754G4295225j715549k027881k257762k331341k225193j977779j638728j242185
$$ 74295225 72579676 70551795 68294033 65962692 63737499 61759720 60120992 58878807
13746E8878807q47368n43217l73600k83006j61859M9489K85108L88985K73841
$$ 58878807 58031439 57488222 57114622 56831616 56669757 56719246 57004354 57393339 57667180
13737E7667180L4730j56441k31963k45917k73372l27382l25490j32996L12534
$$ 57667180 57701910 57545469 57313506 57067589 56794217 56466835 56141345 56008349 56320883
13728E6320883R04502J417064J666537J630754J417474J153689R29051P84885
$$ 56320883 57225385 58642449 60308986 61939740 63357214 64510903 65439954 66224839
13720F6224839P11555O73215O30636N50019M33057L18510K19289J12269M314p1432
$$ 66224839 66936394 67609609 68240245 68790264 69223321 69541831 69761120 69873389 69877703 69806271
13710F9806271j41132k97318n71256q44799r45990p94849m34401J9593M54950
$$ 69806271 69665139 69367821 68796565 67951766 67005776 66210927 65776526 65796119 66251069
13701F6251069Q13357J036723J020608P10752K14073k37183m29236l06469l5629
$$ 66251069 67064426 68101149 69121757 69832509 70046582 69809399 69380163 69073694 69038065
13692F9038065R4531q1126m73656q70128j119076j181061j085846q87536o53910
$$ 69038065 69132596 69051470 68577814 67707686 66588610 65407549 64321703 63434167 62780257
13683F2780257m59865l50275l20293l40273l77411l96742l68599k67380p2324
$$ 62780257 62320392 61970117 61649824 61309551 60932140 60535398 60166799 59899419 59827095
13674E9827095J99402M93305P56783R51625J065509J121698J156119J200698J281575
$$ 59827095 60026497 60519802 61276585 62228210 63293719 64415417 65571536 66772234 68053809
13665F8053809J415765J595936J761664J821918J730336J501505J171443P88819
$$ 68053809 69469574 71065510 72827174 74649092 76379428 77880933 79052376 79841195
13657G9841195M30895J83108P9398J05540K65692N76007R74306J291519J374829
$$ 79841195 80272090 80455198 80534596 80640136 80905828 81481835 82456141 83747660 85122489
13648H5122489J221340R36147O12928L31188J98060L03389O56393J193471J812803
$$ 85122489 86343829 87279976 87892904 88224092 88422152 88725541 89381934 90575405 92388208
13639I2388208K371699K702765K689007K351567J870677J469985J247675J110580
$$ 92388208 94759907 97462672 100151679 102503246 104373923 105843908 107091583 108202163
13631A08202163Q55086L46396l52923j026244j452227j532415j313396r17676
$$ 108202163 109057249 109403645 109050722 108024478 106572251 105039836 103726440 102808764
13623A02808764n02599k42722k33566m24051o90683r19898j003812q45004m35131
$$ 102808764 102306165 102063443 101829877 101405826 100715143 99795245 98791433 97946429 97511298
13614I7511298P8570M75454O24435N25652K53275p3174l11267l55486k19583o6277
$$ 97511298 97589868 98065322 98689757 99215409 99468684 99395510 99084243 98728757 98509174 98442897
13604I8442897p1657k27438l40988k30148J24205N82749R45856J080272R96500
$$ 98442897 98371240 98143802 97802814 97572666 97696871 98279620 99225476 100305748 101302248
13595A01302248Q03007O09325M83746M48720M78243N14990N10822M52348L47395
$$ 101302248 102105255 102714580 103198326 103647046 104125289 104640279 105151101 105603449 105950844
13586A05950844J99650k2336l97224r75578j684618k340449k736214k731861k341763
$$ 105950844 106150494 106128158 105730934 104755356 103070738 100730289 97994075 95262214 92920451
13577I2920451j762618j270135j040213j054811j187911j335653j417520j327956
$$ 92920451 91157833 89887698 88847485 87792674 86604763 85269110 83851590 82523634
13569H2523634r97667m78419J03467O30259J006828J178554J161547J012199P67455
$$ 82523634 81525967 81047548 81151015 81781274 82788102 83966656 85128203 86140402 86907857
13560H6907857M39779N3507l61145p95297j242018j682158k103888k484196k751327
$$ 86907857 87347636 87401143 87039998 86244701 85002683 83320525 81216637 78732441 75981114
13551G5981114k813197k621632k206333j682147j224926r98249j068592j374340
$$ 75981114 73167917 70546285 68339952 66657805 65432879 64434630 63366038 61991698
13543F1991698j767577k077668k149690j893855j351675o79817m9871M14399O26909
$$ 61991698 60224121 58146453 55996763 54102908 52751233 52071416 52021545 52435944 53062853
13534E3062853N34654J74247k87879o43753p87622p58110o70824o19728n94039
$$ 53062853 53597507 53771754 53483875 52840122 52052500 51294390 50623566 50003838 49409799
13525D9409799m83553k01488K17614O54857R96956J180819J187235J031847P85890
$$ 49409799 48926246 48724758 48942372 49597229 50594185 51775004 52962239 53994086 54779976
13516E4779976N65557M47455M10424L75784K62381J7702l51197p63817j098402
$$ 54779976 55345533 55792988 56203412 56579196 56841577 56859279 56508082 55744265 54645863
13507E4645863j285730j371404j451212j541762j539987j337536r41660m57475
$$ 54645863 53360133 51988729 50537517 48995755 47455768 46118232 45176572 44719097
13499D4719097q831K95565L86449K74105N3480j52781k61003k36531q3083J36165
$$ 44719097 44710266 45005831 45392280 45666385 45719865 45567084 45306081 45069550 44986467 45122632
13489D5122632L16488M07700M48287M78343M88440M73171M75637N39119O31522
$$ 45122632 45439120 45846820 46295107 46773450 47261890 47735061 48210698 48749817 49381339
13480D9381339O54280N29428K55125j12425m73799o97400o73939l63480J89330
$$ 49381339 50035619 50565047 50820172 50707747 50233948 49536548 48862609 48499129 48688459
13471D8688459Q46417J412741J722893J703918J375938Q17232J37836n36446j112377
$$ 48688459 49534876 50947617 52670510 54374428 55750366 56567598 56705434 56168988 55056611
13462E5056611j569968j914016k116094k158955k082154j936281j729888j430511
$$ 55056611 53486643 51572627 49456533 47297578 45215424 43279143 41549255 40118744
13454D0118744j001377m54213J09813N32452P01115O16882L67408M7095k99903
$$ 40118744 39117367 38663154 38772967 39305419 40006534 40623416 40990824 41037919 40738016
13445D0738016o64693j004928j214235j181114q84502m40024m3825J62001J86528
$$ 40738016 40073323 39068395 37854160 36673046 35788544 35348520 35304695 35466696 35653224
13436C5653224J51572J81332L36862N86468P85884P76394N47079K23268p7490
$$ 35653224 35804796 35986128 36322990 36909458 37695342 38471736 39018815 39242083 39164593
13427C9164593l13900m95659o30498o86867o15850m08302j10592K08046M69324
$$ 39164593 38850693 38355034 37724536 37037669 36421819 36013517 35902925 36110971 36580295
13418C6580295N93995N59177M27266K84799J83403J28047Q6749L5377n876k6231
$$ 36580295 37174290 37733467 38160733 38445532 38628935 38756982 38843731 38879108 38873232 38847001
13408C8847001r6037k93598n64587p38719o88433m41070j42543Q0749K14390L11133
$$ 38847001 38750964 38457366 37892779 37154060 36465627 36024557 35882014 35962763 36177153 36488286
13398C6488286L88894L97842K82015P6321r4874j48782j28307j29042j80363k37793
$$ 36488286 36877180 37275022 37557037 37633358 37538484 37389702 37261395 37132353 36951990 36714197
13388C6714197k78461l37568m42807n52578n59392l74682k9575L32412N74053
$$ 36714197 36435736 36098168 35655361 35102783 34543391 34168709 34139134 34471546 35045599
13379C5045599O58573O39081N79248M86902L31856J06285j76073n08019q59806
$$ 35045599 35704172 36343253 36922501 37409403 37741259 37847544 37671471 37163452 36303646
13370C6303646j135098j193701r43948m15465K60005R22343J445723J758148J817091
$$ 36303646 35168548 33974847 33030899 32615434 32875439 33797782 35243505 37001653 38818744
13361C8818744J606221J176968O63612K16249r9802l16247m81242o00230o51595
$$ 38818744 40424965 41601933 42265545 42481794 42381992 42065745 41584503 40984273 40332678
13352D0332678o19673n05609l55346k58907k66028l37508m03120m19791l76695
$$ 40332678 39713005 39207396 38852050 38593143 38327115 37989607 37586487 37166696 36790001
13343C6790001k99576k48247k77189l71303m37786m04312k88695j49748k8886
$$ 36790001 36490425 36242178 35964989 35593686 35155900 34751588 34462893 34313145 34284259
13334C4284259M2052K3358q6141j85545j08420K42314Q00663J379600J780681
$$ 34284259 34326311 34349669 34263528 34077983 33969563 34211877 35012540 36392140 38172821
13325C8172821J886437J707113J347623R08773M19283j28634p02765j233002j681408
$$ 38172821 40059258 41766371 43113994 44022767 44442050 44313416 43610651 42377649 40696241
13316D0696241k049158k313759k397037k187438j629388q36115p0184M28688N89121
$$ 40696241 38647083 36333324 33936287 31748849 30119461 29283346 29213162 29641850 30230971
13307C0230971M96149K74019J7120j96498l09804l12461k33347j21862q597J43806
$$ 30230971 30727120 31001139 31018259 30821761 30511957 30199496 29966149 29844287 29835690 29979496
13297B9979496L98679P29874J010637J130463J059458Q19635M75690J27482j69942
$$ 29979496 30378175 31108049 32118686 33249149 34308607 35128242 35603932 35731414 35561472
13288C5561472m62906q31958j283864j725317k034030k135153k015319j703169
$$ 35561472 35098566 34266608 32982744 31257427 29223397 27088244 25072925 23369756
13280B3369756j245952p01909j51724L02929N68718O19011N20947L82074L11221
$$ 23369756 22123804 21421895 21270171 21573100 22141818 22760829 23281776 23663850 23975071
13271B3975071M22139P79562J303591J765479J929862J722449J271791Q00025
$$ 23975071 24397210 25176772 26480363 28245842 30175704 31898153 33169944 33969969
13263C3969969M51045K20330M3085j10295k41385l50382m19728m29922m28282
$$ 33969969 34421014 34641344 34684429 34574134 34332749 33982367 33562639 33132717 32704435
13254C2704435n47938r09075j478715k061382k450702k551154k372157j988176
$$ 32704435 32156497 31247422 29768707 27707325 25256623 22705469 20333312 18345136
13246A8345136j495580r42083l22817L25522Q90136J272480J469353J548826J570056
$$ 18345136 16849556 15907473 15584656 15910178 16800314 18072794 19542147 21090973 22661029
13237B2661029J527514J368978J067713O56466J91563k88858p60633j178953j460720
$$ 22661029 24188543 25557521 26625234 27281700 27473263 27184405 26423772 25244819 23784099
13228B3784099j508002j276771q64935m97074l66903n16109q56449j260247j626105
$$ 23784099 22276097 20999326 20134391 19637317 19270414 18754305 17897856 16637609 15011504
13219A5011504j880557j957539j829727j547366j183182p43055j97704M02392
$$ 15011504 13130947 11173408 9343681 7796315 6613133 5870078 5672374 6074766
13211F074766R23485J258374J387335J357708J254681J178110J199182J305669
$$ 6074766 6998251 8256625 9643960 11001668 12256349 13434459 14633641 15939310
13203A5939310J386777J314447J058911O98845L42977O9206r7983j92928k80607
$$ 15939310 17326087 18640534 19699445 20398290 20741267 20810473 20712490 20519562 20238955
13194B0238955l89580m95876n79338o51061p24313p66469o93831m54637j06989
$$ 20238955 19849375 19353499 18774161 18123100 17398787 16632318 15938487 15483850 15376861
13185A5376861K28480M63541N68946N71307N57400O15937P27639P68306O50011
$$ 15376861 15605341 16068882 16637828 17209135 17766535 18382472 19110111 19878417 20528428
13176B0528428M20906K21643J68211K77306M89358P35980R42341J002400Q62986
$$ 20528428 20949334 21170977 21339188 21616494 22105852 22841832 23784173 24786573 25649559
13167B5649559O28370M77245M57676M33195K48501r5677m57074p13516q55853
$$ 25649559 26277929 26755174 27212850 27646045 27894546 27798869 27341795 26628279 25772426
13158B5772426r27977r51912r36030r06514q95733r16859r66731j034134j104036
$$ 25772426 24844449 23892537 22956507 22049993 21154260 20237401 19270670 18236536 17132500
13149A7132500j159504j162184j065336q73018o36134l93421j75618l9353m6520
$$ 17132500 15972996 14810812 13745476 12872458 12236324 11842903 11667285 11627932 11581412
13140A1581412k15996m99894p94565r71545r45576p53329n21439l44684k33046
$$ 11581412 11365416 10865522 10070957 9099412 8153836 7400507 6879068 6534384 6301338
13131F301338j41713k3381J38571L36885N41963O91854P29210O78816O53881P38085
$$ 6301338 6159625 6136244 6274815 6611700 7153663 7845517 8574727 9253543 9907424 10645509
13121A0645509Q98224J059498J212985J384151J532069J545856J332807Q83933
$$ 10645509 11543733 12603231 13816216 15200367 16732436 18278292 19611099 20495032
13113B0495032K92698k74268o76664q86750r62537r51298q64637p34442o06302
$$ 20495032 20787730 20513462 19836798 18950048 17987511 17036213 16171576 15437134 14830832
13104A4830832m79794l28898j85482j44662k47578m06005m93407m87307m72558
$$ 14830832 14351038 14022140 13836658 13691996 13444418 13038413 12545006 12057699 11585141
13095A1585141n13925n94531o81366p60990p77840o42521l44883J5807L00479
$$ 11585141 11071216 10476685 9795319 9034329 8256489 7613968 7269085 7284892 7585371
13086G585371M05948L22426J15686j49133m39657p27696r67724j087654j008837
$$ 7585371 7991319 8313745 8429431 8280298 7840641 7112945 6145221 5057567 4048730
13077D048730p47955m72953l72176m72055o29996o88953n89366l74564j69721
$$ 4048730 3300775 2827822 2455646 1983591 1353595 664642 75276 -299288 -469009
13068d69009j16079k60925n32710q17175j015049j070910r99532q58539p02601
$$ -469009 -585088 -846013 -1378723 -2195898 -3210947 -4281857 -5281389 -6139928 -6842529
13059f842529n83977n27693m49319j71862M01288J160333J871430K358707K577915
$$ -6842529 -7426506 -7954199 -8403518 -8575380 -8174092 -7013759 -5142329 -2783622 -205707
13050b05707K561813K357240K014405J623878J324308J209765J243404J287458
$$ -205707 2356106 4713346 6727751 8351629 9675937 10885702 12129106 13416564
13042A3416564J216682J012960P42864M85525L11432K61588L13309L89430L98030
$$ 13416564 14633246 15646206 16389070 16874595 17186027 17447615 17760924 18150354 18548384
13033A8548384K62954o1647n68129j164345j689410j996894k011482j713223j163937
$$ 18548384 18811338 18749691 18181562 17017217 15327807 13330913 11319431 9606208 8442271
13024H442271n36445j0350L53539N99081P62070P95250O10681J94291l27657p30566
$$ 8442271 7905826 7895476 8249015 8848096 9610166 10405416 11016097 11210388 10882731 10152165
13014A0152165q19938n66645j18176L14915N67699N74693L77561Q3982j98044
$$ 10152165 9332227 8765582 8647406 8962321 9530020 10104713 10482274 10566256 10368212
13005A0368212m11977n63973o92863q23647r27782r36633q00541n13917j21235
$$ 10368212 9956235 9392262 8699399 7875752 6947970 6011337 5210796 4696879 4575644
12996D575644K81285N92536P59439P73208O50088M38399J99875m1110k97371n59021
$$ 4575644 4856929 5449465 6208904 6982112 7632200 8070599 8270474 8229364 7931993 7372972
12986G372972p56527p87465n69935r8210N25266J128103J561982J773322J784047
$$ 7372972 6616445 5828980 5259045 5160835 5686101 6814204 8376186 10149508 11933555
12977A1933555J628521J341840R77535N80068J49509l29091q23835j257457j562032
$$ 11933555 13562076 14903916 15881451 16461519 16611028 16281937 15458102 14200645 12638613
12968A2638613j686528j578050j216188o66539p1962M21637P18841P85739O80832
$$ 12638613 10952085 9374035 8157847 7491308 7419346 7840983 8559824 9345563 10026395
12959A0026395N60398N61583O61343P11415O00850L16863j11776o11263j011802
$$ 10026395 10586793 11148376 11809719 12521134 13121984 13438847 13327071 12715808 11704006
12950A1704006j126847r09521m84756m9741K38052L15886J97182q0485m78681
$$ 11704006 10577159 9667638 9182882 9133141 9371193 9687079 9884261 9803776 9325095
12941I325095r37674j335473j516955j420386j140105q43243o52303o05149o85626
$$ 9325095 8387421 7051948 5534993 4114607 2974502 2131259 1478956 873807 188181
12932A88181q41909r78661r87398q24038n55912k94477q3885Q9591K04820J88313
$$ 188181 -653728 -1632389 -2619787 -3443825 -3999737 -4294214 -4378099 -4288508 -4083688 -3895375
12922c895375r899l47647o91862q92367q91145p58269o16887n53781n77175o32218
$$ -3895375 -3905274 -4252921 -4944783 -5837150 -6728295 -7486564 -8103451 -8657232 -9234407 -9866625
12912i866625o74509p21142q13355r53337j078325j085038r07004n77068j94029
$$ -9866625 -10541134 -11262276 -12075631 -13028968 -14107293 -15192331 -16099335 -16676403 -16870432
12903a6870432J58714M36182O22152P64923R83223J369373J881120K344136K593070
$$ -16870432 -16711718 -16275536 -15653384 -14888461 -13905238 -12535865 -10654745 -8310609 -5717539
12894e717539K602486K443496K155118J725397J169918N69647L4288l46497n31109
$$ -5717539 -3115053 -671557 1483561 3208958 4378876 4948523 4982811 4636314 4105205
12885D105205n33698m11654k45414r2553M1593J55844K15218J78954K6424k13577
$$ 4105205 3571507 3159853 2914439 2821886 2863479 3019323 3234541 3413495 3439919 3226342
12875C226342m42187n49939n05767l77647k53372j44152K2727L42123Q46655J437548
$$ 3226342 2784155 2234216 1728449 1350802 1097430 953278 976005 1318128 2164783 3602331
12865C602331J905108K047891J793445J216405M67686l05862j001624j543474
$$ 3602331 5507439 7555330 9348775 10565180 11032866 10727004 9725380 8181906
12857H181906j855210j896357j723135j474873j275407j142623r96146p49683
$$ 8181906 6326696 4430339 2707204 1232331 -43076 -1185699 -2181845 -2931528
12849b931528m07105p6641J23999J76943J70018K08155L61579O69388J104254
$$ -2931528 -3338633 -3415274 -3291275 -3114332 -2944314 -2736159 -2374580 -1705192 -600938
12840f00938J547106J843733J883992J648777J220784P38234L14692O391j76328
$$ -600938 946168 2789901 4673893 6322670 7543454 8281688 8596380 8602771 8426443
12831H426443k50565k46531k32389l08159n18647q10481j070926j180514j071620
$$ 8426443 8175878 7929347 7696958 7388799 6870152 6059671 4988745 3808231 2736611
12822B736611p55656k90812K33005O68072Q24782N83510J9592o26762j133782
$$ 2736611 1980955 1690143 1923148 2591220 3416002 3999512 4019104 3392342 2258560
12813B258560j438791j609231j695302j620670j246640n84996J07844N60427P70223
$$ 2258560 819769 -789462 -2484764 -4105434 -5352074 -5937070 -5829226 -5268799 -4498576
12804d498576R65499J307658J677421J764287J358625N54132l16740r25788j146966
$$ -4498576 -3533077 -2225419 -547998 1216289 2574914 3129046 2812306 1886518 739552
12795G39552j067960q66492p09587p00801q02411q40712o94767m57298l48590
$$ 739552 -328408 -1194900 -1904487 -2605288 -3407699 -4248411 -4943178 -5400476 -5749066
12786e749066m82680p54159r52752r40598p14920l64684M075L31704O22370R00933
$$ -5749066 -6231746 -6985905 -7938657 -8879255 -9594175 -9958859 -9954784 -9623080 -9000710 -8099777
12776h099777J138194J223460J056885O81780K91763R8961K00395N34338R18319
$$ -8099777 -6961583 -5738123 -4681238 -3999458 -3707695 -3608734 -3408339 -2874001 -1955682
12767a955682J146108J112718Q90519O91080P30904J080046J606516K083344K356526
$$ -1955682 -809574 303144 1193663 1884743 2615647 3695693 5302209 7385553 9742079
12758I742079K407360K294803K076405J782433J432971J061910P11483L85423
$$ 9742079 12149439 14444242 16520647 18303080 19736051 20797961 21509444 21894867
12750B1894867L4631l98216r18635j444230j834993j972790j826221j477649j084906
$$ 21894867 21929498 21531282 20612647 19168417 17333424 15360634 13534413 12056764 10971858
12741A0971858p74199n66637l94628j56323K11302O56981J004747J067799Q20517
$$ 10971858 10197659 9631022 9236394 9080071 9291373 9948354 10953101 12020900 12841417
12732A2841417M24247Q7076o1066k4532P2140J20047J55313K67738M02427L77666
$$ 12841417 13265664 13352740 13291674 13267142 13339282 13459329 13614642 13882380 14284807 14662473
12722A4662473J01909l15939o68942q34538q45888q01513p59106o99565n62295
$$ 14662473 14764382 14448443 13779501 12944963 12099075 11297562 10538456 9838891 9276596
12713I276596l28565o5991J02418N5491k56156p39329j183819j402652j369333
$$ 9276596 8948031 8882040 8984458 9039949 8783793 8044464 6860645 5457993 4088660
12704D088660j221944j120140j129868j227792j339179j380811j298234j075017
$$ 4088660 2866716 1746576 616708 -611084 -1950263 -3331074 -4629308 -5704325
12696e704325p33881l46690k1612J89554L60463N81350Q32458J027919J103914
$$ -5704325 -6438206 -6784896 -6806508 -6616954 -6256491 -5675141 -4842683 -3814764 -2710850
12687b710850J027877Q05072N00753K01668n1826k55621l69092l20272j12867
$$ -2710850 -1682973 -877901 -377148 -175480 -227306 -482927 -852019 -1172291 -1285158
12678a285158J49526L82710N82930P56609Q63921Q61723P53454N73267L64174
$$ -1285158 -1135632 -752922 -169992 586617 1450538 2312261 3065715 3638982 4003156
12669D003156J69979K3844o5634j22735j83542k63791l76138n61765q33767j094708
$$ 4003156 4173135 4196979 4131345 4008610 3825068 3561277 3185139 2623374 1789607 694899
12659F94899j174944r50347m19239K85510R76086J558870K082251K601929L032872
$$ 694899 -480045 -1430392 -1849631 -1564121 -588035 970835 3053086 5655015 8687887
12650H687887L179432K896129K211140J311808L92444m52929j168790j690259
$$ 8687887 11867319 14763448 16974588 18286396 18678840 18225911 17057121 15366862
12642A5366862k004605k156337k168157k028239j757502j416205j044122o49590
$$ 15366862 13362257 11205920 9037763 7009524 5252022 3835817 2791695 2142105
12634B142105k49982R5926K86035K22591j16811o29648j106984j352394j293831
$$ 2142105 1892123 1988049 2274084 2496675 2379864 1750216 643232 -709162 -2002993
$$ [...]
##END NTUPLES=NMR SPECTRUM
##END=
