##TITLE=31P ikalashn
DE-78 _oil(nlock)
19.11.2024
##JCAMPDX= 6.0         $$ Bruker NMR JCAMP-DX V2.0
##DATA TYPE= NMR SPECTRUM
##DATA CLASS= NTUPLES
##ORIGIN= UXNMR, Bruker Analytische Messtechnik GmbH
##OWNER= root
$$ TOPSPIN		Version 1.3
$$ 2024-11-19 13:38:05.265 +0400  Irina@DPX200
$$ Compression mode = diff/dup
##.OBSERVE FREQUENCY= 81.01967998063
##.OBSERVE NUCLEUS= ^31P
##.ACQUISITION MODE= SIMULTANEOUS
##.ACQUISITION SCHEME= undefined
##.AVERAGES= 64
##.DIGITISER RES= 17
##SPECTROMETER/DATA SYSTEM= spect
##.PULSE SEQUENCE= zgpg
##.SOLVENT NAME= DMSO
##.SHIFT REFERENCE= INTERNAL, DMSO, 1, 298.5841
##AUDIT TRAIL= $$ (NUMBER, WHEN, WHO, WHERE, WHAT)
$$ ##TITLE= Audit trail, TOPSPIN		Version 1.3
$$ ##JCAMPDX= 5.01
$$ ##ORIGIN= Bruker BioSpin GmbH
$$ ##OWNER= Irina
$$ $$ F:/spectra/data/iren/nmr/P31dec/1/pdata/1/auditp.txt
$$ ##AUDIT TRAIL=  $$ (NUMBER, WHEN, WHO, WHERE, VERSION, WHAT)
(   1,<2024-11-19 13:37:36.390 +0400>,<Irina>,<DPX200>,<TOPSPIN 1.3>,
      <created by zg
	started at 2024-11-19 13:35:53.453 +0400,
	POWCHK disabled, PULCHK disabled
       configuration hash MD5:
       BE 6D 3F 07 2A EA 11 49 91 17 2B D3 AF B3 58 0D
       data hash MD5: 32K
       11 30 E8 B6 F2 3F 79 38 DD A3 62 F9 89 39 7A AA>)
(   2,<2024-11-19 13:37:49.890 +0400>,<Irina>,<DPX200>,<TOPSPIN 1.3>,
      <Start of raw data processing
       efp BC_mod = 2 LB = 18 FT_mod = 6 PKNL = 1 PHC0 = 235.9613 PHC1 = 28.00705 SI = 32K 
       data hash MD5: 32K
       C7 26 7A DC 8C 48 3E 9E C3 29 54 DD 71 7C FF E3>)
(   3,<2024-11-19 13:37:52.656 +0400>,<Irina>,<DPX200>,<TOPSPIN 1.3>,
      <abs n ABSG = 5 
       data hash MD5: 32K
       50 19 EB 12 D5 3A 6E 96 5E F2 87 FB B6 93 7E 88>)
$$ ##END=
$$ 
$$ $$ hash MD5
$$ $$ 29 E3 15 13 28 D4 A0 46 28 6E 56 10 94 3F 96 A6
##$RELAX= 
##$RELAX= 
##$RELAX= 
##$RELAX= 
##$RELAX= 
##$RELAX= 
##$RELAX= 
##$RELAX= 
##$RELAX= 
##$RELAX= 
##$RELAX= 
$$ Bruker specific parameters
$$ --------------------------
##$DU= <F:/spectra>
##$EXPNO= 1
##$NAME= <P31dec>
##$PROCNO= 1
##$TYPE= <nmr>
##$USER= <iren>
##$AMP= (0..31)
100 100 100 100 100 100 100 100 100 100 100 100 100 100 100 100 100 100 
100 100 100 100 100 100 100 100 100 100 100 100 100 100 
##$ANAVPT= -1
##$AQSEQ= 0
##$AQ_mod= 1
##$AUNM= <au_zg>
##$AUTOPOS= <>
##$BF1= 81.014009
##$BF2= 200.13
##$BF3= 200.13
##$BF4= 200.13
##$BF5= 200.13
##$BF6= 200.13
##$BF7= 200.13
##$BF8= 200.13
##$BYTORDA= 1
##$CFDGTYP= 0
##$CFRGTYP= 5
##$CHEMSTR= <none>
##$CNST= (0..63)
1 1 145 1 1 1 1 1 1 1 1 1 1 1 1 1 1 1 1 1 1 1 1 1 1 1 1 1 1 1 1 1 1 1 
1 1 1 1 1 1 1 1 1 1 1 1 1 1 1 1 1 1 1 1 1 1 1 1 1 1 1 1 1 1 
##$CPDPRG= <waltz16>
##$CPDPRG1= <>
##$CPDPRG2= <waltz16>
##$CPDPRG3= <>
##$CPDPRG4= <mlev>
##$CPDPRG5= <mlev>
##$CPDPRG6= <mlev>
##$CPDPRG7= <mlev>
##$CPDPRG8= <mlev>
##$CPDPRGB= <>
##$CPDPRGT= <>
##$D= (0..63)
0 1 0 0 0 0 0 0 0 0.06 0 0.03 2e-005 3e-006 0 0 0.0002 0 0 0 0 0 0 0 0 
0 0 0 0 0 0 0 0 0 0 0 0 0 0 0 0 0 0 0 0 0 0 0 0 0 0 0 0 0 0 0 0 0 0 0 
0 0 0 0 
##$DATE= 1732009052
$$ [...]
##$SW_h= 37037.037037037
##$TD= 32768
##$TD0= 1
##$TE= 300
##$TE2= 300
##$TE3= 300
##$TEG= 300
##$TL= (0..7)
0 120 53 12 22 120 120 120 
##$TP= (0..7)
150 150 150 150 150 150 150 150 
##$TP07= 0
##$TPNAME0= <>
##$TPNAME1= <>
##$TPNAME2= <>
##$TPNAME3= <>
##$TPNAME4= <>
##$TPNAME5= <>
##$TPNAME6= <>
##$TPNAME7= <>
##$TPOAL= (0..7)
0.5 0.5 0.5 0.5 0.5 0.5 0.5 0.5 
##$TPOFFS= (0..7)
0 0 0 0 0 0 0 0 
##$TUNHIN= 0
##$TUNHOUT= 0
##$TUNXOUT= 0
##$USERA1= <user>
##$USERA2= <user>
##$USERA3= <user>
##$USERA4= <user>
##$USERA5= <user>
##$V9= 5
##$VALIST= <valist>
##$VCLIST= <CCCCCCCCCCCCCCC>
##$VD= 0
##$VDLIST= <DDDDDDDDDDDDDDD>
##$VPLIST= <PPPPPPPPPPPPPPP>
##$VTLIST= <TTTTTTTTTTTTTTT>
##$WBST= 1024
##$WBSW= 4
##$XGAIN= (0..3)
0 0 0 0 
##$XL= 0
##$YL= 0
##$YMAX_a= 7315
##$YMIN_a= -1115
##$ZGOPTNS= <>
##$ZL1= 120
##$ZL2= 120
##$ZL3= 120
##$ZL4= 120
##$ABSF1= 298.5841
##$ABSF2= -158.5842
##$ABSG= 5
##$ABSL= 5
##$ALPHA= 0
##$AQORDER= 0
##$ASSFAC= 0
##$ASSFACI= 0
##$ASSFACX= 0
##$ASSWID= 0
##$AUNMP= <proc_1d>
##$AXLEFT= 0
##$AXRIGHT= 0
##$AXTYPE= 0
##$AXUNIT= <>
##$AZFE= 0.1
##$AZFW= 0.5
##$BCFW= 0
##$BC_mod= 2
##$BYTORDP= 0
##$COROFFS= 0
##$CY= 12.5935478210449
##$DATMOD= 1
##$DC= 0
##$DFILT= <>
##$DTYPP= 0
##$F1P= 47.1127640792319
##$F2P= -24.0371245302204
##$FCOR= 0.5
##$FTSIZE= 32768
##$FT_mod= 6
##$GAMMA= 0
##$GB= 0
##$INTBC= 1
##$INTSCL= 7.269226e-011
##$ISEN= 30
##$LB= 18
##$LEV0= 0
##$LPBIN= 0
##$MAXI= 12.09355
##$MC2= 0
##$MEAN= 0
##$ME_mod= 0
##$MI= 0.7550151
##$NCOEF= 0
##$NC_proc= -14
##$NLEV= 6
##$NOISF1= 298.5841
##$NOISF2= 270.0111
##$NSP= 0
##$NTH_PI= 0
##$NZP= 0
##$OFFSET= 298.5841
##$PC= 1.4
##$PHC0= 235.9613
##$PHC1= 28.00705
##$PH_mod= 1
##$PKNL= yes
##$PPARMOD= 0
##$PPDIAG= 0
##$PPIPTYP= 0
##$PPMPNUM= 100
##$PPRESOL= 1
##$PSCAL= 0
##$PSIGN= 0
##$REVERSE= no
##$SF= 81.014009
##$SI= 32768
##$SIGF1= 270.0111
##$SIGF2= -158.5842
##$SINO= 77.54984
##$SIOLD= 32768
##$SREGLST= <31P.CDCl3>
##$SSB= 0
##$STSI= 32768
##$STSR= 0
##$SW_p= 37037.037037037
##$SYMM= 0
##$S_DEV= 0
##$TDeff= 32768
##$TDoff= 0
##$TI= <>
##$TILT= no
##$TM1= 0
##$TM2= 0
##$TOPLEV= 0
##$USERP1= <user>
##$USERP2= <user>
##$USERP3= <user>
##$USERP4= <user>
##$USERP5= <user>
##$WDW= 1
##$XDIM= 32768
##$YMAX_p= 380015625
##$YMIN_p= -50675345
$$ End of Bruker specific parameters
$$ ---------------------------------
##NTUPLES= NMR SPECTRUM
##VAR_NAME=  FREQUENCY,     SPECTRUM/REAL,   SPECTRUM/IMAG
##SYMBOL=    X,             R,               I
##VAR_TYPE=  INDEPENDENT,   DEPENDENT,       DEPENDENT
##VAR_FORM=  AFFN,          ASDF,            ASDF
##VAR_DIM=   32768,         32768,           32768
##UNITS=     HZ,            ARBITRARY UNITS, ARBITRARY UNITS
##FACTOR=    1.13031516577767, 1,            1
##FIRST=     37037.037037037, 26519158,      -48827066
##LAST=      0,             -10976386,       -29885835
##MIN=       0,             -50675345,       0
##MAX=       37037.037037037, 380015625,     0
$$ Real data points
##PAGE= N=1
##DATA TABLE= (X++(R..R)), XYDATA
$$ [...]
17565a1350427K5033J48771K58902L29080L57072L63963L82722M42287N54200
17556h488397P07335Q72881J017799J120634J180220J209777J218530J195043
17548C3822J107848R24950O38262K76569j01587m33322o81625q50723r76245j098016
17538a160067j235389j382099j520940j641443j743493j827825j889349j923909
17530a4324514j940384j960842k003715k065288k118357k129308k076609j955398
17522c0574415j769309j520503j205357q18041l60575J48594O76997J190553J664520
17513c2567536K084272K436826K700642K841122K815662K588570K151939J543015
17505a3405488Q46874J79949l39011o18971o19764l63854O8167N58963R83558
$$ plain form
17565 -11350427 -11325394 -11176623 -10917721 -10588641 -10231569 -9867606 -9484884 -9042597 -8488397
17556 -8488397 -7781062 -6908181 -5890382 -4769748 -3589528 -2379751 -1161221 33822
17548 33822 1141670 2066620 2704882 2981451 2879864 2446542 1764917 914194 -62051 -1160067
17538 -1160067 -2395456 -3777555 -5298495 -6939938 -8683431 -10511256 -12400605 -14324514
17530 -14324514 -16264898 -18225740 -20229455 -22294743 -24413100 -26542408 -28619017 -30574415
17522 -30574415 -32343724 -33864227 -35069584 -35887625 -36248200 -36099606 -35422609 -34232056 -32567536
17513 -32567536 -30483264 -28046438 -25345796 -22504674 -19689012 -17100442 -14948503 -13405488
17505 -13405488 -12558614 -12378665 -12717676 -13336647 -13956411 -14320265 -14252098 -13693135 -12709577
17496a2709577J236784J257617J046619O64535K06443k36340o05895q85546j087789
17487a1113149j234854j343323j415921j438750j384764j226185r52330n81518
17479b0690794j58233K61512O26776R02958J076767J156884J170970J158259J157801
17470a3337100J193376J260567J326411J346853J291837J160383R77125P77455
17462d003093N93040M41300L18225J99102N1323j47558l98314o79177r51947j172342
17452e749441j304114j332425j268011j139478r80000q15311o55254m90477k97133
17443a4031644m9776K63799O34373J032305J413539J727253J926634J982677J894417
17434c206423J687586J401859J075935P39918M16126J23014j22404l05075m15626
$$ plain form
17496 -12709577 -11472793 -10215176 -9168557 -8504022 -8297579 -8533919 -9139814 -10025360 -11113149
17487 -11113149 -12348003 -13691326 -15107247 -16545997 -17930761 -19156946 -20109276 -20690794
17479 -20690794 -20849027 -20587515 -19960739 -19057781 -17981014 -16824130 -15653160 -14494901 -13337100
17470 -13337100 -12143724 -10883157 -9556746 -8209893 -6918056 -5757673 -4780548 -4003093
17462 -4003093 -3410053 -2968753 -2650528 -2451426 -2400103 -2547661 -2945975 -3625152 -4577099 -5749441
17452 -5749441 -7053555 -8385980 -9653991 -10793469 -11773469 -12588780 -13244034 -13734511 -14031644
17443 -14031644 -14081420 -13817621 -13183248 -12150943 -10737404 -9010151 -7083517 -5100840 -3206423
17434 -3206423 -1518837 -116978 958957 1698875 2115001 2238015 2115611 1810536 1394910
17425A394910m56404m46019m16467m00390m16677m67666n49643o62577q07725
17416c228658r78593j158855j330759j483455j608799j686468j675004j522926
17408a4673517j195985p02137r7222N32431J099715J541992J830855J967049J968618
17399g728201J860880J671648J428484J154243Q63919N67623K77418J1599k06506
17390i8893l55034m22721m13793l43786k32108r9940K9629J37651K19001K84420
17380a295574L50809M27335N08034N75317O10313O02835N56754M90598M34601
17371C261022M22901M78585N95603P30698Q16934P94458O38068L63633J3900l61796
17361G754006p21941j038641j296471j487819j610765j672977j695468j707270
$$ plain form
17425 1394910 938506 492487 76020 -324370 -741047 -1208713 -1758356 -2420933 -3228658
17416 -3228658 -4207251 -5366106 -6696865 -8180320 -9789119 -11475587 -13150591 -14673517
17408 -14673517 -15869502 -16571639 -16668861 -16136430 -15036715 -13494723 -11663868 -9696819 -7728201
17399 -7728201 -5867321 -4195673 -2767189 -1612946 -749027 -181404 96014 107613 -98893
17390 -98893 -453927 -876648 -1290441 -1634227 -1866335 -1966275 -1936646 -1798995 -1579994 -1295574
17380 -1295574 -944765 -517430 -9396 565921 1176234 1779069 2335823 2826421 3261022
17371 3261022 3683923 4162508 4758111 5488809 6305743 7100201 7738269 8101902 8115802 7754006
17361 7754006 7032065 5993424 4696953 3209134 1598369 -74608 -1770076 -3477346
17353c477346j733216j785866j865866j965560k071878k168443k236009k252040
17345a9556224k194283k048498j812169j488915j079713n81490L764O56797J336040
17336b6764691J983174K534993K935395L144612L146043K949893K590454K116028
17328e364099J576645J016817M75193j3407m18440p16965q98142r67906r51308
17319f261612q87487q15479p58817p21184o96744o84749o94451p36776q11840
17310a3069139r02148r73843r85630r04868p23642m61979j54664J65199M70602
17301a7540112P33964R23717J013330R96081Q91415P36284N69021M18694L05043
17292a0952563K42887K42525L04991M18076N57649O93169P94305Q36704Q05568
$$ plain form
17353 -3477346 -5210562 -6996428 -8862294 -10827854 -12899732 -15068175 -17304184 -19556224
17345 -19556224 -21750507 -23799005 -25611174 -27100089 -28179802 -28761292 -28757528 -28100731 -26764691
17336 -26764691 -24781517 -22246524 -19311129 -16166517 -13020474 -10070581 -7480127 -5364099
17328 -5364099 -3787454 -2770637 -2295444 -2308851 -2727291 -3444256 -4342398 -5310304 -6261612
17319 -6261612 -7149099 -7964578 -8723395 -9444579 -10141323 -10826072 -11520523 -12257299 -13069139
17310 -13069139 -13971287 -14945130 -15930760 -16835628 -17559270 -18021249 -18175913 -18010714 -17540112
17301 -17540112 -16806148 -15882431 -14869101 -13873020 -12981605 -12245321 -11676300 -11257606 -10952563
17292 -10952563 -10709676 -10467151 -10162160 -9744084 -9186435 -8493266 -7698961 -6862257 -6056689
17283f056689O97217N20867L01356P9924r0681j57652q4127J35528M68651Q51198
17273c334408J207985J477947J632017J675736J638414J556298J457665J356434
17265H668088J255152J150207J032861Q88628P00748M57734J60194j76737n25937
17256A3610938q54693j132545j338216j463477j511253j488485j399220j243114
17248C179935j019920p37917m21841j13760J35662K79965K86775J45165j26675
17239A607389m78360q38001j134895j320138j374078j302055j125698q74548n80034
17230g420418k72931J7565K67156M61661N97345O73197O82135O10971M50995K11047
17220c721277p8942l79436o60428r13667j148993j377689j593537j761755j822441
$$ plain form
17283 -6056689 -5359472 -4838605 -4537249 -4457325 -4548006 -4705658 -4789785 -4654257 -4185606 -3334408
17273 -3334408 -2126423 -648476 983541 2659277 4297691 5853989 7311654 8668088
17265 8668088 9923240 11073447 12106308 12994936 13695684 14153418 14313612 14136875 13610938
17256 13610938 12756245 11623700 10285484 8822007 7310754 5822269 4423049 3179935
17248 3179935 2160015 1422098 1000257 886497 1022159 1302124 1588899 1734064 1607389
17239 1607389 1129029 291028 -843867 -2164005 -3538083 -4840138 -5965836 -6840384 -7420418
17230 -7420418 -7693349 -7675784 -7408628 -6946967 -6349622 -5676425 -4994290 -4383319 -3932324 -3721277
17220 -3721277 -3800219 -4179655 -4840083 -5753750 -6902743 -8280432 -9873969 -11635724 -13458165
17211a3458165j710472j384656q49910j59783N98122J321944J913610K294188
17203a1435122K414674K259766J846693J223320M65905l27598j052021j614936
17195f219319j954612k048748j912836j592780j156718o86759k67946K6615J51177
17186a5661926R8143r9155l73413o40983q26313q82895q00277n96218l03662L7670
17176b0049029L84424O94124R34869J095606J187938J234588J250076J229163
17168a2038241J155134J020916Q41752O46837M58434K77023Q4395j36923l80878
17159h071551o08926p64172q00976p09798n21049k88509o5776J10331K21811K57809
17149a1240806K01145L0548k56752o21188r82682j254631j386911j386268j302382
$$ plain form
17211 -13458165 -15168637 -16553293 -17403203 -17562986 -16964864 -15642920 -13729310 -11435122
17203 -11435122 -9020448 -6760682 -4913989 -3690669 -3224764 -3552362 -4604383 -6219319
17195 -6219319 -8173931 -10222679 -12135515 -13728295 -14885013 -15571772 -15839718 -15813103 -15661926
17186 -15661926 -15563783 -15662938 -16036351 -16677334 -17503647 -18386542 -19186819 -19783037 -20086699 -20049029
17176 -20049029 -19664605 -18970481 -18035612 -16940006 -15752068 -14517480 -13267404 -12038241
17168 -12038241 -10883107 -9862191 -9020439 -8373602 -7915168 -7638145 -7553750 -7690673 -8071551
17159 -8071551 -8680477 -9444649 -10245625 -10955423 -11476472 -11764981 -11830757 -11720426 -11498615 -11240806
17149 -11240806 -11039661 -11009113 -11265865 -11887053 -12869735 -14124366 -15511277 -16897545 -18199927
17140a8199927j193455j094680j006328r04194p61845n69377l38884r6222J33011
17131b4031901L32257M91084N94946O21016N49608L83894J59546o5425k32417
17122b1197392l00319k53704j04746J09281L37201N33251O73416P58101Q02386
17113a8642525Q23149Q30809Q28065Q13170P82314P28366O40275N08150L31506
17104a2356721J23968q8624k75733m12952m91080n16887n04201m62381l92599
17095a5377210k95791j84266q4404k7153l4194j08757k34678l82380n17512o08071
17085a7854416o30197n75797m60027l19890j98962j27105j10470j36521j84452
17076b0597837k31873k59000k53565k13405j44376n7269L4093J17610J92653K77330
$$ plain form
17140 -18199927 -19393382 -20488062 -21494390 -22398584 -23160429 -23729806 -24068690 -24164912 -24031901
17131 -24031901 -23699644 -23208560 -22613614 -21992598 -21442990 -21059096 -20899550 -20964975 -21197392
17122 -21197392 -21497711 -21751415 -21856161 -21746880 -21409679 -20876428 -20203012 -19444911 -18642525
17113 -18642525 -17819376 -16988567 -16160502 -15347332 -14565018 -13836652 -13196377 -12688227 -12356721
17104 -12356721 -12232753 -12321377 -12597110 -13010062 -13501142 -14018029 -14522230 -14984611 -15377210
17095 -15377210 -15673001 -15857267 -15941671 -15968824 -16003018 -16111775 -16346453 -16728833 -17246345 -17854416
17085 -17854416 -18484613 -19060410 -19520437 -19840327 -20039289 -20166394 -20276864 -20413385 -20597837
17076 -20597837 -20829710 -21088710 -21342275 -21555680 -21700056 -21757325 -21723232 -21605622 -21412969 -21135639
17066b1135639M02120N89991Q38018J115436J377381J582642J706771J747927
17058a1775353J723704J659140J572995J472407J357500J227400J080303R09841
17050g72063P06382M67399K10423k4387j88771k50700k13412j18447l0717j0575
17040b24868q4072k27069l74061m48631l99679k25617K4258K71767M44168N02669
17030g41135M51833L29090J81865M2784q4992k23482l98801o16162q46146j031393
17020b936539j111838j054075q66416n90745k79206K6719L01726N28021O84203
17011e298150P41832O71972M58748J13329l21383p81162j199899j524583j718533
17002h857829j758374j634665j358945r71249n38346j36765J73446L67865M57936
$$ plain form
17066 -21135639 -20733519 -20143528 -19305510 -18190074 -16812693 -15230051 -13523280 -11775353
17058 -11775353 -10051649 -8392509 -6819514 -5347107 -3989607 -2762207 -1681904 -772063
17050 -772063 -65681 401718 612141 587754 398983 148283 -65129 -183576 -214293 -224868
17040 -224868 -308940 -536009 -910070 -1358701 -1758380 -1983997 -1959739 -1687972 -1243804 -741135
17030 -741135 -289302 39788 221653 264437 179445 -44037 -442838 -1059000 -1905146 -2936539
17020 -2936539 -4048377 -5102452 -5968868 -6559613 -6838819 -6812100 -6510374 -5982353 -5298150
17011 -5298150 -4556318 -3884346 -3425598 -3312269 -3633652 -4414814 -5614713 -7139296 -8857829
17002 -8857829 -10616203 -12250868 -13609813 -14581062 -15119408 -15256173 -15082727 -14714862 -14256926
16993a4256926M75488M52758M07226L38226K38517J12453j5974j12646j50517
16984a2511395j19300k1569J37912L57041O30148R39073J252252J531343J738160
16975f066335J840047J817099J671474J433311J156498R02149P16100O13471N80225
16966D664039N88170O09100O18793N95231N20385L86694K01678j3450k29558m18644
16956G522438n65948o79072p83648r04606j048122j200338j340734j452112j515052
16947a967194j495493j345208j023062n23893J06071P77431J383816J832403K066252
16938a88877K072837J880901J551642J166902Q12076N52957M14056L71421L68051
16929I001966L45669K74080J59908L2230p9611j58299j97022j92775j43367n0508
$$ plain form
16993 -14256926 -13781438 -13328680 -12921454 -12583228 -12344711 -12232258 -12248232 -12360878 -12511395
16984 -12511395 -12630695 -12652264 -12514352 -12157311 -11527163 -10588090 -9335838 -7804495 -6066335
16975 -6066335 -4226288 -2409189 -737715 695596 1852094 2754243 3470343 4083814 4664039
16966 4664039 5252209 5861309 6480102 7075333 7595718 7982412 8184090 8170640 7941082 7522438
16956 7522438 6956490 6277418 5493770 4589164 3541042 2340704 999970 -452142 -1967194
16947 -1967194 -3462687 -4807895 -5830957 -6354850 -6248779 -5471348 -4087532 -2255129 -188877
16938 -188877 1883960 3764861 5316503 6483405 7295481 7848438 8262494 8633915 9001966
16929 9001966 9347635 9621715 9781623 9813853 9734242 9575943 9378921 9186146 9042779 8992271
16919H992271P3231J98721K83279K85987J87349k078k51937n31853q22904j112821
16909G299245j383462j605576j747838j792487j742923j618304j444693j252276
16901e288314j076401r54393r15480r68808j097528j263712j421881j534363j581971
16892a6102851j566044j502331j411894j313794j219327j127709j027027r01537
16884b6172514p39140n32970k77915L1164L93227P87961J167818J469093J640508
16875b2232768J668718J580255J420442J228876J029201Q33736O51532M91956
16867a3328052L63933K72588K14202J73816J30445O8190j3565r6452j48689j39565
16857a2503149n6572Q4921K47400L92175N03854O00490P19901Q90517J106172
$$ plain form
16919 8992271 9065502 9264223 9547502 9833489 10020838 10018760 9766823 9234970 8412066 7299245
16909 7299245 5915783 4310207 2562369 769882 -973041 -2591345 -4036038 -5288314
16901 -5288314 -6364715 -7319108 -8234588 -9203396 -10300924 -11564636 -12986517 -14520880 -16102851
16892 -16102851 -17668895 -19171226 -20583120 -21896914 -23116241 -24243950 -25270977 -26172514
16884 -26172514 -26911654 -27444624 -27722539 -27691375 -27298148 -26510187 -25342369 -23873276 -22232768
16875 -22232768 -20564050 -18983795 -17563353 -16334477 -15305276 -14471540 -13820008 -13328052
16867 -13328052 -12964119 -12691531 -12477329 -12303513 -12173068 -12104878 -12118443 -12214895 -12363584 -12503149
16857 -12503149 -12559721 -12474800 -12227400 -11835225 -11331371 -10730881 -10010980 -9120463 -8014291
16848h014291J321037J469236J499772J406794J235793J059862R39692Q92928
16840A810823Q91265Q82263Q16626O64727M21526J07629k32183n39164p60436
16831D063076q68266q66853p83178o48561m83728k97699r9163R2579K48844L43872
16821G00923L66942L25109K37035J24396N894j05022k00793k81283l55509m40594
16811C77098n56175p14377r08475j108353j270316j357926j359737j292635j191588
16802i382484j093572j022681r81607r54374r20430q70499q10011p46188o71983
16793a7453829n65679m09515k09882R59J82895L08664L71922L82513L56497L05796
16783a6729659K31637J27596o959j52794k70621l19822k83008j76088l7093R5667
$$ plain form
16848 -8014291 -6693254 -5224018 -3724246 -2317452 -1081659 -21797 917895 1810823
16840 1810823 2702088 3584351 4400977 5065704 5487230 5594859 5362676 4823512 4063076
16831 4063076 3194810 2327957 1544779 896218 412490 114791 15628 108207 357051 700923
16821 700923 1067865 1392974 1630009 1754405 1760299 1655277 1454484 1173201 817692 377098
16811 377098 -179077 -893454 -1801929 -2910282 -4180598 -5538524 -6898261 -8190896 -9382484
16802 -9382484 -10476056 -11498737 -12480344 -13434718 -14355148 -15225647 -16035658 -16781846 -17453829
16793 -17453829 -18019508 -18429023 -18638905 -18637946 -18455051 -18146387 -17774465 -17391952 -17035455 -16729659
16783 -16729659 -16498022 -16370426 -16377385 -16530179 -16800800 -17120622 -17403630 -17579718 -17616811 -17521144
16773a7521144K01681K83697L58634M41185N32834O23188O99032P51173P73445
16764a2856275P57314O90895N66002L87242J74809l9860k19773l26542l27630
16755a1193818k09617J0745K89640N74333Q24977J026076J180925J295844J369637
16746d831258J395334J365900J275408J119293Q99741O33630L56408J18683k5354
16737B307785l7051Q6745L05774N47616P30196P82593O61364L65327n7056n19790
16727E173503r30461j222243j368281j375396j267092j068057p99156m83897j56614
16718c497694J40217L70392N16538N78038N57368M49300K42340p1044m84409r73451
16708b172405j499455k017569k483611k854076l083200l127738k962213k592328
$$ plain form
16773 -17521144 -17319463 -17035766 -16677132 -16235947 -15703113 -15079925 -14380893 -13629720 -12856275
16764 -12856275 -12098961 -11408066 -10842064 -10454822 -10280013 -10319873 -10539646 -10866188 -11193818
16755 -11193818 -11403435 -11392690 -11103050 -10528717 -9703740 -8677664 -7496739 -6200895 -4831258
16746 -4831258 -3435924 -2070024 -794616 324677 1224418 1858048 2214456 2333139 2307785
16737 2307785 2270734 2357479 2663253 3210869 3941065 4723658 5385022 5750349 5693293 5173503
16727 5173503 4243042 3020799 1652518 277122 -989970 -2058027 -2857183 -3341080 -3497694
16718 -3497694 -3357477 -2987085 -2470547 -1892509 -1335141 -885841 -643501 -714545 -1198954 -2172405
16708 -2172405 -3671860 -5689429 -8173040 -11027116 -14110316 -17238054 -20200267 -22792595
16700b2792595k053318j396613o80116L2060O70273J169568J485375J604658J548044
16691b0412664J363853J115120Q61654O42398M65323L10349J43652o5991l36408
16682a5912714o66214j030693j381028j652804j787210j758149j588017j338027
16674b7114856j077233q51439o71925n25937l94299k61988j21134K7568J74946
16665c0816297L09118M26219N38890O73987Q56480J088333J339732J563701J725835
16656b2294002J826712J900477J993115K136927K335329K562416K774537K926492
16648c837997K983462K924269K738220K422062J983533J452297Q89218L80804
16640A1935868J4155j57108j35112K7207K53613M74995O46657P49486P80769P44270
$$ plain form
16700 -22792595 -24845913 -26242526 -26922642 -26890582 -26220309 -25050741 -23565366 -21960708 -20412664
16691 -20412664 -19048811 -17933691 -17072037 -16429639 -15964316 -15653967 -15510315 -15576306 -15912714
16682 -15912714 -16578928 -17609621 -18990649 -20643453 -22430663 -24188812 -25776829 -27114856
16674 -27114856 -28192089 -29043528 -29715453 -30241390 -30635689 -30897677 -31018811 -30991243 -30816297
16665 -30816297 -30507179 -30080960 -29542070 -28868083 -28011603 -26923270 -25583538 -24019837 -22294002
16656 -22294002 -20467290 -18566813 -16573698 -14436771 -12101442 -9539026 -6764489 -3837997
16648 -3837997 -854535 2069734 4807954 7230016 9213549 10665846 11555064 11935868
16640 11935868 11950023 11792915 11657803 11685010 11938623 12413618 13060275 13809761 14590530 15334800
16630A5334800O47613N05534L37602J54210n7961l33597p06087j180207j720553
16621A2981354k263627k743455l111807l341177l415104l320611l053724k634938
16613a0903089k118352j578280j076586o36724k48622J00573M00570O21762P42844
16604a4695904P72333P42466O84403O10924N20162M11482K96050J93765J22979
16595a0341340R3984J09903J70137K71328M06071N62274P24621Q77703J009542
16586f115777J113967J189179J230881J225116J150499R91205P49242M46565J20449
16577B101326j82131m14567n48785n91685n84167n80691o23851p29922q89065
16568c043538j073768j248799j380342j443726j428323j337292j181777r73035
$$ plain form
16630 15334800 15982413 16487947 16825549 16979759 16921798 16588201 15882114 14701907 12981354
16621 12981354 10717727 7974272 4862465 1521288 -1893816 -5214427 -8268151 -10903089
16613 -10903089 -13021441 -14599721 -15676307 -16313031 -16561653 -16461080 -16060510 -15438748 -14695904
16604 -14695904 -13923571 -13181105 -12496702 -11885778 -11365616 -10954134 -10658084 -10464319 -10341340
16595 -10341340 -10247356 -10137453 -9967316 -9695988 -9289917 -8727643 -8003022 -7125319 -6115777
16586 -6115777 -5001810 -3812631 -2581750 -1356634 -206135 785070 1534312 1980877 2101326
16577 2101326 1919195 1504628 955843 364158 -220009 -800700 -1424551 -2154473 -3043538
16568 -3043538 -4117306 -5366105 -6746447 -8190173 -9618496 -10955788 -12137565 -13110600
16560a3110600p18429m24662j06110K08936M83103O88082Q24541R25702J037103
16551a0192334J184919J356105J505161J582125J561935J456505J304080J146213
16543I04709J007886Q89719P74086O42090M90677L36436K03788J09242N4686L3231
16533E446550M1543Q8485J93303L73848O30099R30843J212806J397850J422371
16524A1737698J262689R42592N21943P5674l25713o27254p93142q10495o95909
16515A1288083m96286k76623j01961k6901r3937l29010p27246j238889j774015
16506F223215k232688k544797k694851k718776k678371k630073k603712k597162
16498a4477215k583612k526621k400051k205482j973630j744670j543354j371827
$$ plain form
16560 -13110600 -13829029 -14253691 -14359801 -14150865 -13667762 -12979680 -12155139 -11229437 -10192334
16551 -10192334 -9007415 -7651310 -6146149 -4564024 -3002089 -1545584 -241504 904709
16543 904709 1912595 2802314 3576400 4218490 4709167 5045603 5249391 5358633 5413319 5446550
16533 5446550 5488093 5576578 5769881 6143729 6773828 7704671 8917477 10315327 11737698
16524 11737698 13000387 13942979 14464922 14540596 14214883 13587629 12794487 11983992 11288083
16515 11288083 10791797 10515174 10413213 10386312 10292375 9963365 9236119 7997230 6223215
16506 6223215 3990527 1445730 -1249121 -3967897 -6646268 -9276341 -11880053 -14477215
16498 -14477215 -17060827 -19587448 -21987499 -24192981 -26166611 -27911281 -29454635 -30826462
16490c0826462j223403j098758j008624r64832r69933j011854j065402j100611
16482c9269879j094502j038968r38871q02123o30259m17878j62875J20531L98860
16473d3835964O31653P90078Q68996Q87317Q80541Q92829R73282J173464J538221
16464c5199583K085943K784784L540293M210644M653357M783667M606638M199113
16456d335144L658812L061601K450868J851486J288336P94977M07824J50089J8063
16447I346912j7248Q479P5183J86722L57659N88045Q46291J074048J209227J212042
16437A4887360J081571Q55566N90988L33888R7794j35331l95421p01619j049766
16428A5565030j413948j758190k048375k255211k350628k309567k122181j806271
$$ plain form
16490 -30826462 -32049865 -33148623 -34157247 -35122079 -36092012 -37103866 -38169268 -39269879
16482 -39269879 -40364381 -41403349 -42342220 -43144343 -43774602 -44192480 -44355355 -44234824 -43835964
16473 -43835964 -43204311 -42414233 -41545237 -40657920 -39777379 -38884550 -37911268 -36737804 -35199583
16464 -35199583 -33113640 -30328856 -26788563 -22577919 -17924562 -13140895 -8534257 -4335144
16456 -4335144 -676332 2385269 4836137 6687623 7975959 8770936 9178760 9328849 9346912
16447 9346912 9329664 9338143 9413326 9600048 9957707 10545752 11392043 12466091 13675318 14887360
16437 14887360 15968931 16824497 17415485 17749373 17847167 17711836 17316415 16614796 15565030
16428 15565030 14151082 12392892 10344517 8089306 5738678 3429111 1306930 -499341
16420d99341j406585r79921n78736k45694j7359P5106J5193j85379m79595p91674
16410e093985j037738j154705j125258r84905q04816o59101n95880o28045p44447
16401a2828880r27694j162974j433533j711435j955527k120176k169178k086914
16393b6396311j881540j578700j208808p93240l34162J85145P81964J442349K098662
16384b7684641K640780K961233L003897K781334K355373J805024J203730O08431
16376a0324839N6098m31528q37059j140710j325350j388115j345877j227589j059645
16367a9024614q58376o36604m14539k17747n9653P2129K06970L66692N49806P38135
16357a9277801R17067J090720J279904J504278J761220K015963K209527K280524
$$ plain form
16420 -499341 -1905926 -2885847 -3464583 -3710277 -3727636 -3652530 -3637337 -3822716 -4302311 -5093985
16410 -5093985 -6131723 -7286428 -8411686 -9396591 -10201407 -10860508 -11456388 -12084433 -12828880
16401 -12828880 -13756574 -14919548 -16353081 -18064516 -20020043 -22140219 -24309397 -26396311
16393 -26396311 -28277851 -29856551 -31065359 -31858599 -32192761 -32007616 -31225652 -29783303 -27684641
16384 -27684641 -25043861 -22082628 -19078731 -16297397 -13942024 -12137000 -10933270 -10324839
16376 -10324839 -10268741 -10700269 -11537328 -12678038 -14003388 -15391503 -16737380 -17964969 -19024614
16367 -19024614 -19882990 -20519594 -20934133 -21151880 -21211533 -21139404 -20932434 -20565742 -20015936 -19277801
16357 -19277801 -18360734 -17270014 -15990110 -14485832 -12724612 -10708649 -8499122 -6218598
16349f218598K190553J941872J578526J168878P76901M36718J45903j16642l60633
16340A543478n66472o94105p09499o06402m10561j70523N5449K10864K49028J38807
16330i59936j27882n27759j005474j485009j887890k150853k238314k146948j903161
16321a4433226j556679j169834p99152m72476j74375J48773N65823J134552J885832
16312a4870762K816214L872633M925292N757785O117261N829013M908478L576141
16304B2932055K152575R14143P350n49374q13555q66675p88162o51057n22666
16295B1814634m60512n03843o63785r15541j198879j432971j543990j492758j286978
16286A2315377r73149o16714k82394k1681J31263J58845N9741j49653m35418p49869
$$ plain form
16349 -6218598 -4028045 -2086173 -507647 661231 1438132 1874850 2020753 1904111 1543478
16340 1543478 977006 282901 -426598 -1033000 -1443561 -1614084 -1558635 -1347771 -1098743 -959936
16330 -959936 -1087818 -1615577 -2621051 -4106060 -5993950 -8144803 -10383117 -12530065 -14433226
16321 -14433226 -15989905 -17159739 -17958891 -18431367 -18605742 -18456969 -17891146 -16756594 -14870762
16312 -14870762 -12054548 -8181915 -3256623 2501162 8618423 14447436 19355914 22932055
16304 22932055 25084630 25998773 26006123 25456749 24643194 23776519 22988357 22337300 21814634
16295 21814634 21354122 20850279 20186494 19270953 18072074 16639103 15095113 13602355 12315377
16286 12315377 11342228 10725514 10443120 10421439 10552702 10711547 10771288 10621635 10186217 9436348
16276I436348j036558j234645j285799j147566q09758l03473L05724R37974J520877
16267F383124K002931K357764K582777K694177K718095K679025K590631K454139
16259B6462663K263765K012624J694141J301028Q26382K67715l67450j055472
16251C3405396j753436k403994k946672l328652l511878l479539l243810k849165
16243I888250k362236j848015j345545q59295l71980J30310O37754J113774J509114
16234F492131J781843J911701J904330J787161J599370J378608J148874R14536
16226A8918554O63172L76143M3203l24842o93776j018213j261273j408483j469853
16217A3824632j473752j457602j456939j493653j567580j657652j734413j774927
$$ plain form
16276 9436348 8399790 7165145 5879346 4731780 3922022 3618549 3924273 4862247 6383124
16267 6383124 8386055 10743819 13326596 16020773 18738868 21417893 24008524 26462663
16259 26462663 28726428 30739052 32433193 33734221 34560603 34828318 34460868 33405396
16251 33405396 31651960 29247966 26301294 22972642 19460764 15981225 12737415 9888250
16243 9888250 7526014 5677999 4332454 3473159 3101179 3231489 3869243 4983017 6492131
16234 6492131 8273974 10185675 12090005 13877166 15476536 16855144 18004018 18918554
16226 18918554 19581726 19957869 20001072 19676230 18982454 17964241 16702968 15294485 13824632
16217 13824632 12350880 10893278 9436339 7942686 6375106 4717454 2983041 1208114
16209A208114j767270j703748j574984j372910j097837p63066l96722m1317K52026
16200g257714M36405M86071M09970K52385P6379o1819j33477j44592j29115j31130
16190f196637j82435k86362m16589n29021n76697n21059l40149l4393L72446Q36735
16180g874161J298360J683925J917662J944716J756889J401922R65503N34798
16172C629614J65936j25332l47465n06584n91432n82949m82425l35452k28766
16163E95145k56518m76408q82247j404536j934057k358261k598099k628270k470482
16154a4413733k168793j768379j309344q28970l60543P4396M73505Q51558J226776
16145a8223527J603587J962616K262688K452666K487723K343686K023471J553749
$$ plain form
16209 1208114 -559156 -2262904 -3837888 -5210798 -6308635 -7071701 -7468423 -7509740 -7257714
16200 -7257714 -6821309 -6335238 -5925268 -5672883 -5596504 -5658323 -5791800 -5936392 -6065507 -6196637
16190 -6196637 -6379072 -6665434 -7082023 -7611044 -8187741 -8708800 -9048949 -9083342 -8710896 -7874161
16180 -7874161 -6575801 -4891876 -2974214 -1029498 727391 2129313 3094816 3629614
16172 3629614 3795550 3670218 3322753 2816169 2224737 1641788 1159363 823911 595145
16163 595145 338627 -137781 -1020028 -2424564 -4358621 -6716882 -9314981 -11943251 -14413733
16154 -14413733 -16582526 -18350905 -19660249 -20489219 -20849762 -20775366 -20301861 -19450303 -18223527
16145 -18223527 -16619940 -14657324 -12394636 -9941970 -7454247 -5110561 -3087090 -1533341
16137a533341R76243L40561k98898q85664j368298j710527j897168j932670j838131
16128a0147893j650856j419616j188245r76130p74034n61559l31324r8150J13244
16119a7034563K87110M21785N17479N61935N29234L92576J40527k13560o31336
16110a5028813j053881j408313j620970j638738j448152j079475n95794p6969
16102b3951105L95943P56950R70803J041397J008007R30852Q71398Q73742R53396
16093a6148617J097109J271165J431273J530795J529928J406478J162681Q23357
16085e895831M27157J5370l76976p23727j004669j203305j308693j317102j228499
16076a2616275j040486p48430l55992J10815N98739J039326J373115J571660J644561
$$ plain form
16137 -1533341 -557098 -216537 -515435 -1401099 -2769397 -4479924 -6377092 -8309762 -10147893
16128 -10147893 -11798749 -13218365 -14406610 -15382740 -16156774 -16718333 -17049657 -17147807 -17034563
16119 -17034563 -16747453 -16325668 -15808189 -15246254 -14717020 -14324444 -14183917 -14397477 -15028813
16110 -15028813 -16082694 -17491007 -19111977 -20750715 -22198867 -23278342 -23874136 -23951105
16102 -23951105 -23555162 -22798212 -21827409 -20786012 -19778005 -18847153 -17975755 -17102013 -16148617
16093 -16148617 -15051508 -13780343 -12349070 -10818275 -9288347 -7881869 -6719188 -5895831
16085 -5895831 -5468674 -5453304 -5830280 -6554007 -7558676 -8761981 -10070674 -11387776 -12616275
16076 -12616275 -13656761 -14405191 -14761183 -14650368 -14051629 -13012303 -11639188 -10067528 -8422967
16067h422967J629387J572193J509460J459675J425766J402126J378545J339754
16059C293939J264514J126568Q98750N62856J24386l76489q68517j270328j520278
16050C235401j599488j535736j387607j218949j075953r76243r12905q67644q22555
16041g161679p64244o82444n68040m12680k09988M0680L27690O21357Q75733J041852
16031f891763J087763J014021Q55081O65026M93876L65614K68732J63947N669
16022a972034k32797n43284q83871j193519j410311j486236j395940j139368p41644
16013a0999004k52088K62980P38269J128505J412808J583842J635842J563845
16005b925001J374874J099944P92226N07684K80600J11248k6889j67381l33324
$$ plain form
16067 -8422967 -6793580 -5221387 -3711927 -2252252 -826486 575640 1954185 3293939
16059 3293939 4558453 5685021 6583771 7146627 7271013 6894524 6026007 4755679 3235401
16050 3235401 1635913 100177 -1287430 -2506379 -3582332 -4558575 -5471480 -6339124 -7161679
16041 -7161679 -7925923 -8608367 -9176407 -9589087 -9799075 -9758395 -9430705 -8809348 -7933615 -6891763
16031 -6891763 -5804000 -4789979 -3934898 -3269872 -2775996 -2410382 -2141650 -1977703 -1972034
16022 -1972034 -2204831 -2748115 -3631986 -4825505 -6235816 -7722052 -9117992 -10257360 -10999004
16013 -10999004 -11251092 -10988112 -10249843 -9121338 -7708530 -6124688 -4488846 -2925001
16005 -2925001 -1550127 -450183 342043 849727 1130327 1241575 1214686 1047305 713981
15996G13981n32086p59087r99809j225188j388037j431198j308293j005503n50300
15987h485520k786N62842J076102J482435J749655J868226J845793J700928J461829
15978C259504J167536Q62742N84178L47661J45810m2894k39768m51580o60269
15969D972920q22762q85923q13307o08535l17935r667K55188M41459N42278N69250
15959C322966N38186M58982L35432J71514k6141k53294n11723q02542j113809
15950B119571j414901j662746j815014j842623j736972j510965j195523q32596
15942i891769m65102j26732J62688L93161N57040O47142O62962O18430N42213
15933f899967M67036M13170L77424L37695K73595J90082J24069J23292K08983
$$ plain form
15996 713981 181895 -577192 -1577001 -2802189 -4190226 -5621424 -6929717 -7935220 -8485520
15987 -8485520 -8488306 -7925464 -6849362 -5366927 -3617272 -1749046 96747 1797675 3259504
15978 3259504 4427040 5289782 5873960 6221621 6367431 6324537 6084769 5633189 4972920
15969 4972920 4150158 3264235 2450928 1842393 1524458 1514791 1769979 2211438 2753716 3322966
15959 3322966 3861152 4320134 4655566 4827080 4800939 4547645 4035922 3233380 2119571
15950 2119571 704670 -958076 -2773090 -4615713 -6352685 -7863650 -9059173 -9891769
15942 -9891769 -10356871 -10483603 -10320915 -9927754 -9370714 -8723572 -8060610 -7442180 -6899967
15933 -6899967 -6432931 -6019761 -5642337 -5304642 -5031047 -4840965 -4716896 -4593604 -4384621
15924d384621L50354M73425N00682L93077J64913j32830m40320p06495q93843
15915d675658r80216r62225q54470o80642m62028k11985O0591L41277O00657P95425
15905g029274Q83839Q45501O89547M45656J47543j78141n13731q47468j169594
15896f726122j469087j730822j933206k048980k052984j935085j709827j415464
15888b1021577j103339q23650o11280m73493l84889k96781j60238M9963L25739
15879b4499545O34644R38543J208856J429591J589567J674758J670790J574650
15871a3778146J405668J207033J036350R48443R75137J109264J303074J486535
15863d306642J598582J613283J544552J428187J297020J167105J039559R09059
$$ plain form
15924 -4384621 -4034267 -3560842 -3060160 -2667083 -2502170 -2635000 -3075320 -3781815 -4675658
15915 -4675658 -5655874 -6618099 -7472569 -8153211 -8615239 -8827224 -8766633 -8425356 -7824699 -7029274
15905 -7029274 -6145435 -5299934 -4610387 -4164731 -4017188 -4195329 -4709060 -5556528 -6726122
15896 -6726122 -8195209 -9926031 -11859237 -13908217 -15961201 -17896286 -19606113 -21021577
15888 -21021577 -22124916 -22948566 -23559846 -24033339 -24418228 -24715009 -24875247 -24825284 -24499545
15879 -24499545 -23864901 -22926358 -21717502 -20287911 -18698344 -17023586 -15352796 -13778146
15871 -13778146 -12372478 -11165445 -10129095 -9180652 -8205515 -7096251 -5793177 -4306642
15863 -4306642 -2708060 -1094777 449775 1877962 3174982 4342087 5381646 6290705
15855F290705P70093O20555M64829L12542J69557K8858j27135l14406n38395p94891
15845F882312j074584j363227j638490j872118k042509k150815k224837k301628
15837g785896k398871k496560k541731k472106k245891j863952j372626q44208
15829b4021841l48064O7923L79098N80163O85640P30500P62215Q22521R26274
15820a9415571J051270J150452J182373J139089J051323R68981R32387R51186
15812a0988510R99817J031633J005929R12074P75126O41179N53624N33587N73878
15803c961663O49875P39837Q38274R53189J093929J261513J445072J621829J760964
15794F402819J835043J836275J785111J720332J675007J655254J635997J574631
$$ plain form
15855 6290705 7060798 7681353 8146182 8458724 8628281 8657139 8530004 8215598 7677203 6882312
15845 6882312 5807728 4444501 2806011 933893 -1108616 -3259431 -5484268 -7785896
15837 -7785896 -10184767 -12681327 -15223058 -17695164 -19941055 -21805007 -23177633 -24021841
15829 -24021841 -24369905 -24301982 -23922884 -23342721 -22657081 -21926581 -21164366 -20341845 -19415571
15820 -19415571 -18364301 -17213849 -16031476 -14892387 -13841064 -12872083 -11939696 -10988510
15812 -10988510 -9988693 -8957060 -7951131 -7039057 -6263931 -5622752 -5069128 -4535541 -3961663
15803 -3961663 -3311788 -2571951 -1733677 -780488 313441 1574954 3020026 4641855 6402819
15794 6402819 8237862 10074137 11859248 13579580 15254587 16909841 18545838 20120469
15786B0120469J433329J200220R02296O02640L77114K77456L01509L91787M65908
15777B6072728M59848L56649J85426m029j72176l07901m26512n53231p05081q81927
15767B4023794j069779j251795j418873j573379j724312j876641k020219k125952
15759A0962844k154922k076489j882289j586973j218062q04582l72617N1442M36252
15750A354604P46667R52044J036498J004044Q75305O78017M38013J76300q8169
15741G173323l34725n40616o85573p58944p65434p27234o80991o67428p15266
15732A297112q28012r82904j142497j271019j347657j372930j364880j342444
15724h355231j302638j209359j007424o54774j51286M52315J067697J596278J958369
$$ plain form
15786 20120469 21553798 22754018 23656314 24258954 24636068 24913524 25215033 25606820 26072728
15777 26072728 26532576 26889225 27074651 27070622 26898446 26590545 26164033 25610802 24905721 24023794
15767 24023794 22954015 21702220 20283347 18709968 16985656 15109015 13088796 10962844
15759 10962844 8807922 6731433 4849144 3262171 2044109 1239527 866910 918352 1354604
15750 1354604 2101271 3053315 4089813 5093857 5969162 6647179 7085192 7261492 7173323
15741 7173323 6838598 6297982 5612409 4853465 4088031 3360797 2679806 2012378 1297112
15732 1297112 469100 -513804 -1656301 -2927320 -4274977 -5647907 -7012787 -8355231
15724 -8355231 -9657869 -10867228 -11874652 -12529426 -12680712 -12228397 -11160700 -9564422 -7606053
15715g606053K113133K064521J854182J545956J208562R01332O63794N08782M21749
15706C675958L70100L20671K56292J82106J18271Q3679Q2259J01692J23333J32932
15696E447293J24323R7020N3494j056n8599j10939j54124j89371k18423k39560
15686D750058k50379k53017k52107k46171k23662j68933p1047P1665K50390M45604
15676D052401O30020P76374Q66490Q96073Q72069Q03788O95468N48680L70861
15667A0512224J76072k5935k38634m71564p20990r57633j135971j219616j202615
15658D715338j110500r82187q48586p22950o04717m88575l71587k56522j52021
15649h22307p1191k9376l8058r2991j64179k00469j51636L661K40263M90031O67878
$$ plain form
15715 -7606053 -5492920 -3428399 -1574217 -28261 1180301 2081633 2745427 3254209 3675958
15706 3675958 4046058 4366729 4623021 4805127 4923398 5007077 5089336 5191028 5314361 5447293
15696 5447293 5571616 5668636 5722130 5721074 5662475 5551536 5397412 5208041 4989618 4750058
15686 4750058 4499679 4246662 3994555 3748384 3524722 3355789 3284742 3356407 3606797 4052401
15676 4052401 4682421 5458795 6325285 7221358 8093427 8897215 9592683 10141363 10512224
15667 10512224 10688296 10662361 10423727 9952163 9231173 8273540 7137569 5917953 4715338
15658 4715338 3604838 2622651 1774065 1051115 446398 -42177 -413764 -670286 -822307
15649 -822307 -893498 -922874 -960932 -1053923 -1218102 -1418571 -1570207 -1566546 -1326283 -836252 -168374
15638a68374P09177N97965L69515Q6909j93506m45370o67607q57457r89403j023131
15628b581282r34188p39310m94515k67254j03220j0304L2711N4228P3299R8366
15618d871469J37280K06476L27920N12219P40155R60268J109241J143562J060865
15609A326517Q96025O95859M90503K79885M2564k39946n60557q81825j151121
15600H97904j322307j369099j287705j096757q37545n68186l46891k10839j63992
15591f305417j82506k32698k86283l23753l32008l05436k49198j78255j11834
15582h507388o8544o4694j13238k19534l73987n47066o94484p74568p68488o88578
15572a2820569n69559m52573l74138l59879m15643n17838o16154o55780o06239
$$ plain form
15638 -168374 540803 1138768 1508283 1595192 1401686 956316 288709 -568748 -1558151 -2581282
15628 -2581282 -3515470 -4254780 -4749295 -5016549 -5119769 -5130073 -5097362 -5043134 -4969835 -4871469
15618 -4871469 -4734189 -4527713 -4199793 -3687574 -2947419 -1987151 -877910 265652 1326517
15609 1326517 2222542 2918401 3408904 3688789 3731353 3491407 2930850 2049025 897904
15600 897904 -424403 -1793502 -3081207 -4177964 -5015509 -5583695 -5930586 -6141425 -6305417
15591 -6305417 -6487923 -6720621 -7006904 -7330657 -7662665 -7968101 -8217299 -8395554 -8507388
15582 -8507388 -8575932 -8640626 -8753864 -8973398 -9347385 -9894451 -10588935 -11363503 -12131991 -12820569
15572 -12820569 -13390128 -13842701 -14216839 -14576718 -14992361 -15510199 -16126353 -16782133 -17388372
15563a7388372m74715k96542j15177L4509J36210J97029K47008L32412N01744
15554a6825894P85534J176791J623926K043768K350257K484978K436060K237360
15546a687220J947113J617155J272918R15136N34312J24504l07303p36551j125001
15537B555063j433617j637717j736949j756098j734932j709722j697642j695957
15529a0847571j695341j694049j700761j725762j770123j820901j851741j825785
15521b4932034j703198j455536j080464o07280r0755M02937Q14348J108236J282102
15512b6261644J359834J374894J354306J310760J244480J152845J042013R32751
15504a6489761Q57400Q51083R40256J129318J390653J668522J900044K041224
$$ plain form
15563 -17388372 -17863087 -18159629 -18274806 -18240297 -18104087 -17907058 -17660050 -17327638 -16825894
15554 -16825894 -16040360 -14863569 -13239643 -11195875 -8845618 -6360640 -3924580 -1687220
15546 -1687220 259893 1877048 3149966 4065102 4599414 4723918 4416615 3680064 2555063
15537 2555063 1121446 -516271 -2253220 -4009318 -5744250 -7453972 -9151614 -10847571
15529 -10847571 -12542912 -14236961 -15937722 -17663484 -19433607 -21254508 -23106249 -24932034
15521 -24932034 -26635232 -28090768 -29171232 -29778512 -29869267 -29466330 -28651982 -27543746 -26261644
15512 -26261644 -24901810 -23526916 -22172610 -20861850 -19617370 -18464525 -17422512 -16489761
15504 -16489761 -15632361 -14781278 -13841022 -12711704 -11321051 -9652529 -7752485 -5711261
15496e711261K080577K033144J921062J752921J515019J182603P44328K20720
15488E739113l36392q60585j293036j598895j769443j813179j749513j610475
15480e292405j438490j270373j117858r63735p76671n29045k04831K00433O80041
15471a0712934J214381J768644K292032K721951K997111L077473K960979K686542
15463I006179K321312J939116J598909J328954J119892R30877P11992M35554J16059
15454A9508844j98260m56647o34358p38522p95566q38119q99374j008058j178345
15445A2761595j400474j641770j860725k026537k131127k186413k211979k224168
15437b921598k232071k238204k240074k231875k206376k154859k064943j920676
$$ plain form
15496 -5711261 -3630684 -1597540 323522 2076443 3591462 4774065 5518393 5739113
15488 5739113 5402721 4542136 3249100 1650205 -119238 -1932417 -3681930 -5292405
15480 -5292405 -6730895 -8001268 -9119126 -10082861 -10859532 -11388577 -11593408 -11392975 -10712934
15471 -10712934 -9498553 -7729909 -5437877 -2715926 281185 3358658 6319637 9006179
15463 9006179 11327491 13266607 14865516 16194470 17314362 18245239 18957231 19392785 19508844
15454 19508844 19310584 18853937 18219579 17481057 16685491 15847372 14947998 13939940 12761595
15445 12761595 11361121 9719351 7858626 5832089 3700962 1514549 -697430 -2921598
15437 -2921598 -5153669 -7391873 -9631947 -11863822 -14070198 -16225057 -18290000 -20210676
15429b0210676j707834j421799j073079o86440k93224P8396M08998O87442R07575
15420b3310641J064695J151640J158320J082088R45874Q05356P30545P70395R25022
15411a4676706J144143J351851J481742J502270J422360J281027J129953J015605
15403d347755R65907R84962J055657J146819J222569J254072J232111J172317
15395D686659J103767J044909R85159Q87644P11116M35098P2266l37375p44084
15386H845159j105698j395516j599332j707315j708531j593385j363883j045269
15378b673770o88850l59883j15255J5335L3724l5565j57283k93430m08305m74225
15368e157507m78025m25141l37198k40112j46762m7580Q0286K51155M54082O52800
$$ plain form
15429 -20210676 -21918510 -23340309 -24413388 -25099828 -25393052 -25314656 -24905658 -24218216 -23310641
15420 -23310641 -22245946 -21094306 -19935986 -18853898 -17908024 -17102668 -16372123 -15601728 -14676706
15411 -14676706 -13532563 -12180712 -10698970 -9196700 -7774340 -6493313 -5363360 -4347755
15403 -4347755 -3381848 -2396886 -1341229 -194410 1028159 2282231 3514342 4686659
15395 4686659 5790426 6835335 7820494 8708138 9419254 9854352 9926618 9589243 8845159
15386 8845159 7739461 6343945 4744613 3037298 1328767 -264618 -1628501 -2673770
15378 -2673770 -3362620 -3722503 -3837758 -3822423 -3788699 -3824264 -3981547 -4274977 -4683282 -5157507
15368 -5157507 -5635532 -6060673 -6397871 -6637983 -6784745 -6832325 -6752039 -6500884 -6046802 -5394002
15358e394002Q00037Q56267Q03758O50536M23001J51837j38582m30555p07002
15349b984705r47448j129199j230915j235132j131172r23644o45413l61442j50025
15340a0739095o6957j16774k52301m01583n01327n15317m33248k62050k3334K43333
15330a3068653M83052O40738O81177O01048M27190K04169k2468k19478l68535
15321a0641760m58008m72958l93973k06944Q3939M50179Q43639J207002J482545
15312h106339J618698J580232J363330J005517N78207J62274j77587m03749n02013
15303b881430m76041l46477j50005O6694K57645L90005M54572M69297M71614N01648
15293a242478N85888P31136R28550J158950J394701J603190J756603J842355J864303
$$ plain form
15358 -5394002 -4593965 -3737698 -2933940 -2283404 -1860403 -1708566 -1847148 -2277703 -2984705
15349 -2984705 -3932153 -5061352 -6292267 -7527399 -8658571 -9582215 -10227628 -10589070 -10739095
15340 -10739095 -10806052 -10922826 -11175127 -11576710 -12078037 -12593354 -13026602 -13288652 -13311986 -13068653
15330 -13068653 -12585601 -11944863 -11263686 -10662638 -10235448 -10031279 -10053747 -10273225 -10641760
15321 -10641760 -11099768 -11572726 -11966699 -12173643 -12089704 -11639525 -10795886 -9588884 -8106339
15312 -8106339 -6487641 -4907409 -3544079 -2538562 -1960355 -1798081 -1975668 -2379417 -2881430
15303 -2881430 -3357471 -3703948 -3853953 -3787259 -3529614 -3139609 -2685037 -2215740 -1744126 -1242478
15293 -1242478 -656590 74546 1003096 2162046 3556747 5159937 6916540 8758895 10623198
15284A0623198J834472J764769J665609J549413J432561J333354J268872J252944
15276B2725192J293704J391260J539091J728372J948041K177720K381512K511643
15268C7696535K520959K377180K074769J642065J138454O38300K07281j17697
15260D8177846l36377m77391n77603o58961p16749p26209o61733n15035l01844
15251D3205944n6329J79812L67160M76344M94349M26421K91190J12412q7097k86993
15241D5123213m67438o06668o81996o75204n79244m03049j74370N9245K36319
15232D1830808K98944K15437p814l33860p13655j100799j456839j752499j971021
15223C5008702k111816k187312k211213k186746k106296j964024j769956j551622
$$ plain form
15284 10623198 12457670 14222439 15888048 17437461 18870022 20203376 21472248 22725192
15276 22725192 24018896 25410156 26949247 28677619 30625660 32803380 35184892 37696535
15268 37696535 40217494 42594674 44669443 46311508 47449962 48088262 48295543 48177846
15260 48177846 47841469 47364078 46786475 46127514 45410765 44684556 44022823 43507788 43205944
15251 43205944 43149615 43329427 43696587 44172931 44667280 45093701 45384891 45497303 45410206 45123213
15241 45123213 44655775 44049107 43367111 42691907 42112663 41709614 41535244 41594489 41830808
15232 41830808 42129752 42345189 42337375 42003515 41289860 40189061 38732222 36979723 35008702
15223 35008702 32896886 30709574 28498361 26311615 24205319 22241295 20471339 18919717
15215A8919717j341146j158736j004616q62729p11720n35221l24505p4738K15833
15206A3122139N39298Q72305J182185J443202J647692J799526J896494J923135
15198B4425976J866054J737294J579146J441566J350205J289941J213848J069348
15190C5973378Q25650M89639J05880k55516n16340o09405m97782j89377K59875
15181C5586002P57239J196694J487887J580293J472651J204998Q40570M48599
15173D4574933R3937j68504l00291k88626j50419P7719L59805O75707J020620
15164D5894881J393242J784630K174840K537204K846840L087628L252207L336832
15156F6308304L341514L281533L200472L167703L256444L516526L958920M556162
$$ plain form
15215 18919717 17578571 16419835 15415219 14552490 13840770 13305549 12981044 12906306 13122139
15206 13122139 13661437 14533742 15715927 17159129 18806821 20606347 22502841 24425976
15198 24425976 26292030 28029324 29608470 31050036 32400241 33690182 34904030 35973378
15190 35973378 36799028 37288667 37394547 37139031 36622691 36013286 35515504 35326127 35586002
15181 35586002 36343241 37539935 39027822 40608115 42080766 43285764 44126334 44574933
15173 44574933 44668870 44500366 44200075 43911449 43761030 43838749 44198554 44874261 45894881
15164 45894881 47288123 49072753 51247593 53784797 56631637 59719265 62971472 66308304
15156 66308304 69649818 72931351 76131823 79299526 82555970 86072496 90031416 94587578
15148I4587578N252383N976575O655550P223389P626371P824636P791257P510071
15140A50447810O977764O213396N267741M220258L161139K169380J300367N87477
15132A80345332N1379k93176m38871l93289j85511J34534N06832Q78331J216652
15123A81822213J512245J768943J990900K174145K305528K367473K345174K232746
15115A98519367K038341J790031J538661J348844J275904J339586J511533J727589
15107B11089856J920648K054824K138235K206445K291320K399728K513569K602910
15099B29217535K638921K601878K484971K293768K042565J752782J455590J192171
15091B45680181J003815R15238R24623J009793J145556J318714J531493J793464
$$ plain form
15148 94587578 99839961 105816536 112472086 119695475 127321846 135146482 142937739 150447810
15140 150447810 157425574 163638970 168906711 173126969 176288108 178457488 179757855 180345332
15132 180345332 180396711 180103535 179664664 179271375 179085864 179220398 179727230 180605561 181822213
15123 181822213 183334458 185103401 187094301 189268446 191573974 193941447 196286621 198519367
15115 198519367 200557708 202347739 203886400 205235244 206511148 207850734 209362267 211089856
15107 211089856 213010504 215065328 217203563 219410008 221701328 224101056 226614625 229217535
15099 229217535 231856456 234458334 236943305 239237073 241279638 243032420 244488010 245680181
15091 245680181 246683996 247599234 248523857 249533650 250679206 251997920 253529413 255322877
15083B55322877K110003K477318K886192L326196L782679M228671M620601M904479
15075B83659016N030571M966901M703565M249760L630850K888283K078517J267917
15067C12475380N25505q5045n15156p39794p57405n81305k33083K54690Q33767
15058C11177554J446764K046061K610325L143100L654575M144569M601579N012001
15050C37836528N361261N621396N740488N651870N303405M687984L854099K891016
15042C76948047J901301R77349J88928m21604q42583j097959j250555j395385
15034C75007539j638664k068704k731597l621670m687178n845208p000762q067916
15026C39345840q987886r735581j0311958j0730557j1008902j1165470j1214682
$$ plain form
15083 255322877 257432880 259910198 262796390 266122586 269905265 274133936 278754537 283659016
15075 283659016 288689587 293656488 298360053 302609813 306240663 309128946 311207463 312475380
15067 312475380 313000885 312915840 312400684 311660890 310903485 310322180 310089097 310343787 311177554
15058 311177554 312624318 314670379 317280704 320423804 324078379 328222948 332824527 337836528
15050 337836528 343197789 348819185 354559673 360211543 365514948 370202932 374057031 376948047
15042 376948047 378849348 379826697 380015625 379594021 378751438 377653479 376402924 375007539
15034 375007539 373368875 371300171 368568574 364946904 360259726 354414518 347413756 339345840
15026 339345840 330357954 320622373 310310415 299579858 288570956 277405486 266190804
15019B66190804j1158054j0979997j0654876j0161108r494626q679162p770867
15012A97292114o849397n992678n247981m619006m077873l592521l149087k753728
15004A61009843k415995k131281j877568j626141j355889j063167p64809m94376
14996A49280617k92951j97976k34878m13386p26304j147374j628637k103147k499797
14987A40036167k767499k892687k895675k810989k671385k506645k348693k228351
14979A18914243k160645k131337k101177k029576j900807j734824j579757j493599
14971A03782521j522382j681743j947937k261238k542622k721482k762382k674150
14963H5668585k498389k292260k118434k037130k089257k273905k537414k786197
$$ plain form
15019 266190804 255032750 244052753 233397877 223236769 213742143 205062981 197292114
15012 197292114 190442717 184450039 179202058 174583052 170505179 166912658 163763571 161009843
15004 161009843 158593848 156462567 154584999 152958858 151602969 150539802 149774993 149280617
14996 149280617 148987666 148789690 148554812 148141426 147415122 146267748 144639111 142535964 140036167
14987 140036167 137268668 134375981 131480306 128669317 125997932 123491287 121142594 118914243
14979 118914243 116753598 114622261 112521084 110491508 108590701 106855877 105276120 103782521
14971 103782521 102260139 100578396 98630459 96369221 93826599 91105117 88342735 85668585
14963 85668585 83170196 80877936 78759502 76722372 74633115 72359210 69821796 67035599
14955F7035599k918502k858970k580488k105514j489426p96455q0495O22274J288273
14946E6116296J893894K405458K781424K986986L009444K861870K572668K170277
14938G6798317J675362J106271M92700j14118o44479j027526j214043j191995
14930G5880489r87492o53538k53681J53713N27090Q45483J102122J292871J409371
14921G9316428J442187J389557J262572J080793Q61493O12925L39106N2444k16771
14912H6140734m22096n13996m57790k47508Q9574M96590Q96979J211377J379906
14903H8573770J381480J239281J008675P55670N38265L95603L42231L66721M38568
14894I5040264N24360O05050O81936P66596Q63022R56242J015667J009624R20096
$$ plain form
14955 67035599 64117097 61258127 58677639 56572125 55082699 54286244 54205749 54828023 56116296
14946 56116296 58010190 60415648 63197072 66184058 69193502 72055372 74628040 76798317
14938 76798317 78473679 79579950 80072650 79958532 79314053 78286527 77072484 75880489
14930 75880489 74892997 74239459 73985778 74139491 74666581 75512064 76614186 77907057 79316428
14921 79316428 80758615 82148172 83410744 84491537 85353030 85965955 86305061 86357505 86140734
14912 86140734 85718638 85204642 84746852 84499344 84588918 85085508 85982487 87193864 88573770
14903 88573770 89955250 91194531 92203206 92958876 93497141 93892744 94234975 94601696 95040264
14894 95040264 95564624 96169674 96851610 97618206 98481228 99437470 100453137 101462761 102382857
14885A02382857P50025N23364K79505O0568j06882k26379l31719m70722o80879
14876A02179738r68871j303066j622487j858223j956342j891478j668001j314241
14868H9597029q76632m14495R060L40714N48272O24029N82754M60266L11828K03244
14858I1386069J90732K96928M98743P37269R43616J063947J072844R76142Q07909
14849I7974199O22463M80290M29695M92097O59830R05148J190099J471807J707559
14840A05933187J864156J926193J894140J773156J565586J276688R27495N61042
14832A17721643K35216N961r1651n5977Q2887K79304M91558O91445Q61052R83519
14822A21204957J036389R93246Q34807N64136K15202j54476m85122p36741q99584
$$ plain form
14885 102382857 103132882 103656246 103935751 103996319 103889437 103663058 103331339 102860617 102179738
14876 102179738 101210867 99907801 98285314 96427091 94470749 92579271 90911270 89597029
14868 89597029 88720397 88305902 88314962 88655676 89203948 89827977 90410731 90870997 91182825 91386069
14858 91386069 91576801 91873729 92372472 93109741 94053357 95117304 96190148 97166290 97974199
14849 97974199 98596662 99076952 99506647 99998744 100658574 101563722 102753821 104225628 105933187
14840 105933187 107797343 109723536 111617676 113390832 114956418 116233106 117160601 117721643
14832 117721643 117956859 117962820 117871169 117815192 117898079 118177383 118668941 119360386 120221438 121204957
14822 121204957 122241346 123234592 124069399 124633535 124848737 124694261 124209139 123472398 122572814
14813A22572814r91292j045570j096586j163129j238682j292377j281312j170039
14805A13293827r48685o39128k84495P0682L95832O77095R10556J095724J235714
14796A15807122J341578J432652J528537J637332J749963J845456J902398J907652
14788A29152690J857831J755740J606895J418754J200270R58764O96612M13357
14780A39060913J13004j91190m80062p36282r48832j111977j222399j277078j273053
14771A31933044j212047j108918r92276q87314p91695o68278m64206j42585K94198
14762A25959923Q01175J306538J736541K037667K188038K195494K084937J882142
14754A40192455J602992J254340Q46347M07505j2076l56744n90806p12730p46260
$$ plain form
14813 122572814 121581522 120535952 119439366 118276237 117037555 115745178 114463866 113293827
14805 113293827 112345142 111706014 111421519 111492201 111888033 112565128 113475684 114571408 115807122
14796 115807122 117148700 118581352 120109889 121747221 123497184 125342640 127245038 129152690
14788 129152690 131010521 132766261 134373156 135791910 136992180 137950944 138647556 139060913
14780 139060913 139173917 138982727 138502665 137766383 136817551 135705574 134483175 133206097 131933044
14771 131933044 130720997 129612079 128619803 127732489 126940794 126272516 125808310 125665725 125959923
14762 125959923 126761098 128067636 129804177 131841844 134029882 136225376 138310313 140192455
14754 140192455 141795447 143049787 143896134 144303639 144291563 143934819 143344013 142631283 141885023
14745A41885023p17594o39184n11458l35874j25155R7182L05192M77657N98365
14736A41034154O53299O31810N31920L63824J47734r2450l35849n69048p87836
14727A41577558r96531j203929j415584j625977j815170j951999k003390j948194
14719A28616784j790769j566227j330406j135459j004085r21005q49062p56860
14711A19262911o36886n04640l85697l03563k75342l12988m23903o08388q57360
14702A14954144j154282j478811j805805k099620k313478k403009k349774k176073
14694I9173292j934763j678864j433556j188513r11843n75704j79875K39062O16552
14685I2125788Q80357R73139Q70932N92709J98026k25841n82526p86890p85215
$$ plain form
14745 141885023 141167429 140528245 140016787 139680913 139555758 139652940 139958132 140435789 141034154
14736 141034154 141687453 142319263 142851183 143215007 143362741 143270291 142934442 142365394 141577558
14727 141577558 140581027 139377098 137961514 136335537 134520367 132568368 130564978 128616784
14719 128616784 126826015 125259788 123929382 122793923 121789838 120868833 120019771 119262911
14711 119262911 118626025 118121385 117735688 117432125 117156783 116843795 116419892 115811504 114954144
14702 114954144 113799862 112321051 110515246 108415626 106102148 103699139 101349365 99173292
14694 99173292 97238529 95559665 94126109 92937596 92025753 91450049 91270174 91509236 92125788
14685 92125788 93006145 93979284 94850216 95442925 95640951 95415110 94832584 94045694 93260479
14676I3260479n72703k00270K40533O55183R87031J233696J429158J608606J781930
14667A00423643J929547K017419K018605J927818J761016J541362J282478R84363
14659A13886251O49206L03729J703k02989k90998k89892k55914k40112k60473
14650A13300511k95981l06697k68880k01790j65212k26910m22164p30448j077560
14641A09604869j357763j469443j354576j023210n45907j7748M81560R06753J241041
14632A06465576J480403J624231J675150J641637J538387J382599J186712R52444
14624A17947139O72832L43315k6574m10933p75768j090599j336695j509980j620119
14615A12192618j686984j733050j771550j797680j792633j738905j632905j484985
$$ plain form
14676 93260479 92687776 92487506 92728039 93383222 94370253 95603949 97033107 98641713 100423643
14667 100423643 102353190 104370609 106389214 108317032 110078048 111619410 112901888 113886251
14659 113886251 114535457 114839186 114840889 114637900 114346902 114057010 113801096 113560984 113300511
14650 113300511 113004530 112697833 112428953 112227163 112061951 111835041 111412877 110682429 109604869
14641 109604869 108247106 106777663 105423087 104399877 103853970 103836222 104317782 105224535 106465576
14632 106465576 107945979 109570210 111245360 112886997 114425384 115807983 116994695 117947139
14624 117947139 118619971 118963286 118936712 118525779 117750011 116659412 115322717 113812737 112192618
14615 112192618 110505634 108772584 107001034 105203354 103410721 101671816 100038911 98553926
14607I8553926j311935j131476r59645q07527o79035n73954m94540m48925m48273
14598I1698616n01176o10177p71066r72339j193094j400486j550064j591495j479983
14589H1628736j190632p30435j42388N00852J112247J610073J938352K082868
14581H6809673K073049J963364J803668J618422J405889J152117Q49359N11142
14573I8186683J76825r8603k63753k87493j66726P4482L93384P43454J089658
14564I9847911J414331J710510J971044K183552K331554K395327K349947K166929
14556A16371105J826527J337275P48727J43590l92782q11050j120435j378414
14548A16724543j651611j971351k311144k598604k751180k711858k466345k039968
$$ plain form
14607 98553926 97241991 96110515 95150870 94343343 93664308 93090354 92595814 92146889 91698616
14598 91698616 91197440 90587263 89816197 88843858 87650764 86250278 84700214 83108719 81628736
14589 81628736 80438104 79707669 79565281 80066133 81178380 82788453 84726805 86809673
14581 86809673 88882722 90846086 92649754 94268176 95674065 96826182 97675541 98186683
14573 98186683 98363508 98264905 98001152 97713659 97546933 97621415 98014799 98758253 99847911
14564 99847911 101262242 102972752 104943796 107127348 109458902 111854229 114204176 116371105
14556 116371105 118197632 119534907 120283634 120427224 120034442 119223392 118102957 116724543
14548 116724543 115072932 113101581 110790437 108191833 105440653 102728795 100262450 98222482
14540I8222482j484677q66449k56480K75883O72101Q96513R47020Q56742O83281
14531I9946416M90824L33793K45746K32313K69654L13006L14345K40285Q2375
14522A02468757j41354l93077o30045q23707r74118j111371j281076j520238j838148
14513I3755623k212715k598632k938171l171882l250249l143307k844669k371468
14505G1224530j763194j078575l87666K40572P50261J104968J287810J298736
14497G2677442J152444Q78448N21574J38854k09669m74895o32717o91396o86650
14488G2673435o65187o64653o98540p50826p82864p52154o34751m38177j97491
14479F7088792M1890K43631L90676M82889N29921N48590N62512N93609O44472
$$ plain form
14540 98222482 96737805 95871356 95614876 95890759 96562860 97459373 98406393 99263135 99946416
14531 99946416 100437240 100771033 101016779 101249092 101518746 101831752 102146097 102386382 102468757
14522 102468757 102327403 101934326 101304281 100480574 99506456 98395085 97114009 95593771 93755623
14513 93755623 91542908 88944276 86006105 82834223 79583974 76440667 73595998 71224530
14505 71224530 69461336 68382761 67995095 68235667 68985928 70090896 71378706 72677442
14497 72677442 73829886 74708334 75229908 75368762 75159093 74684198 74051481 73360085 72673435
14488 72673435 72008248 71343595 70645055 69894229 69111365 68359211 67724460 67286283 67088792
14479 67088792 67130682 67374313 67764989 68247878 68777799 69326389 69888901 70482510 71126982
14470G1126982O86682O69229N43315K87381q0306n05483r16642j250430j470226
14461F9090502j569845j565871j486437j359937j205130j028760q36307o48714
14453E9389501n07002m54440n05749o26528p41922p73924o84999m99596k90593
14444E4304748j40504j00626j69829l02254m36412n26478n57072n36641m81492
14435E1053440m05460l18579k29776j50134r4250p4358q7709j08540r5068q569
14425D9480997J67921M22115P18763J013872J266802J444732J522690J485721
14417E7523613J334213J087195P79557M53519J45181j30469l85811o48359r34634
14408E9224005j229175j486266j653897j700887j627705j458335j224598r53982
$$ plain form
14470 71126982 71813664 72482893 73026208 73313589 73233283 72727800 71811158 70560728 69090502
14461 69090502 67520657 65954786 64468349 63108412 61903282 60874522 60038215 59389501
14453 59389501 58882499 58428059 57922310 57295782 56553860 55779936 55094937 54595341 54304748
14444 54304748 54164244 54063618 53893789 53591535 53155123 52628645 52071573 51534932 51053440
14435 51053440 50647980 50329401 50099625 49949491 49855241 49780883 49693174 49584634 49489566 49480997
14425 49480997 49648918 50071033 50789796 51803668 53070470 54515202 56037892 57523613
14417 57523613 58857826 59945021 60724578 61178097 61323278 61192809 60806998 60158639 59224005
14408 59224005 57994830 56508564 54854667 53153780 51526075 50067740 48843142 47889160
14400D7889160o64167l62858n2238K62920N68715Q42988J061972J205216J255076
14391E2006784J194590J011019P08496L22536p9579m21850o53905p71030q05514
14382E2511547p98567p73292p23494o22702m47984k03756P1178L18972M90403
14373D9822305N67531N69874N44373N45809O14099P55504R37414J103045J200541
14364E6660495J209577J148609J059395R81829R37264R27686R44529R76584J011000
14355F5856968J030119J013040R45924Q33054O97275N67713M63603L85004L14633
14346G2107333K28416J10879l0677j63907k47756k58042k01948j08681m057J09518
14336G1541078K51576M43109O84191R47966J194868J392757J524786J581207J547457
$$ plain form
14400 47889160 47224993 46862135 46809897 47072817 47641532 48484520 49546492 50751708 52006784
14391 52006784 53201374 54212393 54920889 55243425 55163846 54741996 54088091 53317061 52511547
14382 52511547 51712980 50939688 50216194 49593492 49145508 48941752 49012930 49331902 49822305
14373 49822305 50389836 50959710 51504083 52049892 52663991 53419495 54356909 55459954 56660495
14364 56660495 57870072 59018681 60078076 61059905 61997169 62924855 63869384 64845968 65856968
14355 65856968 66887087 67900127 68846051 69679105 70376380 70944093 71407696 71792700 72107333
14346 72107333 72335749 72446628 72415951 72252044 72004288 71746246 71544298 71435617 71431560 71541078
14336 71541078 71792654 72235763 72919954 73867920 75062788 76455545 77980331 79561538 81108995
14327H1108995J402904J132653P41186K56158k77987q08608j280855j643480j857346
14318G8773620j903491j784448j517420j125514o34648p7520N02077J052068J522348
14309G4807072J876406K098763K195967K190888K111695J980414J806909J589909
14301I0658023J323060J004566O47814K86568l1071k59065l72067l76084l06373
14292I2575371k15835j60412j85032l10342n21933p68749r77816j083275j053895
14283H7298082r00055o57087l62962m9536K52746N10722O93709P84663P88139
14274H8358421P28613O40520N58642N15773N43461O65203Q80655J153250J414930
14265I5459468J587804J609251J448135J109347O29442O6837n08580j023096j407517
$$ plain form
14327 81108995 82511899 83644552 84385738 84641896 84363909 83555301 82274446 80630966 78773620
14318 78773620 76870129 75085681 73568261 72442747 71808099 71730579 72232656 73284724 74807072
14309 74807072 76683478 78782241 80978208 83169096 85280791 87261205 89068114 90658023
14301 90658023 91981083 92985649 93633463 93920031 93888960 93629895 93257828 92881744 92575371
14292 92575371 92359536 92199124 92014092 91703750 91181817 90413068 89435252 88351977 87298082
14283 87298082 86398027 85740940 85377978 85328442 85581188 86091910 86785619 87570282 88358421
14274 88358421 89087034 89727554 90286196 90801969 91345430 92010633 92891288 94044538 95459468
14265 95459468 97047272 98656523 100104658 101214005 101843447 101910284 101401704 100378608 98971091
14256I8971091j612413j627337j490397j277272j071914r32536q70741q55588
14248H9232893q39012p85427o88023n66387m52444l76069l58200m12460n48695
14239H4206176p69957j063128j393401j710926j966351k125084k174621k126096
14231G0876612k010047j863709j713679j565806j410167j237395j056355r02974
14223E9116480q32071q91835j095059j407918j763342k085262k306755k380071
14215D6354167k286028k041293j693363j302479r22996n92219l23981j06176R2316
14206C7177948L04983N49611Q17575J074383J270666J358810J308279J113966
14198D4976221P95735L91911m8114m69428q18181j051547j147247j107796r60394
$$ plain form
14256 98971091 97358678 95731341 94240944 92963672 91891758 90959222 90088481 89232893
14248 89232893 88393881 87608454 86920431 86354044 85901600 85525531 85167331 84754871 84206176
14239 84206176 83436219 82373091 80979690 79268764 77302413 75177329 73002708 70876612
14231 70876612 68866565 67002856 65289177 63723371 62313204 61075809 60019454 59116480
14223 59116480 58284409 57392574 56297515 54889597 53126255 51040993 48734238 46354167
14215 46354167 44068139 42026846 40333483 39031004 38108008 37515789 37191808 37085632 37177948
14206 37177948 37482931 38032542 38850117 39924500 41195166 42553976 43862255 44976221
14198 44976221 45771956 46163867 46115753 45646325 44828144 43776597 42629350 41521554 40561160
14189D0561160p55176n58638m36553m29951n38966p27668r46291j153407j324083
14180C3690427j445071j508067j509019j450788j341528j188815r98849p84425
14172B3463865n70366l85322k46508j53535r5280n7965k3794L4257J47516L35093
14162B2447961N90165Q80524J160603J385777J523695J560547J500734J361286
14154C2411292J166229R44739P30288N54390M33922L60145L00111K12496O7280
14145C7180892j43695m07519o95904r72789j204410j367813j452857j459647j397217
14136B8079041j283575j141806r91407q41673o93569n49197m21200l33321l08622
14127B1514671l51439m35896n10782n19097m20808k07600R5436M40171P72042
$$ plain form
14189 40561160 39805984 39247346 38810793 38380842 37841876 37114208 36167917 35014510 33690427
14180 33690427 32245356 30737289 29228270 27777482 26435954 25247139 24248290 23463865
14172 23463865 22893499 22508177 22261669 22108134 22012854 21954889 21931095 21965352 22112868 22447961
14162 22447961 23038126 23918650 25079253 26465030 27988725 29549272 31050006 32411292
14154 32411292 33577521 34522260 35252548 35806938 36240860 36601005 36901116 37113612 37180892
14145 37180892 37037197 36629678 35933774 34960985 33756575 32388762 30935905 29476258 28079041
14136 28079041 26795466 25653660 24662253 23820580 23127011 22577814 22156614 21823293 21514671
14127 21514671 21163232 20727336 20216554 19697457 19276649 19069049 19164485 19604656 20376698
14118B0376698J044387J225679J300939J269935J142110R29021O39971K86203
14110B8214943j11240n21437r13076j262471j552495j767926j895700j930189
14102A8260409j877623j755557j587583j395524j193424r87762p83592n90570
14094H088774m23360k96442k17837j85852j88993k06294k07527j56768k1784K14116
14084F398033N44144R38344J352346J740634K067471K310453K458340K507959
14076B0317724K461275K320522K083550J746941J320039Q40185L71480k0893l05790
14067C1135033n03040o67224q49886j067652j296638j491607j611311j633381
14059B2014294j556670j397826j186060r56300p42381n72910m68874m39068m73806
$$ plain form
14118 20376698 21421085 22646764 23947703 25217638 26359748 27288769 27928740 28214943
14110 28214943 28103703 27582266 26669190 25406719 23854224 22086298 20190598 18260409
14102 18260409 16382786 14627229 13039646 11644122 10450698 9462936 8679344 8088774
14094 8088774 7665414 7368972 7151135 6965283 6776290 6569996 6362469 6205701 6183917 6398033
14084 6398033 6942177 7880521 9232867 10973501 13040972 15351425 17809765 20317724
14076 20317724 22778999 25099521 27183071 28930012 30250051 31090236 31461716 31440823 31135033
14067 31135033 30631993 29964769 29114883 28047231 26750593 25258986 23647675 22014294
14059 22014294 20457624 19059798 17873738 16917438 16175057 15602147 15133273 14694205 14220399
14050A4220399n44308o12940o48033o30699n50274l99553j81067Q0593L37405
14041A1071523N35033O35807O29741N29497L58542J40592j08041l80736o72082
14032A2739876r62374j210871j368053j397750j291643j068887p66431m26823
14024D247044q7079K28143N06192P40925R27468J059389J127400J121279J038309
14015A0909070Q94836P30372N95359N25008N16031N26605N04284M23027L01287
14006A5925879J89366J40734J89422L39452N60229P89559R52146R89121Q81249
13997B0957157O53976L67372J00732o3688o1262J31026M80678R09081J320211
13988B4795283J631370J791405J782634J612631J306888R07489M71365N9417k82438
$$ plain form
14050 14220399 13676091 13063151 12415118 11784419 11234145 10834592 10653525 10734118 11071523
14041 11071523 11606556 12242363 12872104 13401601 13760143 13900735 13792694 13411958 12739876
14032 12739876 11777502 10566631 9198578 7800828 6509185 5440298 4673867 4247044
14024 4247044 4159965 4388108 4894300 5635225 6562693 7622082 8749482 9870761 10909070
14015 10909070 11803906 12534278 13129637 13654645 14170676 14697281 15201565 15624592 15925879
14006 15925879 16115245 16255979 16445401 16784853 17345082 18134641 19086787 20075908 20957157
13997 20957157 21611133 21978505 22079237 22015549 21954287 22085313 22565991 23475072 24795283
13988 24795283 26426653 28218058 30000692 31613323 32920211 33827700 34299065 34358482 34076044
13979C4076044n38944p26024q73440j001124j107353j177373j203106j196507
13971B6252173j187194j207915j276320j382030j487506j545038j519669j401945
13963A5244556j203541r44030o41466l11579K7532L50081O21973Q08402Q86264
13954A4838192Q52442P22554N23600K87848N1429j45683k64773k79910j88437
13945A6397262j1245K17426M61961O91606Q81480J013720J080640J086512J045692
13936B2865054R80045R17704Q89758R21784J023881J186370J383489J580696J740371
13927C3489152J826260J810090J679620J442015J118386P33153L07384j38371
13919D2267689n74969r58610j235420j357346j301606j081896p44084l50042L8841
$$ plain form
13979 34076044 33537100 32811076 31937636 30936512 29829159 28651786 27448680 26252173
13971 26252173 25064979 23857064 22580744 21198714 19711208 18166170 16646501 15244556
13963 15244556 14041015 13096985 12455519 12143940 12171472 12521553 13143526 13951928 14838192
13954 14838192 15690634 16413188 16936788 17224636 17276065 17130382 16865609 16585699 16397262
13945 16397262 16386017 16603443 17065404 17757010 18638490 19652210 20732850 21819362 22865054
13936 22865054 23845099 24762803 25652561 26574345 27598226 28784596 30168085 31748781 33489152
13927 33489152 35315412 37125502 38805122 40247137 41365523 42098676 42406060 42267689
13919 42267689 41692720 40734110 39498690 38141344 36839738 35757842 35013758 34663716 34702557
13910C4702557L70571O05667P20438P11698N97366M07484J68956j04520m08483
13901C7771734p32166j044054j292939j429495j436548j344570j217472j117843
13893B8156647j077793j094301j144894j205466j257545j286475j278241j219377
13885A8592555j100263r21024o97783m64650k67782j52230j46144k48443m27334
13876A4166902o33826q23271r71084j076235j155931j235908j337609j464487
13868E468551j593990j683490j690875j597391j416179j182232r33622o95423
13860e324651m72350k51534j3569K53220N41559Q22643J054082J194080J214650
13851i81870J109971Q99362O24118L37547R1677p3097j32276p7648Q1956L18221
$$ plain form
13910 34702557 35073128 35678795 36399233 37110931 37708297 38115781 38284737 38180217 37771734
13901 37771734 37039568 35995514 34702575 33273080 31836532 30491962 29274490 28156647
13893 28156647 27078854 25984553 24839659 23634193 22376648 21090173 19811932 18592555
13885 18592555 17492292 16571268 15873485 15408835 15141053 14988823 14842679 14594236 14166902
13876 14166902 13533076 12709805 11738721 10662486 9506555 8270647 6933038 5468551
13868 5468551 3874561 2191071 500196 -1097195 -2513374 -3695606 -4629228 -5324651
13860 -5324651 -5797001 -6048535 -6062104 -5808884 -5267325 -4444682 -3390600 -2196520 -981870
13851 -981870 128101 1027463 1651581 1989128 2080805 2007708 1875432 1797784 1879740 2197961
13841B197961N84543Q27738J007323J108575J138822J112442J040068R29977P94707
13832A0742156O51891N17818M01353L04521K27115J67950J22132Q1771M3431J3381
13822A3273519P84L893N239j6504o7543j28954j63510j34520k5240J51192L54585
13811A3252941N31279O33928O40482N63831M47701L51521L30438M15253N96515
13802A7763889Q20751J007813J087561J036494Q89288P17915N95873N70962O56746
13793B5147292Q38436J083962J353470J606658J810661J947708K017289K030029
13785C7835505J996511J916983J777420J556620J243779Q55808M40065N8271k38569
13776D7442393m30026n31753n84646o32134o97062p72879q35986q69262q77984
$$ plain form
13841 2197961 2782504 3610242 4617565 5726140 6864962 7977404 9017472 9947449 10742156
13832 10742156 11394047 11911865 12313218 12617739 12844854 13012804 13134936 13216707 13260138 13273519
13822 13273519 13274303 13278196 13283435 13266931 13199388 13070434 12906924 12772404 12747164 12898356 13252941
13811 13252941 13784220 14418148 15058630 15622461 16070162 16421683 16752121 17167374 17763889
13802 17763889 18584640 19592453 20680014 21716508 22605796 23323711 23919584 24490546 25147292
13793 25147292 25985728 27069690 28423160 30029818 31840479 33788187 35805476 37835505
13785 37835505 39832016 41748999 43526419 45083039 46326818 47182626 47622691 47680962 47442393
13776 47442393 47012367 46480614 45895968 45263834 44566772 43793893 42957907 42088645 41210661
13767D1210661q89085r39095j059393j262199j529070j808291k029520k134160
13759B9559848k104371j970447j792075j627630j509112j431919j361922j258128
13751A6504244j100493r04922p13804n69694m93294m79248n04012n32217n18654
13742A0687906m14992j88030J57457N69512R66386J271852J444751J486455J428081
13733A7409378J310846J171164J033629R10598Q07199P27228O73296O41524O20040
13724B5304902N97312N74039N66310N94825O67716P70223Q68647R24192R06364
13715C1774530P99481O03318L31545R677l28548o47429r16427j115632j238479
13706B9272036j290002j278853j207030j067217q53289n75528k65264L4903K84998
$$ plain form
13767 41210661 40321576 39382481 38323088 37060889 35531819 33723528 31694008 29559848
13759 29559848 27455477 25485030 23692955 22065325 20556213 19124294 17762372 16504244
13751 16504244 15403751 14498829 13785025 13215331 12722037 12242789 11738777 11206560 10687906
13742 10687906 10272914 10084884 10242341 10811853 11778239 13050091 14494842 15981297 17409378
13733 17409378 18720224 19891388 20925017 21835615 22642814 23370042 24043338 24684862 25304902
13724 25304902 25902214 26476253 27042563 27637388 28305104 29075327 29943974 30868166 31774530
13715 31774530 32574011 33177329 33508874 33518551 33190003 32542574 31626147 30510515 29272036
13706 29272036 27982034 26703181 25496151 24428934 23575645 23000117 22734853 22769756 23054754
13697B3054754M57323N43492N59232N40698N28870N49392O00667O56786O80955
13688B8172169O39589N10199K83134l7859m32881q63659j277258j616657j834347
13679B3542430j904784j830857j640006j371451j061393p32558l92422m1813L12235
13670A4879381O50875R50045J192019J371392J491550J555732J559768J491384
13662B5142146J337212J094948P83592M42874J19957j47611l41330m60092n12096
13653B7459600n06979m52687l57419k31665q4533Q3984K86467N42156Q65311J255609
13643B8859844J694891K149730K577787K937123L197963L353565L422568L436759
13635E1630230L419463L369590L262783L068448K771933K389138J965359J559847
$$ plain form
13697 23054754 23512077 24055569 24614801 25155499 25684369 26233761 26834428 27491214 28172169
13688 28172169 28811758 29321957 29605091 29567232 29134351 28270692 26993434 25376777 23542430
13679 23542430 21637646 19806789 18166783 16795332 15733939 15001381 14608959 14567146 14879381
13670 14879381 15530256 16480301 17672320 19043712 20535262 22090994 23650762 25142146
13662 25142146 26479358 27574306 28357898 28800772 28920729 28773118 28431788 27971696 27459600
13653 27459600 26952621 26499934 26142515 25910850 25826317 25910301 26196768 26738924 27604235 28859844
13643 28859844 30554735 32704465 35282252 38219375 41417338 44770903 48193471 51630230
13635 51630230 55049693 58419283 61682066 64750514 67522447 69911585 71876944 73436791
13627G3436791J225059R90481Q56592P99944P85920P82684P69425P35503O73930
13618H1056329N77800M43674K76048Q5906j15291l19399n19688p04799q53029
13609G9927551r33012r14271p83471n56760k80507j8194J73061K67111K81183
13600G7162691K67260K86925L84960N74012Q31359J105043J329842J449752J434547
13591H4826391J280465J000776O20479J78788k70400o67728r62757j124508j145418
13582H3736088j041211q48873o22096m21079k95833k68984l28308m34869n42647
13573G8932188o19419o59470o83255p25058q14211r57872j132794j291129j380872
13564G0668108j373352j280030j143362j006541q85084p60433n97435l72165r2054
$$ plain form
13627 73436791 74661850 75652331 76508923 77308867 78094787 78877471 79646896 80382399 81056329
13618 81056329 81634129 82077803 82353851 82439757 82324466 82005067 81485379 80780580 79927551
13609 79927551 78994539 78080268 77296797 76740037 76459530 76441336 76614397 76881508 77162691
13600 77162691 77429951 77716876 78101836 78675848 79507207 80612250 81942092 83391844 84826391
13591 84826391 86106856 87107632 87728111 87906899 87636499 86968771 86006014 84881506 83736088
13582 83736088 82694877 81846004 81223908 80802829 80506996 80238012 79909704 79474835 78932188
13573 78932188 78312769 77653299 76970044 76244986 75430775 74472903 73340109 72048980 70668108
13564 70668108 69294756 68014726 66871364 65864823 64979739 64219306 63621871 63249706 63157652
13555F3157652K03669M62273O41035P21138P06813O14419M59516K51243j872k82798
13545F6933088n67628q39395j099124j360382j632761j912136k185967k443550
13537E4892145k676634k869117k989234k996356k859721k575034k169328j696125
13529C4060596j225907q30485n58826m12758l40974k63468j15779J16241L94637
13520C0823277O57468Q53212R59771R83482R48538Q88046Q38086Q29705Q77741
13511C8659326R72242J079238J152393J151253J059365Q94853P06603N54440M82802
13502D6712515N04213O01011P38322Q75788R74232J002045R42418P96761N84158
13493E3731463L41439J20914k3089n7281J3552J48711K90588L88171M14648L74147
$$ plain form
13555 63157652 63361321 63823594 64464629 65185767 65892580 66506999 66966515 67217758 67215886 66933088
13545 66933088 66365460 65526065 64426941 63066559 61433798 59521662 57335695 54892145
13537 54892145 52215511 49346394 46357160 43360804 40501083 37926049 35756721 34060596
13529 34060596 32834689 32004204 31445378 31032620 30691646 30428178 30312399 30428640 30823277
13520 30823277 31480745 32333957 33293728 34277210 35225748 36113794 36951880 37781585 38659326
13511 38659326 39631568 40710806 41863199 43014452 44073817 44968670 45675273 46229713 46712515
13502 46712515 47216728 47817739 48556061 49431849 50406081 51408126 52350544 53147305 53731463
13493 53731463 54072902 54193816 54170727 54113446 54126998 54275709 54566297 54954468 55369116 55743263
13483E5743263K95943K18040J67884J50760J50562J38722Q5116l1093k11115m30431
13473E6277651o43038p98739q66434q48020p71798o70931n65010m56485l38239
13464E0318957k03998n8542P4937J56900J45560J5944k27027n48004q91704j197464
13454D7585559j413231j508297j481769j361213j191695j021360q87987q09245
13446C7910762p80084p78170p73705p38706o51995m98314k64443O1241M82770
13437C3969356R89051J552112K132384K685695L168478L543628L788537L900387
13429E5729628L892700L784387L588206L303513K915470K403555J758464R96985
13421G8372908J62811o86035j490137k193447k744347l100116l234174l142097
$$ plain form
13483 55743263 56039206 56257246 56425130 56575890 56726452 56865174 56950290 56919197 56708082 56277651
13473 56277651 55634613 54835874 53969440 53121420 52349622 51678691 51113681 50657196 50318957
13464 50318957 50114959 50056417 50131354 50288254 50433814 50449758 50222731 49674727 48783023 47585559
13454 47585559 46172328 44664031 43182262 41821049 40629354 39607994 38720007 37910762
13446 37910762 37130678 36352508 35578803 34840097 34188102 33689788 33425345 33486586 33969356
13437 33969356 34958407 36510519 38642903 41328598 44497076 48040704 51829241 55729628
13429 55729628 59622328 63406715 66994921 70298434 73213904 75617459 77375923 78372908
13421 78372908 78535719 77849684 76359547 74166100 71421753 68321637 65087463 61945366
13413F1945366k844943k389078j839522j264399p15543k18405K19746N91707Q80725
13404E4365654J068665J153908J162601J143071J146465J204716J316616J448661
13396F4010357J549852J571266J480334J267620R49366N65873J72817j73275m29424
13387G0964786n75485o15327n69205m61887l14461j43511L5943K09402L66588
13378F8896843N07057O39372P68943Q83644R53084R46083Q54276P04995N54453
13369G5708750M64597M75741N89213P69341R63252J125730J234685J291050J306630
13360H3928989J288525J229793J113374R26935O75478L79136N8943k74389o17550
13351H8709234r61487j281761j541822j706014j752134j677348j498436j249207
$$ plain form
13413 61945366 59100423 56711345 54871823 53607424 52891881 52673476 52893222 53484929 54365654
13404 54365654 55434319 56588227 57750828 58893899 60040364 61245080 62561696 64010357
13396 64010357 65560209 67131475 68611809 69879429 70828795 71394668 71567485 71394210 70964786
13387 70964786 70389301 69773974 69204769 68742882 68428421 68284910 68320853 68530255 68896843
13378 68896843 69403900 70043272 70812215 71695859 72648943 73595026 74449302 75154297 75708750
13369 75708750 76173347 76649088 77238301 78007642 78970894 80096624 81331309 82622359 83928989
13360 83928989 85217514 86447307 87560681 88487616 89163094 89542230 89601173 89326784 88709234
13351 88709234 87747747 86465986 84924164 83218150 81466016 79788668 78290232 77041025
13343G7041025r75214p23373n26629l90736k92861j94266n9267J29379L62626
13334G4370684O04585P99490Q87014Q23573O02166K60985j25832m74496p24741
13325G7023428q62817r20694r52254j001836j082893j174728j233481j209251
13317F8585474j064216p89651m17060j4821L33080N56148O17225N14555K72128
13308F8592862p0000m60384q39748j148862j341080j393971j312435j121537q55735
13299F0049110n51619k45017L0619K47152L84516M29610L73712K15373l1267l31929
13289F0570260o37986r00457j085103j181505j201704j170010j111862j048442
13281E2233191r96000r64581r55163r60055r69238r77078r81577r77389r53488
$$ plain form
13343 77041025 76065811 75342438 74815809 74425073 74132212 73937946 73878679 74008058 74370684
13334 74370684 74975269 75774759 76661773 77485346 78087512 78348497 78222665 77748169 77023428
13325 77023428 76160611 75239917 74287663 73285827 72202934 71028206 69794725 68585474
13317 68585474 67521258 66731607 66314547 66299726 66632806 67188954 67806179 68320734 68592862
13308 68592862 68522862 68062478 67222730 66073868 64732788 63338817 62026382 60904845 60049110
13299 60049110 59497491 59252474 59283093 59530245 59914761 60344371 60718083 60933456 60902189 60570260
13289 60570260 59932274 59031817 57946714 56765209 55563505 54393495 53281633 52233191
13281 52233191 51237191 50272610 49317447 48357392 47388154 46411076 45429499 44452110 43498622
13272D3498622r01777q27975p50719o87059o37891n87120n14938m13634k93116
13263C7884393j72906o9889N246M0775J8116p9025k42207m21921n37935n16942
13253C5907705l34425l2606K96964N54184O69742O24685M48513K03603l6543k08552
13243C8093270k73170k18959n8995J74295M34681O70670Q37685R07983Q71707
13234D1439167P31858N02289K09950j07867m14850o84877q99224j038250j081685
13225C8656511j020323q68639o66538m66288l11591k22074j91474j96981k11773
13216C4500830k14737j95027j51471q9027j5787N6547J09130J15581N1949q5405
13206C4082583k68085m42904n55071n71109m88835l33244j43218M4505K07001
$$ plain form
13272 43498622 42596845 41768870 41018151 40331092 39693201 39106081 38591143 38177509 37884393
13263 37884393 37711487 37641598 37646844 37687619 37705735 37626710 37384503 36962582 36424647 35907705
13253 35907705 35573280 35540674 35837638 36391822 37061564 37686249 38134762 38338365 38301822 38093270
13243 38093270 37820100 37601141 37542146 37716441 38151122 38821792 39659477 40567460 41439167
13234 41439167 42171025 42673314 42883264 42775397 42360547 41675670 40776446 39738196 38656511
13225 38656511 37636188 36767549 36101011 35634723 35323132 35101058 34909584 34712603 34500830
13216 34500830 34286093 34091066 33939595 33850568 33834781 33891328 34000458 34116039 34167988 34082583
13206 34082583 33814498 33371594 32816523 32245414 31756579 31423335 31280117 31324622 31531623
13197C1531623L37293M37650N10321N53026N61254N32056M63440L51371J91418
13188C5469452j3544k45688m72492o58565p82951q48198q74236q84926q99017
13179B9789835r29194r85430j077094j209512j374436j541756j664445j698202
13171A9309766j621181j440391j185874q99949o25215l94332k24522j15780m9567
13162A2752955R841J05594K69487N03289P73735J027124J214056J306191J295915
13153A9258187J186777R88917P24511M34948J76655J414o6757m0803M0237J32554
13143B2836640K05664K49741K72156K87251L04888L22588L25510K95556K24030
13134B5324024J19155O221p6444q5880R794K13771M95584Q05651J098468J348500
$$ plain form
13197 31531623 31868916 32306566 32816887 33369913 33931167 34463223 34926663 35278034 35469452
13188 35469452 35455908 35210220 34737728 34079163 33296212 32448014 31573778 30688852 29789835
13179 29789835 28860641 27875211 26798117 25588605 24214169 22672413 21007968 19309766
13171 19309766 17688585 16248194 15062320 14162371 13537156 13142824 12918302 12802522 12752955
13162 12752955 12762796 12868390 13137877 13641166 14414901 15442025 16656081 17962272 19258187
13153 19258187 20444964 21433881 22158392 22593340 22769995 22771409 22704652 22663849 22704086 22836640
13143 22836640 23042304 23292045 23564201 23851452 24156340 24478928 24804438 25099994 25324024
13134 25324024 25443179 25449400 25372956 25287076 25296870 25510641 26006225 26811876 27910344 29258844
13124B9258844J553761J731589J910329K117608K368087K656330K955921L222132
13116D7774601L399777L439555L316971L040907K646351K177539J671113J147675
13108F8614489O17220R4024l94465q16470j155445j420287j634898j817000j966068
13099F0121100k069364k117326k113675k074130k017819j957434j892005j806909
13091D4072438j683566j512354j296316j042907p55726m38025j02921K25097N21892
13082C7987612P75378R83558J141632J232057J227724J106960Q69561N42854J75102
13073D6042438j78029m65430o45994o89214n76312l03504J16651O58620J286693
13064D5245919J950300K577292L080436L380535L430730L226920K804956K232438
$$ plain form
13124 29258844 30812605 32544194 34454523 36572131 38940218 41596548 44552469 47774601
13116 47774601 51174378 54613933 57930904 60971811 63618162 65795701 67466814 68614489
13108 68614489 69231709 69325733 68931268 68114798 66959353 65539066 63904168 62087168 60121100
13099 60121100 58051736 55934410 53820735 51746605 49728786 47771352 45879347 44072438
13091 44072438 42388872 40876518 39580202 38537295 37781569 37343544 37240623 37465720 37987612
13082 37987612 38762990 39746548 40888180 42120237 43347961 44454921 45324482 45867336 46042438
13073 46042438 45864409 45398979 44752985 44063771 43487459 43183955 43300606 43959226 45245919
13064 45245919 47196219 49773511 52853947 56234482 59665212 62892132 65697088 67929526
13056F7929526J596024R80555M44769R506l31474n89338p68306q71544r12838
13047F7486880r19455r24486r57448j038903j176809j362584j571529j773147
13039E7762519j947536k094348k224369k338419k410043k388900k228020j916375
13031D0214509j490641j018866n73814k17138K657N1598p9485l62965p37018j127861
13021C4660976j475873j745209j916094j976997j926923j781280j572110j339779
13013B0926711j116726r10074o97467m44594j34925K09391N31537P68549Q85014
13004B0017416Q86250Q02701O64170M88165K86108P1647j40940l43805n37555
12995B2194157p25597r06337j068563j190802j243547j196326j031324p56950
$$ plain form
13056 67929526 69525550 70506105 70950874 70960380 70628906 70039568 69271262 68399718 67486880
13047 67486880 66567425 65642939 64685491 63646588 62469779 61107195 59535666 57762519
13039 57762519 55814983 53720635 51496266 49157847 46747804 44358904 42130884 40214509
13031 40214509 38723868 37705002 37131188 36914050 36916707 36968305 36888820 36525855 35788837 34660976
13021 34660976 33185103 31439894 29523800 27546803 25619880 23838600 22266490 20926711
13013 20926711 19809985 18899911 18202444 17757850 17622925 17832316 18363853 19132402 20017416
13004 20017416 20903666 21706367 22370537 22858702 23144810 23216457 23075517 22731712 22194157
12995 22194157 21468560 20562223 19493660 18302858 17059311 15862985 14831661 14074711
12987A4074711m08798l3891L28870O54706R23477J109926J187019J139763R76297
12978A9952080P27641M37727J49126j11297l39524n46798p40996r12999j040150
12969A7574810j102758j098183j040975r50599q37357o96532n13985k78717N556
12960A1061260L16544O18793Q74192J051837J134015J117811J013963Q45475O45650
12951A8679540M51562K91064J70439P5116j3495r9068j67118j99008j88303j47199
12941A8853530j02399q4843j17921k09790l53354n31711p23196r02767j041917
12932A4785632j112565j097595j003280q64212p33585o60445o65583p31523q12985
12923G103859q59777q37505p36636n69886l63290j47182M9613K02651K94536L19192
$$ plain form
12987 14074711 13665913 13632022 13960892 14615598 15539075 16649001 17836020 18975783 19952080
12978 19952080 20679721 21117448 21266574 21155277 20815753 20268955 19527959 18614960 17574810
12969 17574810 16472052 15373869 14332894 13382295 12544938 11848406 11334421 11055704 11061260
12960 11061260 11377804 11996597 12870789 13922626 15056641 16174452 17188415 18033890 18679540
12951 18679540 19131102 19422166 19592605 19667721 19654226 19555158 19388040 19189032 19000729 18853530
12941 18853530 18751131 18666288 18548367 18338577 17985223 17453512 16730316 15827549 14785632
12932 14785632 13673067 12575472 11572192 10707980 9974395 9313950 8648367 7916844 7103859
12923 7103859 6244082 5406577 4669941 4100055 3736765 3589583 3639196 3841847 4136383 4455575
12913D455575K86329K21195J55062J08263P7240L8974k6580j13247j85210j98291
12903D819310j29829N687J66467L10147M15735M84396N24359N40548N39091N35416
12893H211327N50867N97921O65681P16484O99097N75281L44576M8220k51947n02319
12883A1655188o72883p55567p58036p01380o17242n38250m85307m61537m57669
12874F207317m62744m68601m63515m24322l21147j36231J19410M08021O83654
12865E141842R10585J069292J150890J148632J055405Q70129O07059K97195k3033
12856A2227996l28198o12266q82602j143503j379376j550022j604502j505943
12848C221584j250690q70606m18496N4487N15670R51086J351494J699410J971201
$$ plain form
12913 4455575 4741904 4963099 5118161 5226424 5303664 5342638 5316058 5202811 5017601 4819310
12903 4819310 4689481 4695168 4861635 5171782 5587517 6071913 6596272 7136820 7675911 8211327
12893 8211327 8762194 9360115 10025796 10742280 11441377 12016658 12361234 12409454 12157507 11655188
12883 11655188 10982305 10226738 9468702 8767322 8150080 7611830 7126523 6664986 6207317
12874 6207317 5744573 5275972 4812457 4388135 4066988 3930757 4050167 4458188 5141842
12865 5141842 6052427 7121719 8272609 9421241 10476646 11346775 11953834 12251029 12227996
12856 12227996 11899798 11287532 10404930 9261427 7882051 6332029 4727527 3221584
12848 3221584 1970894 1100288 681792 736279 1251949 2203035 3554529 5253939 7225140
12839G225140K152463K250037K285598K275211K215277K088343J881870J603190
12831B3977129J280545R50579O39705L50959O7829k25758n28097q22764j095917
12822B4594210j345314j569890j751303j847659j809786j610465j263504q17706
12814A2578583l34000J34541N50304Q90989J148146J324526J427882J463423J431032
12805B0615426J330483J169947R69068P52962N42506L49291J77197K5221j13283
12796B5818818k52685m12341o07553q40883j101833j374628j645540j902162k126835
12787A5554358k293615k375133k355576k240326k055451j837105j615758j402689
12779f21295j186883r46216o67401l61359o3051J83992L46711M11856L82838K72291
$$ plain form
12839 7225140 9377603 11627640 13913238 16188449 18403726 20492069 22373939 23977129
12831 23977129 25257674 26208253 26847958 27198917 27266746 27040988 26512891 25690127 24594210
12822 24594210 23248896 21679006 19927703 18080044 16270258 14659793 13396289 12578583
12814 12578583 12244583 12379124 12929428 13820417 14968563 16293089 17720971 19184394 20615426
12805 20615426 21945909 23115856 24084924 24837886 25380392 25729683 25906880 25932101 25818818
12796 25818818 25566133 25153792 24546239 23705356 22603523 21228895 19583355 17681193 15554358
12787 15554358 13260743 10885610 8530034 6289708 4234257 2397152 781394 -621295
12779 -621295 -1808178 -2754394 -3421795 -3783154 -3846205 -3662213 -3315502 -2903646 -2520808 -2248517
12769b248517R8267j16313l45638n65173p53730q91113r55030r23497p85057n52049
12759h037850k66737P840K09564K99224K71426J52546q713j53958k31451k13179
12749g971288j02385P4246K81277M84366O54162P70041Q23817Q19131P68078O91331
12739b707224O21149N97941O55221Q00746J008237J226787J401927J495258J493965
12730F594007J409829J269911J101357R17703P17208M94601K54153J0960k19199
12721A2550530m30269o26963q14903r87235j121172j191974j193954j147871j085973
12712C950216j027649r66072q74531p25003n04872k23100R3725M10600O94497
12703H27811R22123J082176J172369J195188J155983J062781R25108P52488N56046
$$ plain form
12769 -2248517 -2150250 -2266563 -2612201 -3177374 -3931104 -4822217 -5777247 -6700744 -7485801 -8037850
12759 -8037850 -8304587 -8296747 -8087183 -7787959 -7516533 -7363987 -7372700 -7526658 -7758109 -7971288
12749 -7971288 -8073673 -7999427 -7718150 -7233784 -6579622 -5809581 -4985764 -4166633 -3398555 -2707224
12739 -2707224 -2086075 -1488134 -832913 -32167 976070 2202857 3604784 5100042 6594007
12730 6594007 8003836 9273747 10375104 11292807 12010015 12504616 12758769 12769729 12550530
12721 12550530 12120261 11493298 10678395 9691160 8569988 7378014 6184060 5036189 3950216
12712 3950216 2922567 1956495 1081964 356961 -147911 -371011 -277286 133314 827811
12703 827811 1749934 2832110 4004479 5199667 6355650 7418431 8343539 9096027 9652073
12694I652073L52980J67637K4434o3606j02071j12556j20965j42115j68892j72880
12684I314039j17144K5208K55867N46442Q45731J094874J243626J263081J153079
12675A5624803R42334O78645M10584J68351m5598k50665m70665p15284r70226
12666A5372279j199956j360597j416598j353311j181888r39079o83979m87282
12658F749589m09230m74033o57390q95816j110140j229969j212502j053655p88548
12649a081694m79455j93059K7364J81917L09885M59308O51881Q69180J065178
12640A810505J189949J208127J106236Q91908N90112K38671j17872m37053o87259
12631E793324q50440r17133q81272p42984n17188k37496N0665L03541M90468N97091
$$ plain form
12694 9652073 10005053 10172690 10197124 10133518 10031447 9918891 9797926 9655811 9486919 9314039
12684 9314039 9196895 9222103 9477970 10024412 10870143 11965017 13208643 14471724 15624803
12675 15624803 16567137 17245782 17656366 17824717 17779119 17528454 17057789 16342505 15372279
12666 15372279 14172323 12811726 11395128 10041817 8859929 7920850 7236871 6749589
12658 6749589 6340359 5866326 5208936 4313120 3202980 1973011 760509 -293146 -1081694
12649 -1081694 -1561149 -1754208 -1726844 -1544927 -1235042 -775734 -123853 745327 1810505
12640 1810505 3000454 4208581 5314817 6206725 6796837 7035508 6917636 6480583 5793324
12631 5793324 4942884 4025751 3144479 2401495 1884307 1646811 1697476 2001017 2491485 3088576
12621C088576O20099N60033M20177K11648m3683l18279n87570q32950j037807
12612B080244j184899j261992j272253j238518j193303j158780j131899j086593
12604g447993r89877q19135n71162k62077P7609M08486O88437Q83188R79967R93911
12594f058646R57938R01384Q33808P44616O15607M36388K14235k5919k50927m33117
12584b064633n60358o37258o77512o91686o78504o28259n38509m28247l33932
12575g238898k87822k97193l42007l91723m25659m39717m36844m14409l60526
12566a0634798k58494r2197J50064M71076Q58147J277260J673889J984714K158254
12557b412085K175503K058565J860517J641004J441049J269775J108591R29802
$$ plain form
12621 3088576 3708675 4268708 4688885 4900533 4856850 4538571 3951001 3118051 2080244
12612 2080244 895345 -366647 -1638900 -2877418 -4070721 -5229501 -6361400 -7447993
12604 -7447993 -8437870 -9257005 -9828167 -10090244 -10012635 -9604149 -8915712 -8032524 -7052557 -6058646
12594 -6058646 -5100708 -4199324 -3365516 -2620900 -2005293 -1568905 -1354670 -1380589 -1631516 -2064633
12584 -2064633 -2624991 -3262249 -3939761 -4631447 -5309951 -5938210 -6476719 -6904966 -7238898
12575 -7238898 -7526720 -7823913 -8165920 -8557643 -8983302 -9423019 -9859863 -10274272 -10634798
12566 -10634798 -10893292 -10985489 -10835425 -10364349 -9506202 -8228942 -6555053 -4570339 -2412085
12557 -2412085 -236582 1821983 3682500 5323504 6764553 8034328 9142919 10072721
12549A0072721P18252M81733K45583M0020j09615j86202j79488q5173R1023L27923
12539A1416777N90725Q41299J048436J191004J255645J234438J124761R30332
12531A9633417O62212L39490j0969l57071o67743r20829j105900j218190j250561
$$ plain form
12549 10072721 10790973 11272706 11518289 11558309 11448694 11262492 11083004 10997831 11088854 11416777
12539 11416777 12007502 12848801 13897237 15088241 16343886 17578324 18703085 19633417
12531 19633417 20295629 20635119 20624150 20267079 19599336 18678507 17572607 16354417 15103856
$$ [...]
##END NTUPLES=NMR SPECTRUM
##END=
