##TITLE=31P ikalashn
DE-77w
21.11.2024
##JCAMPDX= 6.0         $$ Bruker NMR JCAMP-DX V2.0
##DATA TYPE= NMR SPECTRUM
##DATA CLASS= NTUPLES
##ORIGIN= UXNMR, Bruker Analytische Messtechnik GmbH
##OWNER= root
$$ TOPSPIN		Version 1.3
$$ 2024-11-21 16:14:59.171 +0400  Irina@DPX200
$$ Compression mode = diff/dup
##.OBSERVE FREQUENCY= 81.01967998063
##.OBSERVE NUCLEUS= ^31P
##.ACQUISITION MODE= SIMULTANEOUS
##.ACQUISITION SCHEME= undefined
##.AVERAGES= 128
##.DIGITISER RES= 17
##SPECTROMETER/DATA SYSTEM= spect
##.PULSE SEQUENCE= zgpg
##.SOLVENT NAME= D2O
##.SHIFT REFERENCE= INTERNAL, D2O, 1, 298.5841
##AUDIT TRAIL= $$ (NUMBER, WHEN, WHO, WHERE, WHAT)
$$ ##TITLE= Audit trail, TOPSPIN		Version 1.3
$$ ##JCAMPDX= 5.01
$$ ##ORIGIN= Bruker BioSpin GmbH
$$ ##OWNER= Irina
$$ $$ F:/spectra/data/iren/nmr/P31dec/1/pdata/1/auditp.txt
$$ ##AUDIT TRAIL=  $$ (NUMBER, WHEN, WHO, WHERE, VERSION, WHAT)
(   1,<2024-11-21 16:14:40.671 +0400>,<Irina>,<DPX200>,<TOPSPIN 1.3>,
      <created by zg
	started at 2024-11-21 16:11:22.406 +0400,
	POWCHK disabled, PULCHK disabled
       configuration hash MD5:
       BE 6D 3F 07 2A EA 11 49 91 17 2B D3 AF B3 58 0D
       data hash MD5: 32K
       FC BD B7 18 39 1F 7A 59 B5 D6 4D 99 B6 45 E3 6A>)
(   2,<2024-11-21 16:14:41.953 +0400>,<Irina>,<DPX200>,<TOPSPIN 1.3>,
      <Start of raw data processing
       efp BC_mod = 2 LB = 18 FT_mod = 6 PKNL = 1 PHC0 = 194.7541 PHC1 = 57.6963 SI = 32K 
       data hash MD5: 32K
       43 AE 69 8D BA AC 98 7C A8 CB 82 5E B7 D8 7F 80>)
(   3,<2024-11-21 16:14:44.546 +0400>,<Irina>,<DPX200>,<TOPSPIN 1.3>,
      <apk 
       data hash MD5: 32K
       83 82 84 3F C9 CA 7B B4 F5 1A 56 9F 1F 1D E9 92>)
$$ ##END=
$$ 
$$ $$ hash MD5
$$ $$ 40 0F FB AB 17 21 E0 45 55 97 52 5D B9 61 F2 71
##$RELAX= 
##$RELAX= 
##$RELAX= 
##$RELAX= 
##$RELAX= 
##$RELAX= 
##$RELAX= 
##$RELAX= 
##$RELAX= 
##$RELAX= 
##$RELAX= 
$$ Bruker specific parameters
$$ --------------------------
##$DU= <F:/spectra>
##$EXPNO= 1
##$NAME= <P31dec>
##$PROCNO= 1
##$TYPE= <nmr>
##$USER= <iren>
##$AMP= (0..31)
100 100 100 100 100 100 100 100 100 100 100 100 100 100 100 100 100 100 
100 100 100 100 100 100 100 100 100 100 100 100 100 100 
##$ANAVPT= -1
##$AQSEQ= 0
##$AQ_mod= 1
##$AUNM= <au_zg>
##$AUTOPOS= <>
##$BF1= 81.014009
##$BF2= 200.13
##$BF3= 200.13
##$BF4= 200.13
##$BF5= 200.13
##$BF6= 200.13
##$BF7= 200.13
##$BF8= 200.13
##$BYTORDA= 1
##$CFDGTYP= 0
##$CFRGTYP= 5
##$CHEMSTR= <none>
##$CNST= (0..63)
1 1 145 1 1 1 1 1 1 1 1 1 1 1 1 1 1 1 1 1 1 1 1 1 1 1 1 1 1 1 1 1 1 1 
1 1 1 1 1 1 1 1 1 1 1 1 1 1 1 1 1 1 1 1 1 1 1 1 1 1 1 1 1 1 
##$CPDPRG= <waltz16>
##$CPDPRG1= <>
##$CPDPRG2= <waltz16>
##$CPDPRG3= <>
##$CPDPRG4= <mlev>
##$CPDPRG5= <mlev>
##$CPDPRG6= <mlev>
##$CPDPRG7= <mlev>
##$CPDPRG8= <mlev>
##$CPDPRGB= <>
##$CPDPRGT= <>
##$D= (0..63)
0 1 0 0 0 0 0 0 0 0.06 0 0.03 2e-005 3e-006 0 0 0.0002 0 0 0 0 0 0 0 0 
0 0 0 0 0 0 0 0 0 0 0 0 0 0 0 0 0 0 0 0 0 0 0 0 0 0 0 0 0 0 0 0 0 0 0 
0 0 0 0 
##$DATE= 1732191278
##$DBL= (0..7)
$$ [...]
0 1 3 0 0 0 0 0 0 0 0 0 0 0 0 0 
##$SW_h= 37037.037037037
##$TD= 32768
##$TD0= 1
##$TE= 300
##$TE2= 300
##$TE3= 300
##$TEG= 300
##$TL= (0..7)
0 120 53 12 22 120 120 120 
##$TP= (0..7)
150 150 150 150 150 150 150 150 
##$TP07= 0
##$TPNAME0= <>
##$TPNAME1= <>
##$TPNAME2= <>
##$TPNAME3= <>
##$TPNAME4= <>
##$TPNAME5= <>
##$TPNAME6= <>
##$TPNAME7= <>
##$TPOAL= (0..7)
0.5 0.5 0.5 0.5 0.5 0.5 0.5 0.5 
##$TPOFFS= (0..7)
0 0 0 0 0 0 0 0 
##$TUNHIN= 0
##$TUNHOUT= 0
##$TUNXOUT= 0
##$USERA1= <user>
##$USERA2= <user>
##$USERA3= <user>
##$USERA4= <user>
##$USERA5= <user>
##$V9= 5
##$VALIST= <valist>
##$VCLIST= <CCCCCCCCCCCCCCC>
##$VD= 0
##$VDLIST= <DDDDDDDDDDDDDDD>
##$VPLIST= <PPPPPPPPPPPPPPP>
##$VTLIST= <TTTTTTTTTTTTTTT>
##$WBST= 1024
##$WBSW= 4
##$XGAIN= (0..3)
0 0 0 0 
##$XL= 0
##$YL= 0
##$YMAX_a= 6830
##$YMIN_a= -5632
##$ZGOPTNS= <>
##$ZL1= 120
##$ZL2= 120
##$ZL3= 120
##$ZL4= 120
##$ABSF1= 0
##$ABSF2= 0
##$ABSG= 0
##$ABSL= 0
##$ALPHA= 0
##$AQORDER= 0
##$ASSFAC= 0
##$ASSFACI= 0
##$ASSFACX= 0
##$ASSWID= 0
##$AUNMP= <proc_1d>
##$AXLEFT= 0
##$AXRIGHT= 0
##$AXTYPE= 0
##$AXUNIT= <>
##$AZFE= 0.1
##$AZFW= 0.5
##$BCFW= 0
##$BC_mod= 2
##$BYTORDP= 0
##$COROFFS= 0
##$CY= 12.5935478210449
##$DATMOD= 1
##$DC= 0
##$DFILT= <>
##$DTYPP= 0
##$F1P= 47.1127640792319
##$F2P= -24.0371245302204
##$FCOR= 0.5
##$FTSIZE= 32768
##$FT_mod= 6
##$GAMMA= 0
##$GB= 0
##$INTBC= 1
##$INTSCL= 7.269226e-011
##$ISEN= 30
##$LB= 18
##$LEV0= 0
##$LPBIN= 0
##$MAXI= 12.09355
##$MC2= 0
##$MEAN= 0
##$ME_mod= 0
##$MI= 0.7550151
##$NCOEF= 0
##$NC_proc= -14
##$NLEV= 6
##$NOISF1= 298.5841
##$NOISF2= 270.0111
##$NSP= 0
##$NTH_PI= 0
##$NZP= 0
##$OFFSET= 298.5841
##$PC= 1.4
##$PHC0= 178.4125
##$PHC1= 167.9563
##$PH_mod= 1
##$PKNL= yes
##$PPARMOD= 0
##$PPDIAG= 0
##$PPIPTYP= 0
##$PPMPNUM= 100
##$PPRESOL= 1
##$PSCAL= 0
##$PSIGN= 0
##$REVERSE= no
##$SF= 81.014009
##$SI= 32768
##$SIGF1= 270.0111
##$SIGF2= -158.5842
##$SINO= 77.54984
##$SIOLD= 32768
##$SREGLST= <31P.CDCl3>
##$SSB= 0
##$STSI= 32768
##$STSR= 0
##$SW_p= 37037.037037037
##$SYMM= 0
##$S_DEV= 0
##$TDeff= 32768
##$TDoff= 0
##$TI= <>
##$TILT= no
##$TM1= 0
##$TM2= 0
##$TOPLEV= 0
##$USERP1= <user>
##$USERP2= <user>
##$USERP3= <user>
##$USERP4= <user>
##$USERP5= <user>
##$WDW= 1
##$XDIM= 32768
##$YMAX_p= 379391951
##$YMIN_p= -27585807
$$ End of Bruker specific parameters
$$ ---------------------------------
##NTUPLES= NMR SPECTRUM
##VAR_NAME=  FREQUENCY,     SPECTRUM/REAL,   SPECTRUM/IMAG
##SYMBOL=    X,             R,               I
##VAR_TYPE=  INDEPENDENT,   DEPENDENT,       DEPENDENT
##VAR_FORM=  AFFN,          ASDF,            ASDF
##VAR_DIM=   32768,         32768,           32768
##UNITS=     HZ,            ARBITRARY UNITS, ARBITRARY UNITS
##FACTOR=    1.13031516577767, 1,            1
##FIRST=     37037.037037037, 35010477,      62222761
##LAST=      0,             -3568122,        69568769
##MIN=       0,             -27585807,       0
##MAX=       37037.037037037, 379391951,     0
$$ Real data points
##PAGE= N=1
##DATA TABLE= (X++(R..R)), XYDATA
$$ [...]
$$ plain form
16608 37469175 35484789 34137765 33543210 33772093 34841257 36716370 39317084 42517054
16600 42517054 46146029 50006208 53906027 57701073 61321371 64764452 68050512 71162257
16592 71162257 74007280 76429465 78264551 79407435 79853714 79695680 79079193 78145674 76986733
16583 76986733 75632430 74079254 72339165 70472249 68576365 66743459 65018809 63391763
16575 63391763 61817051 60245152 58641747 56989410 55277188 53491570 51621679 49680177
16567 49680177 47726809 45875753 44275099 43062978 42320692 42047132 42165633 42553302 43072277
16558 43072277 43591397 44002144 44234376 44266652 44122236 43852209 43516293 43168821 42849627
16549 42849627 42578798 42357098 42172184 42007501 41852667 41717450 41648607 41740088 42122047 42922361
$$ packed form
16608C7469175j984386j347024n94555K28883J069164J875113K600714L199970
16600D2517054L628975L860179L899819L795046L620298L443081L286060L111745
16592G1162257K845023K422185J835086J142884M46279j58034o16487r33519j158941
16583G6986733j354303j553176j740089j866916j895884j832906j724650j627046
16575F3391763j574712j571899j603405j652337j712222j785618j869891j941502
16567D9680177j953368j851056j600654j212121p42286k73560J18501L87669N18975
16558D3072277N19120M10747K32232L2276j44416k70027l35916l47472l19194
16549D2849627k70829k21700j84914j64683j54834j35217o8843R1481L81959Q00314
$$ plain form
16539 42922361 44213099 45968493 48057819 50278395 52414505 54297459 55841758 57043035
16531 57043035 57945136 58602703 59063601 59374403 59594297 59800968 60079723 60496134 61061676
16522 61061676 61710584 62306801 62685522 62711437 62324454 61552663 60491395 59262619 57975378
16513 57975378 56703732 55485218 54331218 53239215 52202444 51217211 50286846 49416315
16505 49416315 48594420 47774390 46871673 45786463 44437969 42787736 40837522 38605749
16497 38605749 36102597 33325024 30277339 27003529 23608779 20254234 17125408 14388404
16489 14388404 12150438 10435487 9181189 8258442 7505694 6763705 5903948 4854703 3625152
16480 3625152 2314298 1090120 142535 -366858 -335823 271767 1434698 3088268 5136351
$$ packed form
16539D2922361J290738J755394K089326K220576K136110J882954J544299J201277
16531E7043035R02101O57567M60898L10802K19894K06671K78755M16411N65542
16522F1061676O48908N96217L78721K5915l86983p71791j061268j228776j287241
16513E7975378j271646j218514j154000j092003j036771r85233r30365q70531
16505D9416315q21895q20030r02717j085210j348494j650233j950214k231773
16497C8605749k503152k777573l047685l273810l394750l354545l128826k737004
16489A4388404k237966j714951j254298r22747p52748p41989q59757j049245j229551
16480C625152j310854j224178r47585n09393L1035O07590J162931J653570K048083
$$ plain form
16471 5136351 7458079 9909150 12320345 14496546 16219889 17261821 17411084 16525944
16463 16525944 14609357 11879720 8785420 5919897 3846965 2914452 3156053 4323565
16455 4323565 6007022 7768272 9240242 10179576 10477088 10137856 9250566 7965725 6485360
16446 6485360 5047229 3890041 3209762 3130504 3703622 4930215 6790786 9263148 12317535
16437 12317535 15894535 19882547 24107147 28335292 32295042 35713171 38368690 40147938
16429 40147938 41076060 41303720 41050576 40535889 39935173 39375208 38944727 38694740 38630326
16420 38630326 38715068 38897087 39140712 39440404 39810209 40263955 40807043 41445807 42200775
16411 42200775 43104933 44182856 45426377 46785606 48179498 49517186 50718482 51722947
$$ packed form
16471E136351K321728K451071K411195K176201J723343J041932J49263q85140
16463A6525944j916587k729637l094300k865523k072932r32513K41601J167512
16455D323565J683457J761250J471970R39334K97512l39232q87290j284841j480365
16446F485360j438131j157188o80279p9258N73118J226593J860571K472362L054387
16437A2317535L577000L988012M224600M228145L959750L418129K655519J779248
16429D0147938R28122K27660k53144n14687o00716n59965m30481k49987o4414
16420C8630326Q4742J82019K43625K99692L69805M53746N43088O38764P54968
16411D2200775R04158J077923J243521J359229J393892J337688J201296J004465
$$ plain form
16403 51722947 52481601 52938902 53025603 52677211 51867703 50629371 49038646 47175388 45082626
16394 45082626 42750109 40128316 37166665 33862082 30294922 26625822 23045601 19705729
16386 19705729 16677661 13969601 11582196 9554406 7966922 6912334 6464044 6664384
16378 6664384 7527996 9044927 11174999 13839400 16919969 20266782 23706282 27048597
16370 27048597 30102848 32704042 34740358 36165866 36994568 37283084 37112591 36577339 35781116
16361 35781116 34838570 33877695 33039777 32470649 32298810 32607408 33417283 34692532 36361522
16352 36361522 38335294 40513960 42787761 45042045 47165034 49051562 50602086 51723751
16344 51723751 52339885 52405668 51918323 50912427 49445925 47591597 45440494 43110771 40749501
$$ packed form
16403E1722947P58654M57301Q6701l48392q09508j238332j590725j863258k092762
16394D5082626k332517k621793k961651l304583l567160l669100l580221l339872
16386A9705729l028068k708060k387405k027790j587484j054588m48290K00340
16378F664384Q63612J516931K130072K664401L080569L346813L439500L342315
16370B7048597L054251K601194K036316J425508Q28702K88516j70493n35252p96223
16361C5781116r42546r60875q37918n69128j71839L08598Q09875J275249J668990
16352C6361522J973772K178666K273801K254284K122989J886528J550524J121665
16344E1723751O16134O5783m87345j005896j466502j854328k151103k329723k361270
$$ plain form
16335 40749501 38516748 36551478 34934322 33667567 32682357 31868589 31114208 30337787 29502212
16326 29502212 28607532 27672982 26724507 25798137 24954500 24289145 23926357 23996033 24603668
16317 24603668 25806232 27601511 29929997 32684320 35722933 38885683 42006176 44917480
16309 44917480 47457134 49482767 50898788 51678114 51862851 51545166 50841643 49871464 48742123
16300 48742123 47545387 46364930 45290760 44428783 43895249 43794752 44190373 45079492 46386024
16291 46386024 47971513 49659822 51266487 52624493 53601543 54107588 54093631 53544031 52466373
16282 52466373 50883761 48830836 46351328 43498000 40339769 36975284 33541605 30206026
16274 30206026 27141940 24503197 22412793 20969656 20261382 20364815 21326340 23130733
$$ packed form
16335D0749501k232753j965270j617156j266755r85210q13768p54381p76421q35575
16326B9502212q94680r34550r48475r26370q43637o65355l62788O9676O07635
16317B4603668J202564J795279K328486K754323L038613L162750L120493K911304
16309D4917480K539654K025633J416021P79326J84737l17685p03523r70179j129341
16300D8742123j196736j180457j074170q61977n33534j00497L95621Q89119J306532
16291D6386024J585489J688309J606665J358006R77050N06045j3957n49600j077658
16282E2466373j582612k052925k479508k853328l158231l364485l433679l335579
16274C0206026l064086k638743k090404j443137p08274J03433R61525J804393
$$ plain form
16266 23130733 25678839 28793901 32262033 35888608 39537611 43132682 46627523 49972519
16258 49972519 53100158 55933706 58405577 60466042 62074975 63189838 63769630 63795747
16250 63795747 63286661 62286823 60840009 58974741 56714121 54098016 51199842 48130793
16242 48130793 45033024 42062939 39363894 37034546 35109691 33567162 32355339 31421729
16234 31421729 30727316 30244196 29942273 29773388 29660240 29493935 29142348 28473593 27395966
16225 27395966 25903535 24105366 22218203 20518357 19269574 18655721 18742800 19480023 20734202
16216 20734202 22339306 24137435 25996313 27808558 29488275 30971063 32213156 33189935
16208 33189935 33900545 34378863 34698682 34959163 35249654 35611593 36023754 36423391 36747696
$$ packed form
16266B3130733K548106L115062L468132L626575L649003L595071L494841L344996
16258D9972519L127639K833548K471871K060465J608933J114863N79792K6117
16250F3795747n09086r99838j446814j865268k260620k616105k898174l069049
16242D8130793l097769k970085k699045k329348j924855j542529j211823r33610
16234C1421729o94413m83120l01923j68885j13148j66305l51587o68755j077627
16225B7395966j492431j798169j887163j699846j248783o13853Q7079P37223J254179
16216B0734202J605104J798129J858878J812245J679717J482788J242093R76779
16208C3189935P10610M78318L19819K60481K90491L61939M12161L99637L24305
$$ plain form
16199 36747696 36964430 37073851 37089987 37020889 36859778 36587451 36181882 35630873 34943937 34160075
16189 34160075 33349144 32605697 32035723 31737367 31776029 32155682 32795036 33524732 34118822
16180 34118822 34356292 34088011 33278054 32000533 30397360 28625012 26820770 25097889
16172 25097889 23557001 22296953 21416679 21006085 21126974 21790908 22946209 24482282 26247817
16163 26247817 28072550 29786810 31240442 32321716 32970577 33180561 32992494 32488705 31788692
16154 31788692 31036444 30373719 29910167 29708143 29787251 30135943 30715161 31453282 32246318
16145 32246318 32974982 33534602 33864352 33966171 33909260 33815860 33826354 34054419 34554095 35313530
16135 35313530 36270522 37334096 38401510 39370265 40149278 40672118 40910047 40876347 40613754
$$ packed form
16199C6747696K16734J09421J6136o9098j61111k72327m05569n51009o86936p83862
16189C4160075q10931p43447n69974k98356L8662L79653O39354P29696N94090
16180C4118822K37470k68281q09957j277521j603173j772348j804242j722881
16172B5097889j540888j260048q80274m10594J20889O63934J155301J536073J765535
16163B6247817J824733J714260J453632J081274O48861K09984j88067n03789p00013
16154C1788692p52248o62725m63552k02024P9108L48692N79218P38121P93036
16145C2246318P28664N59620L29750J01819n6911r3400J0494K28065M99676P59435
16135C5313530R56992J063574J067414R68755P79013N22840K37929l3700k62593
$$ plain form
16126 40613754 40167578 39559258 38777186 37791047 36581482 35169409 33630401 32084872 30665640
16117 30665640 29479234 28583349 27990958 27691600 27672106 27927696 28464618 29295233 30423229
16108 30423229 31821950 33417281 35085694 36669831 38010101 38988826 39574056 39840577
16100 39840577 39952554 40113626 40505874 41239705 42329610 43701573 45225985 46759520 48178096
16091 48178096 49391845 50345595 51015080 51404623 51542865 51471531 51230794 50852455 50367593
16082 50367593 49820528 49271724 48782272 48392116 48109650 47916275 47774528 47628810 47399614
16073 47399614 46982533 46264906 45164420 43677259 41909554 40068073 38406460 37149228
16065 37149228 36429538 36267964 36592498 37276497 38170345 39120745 39985440 40648091 41029010
$$ packed form
16126D0613754m46176o08320p82072r86139j209565j412073j539008j545529j419232
16117C0665640j186406q95885n92391k99358j9494K55590N36922Q30615J127996
16108C0423229J398721J595331J668413J584137J340270R78725N85230K66521
16100C9840577J11977J61072L92248P33831J089905J371963J524412J533535J418576
16091D8178096J213749R53750O69485L89543J38242p1334k40737l78339m84862
16082E0367593n47065n48804m89452l90156k82466j93375j41747j45718k29196
16073D7399614m17081p17627j100486j487161j767705j841481j661613j257232
16065C7149228p19690j61574L24534O83999Q93848R50400Q64695O62651L80919
$$ plain form
16056 41029010 41087083 40814480 40228862 39366505 38278313 37030512 35709671 34426299 33306932
16047 33306932 32468581 31982840 31847965 31983787 32251526 32490141 32556183 32355325 31859868
16038 31859868 31111635 30209893 29284255 28457212 27807213 27347797 27035082 26800303 26586195
16029 26586195 26364506 26128244 25870261 25566337 25175407 24658393 24006606 23263993 22527343
16020 22527343 21917804 21533075 21403574 21478521 21653718 21826719 21947343 22038713 22186422 22508395
16010 22508395 23118361 24092313 25445137 27120641 28994758 30894130 32633397 34065110
16002 34065110 35121886 35827057 36264608 36522904 36643189 36600305 36321014 35723327 34756539
15993 34756539 33432277 31843901 30167701 28636929 27491714 26925670 27051622 27890415
$$ packed form
16056D1029010N8073k72603n85618q62357j088192j247801j320841j283372j119367
16047C3306932q38351m85741j34875J35822K67739K38615O6042k00858m95457
16038C1859868p48233r01742r25638q27043o49999m59416l12715k34779k14108
16029B6586195k21689k36262k57983l03924l90930n17014o51787p42613p36650
16020B2527343o09539l84729j29501P4947J75197J73001J20624R1370J47709L21973
16010B2508395O09966R73952J352824J675504J874117J899372J739267J431713
16002C4065110J056776P05171M37551K58296J20285m2884k79291n97687r66788
15993C4756539j324262j588376j676200j530772j145215n66044J25952Q38793
$$ plain form
15985 27890415 29371478 31338610 33567025 35797941 37785564 39340943 40354865 40790493
15977 40790493 40655048 39975136 38794647 37191662 35295501 33288701 31389514 29817188
15969 29817188 28748719 28283928 28435158 29143656 30309443 31819464 33566573 35458258
15961 35458258 37416872 39376311 41282082 43098052 44815191 46453349 48051689 49651579
15953 49651579 51278553 52927316 54552658 56071941 57383326 58393167 59037051 59283453
15945 59283453 59121609 58544868 57544030 56120217 54312967 52225268 50025768 47922598
15937 47922598 46122514 44796574 44063960 43991522 44598968 45857341 47672298 49859620 52140430
15928 52140430 54182620 55682759 56447024 56427953 55707111 54447307 52844342 51092628 49363413
$$ packed form
15985B7890415J481063J967132K228415K230916J987623J555379J013922M35628
15977D0790493j35445o79912j180489j602985j896161k006800j899187j572326
15969B9817188j068469m64791J51230P08498J165787J510021J747109J891685
15961C5458258J958614J959439J905771J815970J717139J638158J598340J599890
15953D9651579J626974J648763J625342J519283J311385J009841O43884K46402
15945E9283453j61844n76741j000838j423813j807250k087699k199500k103170
15937D7922598j800084j325940p32614p2438O07446J258373J814957K187322K280810
15928E2140430K042190J500139P64265j9071p20842j259804j602965j751714j729215
$$ plain form
15919 49363413 47790663 46463837 45429345 44698989 44258182 44065958 44047381 44091314 44066892
15910 44066892 43856289 43384213 42622968 41569305 40213266 38527825 36491493 34128772
15902 34128772 31540094 28902659 26443288 24396909 22964325 22277548 22378587 23217323
15894 23217323 24669770 26569375 28737767 31003414 33207478 35207538 36889028 38181751
15886 38181751 39069611 39586273 39801313 39806697 39708519 39621657 39660970 39922978 40458713 41248529
15876 41248529 42194315 43138511 43906578 44357532 44421433 44108185 43488064 42658884 41716895
15867 41716895 40740054 39783328 38881960 38057108 37318875 36668000 36102498 35628865 35267820
15858 35267820 35049207 35003846 35163418 35569751 36284651 37389279 38967798 41079543 43731740
$$ packed form
15919D9363413j572750j326826j034492p30356m40807j92224j8577M3933k4422
15910D4066892k10603m72076p61245j053663j356039j685441k036332k362721
15902C4128772k588678k637435k459371k046379j432584o86777J01039Q38736
15894B3217323J452447J899605K168392K265647K204064K000060J681490J292723
15886C8181751Q87860N16662K15040N384r8178q6862L9313K62008N35735P89816
15876D1248529R45786R44196P68067M50954O3901l13248o20121q29180r41989
15867D1716895r76841r56726r01368q24852p38233o50875n65502m73633l61045
15858C5267820k18613m5361J59572M06333P14900J104628J578519K111745K652197
$$ plain form
15849 43731740 46864649 50352993 54020544 57665699 61097348 64172860 66820327 69031796
15841 69031796 70833779 72256542 73319309 74030929 74393679 74403323 74051355 73335262 72268115
15832 72268115 70872430 69158218 67105388 64672469 61834799 58633229 55206384 51789382
15824 51789382 48678024 46169218 44496191 43781192 44020739 45100316 46824465 48953140
15816 48953140 51242616 53487489 55553503 57389392 59011794 60466658 61780697 62924182
15808 62924182 63803891 64288988 64254964 63625313 62397465 60648482 58522435 56206354 53903782
15799 53903782 51810433 50088764 48839008 48075927 47728727 47671894 47772652 47927599 48071596
15790 48071596 48166120 48186661 48119198 47961066 47718778 47400957 47008978 46531517 45951780 45270735
$$ packed form
15849D3731740L132909L488344L667551L645155L431649L075512K647467K211469
15841F9031796J801983J422763J062767P11620L62750R644l51968p16093j067147
15832G2268115j395685j714212k052830k432919k837670l201570l426845l417002
15824E1789382l111358k508806j673027p14999K39547J079577J724149K128675
15816D8953140K289476K244873K066014J835889J622402J454864J314039J143485
15808F2924182Q79709M85097l4024o29651j227848j748983k126047k316081k302572
15799E3903782k093349j721669j249756p63081l47200n6833J00758J54947J43997
15790D8071596R4524K0541o7463j58132k42288l17821l91979m77461n79737o81045
$$ plain form
15780 45270735 44534527 43841950 43316146 43052438 43074259 43321574 43673630 43992897 44172690
15771 44172690 44170379 44014507 43789524 43612520 43611550 43904421 44574625 45648815 47086796 48790812
15761 48790812 50628792 52459996 54156488 55620538 56797105 57676136 58281381 58650096
15753 58650096 58813915 58791258 58593405 58233844 57728199 57084511 56294800 55336340 54182723
15744 54182723 52819699 51257258 49528158 47671783 45716655 43676981 41563562 39394917
15736 39394917 37197060 34994182 32801240 30626642 28484685 26410198 24466169 22740498
15728 22740498 21335136 20352363 19879585 19972950 20643591 21852703 23517439 25521588 27723481
15719 27723481 29961440 32065198 33880887 35307905 36334321 37052164 37640399 38318690
$$ packed form
15780D5270735p36208o92577n25804k63708K1821K47315L52056L19267J79793
15771D4172690k311j55872k24983j77004r70K92871O70204J074190J437981J704016
15761D8790812J837980J831204J696492J464050J176567Q79031O05245L68715
15753E8650096J63819k2657j97853l59561n05645o43688p89711r58460j153617
15744E4182723j363024j562441j729100j856375j955128k039674k113419k168645
15736C9394917k197857k202878k192942k174598k141957k074487j944029j725671
15728B2740498j405362r82773m72778R3365O70641J209112J664736K004149K201893
15719B7723481K237959K103758J815689J427018J026416P17843N88235O78291
$$ plain form
15711 38318690 39289364 40689047 42562902 44861380 47452623 50143846 52706231 54899811
15703 54899811 56499818 57329285 57297176 56429220 54873088 52869848 50700871 48627670 46840782
15694 46840782 45432020 44400200 43686123 43215903 42930643 42796192 42800720 42949212 43259070
15685 43259070 43757397 44476952 45445647 46669318 48117741 49727119 51420661 53133175
15677 53133175 54823784 56473357 58073700 59615425 61077251 62418023 63575078 64474135
15669 64474135 65050066 65267099 65124580 64646650 63868181 62828491 61571679 60146626 58606367
15660 58606367 57011400 55435543 53965276 52686248 51663052 50925164 50465130 50245717
15652 50245717 50210174 50289995 50406770 50471468 50389677 50076756 49478466 48589024 47456866 46168918
$$ packed form
15711C8318690R70674J399683J873855K298478K591243K691223K562385K193580
15703E4899811J600007Q29467l2109q67956j556132k003240k168977k073201j786888
15694D6840782j408762j031820p14077m70220k85260j34451M528J48492L09858
15685D3259070M98327P19555R68695J223671J448423J609378J693542J712514
15677E3133175J690609J649573J600343J541725J461826J340772J157055Q99057
15669F4474135N75931K17033j42519m77930p78469j039690j256812j425053j540259
15660E8606367j594967j575857j470267j279028j023196p37888m60034k19413
15652E0245717l5543P9821J16775O4698q1791l12921n98290q89442j132158j287948
$$ plain form
15642 46168918 44815350 43454262 42098878 40730820 39323013 37855897 36324507 34742038
15634 34742038 33142971 31584176 30140941 28895589 27918871 27249603 26883200 26776673 26866268
15625 26866268 27085816 27377548 27695444 28004378 28276753 28487746 28611631 28623718 28512106
15616 28512106 28296865 28045351 27872229 27922626 28344721 29257193 30716539 32694735 35079436
15607 35079436 37699756 40367301 42915344 45222677 47218052 48868582 50158871 51069262
15599 51069262 51563752 51597534 51143383 50218764 48891790 47262345 45433744 43491077 41493077
15590 41493077 39479604 37492827 35599796 33897952 32496495 31486227 30916091 30782440
15582 30782440 31024820 31522659 32096204 32520439 32556844 31996797 30701322 28624437 25818347
$$ packed form
15642D6168918j353568j361088j355384j368058j407807j467116j531390j582469
15634C4742038j599067j558795j443235j245352r76718o69268l66403j06527Q9595
15625B6866268K19548K91732L17896L08934K72375K10993J23885J2087j11612
15616B8512106k15241k51514j73122N0397M22095R12472J459346J978196K384701
15607C5079436K620320K667545K548043K307333J995375J650530J290289R10391
15599E1069262M94490L3782m54151r24619j326974j629445j828601j942667j998000
15590D1493077k013473j986777j893031j701844j401457j010268n70136j33651
15582C0782440K42380M97839N73545M24235L6405n60047j295475k076885k806090
$$ plain form
15573 25818347 22424982 18655396 14755063 10958451 7447969 4336480 1678389 -506792
15565 -506792 -2219103 -3476706 -4318565 -4800107 -4979261 -4897741 -4564342 -3945894 -2970000
15556 -2970000 -1541357 430857 3002400 6170189 9862153 13942359 18229035 22518936
15548 22518936 26609346 30315448 33491562 36064490 38070287 39668646 41113346 42682327
15540 42682327 44595097 46951149 49712242 52733557 55828108 58831328 61634062 64178139
15532 64178139 66436083 68399811 70084005 71531184 72803806 73962079 75038997 76025844
15524 76025844 76873140 77501643 77814254 77706511 77081983 75877709 74094650 71817345 69203665
15515 69203665 66439217 63677735 61005589 58453737 56041660 53810834 51819277 50111249
$$ packed form
15573B5818347l393365l769586l900333l796612l510482l111489k658091k185181
15565e06792j712311j257603q41859m81542j79154Q1520L33399O18448R75894
15556b970000J428643J972214K571543L167789L691964M080206M286676M289901
15548B2518936M090410L706102L176114K572928K005797J598359J444700J568981
15540D2682327J912770K356052K761093L021315L094551L003220K802734K544077
15532F4178139K257944J963728J684194J447179J272622J158273J076918R86847
15524G6025844Q47296O28503L12611j07743o24528j204274j783059k277305k613680
15515F9203665k764448k761482k672146k551852k412077k230826j991557j708028
$$ plain form
15507 50111249 48700759 47586912 46778890 46295890 46135487 46240713 46502201 46800671 47057987
15498 47057987 47259186 47436888 47640392 47915026 48298177 48821278 49505350 50349867 51327884
15489 51327884 52397897 53525551 54697506 55918186 57194124 58514583 59835520 61074079
15481 61074079 62118081 62847736 63162507 63005460 62377222 61333764 59968160 58381997 56654952
15472 56654952 54822843 52873534 50763194 48445775 45903454 43167207 40321418 37491893
15464 37491893 34822024 32445752 30466949 28950487 27921222 27362466 27213241 27373951
15456 27373951 27726862 28163418 28603656 29001824 29343580 29640171 29918643 30206670 30517133
15447 30517133 30841591 31156277 31434516 31655993 31808253 31882526 31868576 31752059 31517607 31161647
$$ packed form
15507E0111249j410490j113847q08022m83000j60403J05226K61488K98470K57316
15498D7057987K01199J77702K03504K74634L83151N23101O84072Q44517R78017
15489E1327884J070013J127654J171955J220680J275938J320459J320937J238559
15481F1074079J044002P29655L14771j57047o28238j043458j365604j586163j727045
15472E6654952j832109j949309k110340k317419k542321k736247k845789k829525
15464C7491893k669869k376272j978803j516462j029265n58756j49225J60710
15456B7373951L52911M36556M40238L98168L41756K96591K78472K88027L10463
15447C0517133L24458L14686K78239K21477J52260P4273j3950j16517k34452l55960
$$ plain form
15437 31161647 30713614 30253389 29909465 29833338 30160332 30973644 32286863 34052445 36189124
15428 36189124 38608819 41226653 43953372 46681630 49278507 51592285 53476448 54824119
15420 54824119 55595407 55822645 55594143 55027978 54244352 53340145 52371382 51350473 50258908
15411 50258908 49068096 47758660 46332284 44816508 43265056 41751394 40351263 39118380
15403 39118380 38065861 37162586 36344781 35538733 34688351 33776842 32830809 31904203 31052200
15394 31052200 30308025 29669242 29095715 28522015 27883239 27143280 26308186 25413026 24488289
15385 24488289 23529368 22493159 21325154 19996882 18528933 16989030 15471376 14071846
15377 14071846 12872952 11943288 11343027 11122726 11313155 11915620 12901172 14217704 15800918
$$ packed form
15437C1161647m48033m60225l43924p6127L26994Q13312J313219J765582K136679
15428C6189124K419695K617834K726719K728258K596877K313778J884163J347671
15420E4824119P71288K27238k28502n66165p83626r04207r68763j020909j091565
15411E0258908j190812j309436j426376j515776j551452j513662j400131j232883
15403C9118380j052519r03275q17805q06048q50382r11509r46033r26606q52003
15394C1052200p44175o38783n73527n73700o38776p39959q35094q95160r24737
15385B4488289r58921j036209j168005j328272j467949j539903j517654j399530
15377A4071846j198894r29664o00261k20301J90429O02465R85552J316532J583214
$$ plain form
15368 15800918 17589939 19547185 21670923 23986410 26519002 29270996 32218692 35325307
15360 35325307 38554705 41876682 45264253 48688536 52117370 55520907 58880735 62192652
15352 62192652 65454469 68641044 71680164 74443370 76756771 78429576 79295821 79261354
15344 79261354 78342649 76681933 74528037 72184004 69937804 68000953 66472480 65331703
15336 65331703 64458247 63678048 62825290 61797068 60577846 59228857 57858108 56590503
15328 56590503 55544551 54811717 54437623 54410758 54663178 55082367 55530422 55865084 55956425
15319 55956425 55696119 55001807 53822567 52150348 50036741 47605592 45046542 42581824
15311 42581824 40416795 38698513 37502970 36853203 36752523 37211220 38251574 39889215
$$ packed form
15368A5800918J789021J957246K123738K315487K532592K751994K947696L106615
15360C5325307L229398L321977L387571L424283L428834L403537L359828L311917
15352F2192652L261817L186575L039120K763206K313401J672805Q66245l4467
15344G9261354r18705j660716k153896k344033k246200j936851j528473j140777
15336F5331703q73456p80199q52758j028222j219222j348989j370749j267605
15328E6590503j045952p32834l74094k6865K52420M19189M48055L34662R1341
15319E5956425k60306o94312j179240j672219k113607k431149k559050k464718
15311D2581824k165029j718282j195543o49767j00680M58697J040354J637641
$$ plain form
15303 39889215 42103369 44816890 47902378 51213908 54625521 58051346 61435188 64719795
15295 64719795 67818883 70610680 72958121 74746727 75922326 76510796 76610619 76362046 75907477
15286 75907477 75359292 74782330 74188681 73542825 72778230 71819003 70591341 69019874 67025467
15277 67025467 64544089 61564686 58162431 54503957 50819497 47354341 44317551 41843616
15269 41843616 39978652 38695662 37931447 37627105 37752089 38300525 39265019 40608403 42253743
15260 42253743 44095603 46018000 47903876 49633391 51079367 52111047 52612350 52511522
15252 52511522 51810327 50596754 49029527 47297898 45576973 43999279 42646891 41555924
15244 41555924 40728158 40151213 39826402 39794419 40141977 40975765 42368493 44305958 46669778
$$ packed form
15303C9889215K214154K713521L085488L311530L411613L425825L383842L284607
15295F4719795L099088K791797K347441J788606J175599N88470R9823k48573m54569
15286G5907477n48185n76962n93649o45856p64595r59227j227662j571467j994407
15277F7025467k481378k979403l402255l658474l684460l465156l036790k473935
15269D1843616j864964j282990p64215l04342J24984N48436R64494J343384J645340
15260D2253743J841860J922397J885876J729515J445976J031680N01303j00828
15252E2511522p01195j213573j567227j731629j720925j577694j352388j090967
15244D1555924q27766n76945l24811l1983L47558Q33788J392728J937465K363820
$$ plain form
15235 46669778 49266999 51887085 54357382 56580348 58547523 60326906 62023972 63730353
15227 63730353 65485265 67267373 69012572 70635898 72039494 73110077 73725248 73779908
15219 73779908 73222732 72082312 70469007 68549693 66501825 64461643 62487276 60555819
15211 60555819 58600132 56569210 54478512 52420369 50531655 48943849 47744855 46964848
15203 46964848 46581486 46534304 46739631 47100127 47505924 47830617 47935213 47695917 47054771
15194 47054771 46065802 44901496 43807045 43024023 42721789 42964740 43719217 44885358 46335855
15185 46335855 47950456 49641311 51365243 53117797 54906584 56711314 58449951 59973806
15177 59973806 61102039 61683238 61654207 61066555 60069572 58862038 57640142 56562808 55737452
$$ packed form
15235D6669778K597221K620086K470297K222966J967175J779383J697066J706381
15227F3730353J754912J782108J745199J623326J403596J070583O15171N4660
15219G3779908n57176j140420j613305j919314k047868k040182j974367j931457
15211F0555819j955687k030922k090698k058143j888714j587806j198994p80007
15203D6964848l83362m7182K05327L60496M05797L24693J04596k39296o41146
15194D7054771r88969j164306j094451p83022l02234K42951P54477J166141J450497
15185D6335855J614601J690855J723932J752554J788787J804730J738637J523855
15177E9973806J128233N81199k9031n87652r96983j207534j221896j077334q25356
$$ plain form
15168 55737452 55217046 55001590 55046378 55281569 55636494 56053141 56483493 56883461 57217194
15159 57217194 57468402 57644517 57770104 57881214 58027005 58266231 58645316 59167510 59780333
15150 59780333 60399547 60960305 61463086 61982968 62635636 63521395 64677030 66054758 67533073
15141 67533073 68953054 70164118 71059001 71585035 71733376 71517587 70953392 70047826 68802918
15132 68802918 67233729 65390516 63368182 61293973 59300608 57498773 55956531 54686603
15124 54686603 53643822 52738251 51865691 50947461 49963305 48960956 48035563 47289421 46796526
15115 46796526 46593706 46699189 47137058 47943289 49147944 50748701 52694690 54887851 57195814
15106 57195814 59465828 61535060 63241755 64445142 65055207 65061606 64545435 63665035 62620695
$$ packed form
15168E5737452n20406k15456M4788K35191L54925M16647M30352L99968L33733
15159E7217194K51208J76115J25587J11110J45791K39226L79085N22194O12823
15150E9780333O19214N60758N02781N19882O52668Q85759J155635J377728J478315
15141F7533073J419981J211064Q94883N26034J48341k15789n64195r05566j244908
15132F8802918j569189j843213k022334k074209j993365j801835j542242j269928
15124E4686603j042781r05571q72560r18230r84156j002349r25393p46142m92895
15115D6796526k02820J05483M37869Q06231J204655J600757J945989K193161K307963
15106E7195814K270014K069232J706695J203387O10065O399n16171q80400j044340
$$ plain form
15097 62620695 61610799 60790856 60244280 59973255 59913567 59966133 60030013 60024131 59893446 59603490
15087 59603490 59132515 58469427 57618884 56609625 55500998 54381119 53349499 52484776 51812173
15078 51812173 51290838 50830264 50326923 49703484 48938092 48077836 47230900 46534282 46106870
15069 46106870 46009640 46229731 46688820 47267532 47839546 48307884 48627911 48802235 48850114 48772867
15059 48772867 48538932 48097819 47412918 46491614 45396409 44238094 43162039 42332006 41907295
15050 41907295 42013632 42718032 44018331 45849158 48096622 50611575 53219323 55734267
15042 55734267 57986538 59854419 61288004 62313821 63017552 63507339 63868180 64125701 64235107
15033 64235107 64098760 63603524 62663138 61250363 59409456 57251255 54939090 52667559
$$ packed form
15097F2620695j009896q19943n46576k71025n9688N2566O3880n882j30685k89956
15087E9603490m70975o63088q50543j009259j108627j119879j031620q64723o72603
15078E1812173n21335m60574n03341o23439p65392q60256q46936o96618m27412
15069D6106870r7230K20091M59089N78712N72014M68338L20027J74324M7879p7247
15059D8772867k33935m41113o84901r21304j095205j158315j076055q30033m24711
15050D1907295J06337P04400J300299J830827K247464K514953K607748K514944
15042E5734267K252271J867881J433585J025817P03731M89787L60841K57521J09406
15033F4235107j36347m95236r40386j412775j840907k158201k312165k271531
$$ plain form
15025 52667559 50630544 48981954 47802966 47087988 46751485 46652145 46629720 46545627 46314087
15016 46314087 45916220 45399648 44867074 44451131 44274329 44404409 44825532 45444720 46137076
15007 46137076 46808135 47436592 48072602 48797242 49670788 50696657 51812646 52908589 53865077
14998 53865077 54602919 55124432 55525757 55971547 56642018 57675349 59129037 60971993 63102794
14989 63102794 65379564 67646576 69749348 71541421 72894886 73723261 74011196 73834724
14981 73834724 73358196 72804661 72405040 72337432 72675239 73365127 74244054 75086156 75660916
14972 75660916 75786609 75367981 74409660 73001919 71286702 69421224 67553139 65808509
14964 65808509 64286253 63055390 62156111 61605785 61407851 61557725 62039895 62817569 63824476
$$ packed form
15025E2667559k037015j648590j178988p14978l36503r9340k2425q4093k31540
15016D6314087l97867n16572n32574m15943j76802J30080M21123O19188O92356
15007D6137076O71059O28457O36010P24640Q73546J025869J115989J095943R56488
14998E3865077P37842N21513M01325M45790O70471J033331J453688J842956K130801
14989F3102794K276770K267012K102772J792073J353465Q28375K87935j76472
14981G3834724m76528n53535l99621o7608L37807O89888Q78927Q42102N74760
14972G5660916J25693m18628r58321j407741j715217j865478j868085j744630
14964F5808509j522256j230863q99279n50326j97934J49874M82170P77674J006907
$$ plain form
14955 63824476 64967913 66144215 67260677 68255451 69108279 69838727 70494543 71137075 71827905
14946 71827905 72614481 73514278 74505630 75534461 76536566 77465157 78310122 79098316 79872490
14937 79872490 80657492 81431245 82119400 82621723 82859984 82824012 82593133 82323713 82211794
14928 82211794 82448745 83182007 84485005 86341077 88648017 91242332 93933809 96542126
14920 96542126 98931283 101034082 102855482 104451933 105898745 107263611 108596682 109934928
14912 109934928 111310383 112750881 114268493 115842756 117414775 118905369 120254951 121465175
14904 121465175 122618258 123862180 125364889 127250603 129541387 132131652 134808272 137304099
14896 137304099 139363879 140809808 141595211 141824887 141722282 141547126 141495881 141629697 141862388
$$ packed form
14955F3824476J143437J176302J116462R94774Q52828P30448O55816O42532O90830
14946G1827905P86576Q99797R91352J028831J002105R28591Q44965P88194P74174
14937G9872490P85002P73753O88155N02323K38261l5972k30879k69420j11919
14928H2211794K36951P33262J302998J856072K306940K594315K691477K608317
14920I6542126K389157K102799J821400J596451J446812J364866J333071J338246
14912A09934928J375455J440498J517612J574263J572019J490594J349582J210224
14904A21465175J153083J243922J502709J885714K290784K590265K676620K495827
14896A37304099K059780J445929P85403K29676j02605j75156n1245J33816K32691
$$ plain form
14887 141862388 142009657 141868905 141289258 140208439 138657136 136742998 134623654 132470031
14879 132470031 130419027 128526358 126746148 124960115 123049758 120974449 118813063 116748247
14871 116748247 115003750 113768244 113141164 113117484 113603935 114448492 115473046 116509888 117439055
14862 117439055 118212412 118850527 119413665 119965079 120548186 121187340 121905614 122744028 123765932
14853 123765932 125035550 126574872 128323747 130134536 131814968 133204579 134248227 135025034
14845 135025034 135710837 136490011 137463476 138602391 139771145 140804844 141597960 142158462 142604465
14836 142604465 143112591 143848221 144907494 146287658 147889261 149544965 151064773 152284843
14828 152284843 153106355 153513767 153568701 153385148 153100455 152857905 152806696 153109158 153935090
$$ packed form
14887A41862388J47269j40752n79647j080819j551303j914138k119344k153623
14879A32470031k051004j892669j780210j786033j910357k075309k161386k064816
14871A16748247j744497j235506o27080k3680M86451Q44557J024554J036842R29167
14862A17439055P73357O38115N63138N51414N83107O39154P18274Q38414J021904
14853A23765932J269618J539322J748875J810789J680432J389611J043648P76807
14845A35025034O85803P79174R73465J138915J168754J033699P93116N60502M46003
14836A42604465N08126P35630J059273J380164J601603J655704J519808J220070
14828A52284843Q21512M07412N4934j83553k84693k42550n1209L02462Q25932
$$ plain form
14819 153935090 155430975 157675585 160650878 164247059 168292721 172586805 176921641 181103164
14811 181103164 184973110 188426059 191410945 193915310 195940628 197479803 198506582 198983929
14803 198983929 198889012 198238524 197095912 195557366 193729521 191711626 189583338 187394391
14795 187394391 185160614 182878226 180559155 178268745 176136068 174322045 172960935 172109822
14787 172109822 171732341 171717407 171915368 172173963 172365779 172404980 172252799 171913776 171427415
14778 171427415 170858884 170288531 169798424 169457107 169307363 169361999 169609239 170024598 170583880
14769 170583880 171273439 172094624 173056666 174154617 175342312 176521819 177562606 178340742
14761 178340742 178775619 178849484 178608851 178152410 177610795 177125104 176829284 176834363 177208530 177953858
$$ packed form
14819A53935090J495885K244610K975293L596181M045662M294084M334836M181523
14811A81103164L869946L452949K984886K504365K025318J539175J026779M77347
14803A98983929r4917o50488j142612j538546j827845k017895k128288k188947
14795A87394391k233777k282388k319071k290410k132677j814023j361110q51113
14787A72109822l77481j4934J97961K58595J91816L9201j52181l39023m86361
14778A71427415n68531n70353m90107l41317j49744N4636K47240M15359N59282
14769A70583880O89559Q21185R62042J097951J187695J179507J040787P78136
14761A78340742M34877P3865k40633m56441n41615m85691k95820N079L74167P45328
$$ plain form
14751 177953858 178993276 180183577 181353155 182343035 183029073 183321563 183156592 182496313 181342870
14742 181342870 179756508 177863203 175840339 173877538 172123697 170644001 169410134 168329952
14734 168329952 167301015 166261622 165218674 164245945 163458521 162975877 162887009 163225866 163959191
14725 163959191 164990194 166184498 167415907 168612033 169773467 170954387 172217325 173590830
14717 173590830 175054004 176552259 178031393 179470539 180895101 182358443 183898040 185490745
14709 185490745 187035235 188372645 189333787 189790531 189690964 189065658 188003842 186613316 184987224
14700 184987224 183192878 181278165 179278652 177215240 175089441 172889838 170610550 168267144
14692 168267144 165897114 163547277 161260379 159070332 157007318 155107737 153421603 152010422
$$ packed form
14751A77953858J039418J190301J169578R89880O86038K92490j64971o60279j153443
14742A81342870j586362j893305k022864j962801j753841j479696j233867j080182
14734A68329952j028937j039393j042948r72729p87424m82644q8868L38857P33325
14725A63959191J031003J194304J231409J196126J161434J180920J262938J373505
14717A73590830J463174J498255J479134J439146J424562J463342J539597J592705
14709A85490745J544490J337410R61142M56744r9567o25306j061816j390526j626092
14700A84987224j794346j914713j999513k063412k125799k199603k279288k343406
14692A68267144k370030k349837k286898k190047k063014j899581j686134j411181
$$ plain form
14684 152010422 150931431 150210316 149814675 149645473 149554665 149379698 148976050 148236198 147097960
14675 147097960 145550814 143642260 141478544 139213443 137023550 135073970 133484293 132307969
14667 132307969 131531829 131089479 130876912 130765836 130619010 130310205 129742003 128851539 127604622
14658 127604622 125990944 124031754 121798384 119428548 117124726 115125513 113656531 112881629
14650 112881629 112873195 113606048 114969996 116796404 118895468 121097078 123281001 125380798
14642 125380798 127359463 129175863 130769004 132071688 133039704 133670389 133995612 134056745 133880772
14633 133880772 133470851 132813421 131898661 130749258 129445798 128130495 126978440 126144841
14625 126144841 125711458 125656270 125859413 126141352 126314924 126230476 125802702 125018233 123926505
$$ packed form
14684A52010422j078991p21115l95641j69202r0808j74967m03648p39852j138238
14675A47097960j547146j908554k163716k265101k189893j949580j589677j176324
14667A32307969p76140m42350k12567j11076j46826l08805n68202q90464j246917
14658A27604622j613678j959190k233370k369836k303822j999213j468982p74902
14650A12881629q434P32853J363948J826408K099064K201610K183923K099797
14642A25380798J978665J816400J593141J302684R68016O30685L25223O1133j75973
14633A33880772m09921o57430r14760j149403j303460j315303j152055q33599
14625A26144841m33383n5188K03143K81939J73572q4448m27774p84469j091728
$$ plain form
14616 123926505 122617919 121199013 119775775 118445916 117292587 116378195 115744179 115415171
14608 115415171 115395885 115656588 116120115 116666334 117156082 117462432 117494270 117204625 116588301
14599 116588301 115681455 114569670 113393628 112334401 111575535 111259949 111463875 112196511 113417068
14590 113417068 115052578 117003942 119141201 121302408 123311748 125016526 126322012 127201386
14582 127201386 127678405 127799824 127614324 127162053 126471555 125563476 124462158 123208657 121862948
14573 121862948 120493737 119169683 117962286 116953312 116233313 115887981 115979253 116528144 117502697
14564 117502697 118814347 120326937 121880653 123327625 124568028 125570619 126367883 127030622
14556 127030622 127637142 128250414 128907872 129620518 130375074 131136273 131853616 132480064 133002037
$$ packed form
14616A23926505j308586j418906j423238j329859j153329r14392o34016l29008
14608A15415171j9286K60703M63527N46219M89748L06350L1838k89645o16324
14599A16588301r06846j111785j176042j059227p58866l15586K03926P32636J220557
14590A13417068J635510J951364K137259K161207K009340J704778J305486Q79374
14582A27201386M77019J21419j85500m52271o90498r08079j101318j253501j345709
14573A21862948j369211j324054j207397j008974p19999l45332R1272N48891R74553
14564A17502697J311650J512590J553716J446972J240403J002591P97264O62739
14556A27030622O06520O13272O57458P12646P54556P61199P17343O26448N21973
$$ plain form
14547 133002037 133466474 133985506 134708678 135769537 137228532 139039470 141055906 143070664
14539 143070664 144865228 146249215 147084392 147296410 146878704 145891722 144457881 142749858
14531 142749858 140970042 139321112 137970436 137016364 136470051 136263460 136280294 136392736 136485906
14522 136485906 136464172 136248287 135777679 135024698 134014649 132838170 131644581 130613429 129912367
14513 129912367 129656257 129879990 130528778 131463080 132477084 133336348 133837602 133874233 133470897
14504 133470897 132759720 131910920 131063728 130294435 129621618 129025923 128468236 127905100 127304479
14495 127304479 126660424 126000717 125381502 124868545 124513057 124334460 124320490 124445950 124698719
14486 124698719 125095197 125673589 126467880 127478578 128659993 129933594 131218365 132456438
$$ packed form
14547A33002037M64437N19032P23172J060859J458995J810938K016436K014758
14539A43070664J794564J383987Q35177K12018m17706r86982j433841j708023
14531A42749858j779816j648930j350676r54072n46313k06591J6834J12442R3170
14522A36485906k1734k15885m70608p52981j010049j176479j193589j031152p01062
14513A29912367k56110K23733O48788R34302J014004Q59264N01254L6631m03336
14504A33470897p11177q48800q47192p69293o72817n95695n57687n63136o00621
14495A27304479o44055o59707o19215n12957l55488j78597j3970J25460K52769
14486A24698719L96478N78392P94291J010698J181415J273601J284771J238073
$$ plain form
14478 132456438 133615590 134668172 135565634 136234206 136602922 136648784 136427746 136069342 135739149
14469 135739149 135593538 135749658 136276355 137196328 138487013 140076691 141844028 143631295
14461 143631295 145271633 146622286 147597386 148195113 148507023 148694244 148929883 149331001 149915734
14452 149915734 150609155 151291680 151858644 152258979 152499064 152616173 152638902 152559291 152334654
14443 152334654 151915934 151282357 150463595 149542179 148635066 147856403 147273931 146881975 146607395
14434 146607395 146342687 145984305 145457274 144720670 143758860 142567381 141141898 139474263 137554822
14425 137554822 135379095 132958088 130330837 127575078 124809461 122182031 119846838 117937602
14417 117937602 116548085 115725821 115482569 115818102 116745235 118300486 120529475 123447349
$$ packed form
14478A32456438J159152J052582Q97462O68572L68716M5862k21038l58404l30193
14469A35739149j45611J56120N26697R19973J290685J589678J767337J787267
14461A43631295J640338J350653R75100N97727L11910J87221K35639M01118N84733
14452A49915734O93421O82525N66964M00335K40085J17109K2729p9611k24637
14443A52334654m18720o33577q18762r21416r07113p78663n82472l91956k74580
14434A46607395k64708l58382n27031p36604r61810j191479j425483j667635j919441
14425A37554822k175727k421007k627251k755759k765617k627430k335193j909236
14417A17937602j389517q22264k43252L35533R27133J555251K228989K917874
$$ plain form
14409 123447349 126990257 130984499 135153553 139162232 142680971 145452095 147344006 148379014
14401 148379014 148721655 148625615 148355420 148113224 148000781 148027968 148152039 148319476 148495195
14392 148495195 148681499 148927657 149320181 149949510 150868196 152063290 153455026 154921210 156340653
14383 156340653 157642987 158843976 160046073 161401645 163057927 165109435 167572944 170386098
14375 170386098 173423971 176528176 179542956 182348161 184877155 187115433 189085571 190825379
14367 190825379 192362625 193691001 194757675 195473045 195742533 195505341 194760047 193566732
14359 193566732 192030796 190281397 188452164 186662259 184995991 183489220 182134059 180901255
14351 180901255 179764996 178712761 177734609 176803602 175868254 174867231 173755597 172525740
$$ packed form
14409A23447349L542908L994242M169054M008679L518739K771124J891911J035008
14401A48379014L42641r6040k70195k42196j12443K7187J24071J67437J75719
14392A48495195J86304K46158L92524O29329R18686J195094J391736J466184J419443
14383A56340653J302334J200989J202097J355572J656282K051508K463509K813154
14375A70386098L037873L104205L014780K805205K528994K238278J970138J739808
14367A90825379J537246J328376J066674P15370K69488k37192p45294j193315
14359A93566732j535936j749399j829233j789905j666268j506771j355161j232804
14351A80901255j136259j052235r78152r31007r35348j001023j111634j229857
$$ plain form
14343 172525740 171217312 169917531 168748929 167842114 167302063 167184278 167492159 168195132 169257464
14334 169257464 170663953 172431329 174601390 177219268 180304850 183826517 187685383 191717031
14326 191717031 195715460 199476475 202845484 205746921 208179613 210181848 211787996 213001239
14318 213001239 213793262 214123691 213962964 213306133 212177142 210633286 208777152 206768863
14310 206768863 204820805 203164284 201997030 201434579 201486949 202069103 203039113 204248284 205584477
14301 205584477 206991931 208458789 209981580 211535752 213078937 214583631 216067599 217592777
14293 217592777 219231399 221022618 222946102 224925387 226856866 228648688 230251897 231673719
14285 231673719 232973089 234244399 235596117 237127791 238906449 240946941 243206079 245597574
$$ packed form
14343A72525740j308428j299781j168602r06815n40051j17785L07881P02973J062332
14334A69257464J406489J767376K170061K617878L085582L521667L858866M031648
14326A91717031L998429L761015L369009K901437K432692K002235J606148J213243
14318B13001239P92023L30429j60727o56831j128991j543856j856134k008289
14310B06768863j948058j656521j167254n62451N2370N82154R70010J209171J336193
14301B05584477J407454J466858J522791J554172J543185J504694J483968J525178
14293B17592777J638622J791219J923484J979285J931479J791822J603209J421822
14285B31673719J299370J271310J351718J531674J778658K040492K259138K391495
$$ plain form
14277 245597574 248023194 250405115 252704410 254921609 257086767 259246866 261451115 263733039
14269 263733039 266093681 268493105 270852669 273064526 275004530 276548909 277596509 278093822
14261 278093822 278053545 277556566 276734871 275742373 274724490 273796094 273033620 272479346 272147639
14252 272147639 272024410 272062872 272189154 272327418 272436227 272533020 272688872 272997664 273541102
14243 273541102 274369522 275502813 276940852 278669645 280656767 282838024 285102764 287291361
14235 287291361 289219499 290727855 291731759 292241149 292342387 292156834 291798323 291345393 290834532
14226 290834532 290272897 289662474 289021243 288386838 287800532 287285716 286838382 286435333 286053570
14217 286053570 285689556 285367104 285129608 285024696 285092214 285355545 285810177 286413444 287087468
$$ packed form
14277B45597574K425620K381921K299295K217199K165158K160099K204249K281924
14269B63733039K360642K399424K359564K211857J940004J544379J047600M97313
14261B78093822m0277m96979q21695r92498j017883r28396p62474n54274l31707
14252B72147639j23229L8462J26282J38264J08809R6793J55852L08792N43438
14243B73541102Q28420J133291J438039J728793J987122K181257K264740K188597
14235B87291361J928138J508356J003904N09390J01238j85553l58511m52930n10861
14226B90834532n61635o10423o41231o34405n86306n14816m47334m03049l81763
14217B86053570l64014l22452k37496j04912O7518K63331M54632O03267O74024
$$ plain form
14208 287087468 287737424 288273141 288624326 288750848 288651457 288369005 287988645 287627009 287411761
14199 287411761 287455485 287833465 288572593 289650556 291003475 292543031 294176517 295815159
14191 295815159 297366348 298724404 299776884 300427973 300626736 300387364 299793736 298984760 298123119
14182 298123119 297358713 296801805 296513629 296508852 296760830 297210909 297792390 298472215 299291607
14173 299291607 300373610 301882410 303956189 306656075 309956942 313771876 317986544 322489427
14165 322489427 327194656 332051552 337032778 342104631 347198481 352203690 356986687 361423033
14157 361423033 365422552 368933640 371927470 374378714 376264176 377585563 378398147 378817750
14149 378817750 378995362 379073771 379149911 379257240 379366236 379391951 379201869 378627093 377481058
$$ packed form
14208B87087468O49956N35717L51185J26522r9391k82452l80360l61636k15248
14199B87411761M3724L77980P39128J077963J352919J539556J633486J638642
14191B95815159J551189J358056J052480O51089J98763k39372n93628q08976q61641
14182B98123119p64406n56908k88176m777K51978M50079N81481O79825Q19392
14173B99291607J082003J508800K073779K699886L300867L814934M214668M502883
14165C22489427M705229M856896M981226N071853N093850N005209M782997M436346
14157C61423033L999519L511088K993830K451244J885462J321387Q12584M19603
14149C78817750J77612P8409P6140J07329J08996K5715j90082n74776j146035
$$ plain form
14140 377481058 375582547 372776051 368947862 364040533 358064480 351100609 343289672 334809911
14132 334809911 325849381 316581119 307147399 297654874 288179206 278776770 269498942 260400989
14124 260400989 251540906 242974268 234754725 226938940 219585189 212741816 206435169 200667796
14116 200667796 195426737 190693634 186450191 182677711 179351956 176435363 173870773 171583343
14108 171583343 169494410 167541528 165691823 163940294 162296317 160770300 159372892 158128774
14100 158128774 157090314 156331469 155919344 155881602 156187933 156747608 157415822 158006128 158313148
14091 158313148 158149061 157388794 156009623 154108201 151884146 149591926 147476077 145712763
14083 145712763 144379436 143461952 142889036 142570750 142422518 142374431 142378171 142418356 142520734 142745333
$$ packed form
14140C77481058j898511k806496l828189m907329n976053o963871p810937q479761
14132C34809911q960530r268262r433720r492525r475668r402436r277828r097953
14124B60400989q860083q566638q219543p815785p353751o843373o306647n767373
14116B00667796n241059m733103m243443l772480l325755k916593k564590k287430
14108A71583343k088933j952882j849705j751529j643977j526017j397408j244118
14100A58128774j038460p58845m12125l7742L06331N59675O68214N90306L07020
14091A58313148j64087p60267j379171j901422k224055k292220k115849j763314
14083A45712763j333327r17484n72916l18286j48232m8087L740M0185J02378K24599
$$ plain form
14073 142745333 143164143 143835010 144783721 145997618 147425835 148979935 150534716 151935073
14065 151935073 153014668 153627419 153685336 153187034 152218197 150917816 149425796 147840971 146211006
14056 146211006 144551718 142875085 141208543 139601372 138119079 136827620 135776012 134990249
14048 134990249 134482105 134261680 134340207 134721115 135387489 136294724 137372750 138537252 139705666
14039 139705666 140813258 141826650 142753403 143646222 144600144 145740877 147202398 149094633
14031 149094633 151468637 154292519 157449878 160762619 164026500 167041591 169629208 171643212
14023 171643212 172986266 173626343 173596713 172971954 171834815 170258618 168315218 166093437
14015 166093437 163704201 161264843 158875526 156602121 154467801 152451387 150498063 148549590
$$ packed form
14073A42745333M18810O70867R48711J213897J428217J554100J554781J400357
14065A51935073J079595O12751N7917m98302r68837j300381j492020j584825j629965
14056A46211006j659288j676633j666542j607171j482293j291459j051608p85763
14048A34990249n08144k20425P8527L80908O66374R07235J078026J164502J168414
14039A39705666J107592J013392R26753Q92819R53922J140733J461521J892235
14031A49094633K374004K823882L157359L312741L263881L015091K587617K014004
14023A71643212J343054O40077k9630o24759j137139j576197j943400k221781
14015A66093437k389236k439358k389317k273405k134320k016414j953324j948473
$$ plain form
14007 148549590 146585893 144652574 142851485 141294735 140046610 139085707 138307227 137559512
13999 137559512 136689393 135574659 134140436 132367451 130297647 128035288 125737982 123593905
13991 123593905 121787286 120460937 119688111 119462569 119709249 120314400 121169957 122216307 123458884
13982 123458884 124944797 126713562 128754563 130995229 133321137 135613190 137783745 139799489
13974 139799489 141687691 143527042 145425001 147486413 149782010 152323931 155050615 157823189
13966 157823189 160440040 162675098 164332302 165294029 165541125 165138003 164194136 162821593
13958 162821593 161104603 159086588 156772396 154143957 151188516 147931111 144455425 140902671
13950 140902671 137451653 134288408 131569481 129384002 127729629 126518523 125612499 124868095
$$ packed form
14007A48549590j963697j933319j801089j556750j248125r60903p78480p47715
13999A37559512q70119j114734j434223j772985k069804k262359k297306k144077
13991A23593905j806619j326349p72826k25542K46680O05151Q55557J046350J242577
13982A23458884J485913J768765K041001K240666K325908K292053K170555K015744
13974A39799489J888202J839351J897959K061412K295597K541921K726684K772574
13966A57823189K616851K235058J657204R61727K47096m03122r43867j372543
13958A62821593j716990k018015k314192k628439k955441l257405l475686l552754
13950A40902671l451018l163245k718927k185479j654373j211106r06024p44404
$$ plain form
13942 124868095 124170539 123446057 122653828 121769149 120772775 119652260 118410070 117073662 115707049
13933 115707049 114418995 113356413 112675884 112500496 112881382 113783156 115098851 116683156
13925 116683156 118386516 120079781 121667512 123089365 124310528 125309662 126076994 126626040
13917 126626040 127005202 127288452 127539349 127768249 127912101 127849430 127439218 126563306 125157676
13908 125157676 123227021 120843621 118133731 115252070 112344930 109511879 106786124 104148637
13900 104148637 101572251 99072862 96736807 94703384 93108059 92017391 91390304 91083614
13892 91083614 90899473 90656852 90257525 89715107 89131690 88635768 88316576 88185261 88170326
13883 88170326 88139040 87936654 87435900 86580264 85399102 83985862 82452089 80879284 79287200
$$ packed form
13942A24868095o97556p24482p92229q84679r96374j120515j242190j336408j366613
13933A15707049j288054j062582o80529j75388L80886R01774J315695J584305
13925A16683156J703360J693265J587731J421853J221163R99134P67332N49046
13917A26626040L79162K83250K50897K28900J43852o2671m10212q75912j405630
13908A25157676j930655k383400k709890k881661k907140k833051k725755k637487
13900A04148637k576386k499389k336055k033423j595325j090668o27087l06690
13892I1083614j84141k42621l99327n42418n83417m95922l19192j31315j4935
13883H8170326l1286k02386n00754q55636j181162j413240j533773j572805j592084
$$ plain form
13874 79287200 77630524 75825900 73796193 71509201 68994667 66339804 63674009 61151898
13866 61151898 58936742 57182608 56014471 55508574 55677195 56460743 57727733 59284981
13858 59284981 60904533 62368590 63517621 64278675 64662588 64736465 64587078 64290333 63895107
13849 63895107 63421618 62872656 62256906 61614928 61027910 60598089 60413965 60523855 60927148
13840 60927148 61576324 62383104 63230499 63993780 64567449 64890547 64961463 64835880 64609243
13831 64609243 64393334 64295799 64403185 64763978 65373169 66166494 67030858 67827853 68419115
13822 68419115 68683908 68528431 67891655 66749248 65114577 63040021 60623101 58013295
13814 58013295 55407632 53028816 51092972 49778976 49204656 49409070 50341275 51859449
$$ packed form
13874G9287200j656676j804624k029707k286992k514534k654863k665795k522111
13866F1151898k215156j754134j168137n05897J68621P83548J266990J557248
13858E9284981J619552J464057J149031P61054L83913P3877j49387k96745l95226
13849F3895107m73489n48962o15750o41978n87018m29821j84124J09890M03293
13840F0927148O49176Q06780Q47395P63281N73669L23098P0916j25583k26637
13831F4609243k15909r7535J07386L60793O09191P93325Q64364P96995N91262
13822F8419115K64793j55477o36776j142407j634671k074556k416920k609806
13814E8013295k605663k378816j935844j313996n74320K04414R32205J518174
$$ plain form
13806 51859449 53745891 55742182 57601514 59142976 60284848 61040489 61480840 61688111
13798 61688111 61729217 61661139 61554664 61507705 61627852 61990763 62603751 63402205 64282004 65146777
13788 65146777 65945377 66687817 67438755 68292501 69340442 70647115 72243444 74130244 76279808
13779 76279808 78630377 81076543 83463850 85599497 87287681 88381789 88825858 88656741
13771 88656741 87965295 86846278 85369685 83581094 81515201 79205229 76685989 74001710
13763 74001710 71222954 68455993 65823666 63421821 61282550 59372435 57622962 55964153
13755 55964153 54336824 52686047 50958282 49116784 47164179 45148728 43146740 41236664
13747 41236664 39482140 37925242 36581640 35435582 34440971 33533461 32650086 31747531 30812660
$$ packed form
13806E1859449J886442J996291J859332J541462J141872P55641M40351K07271
13798F1688111M1106o8078j06475m6959J20147L62911O12988P98454Q79799Q64773
13788F5146777P98600P42440P50938Q53746J047941J306673J596329J886800K149564
13779G6279808K350569K446166K387307K135647J688184J094108M44069j69117
13771H8656741o91446j119017j476593j788591k065893k309972k519240k684279
13763G4001710k778756k766961k632327k401845k139271j910115j749473j658809
13755E5964153j627329j650777j727765j841498j952605k015451k001988j910076
13747D1236664j754524j556898j343602j146058r94611r07510q83375r02555r34871
$$ plain form
13738 30812660 29864884 28952067 28141476 27508190 27123430 27042972 27294959 27867706 28700388
13729 28700388 29681940 30664578 31495400 32060201 32320384 32319538 32153036 31920827 31693222 31502853
13719 31502853 31353550 31230715 31109566 30969117 30814062 30690517 30678612 30861922 31293458
13710 31293458 31981655 32905288 34045434 35409425 37025815 38910590 41028517 43279452
13702 43279452 45522007 47619764 49478428 51049815 52305713 53208178 53703107 53742957 53320069
13693 53320069 52483495 51325990 49952106 48451580 46893244 45334662 43833123 42450865
13685 42450865 41255862 40318409 39701083 39443442 39548575 39980235 40674737 41562034 42583374
13676 42583374 43697978 44881133 46117866 47392744 48677462 49923323 51066718 52047729
$$ packed form
13738C0812660r47776r12817q10591o33286l84760q0458K51987N72747Q32682
13729B8700388R81552R82638Q30822N64801K60183q46j66502k32209k27605j90369
13719C1502853j49303j22835j21149j40449j55055j23545j1905J83310M31536
13710C1293458O88197R23633J140146J363991J616390J884775K117927K250935
13702D3279452K242555K097757J858664J571387J255898R02465M94929L9850m22888
13693E3320069q36574j157505j373884j500526j558336j558582j501539j382258
13685D2450865j195003r37453o17326k57641J05133M31660O94502Q87297J021340
13676D2583374J114604J183155J236733J274878J284718J245861J143395R81011
$$ plain form
13668 52047729 52831396 53419696 53851081 54191098 54515816 54889395 55343489 55868776 56421250
13659 56421250 56937211 57349505 57600011 57645924 57461438 57039284 56394673 55570236 54637819
13650 54637819 53692241 52835247 52154074 51702742 51491415 51484302 51605044 51750106 51812324 51714226
13640 51714226 51441280 51056603 50685148 50474321 50550257 50984423 51775939 52853901 54104485
13631 54104485 55417334 56730530 58050353 59436353 60963795 62687158 64619896 66726805
13623 66726805 68919311 71057083 72968704 74491126 75508096 75967886 75878500 75291497 74284820
13614 74284820 72947861 71367265 69613510 67732370 65744998 63655769 61464530 59181389
13606 59181389 56843066 54526893 52354143 50475041 49037257 48150628 47862068 48146757
$$ packed form
13668E2047729P83667N88300M31385L40017L24718L73579M54094N25287N52474
13659E6421250N15961M12294K50506M5913j84486m22154o44611q24437r32417
13650E4637819r45578q56994o81173m51332k11327p113J20742J45062O2218r8098
13640E1714226k72946l84677l71455k10827P5936M34166P91516J077962J250584
13631E4104485J312849J313196J319823J386000J527442J723363J932738K106909
13623F6726805K192506K137772J911621J522422J016970M59790q9386n87003j006677
13614G4284820j336959j580596j753755j881140j987372k089229k191239k283141
13606E9181389k338323k316173k172750j879102j437784q86629k88560K84689
$$ plain form
13598 48146757 48914108 50025123 51319765 52651462 53918887 55081482 56153334 57183971
13590 57183971 58238522 59380289 60652374 62060234 63562549 65074398 66482299 67669491
13582 67669491 68545536 69067259 69239896 69100325 68696048 68072750 67271941 66331256 65282311
13573 65282311 64148661 62947859 61697602 60424596 59173203 58004825 56978980 56121861
13565 56121861 55402158 54728793 53969795 52986239 51677215 50024751 48116598 46130438 44285588
13556 44285588 42785420 41772814 41309148 41375965 41893411 42748882 43826792 45027942 46273068
13547 46273068 47497731 48651920 49710278 50685670 51633270 52638864 53795126 55173520
13539 55173520 56796689 58615778 60503570 62276442 63744373 64768452 65298707 65377458
$$ packed form
13598D8146757P67351J111015J294642J331697J267425J162595J071852J030637
13590E7183971J054551J141767J272085J407860J502315J511849J407901J187192
13582F7669491Q76045N21723J72637j39571m04277o23298q00809r40685j048945
13573F5282311j133650j200802j250257j273006j251393j168378j025845q57119
13565E6121861p19703o73365p58998r83556j309024j652464j908153j986160j844850
13556D4285588j500168j012606m63666O6817N17446Q55471J077910J201150J245126
13547D6273068J224663J154189J058358R75392R47600J005594J156262J378394
13539E5173520J623169J819089J887792J772872J467931J024079N30255P8751
$$ plain form
13531 65377458 65113672 64646344 64112967 63629246 63278458 63108013 63133984 63354675 63768360
13522 63768360 64384957 65223997 66300474 67608263 69112191 70754204 72469038 74196826
13514 74196826 75883189 77470162 78888677 80058637 80896226 81328030 81310546 80845890 79979119
13505 79979119 78773333 77280901 75536609 73578758 71478562 69353372 67354560 65638605
13497 65638605 64336067 63527534 63228277 63381565 63862138 64491883 65068874 65406827 65374543
13488 65374543 64919038 64059589 62853889 61354813 59583413 57532332 55192694 52587114
13480 52587114 49796891 46978525 44363919 42235751 40873469 40477688 41097174 42594729
13472 42594729 44680986 47009742 49286326 51330378 53069304 54489720 55596265 56402990
$$ packed form
13531F5377458k63786m67328n33377m83721l50788j70445K5971K20691M13685
13522F3768360O16597Q39040J076477J307789J503928J642013J714834J727788
13514G4196826J686363J586973J418515J169960Q37589M31804j7484m64656q66771
13505G9979119j205786j492432j744292j957851k100196k125190j998812j715955
13497F5638605j302538q08533k99257J53288M80573O29745N76991L37953l2284
13488F5374543m55505q59449j205700j499076j771400k051081k339638k605580
13480E2587114k790223k818366k614606k128168j362282l95781O19486J497555
13472D2594729K086257K328756K276584K044052J738926J420416J106545Q06725
$$ plain form
13464 56402990 56941447 57256426 57383570 57330503 57082862 56631639 55997033 55227560 54376441
13455 54376441 53477994 52545771 51592805 50653810 49788662 49064653 48533654 48221518 48131605
13446 48131605 48251594 48556732 49012094 49575592 50197936 50819150 51370003 51786948 52037466
13437 52037466 52140785 52169962 52232535 52437464 52862109 53534226 54436210 55524302 56747435
13428 56747435 58057415 59412899 60778957 62117536 63369528 64444346 65235482 65660699
13420 65660699 65701516 65414262 64906834 64298744 63687867 63137111 62680117 62335165 62113903
13411 62113903 62016301 62012506 62021948 61905161 61481061 60571892 59062575 56947698 54340414 51438519
13401 51438519 48468935 45640277 43117911 41014290 39380662 38197057 37370325 36752908
$$ packed form
13464E6402990N38457L14979J27144n3067k47641m51223o34606p69473q51119
13455E4376441q98447r32223r52966r38995q65148p24009n30999l12136q9913
13446D8131605J19989L05138M55362N63498O22344O21214N50853M16945K50518
13437E2037466J03319K9177O2573K04929M24645O72117R01984J088092J223133
13428E6747435J309980J355484J366058J338579J251992J074818P91136M25217
13420F5660699M0817k87254n07428o08090o10877n50756m56994l44952k21262
13411F2113903r7602l795R442j16787m24100r09169j509317k114877k607284k901895
13401E1438519k969584k828658k522366k103621j633628j183605q26732o17417
$$ plain form
13393 36752908 36187089 35564082 34873219 34215912 33773551 33739185 34239433 35278095 36724007
13384 36724007 38348260 39895963 41161820 42037120 42512447 42644569 42511908 42182611 41705587
13375 41705587 41120662 40477299 39849161 39332719 39027281 39008779 39315443 39951799 40901280
13366 40901280 42135545 43618415 45307890 47157386 49117059 51138450 53181634 55216719
13358 55216719 57214104 59129653 60896910 62430971 63639358 64434408 64745062 64526611
13350 64526611 63767526 62493826 60769966 58693276 56379793 53940461 51450867 48928192
13342 48928192 46335159 43618300 40762386 37827352 34944032 32270930 29936008 27994965
13334 27994965 26428353 25175663 24178771 23403453 22832028 22446527 22221696 22127752 22133199
$$ packed form
13393C6752908n65819o23007o90863o57307m42361l4366N00248J038662J445912
13384C6724007J624253J547703J265857Q75300M75327J32122j32661l29297m77024
13375D1705587n84925o43363o28138n16442l05438j8502L06664O36356R49481
13366D0901280J234265J482870J689475J849496J959673K021391K043184K035085
13358E5216719J997385J915549J767257J534061J208387P95050L10654k18451
13350F4526611p59085j273700j723860k076690k313483k439332k489594k522675
13342D8928192k593033k716859k855914k935034k883320k673102k334922j941043
13334B7994965j566612j252690r96892p75318n71425l85501k24831r3944N447
$$ plain form
13325 22133199 22208159 22338118 22547643 22914125 23549380 24549002 25934908 27623113 29434674
13316 29434674 31147431 32569266 33601444 34260872 34651940 34909013 35143032 35413741 35730069
13307 35730069 36069068 36398574 36689366 36911491 37022326 36961255 36661844 36078445 35210391
13298 35210391 34107467 32854194 31542236 30242382 28985508 27760964 26537489 25301745
13290 25301745 24097840 23047366 22336611 22172692 22725760 24079781 26207638 28976089
13282 28976089 32177654 35579782 38978225 42242188 45340621 48341295 51379173 54599291
13274 54599291 58090928 61838884 65714588 69510766 72999647 75984783 78327156 79946251
13266 79946251 80809557 80923874 80333450 79121215 77406096 75331471 73043547 70663353
$$ packed form
13325B2133199P4960J29959K09525L66482O35255R99622J385906J688205J811561
13316B9434674J712757J421835J032178O59428L91068K57073K34019K70709L16328
13307C5730069L38999L29506K90792K22125J10835o1071k99411n83399q68054
13298C5210391j102924j253273j311958j299854j256874j224544j223475j235744
13290B5301745j203905j050474p10755j63919N53068J354021K127857K768451
13282B8976089L201565L402128L398443L263963L098433L000674L037878L220118
13274E4599291L491637L747956L875704L796178L488881K985136K342373J619095
13266G9946251Q63306J14317n90424j212235j715119k074625k287924k380194
$$ plain form
13258 70663353 68261732 65849453 63390219 60833179 58148804 55347741 52473716 49581460
13250 49581460 46719290 43925309 41230627 38659707 36225981 33929049 31762722 29738148
13242 29738148 27912605 26403028 25366726 24949034 25218862 26126812 27513406 29165867
13234 29165867 30890994 32564121 34134188 35594965 36949360 38188872 39292635 40237535
13226 40237535 41009657 41611495 42062357 42392002 42630684 42801042 42917763 42996512 43064357 43160378
13216 43160378 43324925 43588513 43970262 44483755 45141810 45957247 46943174 48115404 49494298
13207 49494298 51098332 52922075 54902763 56896946 58691752 60053898 60792909 60809336
13199 60809336 60113628 58817429 57105131 55192088 53274307 51478314 49829159 48257259
$$ packed form
13258G0663353k401621k412279k459234k557040k684375k801063k874025k892256
13250D9581460k862170k793981k694682k570920k433726k296932k166327k024574
13242B9738148j825543j509577j036302m17692K69828R07950J386594J652461
13234B9165867J725127J673127J570067J460777J354395J239512J103763R44900
13226D0237535P72122O01838M50862L29645K38682J70358J16721P8749O7845R6021
13216D3160378J64547K63588L81749N13493O58055Q15437R85927J172230J378894
13207D9494298J604034J823743J980688J994183J794806J362146P39011J6427
13199F0809336o95708j296199j712298j913043j917781j795993j649155j571900
$$ plain form
13191 48257259 46648755 44917347 43061564 41181150 39447896 38045351 37104506 36665695
13183 36665695 36683148 37061909 37699162 38508867 39428172 40414191 41435672 42459231 43433739
13174 43433739 44282066 44908417 45223078 45176749 44787357 44142906 43377872 42635728 42034786
13165 42034786 41650522 41519245 41655376 42065341 42747411 43684459 44843296 46181677 47652523
13156 47652523 49200372 50756200 52237452 53554132 54620125 55370501 55781871 55884398
13148 55884398 55753185 55479645 55138140 54765724 54363490 53914394 53403225 52825786 52184312
13139 52184312 51476738 50691207 49812294 48834983 47775230 46668579 45558124 44479929 43453971
13130 43453971 42485539 41577183 40743387 40015504 39430817 39012587 38754926 38622460 38565318
$$ packed form
13191D8257259j608504j731408j855783j880414j733254j402545r40845m38811
13183C6665695J7453L78761O37253Q09705R19305R86019J021481J023559R74508
13174D3433739Q48327O26351L14661m6329l89392o44451p65034p42144o00942
13165D2034786l84264j31277J36131M09965O82070R37048J158837J338381J470846
13156D7652523J547849J555828J481252J316680J065993P50376M11370J02527
13148E5884398j31213k73540l41505l72416m02234m49096n11169n77439o41474
13139E2184312p07574p85531q78913r77311j059753j106651j110455j078195j025958
13130D3453971r68432r08356q33796p27883n84687m18230k57661j32466n7142
$$ plain form
13121 38565318 38541395 38532931 38547123 38602294 38712336 38879122 39089890 39314249 39505560 39614407
13111 39614407 39610585 39500542 39329634 39167888 39086756 39138285 39344708 39698754 40168227 40696813
13101 40696813 41199892 41565832 41675185 41434980 40808735 39824393 38559984 37120857 35621865
13092 35621865 34177376 32892297 31848322 31090395 30624434 30430026 30480282 30756941 31253330
13083 31253330 31965533 32877091 33945050 35097973 36254365 37357863 38411884 39492891
13075 39492891 40730599 42260255 44167734 46451896 49018000 51700648 54303970 56642808
13067 56642808 58572238 60002333 60902790 61301139 61272714 60918841 60334143 59571499 58620038
13058 58620038 57410709 55851623 53880078 51511893 48872629 46202326 43828513 42104297
$$ packed form
13121C8565318k3923q464J4192N5171J10042J66786K10768K24359J91311J08847
13111C9614407l822j10043j70908j61746q1132N1529K06423L54046M69473N28586
13101D0696813N03079L65940J09353k40205o26245r84342j264409j439127j498992
13092C5621865j444489j285079j043975p57927m65961j94408N0256K76659M96389
13083C1253330P12203R11558J067959J152923J156392J103498J054021J081007
13075C9492891J237708J529656J907479K284162K566104K682648K603322K338838
13067E6642808J929430J430095R00457L98349k8425l53873n84698p62644r51461
13058E8620038j209329j559086j971545k368185k639264k670303k373813j724216
$$ plain form
13050 42104297 41319806 41615326 42934367 45042192 47606810 50309033 52930657 55379988
13042 55379988 57651994 59759907 61684875 63367346 64732790 65727020 66337726 66593662
13034 66593662 66548660 66262263 65784923 65151999 64387545 63513761 62559661 61565115 60580392
13025 60580392 59663476 58876931 58283366 57937770 57879210 58125865 58670300 59468507 60427507
13016 60427507 61407839 62249703 62812073 63004264 62796720 62213060 61314524 60184995 58917673
13007 58917673 57602932 56318052 55117443 54022822 53020083 52072047 51144407 50227171
12999 50227171 49333961 48478389 47645665 46783272 45820712 44703662 43415419 41972794 40407550
12990 40407550 38751218 37029852 35264080 33470071 31664039 29873504 28148795 26561974
$$ packed form
13050D2104297p84491K95520J319041K107825K564618K702223K621624K449331
13042E5379988K272006K107913J924968J682471J365444R94230O10706K55936
13034F6593662m5002k86397m77340o32924p64454q73784r54100r94546r84723
13025F0580392r16916p86545n93565l45596n8560K46655N44435P98207R59000
13016F0427507R80332Q41864N62370J92191k07544n83660q98536j129529j267322
13007E8917673j314741j284880j200609j094621j002739r48036r27640r17236
12999E0227171q93210q55572q32724q62393r62560j117050j288243j442625j565244
12990D0407550j656332j721366j765772j794009j806032j790535j724709j586821
$$ plain form
12982 26561974 25189480 24088960 23283578 22757508 22456359 22287367 22124123 21825427 21269476
12973 21269476 20391810 19210210 17823735 16382669 15039000 13897716 12988915 12268682
12965 12268682 11642670 10999679 10243816 9318387 8219487 7000368 5766523 4657961 3816617
12956 3816617 3347158 3290291 3624527 4294734 5249064 6462342 7934442 9669168 11651203
12947 11651203 13836402 16157315 18534193 20882096 23114343 25151112 26940510 28485984
12939 28485984 29857674 31166986 32510199 33913707 35313351 36576847 37553975 38127841
12931 38127841 38243783 37906364 37152390 36020035 34535007 32722423 30634610 28373259
12923 28373259 26087204 23941968 22075527 20563996 19412844 18571824 17961750 17502204
$$ packed form
12982B6561974j372494j100520q05382n26070l01149j68992j63244k98696n55951
12973B1269476q77666j181600j386475j441066j343669j141284r08801p20233
12965A2268682o26012o42991p55863r25429j098900j219119j233845j108562q41344
12956C816617m69459n6867L34236O70207R54330J213278J472100J734726J982035
12947A1651203K185199K320913K376878K347903K232247K036769J789398J545474
12939B8485984J371690J309312J343213J403508J399644J263496R77128N73866
12931C8127841J15942l37419p53974j132355j485028j812584k087813k261351
12923B8373259k286055k145236j866441j511531j151152q41020o10074m59546
$$ plain form
12915 17502204 17132740 16822681 16569368 16391427 16324980 16423019 16748415 17353241 18252458 19411150
12905 19411150 20757334 22213600 23728243 25287745 26903066 28577622 30278107 31927911
12897 31927911 33424903 34666927 35566552 36050839 36056921 35537616 34482712 32947273 31066542
12888 31066542 29035910 27051788 25240939 23626444 22159634 20795711 19552751 18507843
12880 18507843 17737496 17250717 16959333 16696619 16269806 15525761 14407834 12981495 11417252
12871 11417252 9940226 8771096 8082671 7983222 8521860 9701331 11484657 13792920 16501528
12862 16501528 19442473 22414991 25205370 27616151 29499615 30782372 31466644 31605504
12854 31605504 31267066 30509836 29378779 27912127 26144856 24110484 21854153 19456901
$$ packed form
12915A7502204l69464l10059k53313j77941o6447R8039L25396O04826Q99217J158692
12905A9411150J346184J456266J514643J559502J615321J674556J700485J649804
12897C1927911J496992J242024Q99625M84287O082n19305j054904j535439j880731
12888C1066542k030632j984122j810849j614495j466810j363923j242960j044908
12880A8507843p70347m86779k91384k62714m26813p44045j117927j426339j564243
12871A1417252j477026j169130o88425r9449N38638J179471J783326K308263K708608
12862A6501528K940945K972518K790379K410781J883464J282757O84272J38860
12854C1605504l38438p57230j131057j466652j767271k034372k256331k397252
$$ plain form
12846 19456901 17049423 14794425 12842365 11288073 10153281 9398873 8951486 8725803
12838 8725803 8636720 8609343 8594045 8582235 8610558 8745354 9052605 9570328 10299378 11216168
12828 11216168 12297792 13543902 14981979 16653559 18592562 20811214 23299189 26028498
12820 26028498 28954406 32010436 35103071 38112805 40904158 43341590 45306089 46710511
12812 46710511 47514311 47735233 47453259 46805848 45976672 45178606 44628826 44513032 44940624
12803 44940624 45905067 47272169 48809162 50245280 51339306 51929661 51954430 51445270 50509803
12794 50509803 49313073 48056809 46950001 46169197 45814415 45871887 46197553 46534186 46567062
12785 46567062 46008440 44686152 42606360 39967323 37114789 34450036 32323174 30949990
$$ packed form
12846A9456901k407478k254998j952060j554292j134792p54408m47387k25683
12838H725803q9083k7377j5298j1810K8323J34796L07251N17723P29050R16790
12828A1216168J081624J246110J438077J671580J939003K218652K487975K729309
12820B6028498K925908L056030L092635L009734K791353K437432J964499J404422
12812D6710511Q03800K20922k81974o47411q29176p98066n49780j15794M27592
12803D4940624R64443J367102J536993J436118J094026N90355K4769n09160r35467
12794E0509803j196730j256264j106808p80804l54782N7472L25666L36633L2876
12785D6567062n58622j322288k079792k639037k852534k664753k126862j373184
$$ plain form
12777 30949990 30375990 30490465 31076690 31874637 32635423 33159482 33319745 33069691 32434082
12768 32434082 31487023 30329764 29076585 27844143 26735644 25821946 25131410 24655855 24368572
12759 24368572 24244183 24271386 24455910 24817941 25389666 26212956 27332230 28779682 30556755
12750 30556755 32621796 34893245 37267593 39639735 41913393 44001264 45825628 47328056
12742 47328056 48482488 49295373 49785696 49959389 49802827 49306431 48504441 47503612 46481749
12733 46481749 45655022 45226271 45332360 46009323 47188265 48722788 50435192 52160411 53769111
12724 53769111 55166994 56286402 57088969 57580165 57816953 57889600 57878789 57810451 57635411
12715 57635411 57248383 56541834 55471427 54097942 52577236 51098596 49804796 48739107
$$ packed form
12777C0949990n74000J14475N86225P97947P60786N24059J60263k50054o35609
12768C2434082r47059j157259j253179j232442j108499r13698o90536m75555k87283
12759B4368572j24389K7203J84524L62031N71725Q23290J119274J447452J777073
12750C0556755K065041K271449K374348K372142K273658K087871J824364J502428
12742D7328056J154432Q12885M90323J73693j56562m96396q01990j000829j021863
12733D6481749q26727m28751J06089O76963J178942J534523J712404J725219J608700
12724E3769111J397883J119408Q02567M91196K36788P2647j0811o8338j75040
12715E7635411l87028p06549j070407j373485j520706j478640j293800j065689
$$ plain form
12707 48739107 47845434 47012369 46128021 45116766 43951302 42649314 41262209 39855910
12699 39855910 38487502 37191743 35988631 34905384 33994452 33336747 33033716 33195249 33923304
12690 33923304 35288085 37300013 39887226 42888379 46068007 49157458 51914872 54183811
12682 54183811 55923619 57197079 58127062 58851324 59496794 60172084 60964522 61933638 63102837
12673 63102837 64453191 65921739 67407666 68789098 69946630 70783726 71236432 71273241 70892094
12664 70892094 70119138 69006423 67624267 66051145 64367793 62656452 60999487 59473003
12656 59473003 58137779 57032276 56167723 55522773 55041605 54644586 54252246 53808937 53290559
12647 53290559 52695622 52035092 51335482 50651989 50073445 49704363 49627757 49869225 50385250
$$ packed form
12707D8739107q93673q33065q84348j011255j165464j301988j387105j406299
12699C9855910j368408j295759j203112j083247r10932o57705l03031J61533P28055
12690C3923304J364781K011928K587213L001153L179628L089451K757414K268939
12682E4183811J739808J273460R29983P24262O45470O75290P92438R69116J169199
12673F3102837J350354J468548J485927J381432J157532Q37096M52706L6809l81147
12664G0892094p72956j112715j382156j573122j683352j711341j656965j526484
12656E9473003j335224j105503q64553o44950m81168l97019l92340m43309n18378
12647E3290559n94937o60530o99610o83493n78544l69082p6606K41468N16025
$$ plain form
12638 50385250 51085029 51874440 52697016 53549138 54462201 55463691 56542065 57638420 58669432
12629 58669432 59562648 60277184 60799649 61129749 61276071 61265616 61151422 61002267 60875998
12620 60875998 60793492 60729117 60621184 60394880 59986113 59356926 58498532 57423774 56154180
12611 56154180 54707485 53090374 51298945 49326273 47173411 44859740 42430826 39963225
12603 39963225 37563708 35358400 33470651 31994770 30978192 30419364 30276540 30477656
12595 30477656 30928854 31527315 32180829 32826966 33442589 34042099 34669975 35391778 36283122
12586 36283122 37414944 38835038 40548736 42505704 44602539 46706663 48693921 50479709
12578 50479709 52026342 53327648 54387649 55209440 55798050 56171874 56376665 56497365 56661869
$$ packed form
12638E0385250O99779P89411Q22576Q52122R13063J001490J078374J096355J031012
12629E8669432Q93216P14536N22465L30100J46322j0455j14194j49155j26269
12620F0875998q2506o4375j07933k26304m08767o29187q58394j074758j269594
12611E6154180j446695j617111j791429j972672k152862k313671k428914k467601
12603C9963225k399517k205308j887749j475881j016578n58828j42824K01116
12595C0477656M51198N98461O53514O46137O15623N99510O27876P21803Q91344
12586C6283122J131822J420094J713698J956968K096835K104124J987258J785788
12578E0479709J546633J301306J060001Q21791N88610L73824K04791J20700J64504
$$ plain form
12569 56661869 57030503 57767814 59000010 60772245 63027172 65619027 68357634 71057418
12561 71057418 73563581 75746132 77478456 78627096 79066583 78713576 77564219 75716660
12553 75716660 73364236 70757097 68147253 65740438 63670289 61993419 60693189 59682833
12545 59682833 58809132 57866196 56629240 54907971 52603185 49741560 46473410 43038782
12537 43038782 39718993 36787523 34468068 32906017 32158257 32201820 32956251 34310467 36143790
12528 36143790 38334131 40754116 43264448 45716306 47967732 49906332 51463356 52610504
12520 52610504 53344840 53674402 53613322 53189112 52460319 51535000 50573223 49761315 49262276
12511 49262276 49162541 49438681 49958824 50518707 50896477 50903209 50413693 49375092 47797354
$$ packed form
12569E6661869L68634P37311J232196J772235K254927K591855K738607K699784
12561G1057418K506163K182551J732324J148640M39487l53007j149357j847559
12553G5716660k352424k607139k609844k406815k070149j676870j300230j010356
12545E9682833q73701r42936j236956j721269k304786k861625l268150l434628
12537D3038782l319789k931470k319455j562051p47760M3563P54431J354216J833323
12528C6143790K190341K419985K510332K451858K251426J938600J557024J147148
12520E2610504P34336L29562o1080m24210p28793r25319r61777q11908m99039
12511D9262276r9735K76140N20143N59883L77770O732m89516j038601j577738
$$ plain form
12502 47797354 45732868 43259167 40477760 37526803 34588214 31870792 29570729 27829964
12494 27829964 26712373 26202230 26216880 26624379 27261854 27955197 28542921 28904014 28982042
12485 28982042 28795005 28428195 28015625 27714890 27675841 28005767 28741484 29841076 31199915
12476 31199915 32683633 34164707 35551340 36801123 37913894 38904064 39766263 40457625
12468 40457625 40911184 41073154 40941408 40583535 40126341 39724243 39522547 39630108 40109437
12459 40109437 40984835 42259261 43923786 45949440 48266710 50748118 53207024 55416664
12451 55416664 57146005 58205303 58489717 58003959 56854732 55213910 53270139 51188647
12443 51188647 49090813 47054073 45123292 43321651 41654464 40107425 38644900 37214187
$$ packed form
12502D7797354k064486k473701k781407k950957k938589k717422k300063j740765
12494B7829964j117591n10143J4650M07499O37475O93343N87724L61093P8028
12485B8982042j87037l66810m12570l00735l9049L29926P35717J099592J358839
12476C1199915J483718J481074J386633J249783J112771R90170Q62199O91362
12468D0457625M53559J61970j31746l57873m57194m02098k01696J07561M79329
12459D0109437Q75398J274426J664525K025654K317270K481408K458906K209640
12451E5416664J729341J059298K84414m85758j149227j640822j943771k081492
12443E1188647k097834k036740j930781j801641j667187j547039j462525j430713
$$ plain form
12435 37214187 35758751 34236966 32637676 30985541 29335121 27757379 26324124 25094298
12427 25094298 24102600 23348459 22784526 22309350 21774451 21012835 19882731 18307603 16294186
12418 16294186 13925498 11341383 8719046 6254253 4138958 2537568 1569117 1299317
12410 1299317 1739623 2848324 4533281 6660039 9067164 11587201 14069724 16399246
12402 16399246 18498315 20314019 21801665 22925438 23680352 24115740 24333710 24455618 24576801
12393 24576801 24738278 24928914 25111190 25253525 25352876 25439126 25562835 25775108 26111808 26592986
12383 26592986 27239010 28089382 29203042 30631433 32379665 34383302 36516856 38627581
12375 38627581 40574607 42255559 43614559 44636770 45339704 45769832 46004954 46152935 46335951
$$ packed form
12435C7214187j455436j521785j599290j652135j650420j577742j433255j229826
12427B5094298r91698p54141n63933m75176n34899p61616j130104j575128k013417
12418A6294186k368688k584115k622337k464793k115295j601390r68451k69800
12410A299317M40306J108701J684957K126758K407125K520037K482523K329522
12402A6399246K099069J815704J487646J123773P54914M35388K17970J21908J21183
12393B4576801J61477J90636J82276J42335R9351Q6250J23709K12273L36700M81178
12383B6592986O46024Q50372J113660J428391J748232K003637K133554K110725
12375C8627581J947026J680952J359000J022211P02934M30128K35122J47981J83016
$$ plain form
12366 46335951 46659395 47176096 47860645 48606330 49250118 49618808 49578351 49068666 48117110
12357 48117110 46832142 45378686 43936881 42654499 41612750 40821892 40247581 39853367
12349 39853367 39637286 39643378 39942559 40595819 41621892 42984499 44599012 46348318 48098987
12340 48098987 49718267 51097781 52182347 52989450 53604185 54150108 54752475 55511200 56489655
12331 56489655 57715520 59187491 60882208 62755485 64734711 66708223 68524782 70012421
12323 70012421 71013415 71421479 71204579 70401700 69094214 67367285 65282736 62876130
12315 62876130 60176581 57235820 54146212 51032837 48024088 45220570 42677580 40403183
12307 40403183 38370220 36540731 34893205 33434984 32190187 31173075 30367700 29727375
$$ packed form
12366D6335951L23444N16701O84549P45685O43788L68690m0457n09685r51556
12357D8117110j284968j453456j441805j282382j041749p90858n74311l94214
12349C9853367k16081O092K99181O53260J026073J362607J614513J749306J750669
12340D8098987J619280J379514J084566Q07103O14735N45923O02367P58725R78455
12331E6489655J225865J471971J694717J873277J979226J973512J816559J487639
12323G0012421J000994M08064k16900q02879j307486j726929k084549k406606
12315F2876130k699549k940761l089608l113375l008749k803518k542990k274397
12307D0403183k032963j829489j647526j458221j244797j017112q05375o40325
$$ plain form
12299 29727375 29192221 28713322 28270728 27876243 27560103 27350863 27261622 27289219 27421540 27642378
12289 27642378 27930090 28258494 28608835 28987222 29430827 29992249 30707285 31560788 32463849
12280 32463849 33252292 33714181 33644269 32907068 31482991 29479493 27103750 24607862 22227077
12271 22227077 20132356 18411203 17079618 16116703 15504485 15252556 15394173 15958202 16938675
12262 16938675 18284540 19914780 21745192 23708276 25756762 27854244 29963134 32039331
12254 32039331 34038551 35932206 37723183 39449744 41170112 42927821 44707594 46403386
12246 46403386 47824854 48752216 49018010 48575045 47519572 46065136 44482681 43027505
12238 43027505 41872065 41064072 40526861 40103741 39625043 38965002 38065653 36927975 35588047
$$ packed form
12299B9727375n35154m78899m42594l94485l16140k09240q9241K7597J32321K20838
12289B7642378K87712L28404L50341L78387M43605N61422P15036Q53503R03061
12280C2463849P88443M61889o9912p37201j424077k003498k375743k495888k380785
12271B2227077k094721j721153j331585r62915o12218k51929J41617N64029R80473
12262A6938675J345865J630240J830412J963084K048486K097482K108890K076197
12254C2039331J999220J893655J790977J726561J720368J757709J779773J695792
12246D6403386J421468R27362K65794m42965j055473j454436j582455j455176
12238D3027505j155440q07993n37211m23120m78698o60041q99349j137678j339928
$$ plain form
12229 35588047 34097199 32514704 30911031 29374006 28008205 26921743 26204913 25911941
12221 25911941 26052453 26591000 27453150 28540181 29749785 30994378 32213369 33381691
12213 33381691 34513274 35655610 36876855 38248861 39824784 41611755 43550766 45520583
12205 45520583 47368513 48951236 50163836 50947589 51283282 51182920 50685778 49855541 48776248
12196 48776248 47552456 46315307 45220853 44424207 44033834 44073474 44478036 45124742 45875670
12187 45875670 46605047 47204583 47581344 47663552 47413669 46837179 45978975 44908042 43697803
12178 43697803 42413475 41115315 39874204 38783803 37955341 37494381 37471272 37902611 38757164
12169 38757164 39983520 41537508 43386257 45488370 47773374 50141973 52486179 54710881
$$ packed form
12229C5588047j490848j582495j603673j537025j365801j086462p16830k92972
12221B5911941J40512N38547Q62150J087031J209604J244593J218991J168322
12213C3381691J131583J142336J221245J372006J575923J786971J939011J969817
12205D5520583J847930J582723J212600P83753L35693j00362m97142q30237j079293
12196D8776248j223792j237149j094454p96646l90373L9640M04562O46706P50928
12187D5875670P29377N99536L76761Q2208k49883n76490q58204j070933j210239
12178D3697803j284328j298160j241111j090401q28462m60960k3109M31339Q54553
12169C8757164J226356J553988J848749K102113K285004K368599K344206K224702
$$ plain form
12161 54710881 56741866 58520943 59998095 61127619 61870155 62200994 62122692 61676240 60944175
12152 60944175 60041936 59098703 58234825 57545290 57093274 56908411 56982665 57266974 57680607
12143 57680607 58136971 58571929 58954904 59277484 59533432 59708384 59785225 59755773 59623799 59393053
12133 59393053 59050522 58562601 57890183 57011002 55934339 54704731 53400666 52131629 51029545
12124 51029545 50230434 49849247 49955291 50552722 51569412 52861690 54241360 55520152 56555761
12115 56555761 57283179 57723616 57971203 58159463 58412671 58799270 59311361 59878812 60401499
12106 60401499 60776627 60912570 60735467 60195916 59275498 57989599 56386209 54542202 52556426
12097 52556426 50539865 48607481 46873871 45444015 44388726 43711389 43329279 43088175
$$ packed form
12161E4710881K030985J779077J477152J129524P42536L30839p8302m46452p32065
12152F0944175r02239r43233q63878o89535m52016j84863P4254K84309M13633
12143E7680607M56364M34958L82975L22580K55948J74952P6841k9452j31974k30746
12133E9393053l42531m87921o72418q79181j076663j229608j304065j269037j102084
12124E1029545p99111l81187J06044N97431J016690J292278J379670J278792J035609
12115E6555761P27418M40437K47587J88260K53208L86599N12091N67451N22687
12106F0401499L75128J35943j77103n39551r20418j285899j603390j844007j985776
12097E2556426k016561j932384j733610j429856j055289o77337l82110k41104
$$ plain form
12089 43088175 42808122 42339509 41602681 40594692 39367955 37999137 36562344 35110898
12081 35110898 33669584 32240083 30818264 29413425 28056012 26789630 25658182 24702810
12073 24702810 23971090 23525531 23435049 23745652 24445822 25450910 26618423 27783684 28795849
12064 28795849 29543504 29970050 30078688 29920881 29564588 29051958 28367931 27439536 26169816
12055 26169816 24489815 22401759 19994748 17430839 14911084 12635139 10766585 9411433
12047 9411433 8613039 8363234 8624143 9349189 10490849 11990794 13761540 15676629 17582245
12038 17582245 19330336 20820033 22026868 23002149 23839615 24627384 25413731 26202272 26966188
12029 26966188 27659863 28220706 28572865 28645522 28401904 27860700 27094485 26206141 25298155
$$ packed form
12089D3088175k80053m68613p36828j007989j226737j368818j436793j451446
12081C5110898j441314j429501j421819j404839j357413j266382j131448r55372
12073B4702810p31720m45559r0482L10603P00170J005088J167513J165261J012165
12064B8795849P47655M26546J08638j57807l56293n12630o84027r28395j269720
12055B6169816j680001k088056k407011k563909k519755k275945j868554j355152
12047I411433p98394k49805K60909P25046J141660J499945J770746J915089J905616
12038A7582245J748091J489697J206835R75281Q37466P87769P86347P88541P63916
12029B6966188O93675N60843L52159P2657k43618n41204p66215q88344r07986
$$ plain form
12020 25298155 24452254 23729439 23188396 22908949 23000915 23582533 24730146 26425030 28533209
12011 28533209 30834746 33084149 35067149 36634348 37715699 38325634 38558294 38565270 38515829
12002 38515829 38553431 38766272 39180292 39770218 40477228 41225248 41937738 42559552 43078072
11993 43078072 43529386 43983450 44516097 45179057 45975899 46853318 47716351 48463027 49018680
11984 49018680 49350646 49459563 49358436 49053515 48533776 47769601 46721963 45364451 43712314
11975 43712314 41840407 39872860 37946446 36170366 34607942 33288368 32234930 31487385
11967 31487385 31104045 31143133 31633235 32547414 33794458 35232567 36701622 38064519 39244072
11958 39244072 40241045 41124811 41998220 42948944 44008443 45139627 46259878 47285489 48171029
$$ packed form
12020B5298155q45901p22815n41043k79447R1966N81618J147613J694884K108179
12011B8533209K301537K249403J983000J567199J081351O09935K32660O976m9441
12002C8515829L7602K12841M14020N89926P07010P48020P12490O21814N18520
11993D3078072M51314M54064N32647O62960P96842Q77419Q63033P46676N55653
11984D9018680L31966J08917j01127l04921n19739p64175j047638j357512j652137
11975D3712314j871907j967547j926414j776080j562424j319574j053438p47545
11967C1487385l83340L9088M90102R14179J247044J438109J469055J362897J179553
11958C9244072R96973Q83766Q73409R50724J059499J131184J120251J025611Q85540
$$ plain form
11949 48171029 48920263 49563257 50118511 50571710 50888865 51051110 51081666 51049255 51057027 51231074
11939 51231074 51705453 52591101 53932090 55672680 57654980 59646839 61387037 62635368
11931 62635368 63216201 63043134 62118964 60518379 58366643 55821763 53059462 50257679
11923 50257679 47580388 45164510 43113545 41498249 40361097 39718920 39558514 39825504
11915 39825504 40415308 41179042 41950940 42590345 43019964 43242577 43330843 43397831 43560305 43905214
11905 43905214 44468088 45229357 46128168 47085219 48023308 48879904 49614092 50211451 50684863
11896 50684863 51065707 51385908 51662255 51897001 52096797 52295309 52558714 52963933 53561126
11887 53561126 54347837 55274761 56276739 57302417 58319461 59292399 60150929 60775392 61014816
$$ packed form
11949D8171029P49234O42994N55254M53199L17155J62245L0556l2411P772J74047
11939E1231074M74379Q85648J340989J740590J982300J991859J740198J248331
11931F2635368N80833j73067r24170j600585k151736k544880k762301k801783
11923E0257679k677291k415878k050965j615296j137152o42177j60406K66990
11915C9825504N89804P63734P71898O39405M29619K22613Q8266O6988J62474L44909
11905D3905214N62874P61269Q98811R57051R38089Q56596P34188N97359M73412
11896E0684863L80844L20201K76347K34746J99796J98512K63405M05219N97193
11887E3561126P86711R26924J001978J025678J017044R72938Q58530O24463K39424
$$ plain form
11878 61014816 60726571 59808581 58205973 55902622 52921479 49343549 45331438 41131857
11870 41131857 37039329 33326729 30175245 27644658 25699717 24269077 23297078 22764798
11862 22764798 22680156 23047580 23831378 24931120 26184424 27397583 28388437 29023109 29239221
11853 29239221 29059164 28595465 28040416 27630126 27586662 28059031 29086702 30596215 32425485
11844 32425485 34363538 36195157 37740905 38880706 39555318 39757145 39528660 38971183 38246841
11835 38246841 37555837 37089838 36981380 37273094 37919318 38816727 39850014 40935208 42044554
11826 42044554 43203770 44466071 45879479 47463363 49198316 51023885 52838917 54505149
11818 54505149 55858562 56732010 56987654 56551573 55439394 53762705 51712677 49528182
$$ packed form
11878F1014816k88245r17990j602608k303351k981143l577930m012111m199581
11870D1131857m092528l712600l151484k530587j944941j430640r71999n32280
11862B2764798q4642L67424P83798J099742J253304J213159R90854O34672K16112
11853B9239221j80057m63699n55049m10290m3464M72369J027671J509513J829270
11844C2425485J938053J831619J545748J139801O74612K01827k28485n57477p24342
11835C8246841o91004m65999j08458K91714O46224Q97409J033287J085194J109346
11826D2044554J159216J262301J413408J583884J734953J825569J815032J666232
11818E4505149J353413Q73448K55644m36081j112179j676689k050028k184495
$$ plain form
11810 49528182 47461345 45746494 44568579 44029875 44125672 44742524 45681120 46694093 47528943
11801 47528943 47970458 47873886 47175858 45879279 44025935 41676267 38905215 35810235 32521818
11792 32521818 29206801 26057352 23265289 20991631 19346521 18386981 18125628 18537594
11784 18537594 19561879 21106382 23066356 25350925 27897667 30660836 33582141 36568509
11776 36568509 39492677 42214037 44608894 46601738 48190781 49457556 50549705 51636455
11768 51636455 52852096 54251067 55793149 57361814 58802808 59964988 60731757 61037675
11760 61037675 60866517 60232387 59157809 57669522 55820689 53723509 51561779 49563616
11752 49563616 47940905 46821805 46203680 45943300 45789896 45454390 44693272 43376865 41519333
$$ packed form
11810D9528182k066837j714851j177915n38704R5797O16852R38596J012973Q34850
11801D7528943M41515r6572o98028j296579j853344k349668k771052l094980l288417
11792C2521818l315017l149449k792063k273658j645110r59540k61353M11966
11784A8537594J024285J544503J959974K284569K546742K763169K921305K986368
11776C6568509K924168K721360K394857J992844J589043J266775J092149J086750
11768E1636455J215641J398971J542082J568665J440994J162180P66769L05918
11760F1037675j71158o34130j074578j488287j848833k097180k161730j998163
11752D9563616j622711j119100o18125k60380j53404l35506p61118j316407j857532
$$ plain form
11743 41519333 39266847 36855532 34554066 32603788 31169746 30314768 29999121 30098005 30429042
11734 30429042 30787713 30988618 30903964 30487771 29778676 28881574 27935292 27077755 26418788
11725 26418788 26024586 25913771 26065141 26435544 26978809 27654372 28425479 29258168 30127390
11716 30127390 31022258 31937154 32846970 33683363 34336338 34689745 34670226 34276300 33572689
11707 33572689 32664395 31675314 30742699 30018661 29659600 29792597 30470136 31641051 33158369
11698 33158369 34819908 36417390 37768861 38726835 39176548 39044265 38319151 37072412 35453977
11689 35453977 33660909 31889904 30294467 28962102 27916994 27146689 26643456 26440198
11681 26440198 26618786 27284566 28522680 30360359 32751158 35582549 38697899 41922175
$$ packed form
11743D1519333k252486k411315k301466j950278j434042q54978l15647R8884L31037
11734C0429042L58671K00905q4654m16193p09095q97102r46282q57537o58967
11725B6418788l94202j10815J51370L70403N43265O75563P71107Q32689Q69222
11716C0127390Q94868R14896R09816Q36393O52975L53407j9519l93926p03611
11707C3572689r08294r89081r32615p24038l59061J32997O77539J170915J517318
11698C3158369J661539J597482J351471R57974M49713j32283p25114j246739j618435
11689C5453977j793068j771005j595437j332365j045108p70305n03233k03258
11681B6440198J78588O65780J238114J837679K390799K831391L115350L224276
$$ [...]
##END NTUPLES=NMR SPECTRUM
##END=
