##TITLE=31P ikalashn
DE-77rm_5h(nlock)
14.11.2024
##JCAMPDX= 6.0         $$ Bruker NMR JCAMP-DX V2.0
##DATA TYPE= NMR SPECTRUM
##DATA CLASS= NTUPLES
##ORIGIN= UXNMR, Bruker Analytische Messtechnik GmbH
##OWNER= root
$$ TOPSPIN		Version 1.3
$$ 2024-11-14 16:09:15.359 +0400  Irina@DPX200
$$ Compression mode = diff/dup
##.OBSERVE FREQUENCY= 81.01967998063
##.OBSERVE NUCLEUS= ^31P
##.ACQUISITION MODE= SIMULTANEOUS
##.ACQUISITION SCHEME= undefined
##.AVERAGES= 64
##.DIGITISER RES= 17
##SPECTROMETER/DATA SYSTEM= spect
##.PULSE SEQUENCE= zgpg
##.SOLVENT NAME= D2O
##.SHIFT REFERENCE= INTERNAL, D2O, 1, 298.5841
##AUDIT TRAIL= $$ (NUMBER, WHEN, WHO, WHERE, WHAT)
$$ ##TITLE= Audit trail, TOPSPIN		Version 1.3
$$ ##JCAMPDX= 5.01
$$ ##ORIGIN= Bruker BioSpin GmbH
$$ ##OWNER= Irina
$$ $$ F:/spectra/data/iren/nmr/P31dec/1/pdata/1/auditp.txt
$$ ##AUDIT TRAIL=  $$ (NUMBER, WHEN, WHO, WHERE, VERSION, WHAT)
(   1,<2024-11-14 16:08:10.281 +0400>,<Irina>,<DPX200>,<TOPSPIN 1.3>,
      <created by zg
	started at 2024-11-14 16:06:27.359 +0400,
	POWCHK disabled, PULCHK disabled
       configuration hash MD5:
       BE 6D 3F 07 2A EA 11 49 91 17 2B D3 AF B3 58 0D
       data hash MD5: 32K
       EE FD D8 2E 8A D7 D2 62 BB DA C1 E7 01 92 D1 93>)
(   2,<2024-11-14 16:08:58.109 +0400>,<Irina>,<DPX200>,<TOPSPIN 1.3>,
      <Start of raw data processing
       efp BC_mod = 2 LB = 10 FT_mod = 6 PKNL = 1 PHC0 = 241.2667 PHC1 = -14.09473 SI = 32K 
       data hash MD5: 32K
       B8 51 19 2E A9 5B 63 75 B4 48 10 A8 75 7E B4 CF>)
(   3,<2024-11-14 16:09:00.359 +0400>,<Irina>,<DPX200>,<TOPSPIN 1.3>,
      <apk 
       data hash MD5: 32K
       67 DC 29 8A 76 4A DE FB B4 9C 81 21 B8 58 7C 8D>)
(   4,<2024-11-14 16:09:02.328 +0400>,<Irina>,<DPX200>,<TOPSPIN 1.3>,
      <abs n ABSG = 5 
       data hash MD5: 32K
       1B DA 78 ED 70 E1 D0 18 38 09 C4 2B D9 F3 6C 97>)
$$ ##END=
$$ 
$$ $$ hash MD5
$$ $$ 84 06 8A D2 46 63 62 0D 16 5E 00 92 C2 E2 E1 D0
##$RELAX= 
##$RELAX= 
##$RELAX= 
##$RELAX= 
##$RELAX= 
##$RELAX= 
##$RELAX= 
##$RELAX= 
##$RELAX= 
##$RELAX= 
##$RELAX= 
$$ Bruker specific parameters
$$ --------------------------
##$DU= <F:/spectra>
##$EXPNO= 1
##$NAME= <P31dec>
##$PROCNO= 1
##$TYPE= <nmr>
##$USER= <iren>
##$AMP= (0..31)
100 100 100 100 100 100 100 100 100 100 100 100 100 100 100 100 100 100 
100 100 100 100 100 100 100 100 100 100 100 100 100 100 
##$ANAVPT= -1
##$AQSEQ= 0
##$AQ_mod= 1
##$AUNM= <au_zg>
##$AUTOPOS= <>
##$BF1= 81.014009
##$BF2= 200.13
##$BF3= 200.13
##$BF4= 200.13
##$BF5= 200.13
##$BF6= 200.13
##$BF7= 200.13
##$BF8= 200.13
##$BYTORDA= 1
##$CFDGTYP= 0
##$CFRGTYP= 5
##$CHEMSTR= <none>
##$CNST= (0..63)
1 1 145 1 1 1 1 1 1 1 1 1 1 1 1 1 1 1 1 1 1 1 1 1 1 1 1 1 1 1 1 1 1 1 
1 1 1 1 1 1 1 1 1 1 1 1 1 1 1 1 1 1 1 1 1 1 1 1 1 1 1 1 1 1 
##$CPDPRG= <waltz16>
##$CPDPRG1= <>
##$CPDPRG2= <waltz16>
##$CPDPRG3= <>
##$CPDPRG4= <mlev>
##$CPDPRG5= <mlev>
##$CPDPRG6= <mlev>
##$CPDPRG7= <mlev>
##$CPDPRG8= <mlev>
##$CPDPRGB= <>
##$CPDPRGT= <>
##$D= (0..63)
$$ [...]
##$SW_h= 37037.037037037
##$TD= 32768
##$TD0= 1
##$TE= 300
##$TE2= 300
##$TE3= 300
##$TEG= 300
##$TL= (0..7)
0 120 53 12 22 120 120 120 
##$TP= (0..7)
150 150 150 150 150 150 150 150 
##$TP07= 0
##$TPNAME0= <>
##$TPNAME1= <>
##$TPNAME2= <>
##$TPNAME3= <>
##$TPNAME4= <>
##$TPNAME5= <>
##$TPNAME6= <>
##$TPNAME7= <>
##$TPOAL= (0..7)
0.5 0.5 0.5 0.5 0.5 0.5 0.5 0.5 
##$TPOFFS= (0..7)
0 0 0 0 0 0 0 0 
##$TUNHIN= 0
##$TUNHOUT= 0
##$TUNXOUT= 0
##$USERA1= <user>
##$USERA2= <user>
##$USERA3= <user>
##$USERA4= <user>
##$USERA5= <user>
##$V9= 5
##$VALIST= <valist>
##$VCLIST= <CCCCCCCCCCCCCCC>
##$VD= 0
##$VDLIST= <DDDDDDDDDDDDDDD>
##$VPLIST= <PPPPPPPPPPPPPPP>
##$VTLIST= <TTTTTTTTTTTTTTT>
##$WBST= 1024
##$WBSW= 4
##$XGAIN= (0..3)
0 0 0 0 
##$XL= 0
##$YL= 0
##$YMAX_a= 10675
##$YMIN_a= -4449
##$ZGOPTNS= <>
##$ZL1= 120
##$ZL2= 120
##$ZL3= 120
##$ZL4= 120
##$ABSF1= 298.5841
##$ABSF2= -158.5842
##$ABSG= 5
##$ABSL= 5
##$ALPHA= 0
##$AQORDER= 0
##$ASSFAC= 0
##$ASSFACI= 0
##$ASSFACX= 0
##$ASSWID= 0
##$AUNMP= <proc_1d>
##$AXLEFT= 0
##$AXRIGHT= 0
##$AXTYPE= 0
##$AXUNIT= <>
##$AZFE= 0.1
##$AZFW= 0.5
##$BCFW= 0
##$BC_mod= 2
##$BYTORDP= 0
##$COROFFS= 0
##$CY= 12.5935478210449
##$DATMOD= 1
##$DC= 0
##$DFILT= <>
##$DTYPP= 0
##$F1P= 47.1127640792319
##$F2P= -24.0371245302204
##$FCOR= 0.5
##$FTSIZE= 32768
##$FT_mod= 6
##$GAMMA= 0
##$GB= 0
##$INTBC= 1
##$INTSCL= 7.269226e-011
##$ISEN= 30
##$LB= 10
##$LEV0= 0
##$LPBIN= 0
##$MAXI= 12.09355
##$MC2= 0
##$MEAN= 0
##$ME_mod= 0
##$MI= 0.7550151
##$NCOEF= 0
##$NC_proc= -10
##$NLEV= 6
##$NOISF1= 298.5841
##$NOISF2= 270.0111
##$NSP= 0
##$NTH_PI= 0
##$NZP= 0
##$OFFSET= 298.5841
##$PC= 1.4
##$PHC0= 228.164
##$PHC1= 4.358885
##$PH_mod= 1
##$PKNL= yes
##$PPARMOD= 0
##$PPDIAG= 0
##$PPIPTYP= 0
##$PPMPNUM= 100
##$PPRESOL= 1
##$PSCAL= 0
##$PSIGN= 0
##$REVERSE= no
##$SF= 81.014009
##$SI= 32768
##$SIGF1= 270.0111
##$SIGF2= -158.5842
##$SINO= 77.54984
##$SIOLD= 32768
##$SREGLST= <31P.CDCl3>
##$SSB= 0
##$STSI= 32768
##$STSR= 0
##$SW_p= 37037.037037037
##$SYMM= 0
##$S_DEV= 0
##$TDeff= 32768
##$TDoff= 0
##$TI= <>
##$TILT= no
##$TM1= 0
##$TM2= 0
##$TOPLEV= 0
##$USERP1= <user>
##$USERP2= <user>
##$USERP3= <user>
##$USERP4= <user>
##$USERP5= <user>
##$WDW= 1
##$XDIM= 32768
##$YMAX_p= 282331504
##$YMIN_p= -3541829
$$ End of Bruker specific parameters
$$ ---------------------------------
##NTUPLES= NMR SPECTRUM
##VAR_NAME=  FREQUENCY,     SPECTRUM/REAL,   SPECTRUM/IMAG
##SYMBOL=    X,             R,               I
##VAR_TYPE=  INDEPENDENT,   DEPENDENT,       DEPENDENT
##VAR_FORM=  AFFN,          ASDF,            ASDF
##VAR_DIM=   32768,         32768,           32768
##UNITS=     HZ,            ARBITRARY UNITS, ARBITRARY UNITS
##FACTOR=    1.13031516577767, 1,            1
##FIRST=     37037.037037037, 62556,         1037207
##LAST=      0,             165701,          -4155922
##MIN=       0,             -3541829,        0
##MAX=       37037.037037037, 282331504,     0
$$ Real data points
##PAGE= N=1
##DATA TABLE= (X++(R..R)), XYDATA
$$ [...]
18583b174302K51199L56492M47599N08004N32510N18599M67204L82778K75250
18574A565333J74147J11652Q4158N5023j205p9918j70977k61127l22623l25438
18564H29025k63438j69902r6944p5466j03880j66791k41101k83086k54477j64829
18554i90889n8124J9555L8173J4669J0378O1314J39135J88321J70463R6500K7542
18543b82963J4184M0694M8822R550n5520j12694j42500j35044r3789m4801j3982
18532g68043j302Q778K3317L2043K2836j46k5454n6434j05172j57561j74260j42352
18520a343750r5458o9157o0865m3705M537R2375K04478K94189L17077K77538K18757
18509b03984J69279J22164O7096J9598k591o531q462j7006k8803k4224J5941Q7996
$$ plain form
18583 -2174302 -1923103 -1566611 -1119012 -611008 -78498 440101 907305 1290083 1565333
18574 1565333 1739480 1851132 1935290 1990313 1989108 1909190 1738213 1477086 1154463 829025
18564 829025 565587 395685 298741 223275 119395 -47396 -288497 -571583 -826060 -990889
18554 -990889 -1049013 -1029458 -991285 -976616 -966238 -904924 -765789 -577468 -407005 -310505 -282963
18543 -282963 -268779 -228085 -179263 -169713 -225233 -337927 -480427 -615471 -709260 -754061 -768043
18532 -768043 -769345 -760567 -737250 -705207 -682371 -682517 -707971 -764405 -869577 -1027138 -1201398 -1343750
18520 -1343750 -1439208 -1508365 -1569230 -1612935 -1608398 -1516023 -1311545 -1017356 -700279 -422741 -203984
18509 -203984 -34705 87459 154555 174153 171562 165031 156569 139563 110760 86536 102477 190473
18497A90473J66073K14789K12216J59118P0766l1553j28942j98754k22738k17747
18487B13701k21692k43225k54382k27232j66262r8289m0663n507j3991p2539j50360
18476a280441j95589j80499j27635p6788m9481m6176n1151m1351j100O8711J49947
18465a831553K11965K30274K03486J51587R6582N1432K1745J1119K4868N9033
18455g69462J01738J51521K17099K88644L32203L31607K96099K23024J09668j6692
18445A265449j22153j82630j78192j10339j9251M4670O6641O8098O4649M6344
18435I43286Q702k9689n3279p6308j34693k31181l04419k94468k11225j12760
18425d96034m3373j2458j2223k6949m7516p1811p8254n1051j4451O992K8319O8538
$$ plain form
18497 190473 356546 571335 783551 942669 1013435 981882 852940 654186 431448 213701
18487 213701 -7991 -251216 -505598 -732830 -899092 -997381 -1038044 -1043551 -1057542 -1130081 -1280441
18476 -1280441 -1476030 -1656529 -1784164 -1860952 -1910433 -1956609 -2007760 -2049111 -2050211 -1981500 -1831553
18465 -1831553 -1619588 -1389314 -1185828 -1034241 -937659 -886227 -864482 -853363 -828495 -769462
18455 -769462 -667724 -516203 -299104 -10460 321743 653350 949449 1172473 1282141 1265449
18445 1265449 1143296 960666 782474 672135 652884 697554 764195 832293 896942 943286
18435 943286 951988 922299 869020 792712 658019 426838 122419 -172049 -383274 -496034
18425 -496034 -539407 -551865 -564088 -591037 -638553 -710364 -788618 -839669 -854120 -847128 -818809 -750271
18413g50271J08037J09892O2111q422n5784m7491J2505R3829J58395J67777J09209
18402d0213J6071n9405q2907m7459K4989R2776J29242J44704J51887J47228J32115
18391F09028J10406Q3165O1349O0047P3397Q0039P0810M7084L208o6500j45050
18380I86983k02927k30114k38970k41555k37002k19544j85484j28009m6798L2115
18370g11305P7375R4973J23583J86280K68252L35582L48856K77653J33022l0463
18360A103808j54767k21628k58256k86153k87289k43961j79967j37844j30691
18351g96748j31753j05904m8667O799K7385P479l5274p2473q3280o4942k2039
18340a319417L5562Q9907J19980J09659O4220P808m2397p8577q6027n4858J2593
$$ plain form
18413 -750271 -642234 -532342 -470231 -478653 -534437 -581928 -569423 -475594 -317199 -149422 -40213
18402 -40213 -24142 -83547 -166454 -213913 -188924 -96148 33094 177798 329685 476913 609028
18391 609028 719434 802599 863948 923995 997392 1077431 1148241 1195325 1198533 1132033 986983
18380 986983 784056 553942 314972 73417 -163585 -383129 -568613 -696622 -743420 -711305
18370 -711305 -633930 -538957 -415374 -229094 39158 374740 723596 1001249 1134271 1103808
18360 1103808 949041 727413 469157 183004 -104285 -348246 -528213 -666057 -796748
18351 -796748 -928501 -1034405 -1083072 -1076273 -1048888 -1041409 -1076683 -1149156 -1232436 -1297378 -1319417
18340 -1319417 -1283855 -1193948 -1073968 -964309 -900089 -892281 -934678 -1013255 -1099282 -1154140 -1141547
18329a141547J13688K34493L30720L50798K78228J45444J5082o5833j00869j21350
18319C8854j46134j81635k29901k71400k68324k03895r9870R3O2134Q2884P5938
18308a141256N9460M7028L6827K3266J5179K9066P0760J26440J59478J45177J00569
18297c28006O1466N0505O5932R8780J45414J93376K14415J84988J11260L0451
18287H28581k9720q4363j61109k54451l35649l93011m28779m20989l35306j91585
18277a806381o4504k925J008j9392k7188P311R0759J98865K99004L66595L75162
18266e81686L13880K10903J03080Q44r4564j61202j64885r3480K7595J61874K79366
18255A725L48308L45028K76764J79473Q4683n048r2391j52098j58208j31563j15199
$$ plain form
18329 -1141547 -1027859 -793366 -462646 -111848 166380 311824 326906 261073 160204 38854
18319 38854 -107280 -288915 -518816 -790216 -1058540 -1262435 -1362305 -1362212 -1300078 -1217194 -1141256
18308 -1141256 -1081796 -1034768 -997941 -974675 -959496 -930430 -859670 -733230 -573752 -428575 -328006
18297 -328006 -266540 -216035 -150103 -51323 94091 287467 501882 686870 798130 828581
18287 828581 798861 714498 553389 298938 -36711 -429722 -858501 -1279490 -1614796 -1806381
18277 -1806381 -1870885 -1873810 -1872802 -1892194 -1919382 -1912071 -1821312 -1622447 -1323443 -956848 -581686
18266 -581686 -267806 -56903 46177 47021 -47543 -208745 -373630 -467110 -439515 -277641 1725
18255 1725 350033 695061 971825 1151298 1235981 1230933 1138542 986444 828236 696673 581474
18244E81474j24136j43022j47809j30372r6620m7867Q406N2363P0226O0342K9046
18233A12031r033l7134o0551j05509j85854k78617l36391l35577l02578k80385
18223a819598k72277k34604j41704k2887Q5790J71704K25955K36408K05029J50857
18213a415327R8174P0953P5425Q4960P3723N3275M5280M1818J7631l0281o9326
18202i53695o5658k0980M6695J26647J94916K15405J77286J01995J8671m3813
18192b02531o1568m6927m8678r4959j62058k08507k18009j96307j48919p6489
18182a464952J6568J11853J73553J64982R2747J7943n160K0078N0006M9664K6433
18171g46285J6599M9038J34363K46759L20666L04675K04854P2475l2928p1436
$$ plain form
18244 581474 457338 314316 166507 36135 -60485 -108352 -99946 -47583 22643 82985 112031
18233 112031 102998 65864 5313 -100196 -286050 -564667 -901058 -1236635 -1539213 -1819598
18223 -1819598 -2091875 -2326479 -2468183 -2491070 -2405280 -2233576 -2007621 -1771213 -1566184 -1415327
18213 -1415327 -1317153 -1246200 -1170775 -1085815 -1012092 -958817 -913537 -871719 -854088 -884369 -953695
18202 -953695 -1019353 -1040333 -993638 -866991 -672075 -456670 -279384 -177389 -158718 -202531
18192 -202531 -264099 -311026 -359704 -454663 -616721 -825228 -1043237 -1239544 -1388463 -1464952
18182 -1464952 -1448384 -1336531 -1162978 -997996 -905249 -887306 -892466 -872388 -822382 -772718 -746285
18171 -746285 -729686 -680648 -546285 -299526 21140 325815 530669 603144 570216 498780
18161D98780m7255l502J8956N554k6076m2421l6154k2090l691J3904J3880l537
18149C66348j4452O152O9815J63291K53554L01383K74362J88008J06086N4158
18139A768705j6130j37448k62336l21201k88796k00681j28811j17595j51726j92226
18129d8245k13306k06518j74199j18519m8073J1481M3123O0690P9555Q9732P7343
18118d46936N7242N0452M1394j530q4812j94280l02616l75900l96527l53690k27662
18107b234865k2757K10726M02642M89112M39732K89938J19351k749m2205l40Q6249
18096b65166J64310K09090K41124K82137L11518K96443K39413J70732J04632K4266
18086A778499p9093j70797k03967j75364j30408j04195q5301n0317J1954J12176
$$ plain form
18161 498780 451525 448023 466979 472533 446457 404036 367882 345792 342101 356005 369885 366348
18149 366348 351896 358048 427863 591154 844708 1146091 1420453 1608461 1714547 1768705
18139 1768705 1752575 1615127 1352791 1031590 742794 542113 413302 295707 143981 -48245
18129 -48245 -261551 -468069 -642268 -760787 -808860 -797379 -754256 -693566 -614011 -524279 -446936
18118 -446936 -389694 -339242 -297848 -299378 -384190 -578470 -881086 -1256986 -1653513 -2007203 -2234865
18107 -2234865 -2257622 -2046896 -1644254 -1155142 -715410 -425472 -306121 -308870 -351075 -351415 -265166
18096 -265166 -100856 108234 349358 631495 943013 1239456 1478869 1649601 1754233 1778499
18086 1778499 1699406 1528609 1324642 1149278 1018870 914675 829374 779057 791011 903187
18076I03187K53619M02632M93886M77307L50104J53256m1689j70388k37591l06837
18066B277486m10744n18232n78594n64441m93139m02740k99616j68821k3076J02206
18056a079711J86618K29889K30545J88263J25099P0131L3853J2077q331l0286
18046d1853l8060k5338o23M1968J13607J89379K14882J46312j8496k24449l89256
18035c1927m61559m45023l75326k83940j86649r2326q366O4729J22647J45907
18025a551833J32591J13889J06932R0857N2174J4324J0520M8708J10349J62623
18015g08866J70487J22437M3864k3161n7781p5157r8502j24483j25165r3697o1723
18004a031747m4682j7571L6679Q2664O7749l805p7156j16582j30789j36706j25068
$$ plain form
18076 903187 1156806 1559438 2053324 2530631 2880735 3033991 2992302 2821914 2584323 2277486
18066 2277486 1866742 1348510 769916 205475 -287664 -690404 -990020 -1158841 -1181917 -1079711
18056 -1079711 -893093 -663204 -432659 -244396 -119297 -49166 -15313 -3236 -11567 -41853
18046 -41853 -79913 -105251 -105874 -63906 49701 239080 453962 600274 581778 357329 -31927
18035 -31927 -493486 -938509 -1313835 -1597775 -1784424 -1876750 -1885116 -1820387 -1697740 -1551833
18025 -1551833 -1419242 -1305353 -1198421 -1107564 -1055390 -1041066 -1030546 -981838 -871489 -708866
18015 -708866 -538379 -415942 -372078 -395239 -453020 -528177 -626679 -751162 -876327 -970024 -1031747
18004 -1031747 -1076429 -1094000 -1057321 -974657 -906908 -910713 -987869 -1104451 -1235240 -1371946 -1497014
17993a497014p9469j8365J4403J2232K1553P2128J37852J85938K11163K15935
17983g23644J95154J44975P0011n166m7403n1703m9902p5354j22221j59695j76496
17972a001444j66524j09288q035J04093K05572K95683L61356L72948L22301K35180
17962F11842J44775P2695L0357K8259P2959J44251J94980J85695J10224o313j15271
17951A474453j68660j67397j51323j37968j14281o9610n077P0719J37742J58230
17941A026828R5636m2404j96840k90984k73482j56627p281J06553J62459J86743
17931F10601K09194K33265K44968K20896J43489K6053r0643j69661k02514j99376
17921A026272j64854j01354k2044M0906N5306L8778M4713R0941J42561J55339
$$ plain form
17993 -1497014 -1576483 -1594848 -1580445 -1568213 -1546660 -1474532 -1336680 -1150742 -939579 -723644
17983 -723644 -528490 -383515 -313504 -318670 -366073 -417776 -467678 -543032 -665253 -824948 -1001444
17972 -1001444 -1167968 -1277256 -1285291 -1181198 -975626 -679943 -318587 54361 376662 611842
17962 611842 756617 829312 859669 887928 960887 1105138 1300118 1485813 1596037 1589724 1474453
17951 1474453 1305793 1138396 987073 849105 734824 665214 660137 730856 868598 1026828
17941 1026828 1122464 1080060 883220 592236 318754 162127 154846 261399 423858 610601
17931 610601 819795 1053060 1298028 1518924 1662413 1688466 1597823 1428162 1225648 1026272
17921 1026272 861418 760064 738020 778926 834232 873010 917723 1008664 1151225 1306564
17911A306564J25459R2621Q8984J05881J10035P3806r388j15946j98663k34294
17901A345059k44467k58585k79978k80902k25930j04585N2484J83451K26877J66358
17891E79782M5414o8968j37730j74526k12092k52553k74640k61646k09250j27353
17881a093562l0986O6219J43891J75499J45571P1220J2957K6710J04731J97717
17871a80033K65157K78255K17891J05811J844m9848m9107k7636k6409o5227j19179
17860C51519j38669r2409R561J16453J68776J46270P5721j0978r3267j42320j39554
17849B51103j04606p1887o2845r4527j79178k92809l73333l82842l47719l19270
17839a977913l04841k61053j65665n9069J0706M6569P7716J17052J56164J80543
$$ plain form
17911 1306564 1432023 1524644 1613628 1719509 1829544 1903350 1893962 1778016 1579353 1345059
17901 1345059 1100592 842007 562029 281127 55197 -49388 3096 186547 413424 579782
17891 579782 625196 556228 418498 243972 31880 -220673 -495313 -756959 -966209 -1093562
17881 -1093562 -1124548 -1058329 -914438 -738939 -593368 -522148 -509191 -482481 -377750 -180033
17871 -180033 85124 363379 581270 687081 688925 639077 589970 562334 535925 470698 351519
17860 351519 212850 120441 130002 246455 415231 561501 637222 626244 532977 390657 251103
17849 251103 146497 74610 11765 -82762 -261940 -554749 -928082 -1310924 -1658643 -1977913
17839 -1977913 -2282754 -2543807 -2709472 -2768541 -2757835 -2711266 -2633550 -2516498 -2360334 -2179791
17829b179791J81800J64141J43974J25671R9228P3700O9218P9841Q5993Q1419
17819a074806P5227Q2006R8725R8853O1535p351q2911j37472j61825j68269j64810
17808a381098j41891q7011n6J02254J97855K73525L07146K63511J47655J2139
17798c05971j04804j96003k61302k94843k77170j85912k8749J46725K78807L34296
17788h94926L24478K78655K17494J47237P2519J1697k1017l7895o4290j18247
17778h4295j96314k62383k72471k19521j30547l8502K8067O5218R9927J47760
17768h63061J87371J90358J56198J10075P5083M9506J3503l5779o1685k6014O1850
17757a42595J59299K27411K42122J97134J10357K7263l632J8846M0237O679q0355
$$ plain form
17829 -2179791 -1997991 -1833850 -1689876 -1564205 -1464977 -1391277 -1322059 -1242218 -1156225 -1074806
17819 -1074806 -999579 -917573 -818848 -719995 -658460 -665811 -748722 -886194 -1048019 -1216288 -1381098
17808 -1381098 -1522989 -1610000 -1610056 -1507802 -1309947 -1036422 -729276 -465765 -318110 -305971
17798 -305971 -410775 -606778 -868080 -1162923 -1440093 -1626005 -1654754 -1508029 -1229222 -894926
17788 -894926 -570448 -291793 -74299 72938 145457 157154 136137 98242 33952 -84295
17778 -84295 -280609 -542992 -815463 -1034984 -1165531 -1204033 -1175966 -1110748 -1010821 -863061
17768 -863061 -675690 -485332 -329134 -219059 -143976 -94470 -80967 -116746 -178431 -204445 -142595
17757 -142595 16704 244115 486237 683371 793728 820991 817359 836205 876442 883121 802766
17746H02766j75858k53152l10790l33915k95519j75507K2400K49310M15240M49343
17736C94318L61022K22805R8290R500l9640m7900k1975P376n701o8583j37354
17725G72158j62753j29308o8317k9272k8520l6360k1568J1394M5811P7103J04118
17714E34486J27138J49569J65420J55515J08915L7762m2678j31107k26734l08029
17704E70257l32942k80024j83950j10020q8358r0524p9758n7278n0187p5699j31676
17693i10159j95688k33086k22568j67082q5162k886N2452O9167O0233M5115L4679
17682a554985L6764N5556Q8164J37653K14601L05777L60801L38588K58607J80207
17672D21733J39468J29588J24870J06775Q0727P2741J00884J55138K07720K33066
$$ plain form
17746 802766 626908 373756 62966 -270949 -566468 -741975 -719575 -470265 -55025 394318
17736 394318 755340 978145 1076435 1085935 1046295 998395 976420 983796 978095 909512 772158
17725 772158 609405 480097 411780 382508 353988 317628 296060 307454 353265 430368 534486
17714 534486 661624 811193 976613 1132128 1241043 1278805 1236127 1105020 878286 570257
17704 570257 237315 -42709 -226659 -336679 -425037 -515561 -595319 -652597 -702784 -778483 -910159
17693 -910159 -1105847 -1338933 -1561501 -1728583 -1813745 -1816631 -1764179 -1695012 -1634779 -1589664 -1554985
17682 -1554985 -1518221 -1462665 -1374501 -1236848 -1022247 -716470 -355669 -17081 241526 421733
17672 421733 561201 690789 815659 922434 1003161 1075902 1176786 1331924 1539644 1772710
17662A772710K18910J65582Q6366K635p2651j34863j76577k01897k34978k86821
17652A138416l32423l40879l18854k95977k75380k30579j49653o0844l254L158
17642h66269l7819r6264j33633j35438j17474r8140p0466j3270O6335J28776J46905
17631a226757J24371P8744L2755O199R296M8388J17689J87834K26136K15783J52358
17620b7204N5900k2158l4043J0209M7875M0696J6008J9374N2878Q0318Q1489O7118
17608C88460N6543P3614J31637K01384K26476J85332J10367M3901j372l7560p4246
17597A304536j14221j54849j91005k30279k82190l30993l51266l38361k95123
17588i83751k26434j48392p1669j86O2709J17412J58504J77796J78730J71312
$$ plain form
17662 1772710 1991620 2157202 2243568 2246203 2173552 2038689 1862112 1660215 1425237 1138416
17652 1138416 805993 465114 146260 -149717 -425097 -655676 -805329 -866173 -869427 -866269
17642 -866269 -904088 -1000352 -1133985 -1269423 -1386897 -1485037 -1555503 -1568773 -1502438 -1373662 -1226757
17631 -1226757 -1102386 -1023642 -990887 -984688 -975392 -927004 -809315 -621481 -395345 -179562 -27204
17620 -27204 28696 6538 -27505 -17296 30579 71275 87283 106657 159535 239853 321342 388460
17608 388460 445003 518617 650254 851638 1078114 1263446 1373813 1417714 1416342 1378782 1304536
17597 1304536 1190315 1035466 844461 614182 331992 999 -350267 -688628 -983751
17588 -983751 -1210185 -1358577 -1430246 -1430432 -1367723 -1250311 -1091807 -914011 -735281 -563969
17578e63969J65593J76527K06117K16317J55750K5681j04621j64702j45566q9698
17568a22571m8783n1658r1415j37614j60613j60179j66090j95940k30916k26067
17558a591846j38262L2952K35409M03367N01427N28631M93543L96242K43839P6181
17548A181483n0749j13703j33638j44607j70147k04564k17132j90031j42133j11607
17538b96828j06500q2728L863J34606K40628K72300K42029J91855J37566O9864
17528H06655j7710j21247k23794k92682k99184k53129j90990j25880m4839N8094
17518g04706J73944K80866L38602L14934K29205J32889N9153J9621J7941M2021
17508I04470O1038O5000P8202J12032J41706J29443O4540j7123n5738j9588N9724
$$ plain form
17578 -563969 -398376 -221849 -15732 200585 356335 382016 277395 112693 -32873 -122571
17568 -122571 -171354 -223012 -314427 -452041 -612654 -772833 -938923 -1134863 -1365779 -1591846
17558 -1591846 -1730108 -1697156 -1461747 -1058380 -556953 -28322 465221 861463 1105302 1181483
17548 1181483 1130734 1017031 883393 738786 568639 364075 146943 -43088 -185221 -296828
17538 -296828 -403328 -486056 -482193 -347587 -106959 165341 407370 599225 736791 806655
17528 806655 788945 667698 443904 151222 -147962 -401091 -592081 -717961 -762800 -704706
17518 -704706 -530762 -249896 88706 403640 632845 765734 824887 844508 862449 904470
17508 904470 965508 1030508 1108710 1220742 1362448 1491891 1556431 1539308 1483570 1463982 1523706
17497A523706J29897J70673J84057J71441J37524R8537P1256N2015K5601j0259
17487B554448n6807j19791j89044k35099k25208j54900n8580J1247M255q6763
17477A443758j99989k65170k65579k22282j71321j41564j21239o7124M1417J73203
17467B04110K72643K93741K23069R5638k4536r2747j10863j06622j05994j27259
17457E21180j72115k12826k08657j43519l9795N9328J26158J59947J58016J09893
17447C57610K6318n3934q9651n6671M3718J60559K13074J63589M2054q7294j71723
17436E47649j95714j78634j47306j12465p9602o3221p6144j09148j32588j22848
17426f70021q2732l5144q5K5926P3145J63219K67401L22270K85788J64611O924
$$ plain form
17497 1523706 1653603 1824276 2008333 2179774 2317298 2415835 2487091 2539106 2564707 2554448
17487 2554448 2497641 2377850 2188806 1953707 1728499 1573599 1515019 1526266 1530521 1443758
17477 1443758 1243769 978599 713020 490738 319417 177853 56614 -10510 30907 204110
17467 204110 476753 770494 993563 1089201 1064665 971918 861055 754433 648439 521180
17457 521180 349065 136239 -72418 -215937 -255732 -196404 -70246 89701 247717 357610
17447 357610 383928 329994 240343 183672 227390 387949 601023 764612 806666 719372 547649
17436 547649 351935 173301 25995 -86470 -166072 -229293 -305437 -414585 -547173 -670021
17426 -670021 -752753 -787897 -787982 -762056 -688911 -525692 -258291 63979 349767 514378 521302
17415E21302j16291j49800r5526j5445J6257l7427j60320k89393l58703l54936
17405a040282l21658k95821k64081k07791j41545q7919n4942m0584k7329J7526
17395b464426J07741K15717L05784L70019M09515M02209L26320K03746Q7296J8483
17385a7596m665j6719k8420k1715N94J7752K9041L8280L0110o548o9235j54180
17373b03301k43845k98111k86282k19165j26680l2564L9518P9220Q8437O3408
17363a139365J5668k4153m6591o7424q1236n7629M385O8523J02380J04742R5508
17352a025192Q0135M8540K968l6934n1840m8329n0996o2587o2720m7602l5933
17341a290490l3319l2654m0537p3610j39736k16695k47821j81814k8710J37562
$$ plain form
17415 521302 405011 255211 159685 144240 160497 123070 -37250 -326643 -685346 -1040282
17405 -1040282 -1361940 -1657761 -1921842 -2129633 -2271178 -2359097 -2414039 -2454623 -2481952 -2464426
17395 -2464426 -2356685 -2140968 -1835184 -1465165 -1055650 -653441 -327121 -123375 -36079 -17596
17385 -17596 -22261 -38980 -67400 -89115 -88521 -70769 -41728 -3448 26662 20114 -49121 -203301
17373 -203301 -447146 -745257 -1031539 -1250704 -1377384 -1409948 -1370430 -1291210 -1202773 -1139365
17363 -1139365 -1123697 -1147850 -1194441 -1261865 -1343101 -1400730 -1396345 -1327822 -1225442 -1120700 -1025192
17352 -1025192 -945057 -896517 -893549 -930483 -982323 -1030652 -1081648 -1144235 -1206955 -1254557 -1290490
17341 -1290490 -1323809 -1356463 -1397000 -1470610 -1610346 -1827041 -2074862 -2256676 -2285386 -2147824
17331b147824K51478L08568L41227L68940L82446L63926L06424K30817J85477
17322E91479J93929K08627J64533O3402m5419j30195j79917j83355j35331m9526
17312D98227L5066P2147N0639Q695n825J7618L9268J1724n9945j30899j71109
17301C65606j79956j64333j22496n8429J362K4692o042q7942j81497k23393j77316
17290h09744o0768O9608J58508J87355J75881J58641J50724J41027J13861O9290
17280C54383L1867L8078J09263K27570L36014L78169L40393K49889J36215O325
17270B208166j33165k59677l54963m17833m59558m95628n21520m92485l72485
17261a299148j91407o095J43357K25587K29989J79971J10972N1521R422k9913
$$ plain form
17331 -2147824 -1896346 -1587778 -1246551 -877611 -495165 -131239 175185 406002 591479
17322 591479 785408 994035 1158568 1221970 1176551 1046356 866439 683084 547753 498227
17312 498227 533293 605440 656079 664774 658949 676567 715835 727559 667614 536715 365606
17301 365606 185650 21317 -101179 -159608 -158246 -133554 -139596 -227538 -409035 -632428 -809744
17290 -809744 -870512 -800904 -642396 -455041 -279160 -120519 30205 171232 285093 354383
17280 354383 386250 424328 533591 761161 1097175 1475344 1815737 2065626 2201841 2208166
17270 2208166 2075001 1815324 1460361 1042528 582970 87342 -434178 -926663 -1299148
17261 -1299148 -1490555 -1496650 -1353293 -1127706 -897717 -717746 -606774 -555253 -545831 -575744
17251e75744o7820p2780j5094R5849K12209K86422L13909L21089L17947K89090
17241A105077K26666J42536N8106n655l7760l7412j1804K3451M8594M5507J781
17230A559087q2245j89770k95331l75913m11855l89457l16667k27619j48584p4568
17220i52922O757R4618J69428J97512J62926R6267M6967K1724j5802q6708j78484
17209d37717k63397l04632k76847j92340r4603k6436j351K904J4937M2135Q3165
17198a454182J42246K21222L08314L70424L76729L41160K96855K41592J55019
17189I99379M6691n0461j16283j43742j27693q0309l2222j278J1492Q029J693
17178E15296K1217Q4523J76735K64761L15838L05044K35875J51248J01980J06306
$$ plain form
17251 -575744 -643564 -716344 -731438 -635589 -423380 -136958 176951 498040 815987 1105077
17241 1105077 1331743 1474279 1532385 1526730 1488970 1451558 1439754 1463205 1511799 1557306 1559087
17230 1559087 1476842 1287072 991741 615828 203973 -185484 -502151 -729770 -878354 -952922
17220 -952922 -946165 -851547 -682119 -484607 -321681 -225414 -178447 -156723 -172525 -259233 -437717
17209 -437717 -701114 -1005746 -1282593 -1474933 -1569536 -1595972 -1597323 -1594419 -1579482 -1537347 -1454182
17198 -1454182 -1311936 -1090714 -782400 -411976 -35247 305913 602768 844360 999379
17189 999379 1046070 995609 879326 735584 607891 527582 495360 494082 505574 513603 515296
17178 515296 536513 621036 797771 1062532 1378370 1683414 1919289 2070537 2172517 2278823
17168B278823J35771J38577R0416J5640m6881q6251j37276k47682m10430n52863
17158A177844n96139n17799l71836k33518j31885n8642p042L1690Q0796J50959
17148d75572K07208K07757J69550J39228J30280J25309J04340N9944j732p5913
17138E90399j67052k66926l33874l29590k60361j58863m4178P9499J86591K31403
17128d72952K02928J53864J54429K18074K83947K83897K16784J33750O5384j2909
17118A227196j31914k67760l70896m25951m40273m07488l29796k48230k10158
17109a605270k19695k33492k00585j07386J2167J11088J70975J85799J43974O3548
17099a678877n252k2784J9760J09622K27972L50100M38278M59241M10030L22017
$$ plain form
17168 2278823 2414594 2553171 2643587 2659227 2612346 2526095 2388819 2141137 1730707 1177844
17158 1177844 581705 63906 -307930 -541448 -673333 -731975 -739017 -707327 -626531 -475572
17148 -475572 -268364 -60607 108943 248171 378451 503760 608100 668044 666312 590399
17138 590399 423347 156421 -177453 -507043 -767404 -926267 -970445 -890946 -704355 -472952
17128 -472952 -270024 -116160 38269 256343 540290 824187 1040971 1174721 1240105 1227196
17118 1227196 1095282 827522 456626 30675 -409598 -817086 -1146882 -1395112 -1605270
17109 -1605270 -1824965 -2058457 -2259042 -2366428 -2354261 -2243173 -2072198 -1886399 -1742425 -1678877
17099 -1678877 -1684129 -1706913 -1687153 -1577531 -1349559 -999459 -561181 -101940 308090 630107
17089F30107K36274J70326J23641R6106Q2634P1003N1600K5061n782n0214j22403
17078A308353k14608k88341l05350k63266j92376j18141l5223O6342J69209K44010
17068C70609K76407K65488K07220R8798m0360j69472k52167k74303k44271j87323
17058E0626j26680o5887j813O1185J21994J90504K73121L47939L71855L28232
17048A551076K49426J84282J53929J39135J02074J3618j17041k34594k85679k72158
17038A484068k44620k47648k81777l16754l18438k70178j99446j53425j37244
17029f85462j19095p3528K243R1335J63348J91048J76030J46411J19883Q5396
17019I7609L7924J2309M7669J28441K02236K35846K26220J79806R8459r741j13582
$$ plain form
17089 630107 866381 1036707 1160348 1256454 1339088 1410091 1461691 1486752 1480970 1430756 1308353
17078 1308353 1093745 805404 500054 236788 44412 -73729 -108952 -42610 126599 370609
17068 370609 647016 912504 1119724 1218522 1178162 1008690 756523 482220 237949 50626
17058 50626 -76054 -141941 -143754 -82569 39425 229929 503050 850989 1222844 1551076
17048 1551076 1800502 1984784 2138713 2277848 2379922 2393540 2276499 2041905 1756226 1484068
17038 1484068 1239448 991800 710023 393269 74831 -195347 -394793 -548218 -685462
17029 -685462 -804557 -878085 -875842 -784507 -621159 -430111 -254081 -107670 12213 97609
17019 97609 135533 147842 195511 323952 526188 762034 988254 1168060 1266519 1256778 1143196
17008A143196j74856j85281j74565j75105j88478j93298j72387j25154n9723J3834
16998b91817Q3347J33704J46482J08963L3029m6538r8539j14113r9624n9212k603
16987b06921M6390P0313P0442O2150N7688N5959L8103l0278j51706k67748l01550
16976e57158k22294n8481J31320K81406L41016L00271K01104J12417P2101O3705
16966F65407N2309K2931j2157k1771K5250J21503K06415K16539J45158L4054p5272
16955A380366j69902k57241l40025m03560m19230l69157k60993j21386J3538J24488
16945h23102K16140K91886L39584L41713K95651K11164J03959P625l6479k2745
16935I25396N491J651l1041n0805k6810M4954J46021K35894K71006K39102J62934
$$ plain form
17008 1143196 968340 783059 608494 433389 244911 51613 -120774 -245928 -305651 -291817
16998 -291817 -208470 -74766 71716 180679 213708 167170 68631 -45482 -145106 -204318 -206921
16987 -206921 -160531 -90218 -19776 42374 100062 156021 194124 163846 12140 -255608 -557158
16976 -557158 -779452 -837933 -706613 -425207 -84191 216080 417184 529601 601702 665407
16966 665407 717716 740647 728490 706719 731969 853472 1059887 1276426 1421584 1455638 1380366
16955 1380366 1210464 953223 613198 209638 -209592 -578749 -839742 -961128 -947590 -823102
16945 -823102 -606962 -315076 24508 366221 661872 873036 976995 984620 948141 925396
16935 925396 930887 932538 901497 850692 823882 868836 1014857 1250751 1521757 1760859 1923793
16924A923793O4383n5868j93374l17962l98996m35530m53334m75099m89848m67787
16914a299622l99799l03262j98111r5268l456P3221J32500J62097J52019J10139
16904a669542N7756K5615M1374J04972J90863K63689K91393K63339J90120R6262
16894a44159J3923l0328k4819K7767R9337J32653R9010L0388l6422q9499j17470
16883c9619j08608o7534p468O2998J29178J69109J78132J78212J83079J81549
16873H59028J59262J18894Q3906P5784R8577J45701J95655K18474J98287J38987
16863B292555N3848l1236q1241p6072l2117M726J290l3330p5279j16053j44484
16852A762607j46748j28785j05681q0239m9157j7540J3640N5845J03495J23139
$$ plain form
16924 1923793 1988176 1932308 1738934 1420972 1021976 586446 133112 -341987 -831835 -1299622
16914 -1299622 -1699421 -2002683 -2200794 -2296062 -2299518 -2226297 -2093797 -1931700 -1779681 -1669542
16904 -1669542 -1611786 -1586171 -1544797 -1439825 -1248962 -985273 -693880 -430541 -240421 -144159
16894 -144159 -130236 -160564 -185383 -157616 -58279 74374 173384 203772 167350 77851 -39619
16883 -39619 -148227 -215761 -223229 -160231 -31053 138056 316188 494400 677479 859028
16873 859028 1018290 1137184 1221090 1296874 1395451 1541152 1736807 1955281 2153568 2292555
16863 2292555 2346403 2315167 2233926 2157854 2125737 2130463 2131753 2098423 2023144 1907091 1762607
16852 1762607 1615859 1487074 1381393 1301154 1251997 1234457 1248097 1303942 1407437 1530576
16842A530576R8728O1902M8398M9850L8505J0511k2648m8949m5340P81O0104Q9808
16830A872226Q6778Q8776J22241J69463J92330J74676J29537Q0059M4259L4043
16820B994388N9127J15187J79587K36984L04555M07567N41102O81272Q14271R35548
16810G269588J016151R91074Q09664M89172J08044k50473n32229p10312p88289
16801H402390p99246p83424p62781p28899o59004n46596m09266k82198k07458
16792C223518k02659k41750k84210l09068l14635l05152k82656k51906k29001
16783H02481k34132k78520l43989l83097l67712l13619k46778j73239q8536K58
16773a626883P1292J05222J10240J15689J37180J77673K32852K72451K65612K22166
$$ plain form
16842 1530576 1629304 1691206 1739604 1789454 1827959 1838470 1815822 1766873 1721533 1722314 1782418 1872226
16830 1872226 1959004 2047780 2170021 2339484 2531814 2706490 2836027 2916086 2960345 2994388
16820 2994388 3053515 3168702 3348289 3585273 3889828 4297395 4838497 5519769 6334040 7269588
16810 7269588 8285739 9276813 10086477 10575649 10683693 10433220 9900991 9190679 8402390
16801 8402390 7603144 6819720 6056939 5328040 4669036 4122440 3713174 3430976 3223518
16792 3223518 3020859 2779109 2494899 2185831 1871196 1566044 1283388 1031482 802481
16783 802481 568349 289829 -54160 -437257 -804969 -1118588 -1365366 -1538605 -1627141 -1626883
16773 -1626883 -1555591 -1450369 -1340129 -1224440 -1087260 -909587 -676735 -404284 -138672 83494
16763H3494J80472J64038J64452J62195J46695J09527N0368l619j4649J8966O4372
16752A126311J02719J39792J79848K16810K35759K13362J39761M0302m5515r2144
16742B257005q6117l3281J5309o873j04340k12228k63771k44402j95708j73987
16732I51607k01076k42762k31697j31747L0757K02736L35862L99351L99538L69067
16722A881636L25150K70048K20927J95226J75360J24651K8482q8096j69188j73813
16712B790383j15158m5788o044J8664O5095J24394J53306J28055O1396j2961p4943
16701C086399j28859j71177j76666j37052p8018k6093P387J2626j3584m9256o4391
16690B261316m8319q171L6097O3520P6709R0668R6980P0168Q453n0457o6105l7179
$$ plain form
16763 83494 263966 428004 592456 754651 901346 1010873 1061241 1057622 1042973 1061939 1126311
16752 1126311 1229030 1368822 1548670 1765480 2001239 2214601 2354362 2394664 2349149 2257005
16742 2257005 2170888 2137607 2152916 2146043 2041703 1829475 1565704 1321302 1125594 951607
16732 951607 750531 507769 276072 144325 175082 377818 713680 1113031 1512569 1881636
16722 1881636 2206786 2476834 2697761 2892987 3068347 3192998 3221480 3133384 2964196 2790383
16712 2790383 2675225 2629437 2623393 2642057 2707152 2831546 2984852 3112907 3174303 3161342 3086399
16701 3086399 2957540 2786363 2609697 2472645 2394627 2368534 2375921 2388547 2374963 2325707 2261316
16690 2261316 2212997 2204826 2240923 2304443 2381152 2471820 2568800 2638968 2647421 2596964 2530859 2493680
16678B493680N725L7354O2106R7647J38527J49902J01831k724j28692k26391k60922
16667B468043k33264j77935j38909j40932j75953k13283k33506k46737k61867
16658F45657k68480k65569k59363k32160j69745j02981p3508p7289o5616P712
16648h61342J40882K77591L48134L19124K16672J09465M4639M723m5430j02170
16638D52288j47329j91830k62053l51557m05752l83059l02302k06671j18530k7067
16628a943862Q4257K08671L29121M21346M52475M11396L21972K23299J50178J23474
16618G82327J43173J86759K29067K51742K31697J56233M8172o3093j74548k82757
16608A508772l69242m19638m27616l97526l43187k71922j80417o6895N5253J62196
$$ plain form
16678 2493680 2499405 2536759 2598865 2696512 2835039 2984941 3086772 3084048 2955356 2728965 2468043
16667 2468043 2234779 2056844 1917935 1777003 1601050 1387767 1154261 907524 645657
16658 645657 377177 111608 -147755 -379915 -549660 -652641 -726149 -803438 -869054 -861342
16648 -861342 -720460 -442869 -94735 224389 441061 550526 595165 599888 554458 452288
16638 452288 304959 113129 -148924 -500481 -906233 -1289292 -1591594 -1798265 -1916795 -1943862
16628 -1943862 -1859605 -1650934 -1321813 -900467 -447992 -36596 285376 508675 658853 782327
16618 782327 925500 1112259 1341326 1593068 1824765 1980998 2029170 1966077 1791529 1508772
16608 1508772 1139530 719892 292276 -105250 -448437 -720359 -900776 -967671 -912418 -750222
16598g50222K44359L07049L43827L32390K55483J25568j7645j35320j93093j66839
16588C45557p4965K6281R4926J24078J19529R1501N6714K9798K8158P2802J58302
16577A072681K34386K47029K01558J46639R3186J2514r6489j95255k41598k20661
16567A253990j59204j02057o9806m8344j2376N1281J29511J80166J60225P8805
16557A462191J0174J9376R3112J60325J64081J04339K0091n2370r3207q9491l6639
16546A761982M8468J26556J62626J55396J32803J13770Q9308M9349Q964o385J5435
16535B658272O9900J35986J92341K28913K28507J71069P8806R976j0233j0407
16525C753130k4906n2369p2482p4113m4288K8382J25967K07616K39940K05008
$$ plain form
16598 -750222 -505863 -198814 145013 477403 732886 858454 840809 705489 512396 345557
16588 345557 270592 296873 391799 515877 635406 726907 783621 813419 841577 914379 1072681
16577 1072681 1307067 1554096 1755654 1902293 1995479 2007993 1911504 1716249 1474651 1253990
16567 1253990 1094786 992729 922923 874579 862203 913484 1042995 1223161 1383386 1462191
16557 1462191 1472365 1491741 1584853 1745178 1909259 2013598 2033689 1981319 1888112 1798621 1761982
16546 1761982 1810450 1937006 2099632 2255028 2387831 2501601 2590909 2640258 2649222 2642837 2658272
16535 2658272 2728172 2864158 3056499 3285412 3513919 3684988 3763794 3773770 3763537 3753130
16525 3753130 3728224 3675855 3603373 3529260 3484972 3513354 3639321 3846937 4086877 4291885
16515D291885J09858j1675j27308k10210k32388j85837j00646k7505l095k0823
16505C482256l2340J138P2668J48200J89723J70840R1433l2337j78749l10346
16495C602486l78568l64752l20060l22553l85226m43915m35959l56261k40699
16486C54493j25177k3812N8531J03286R0357M4678K9009P8882J74498K66911L06498
16475A358154K70475J86302J07754O6914N7481M7944M471p5451j61589k28954
16465A633501k69615k67729j95038m7625J36739L02446L88252L59171K46578J16332
16455B403012K0158j8310o999K3236M0655K0476n3159j64294k61689k98373k72874
16444A431839k31059k13946k09727j80978j22216o3017k0735K2863Q4893J50847
$$ plain form
16515 4291885 4401743 4390068 4262760 4052550 3820162 3634325 3533679 3506174 3503079 3482256
16505 3482256 3449916 3451054 3523722 3671922 3861645 4032485 4123918 4091581 3912832 3602486
16495 3602486 3223918 2859166 2539106 2216553 1831327 1387412 951453 595192 354493
16486 354493 229316 205504 264035 367321 457678 502356 531365 610247 784745 1051656 1358154
16475 1358154 1628629 1814931 1922685 1989599 2047080 2095024 2099495 2024044 1862455 1633501
16465 1633501 1363886 1096157 901119 853494 990233 1292679 1680931 2040102 2286680 2403012
16455 2403012 2423170 2404860 2397861 2421097 2461752 2482228 2429069 2264775 2003086 1704713 1431839
16444 1431839 1200780 986834 777107 596129 473913 410896 390161 413024 497917 648764
16434F48764J91149J89998J58877J28146J14735J00988O1165k316o2718r6221
16424A432567r5200n7014J4846R9469J61710J74398J47021J07021O4130K2720
16414B071668N189K8651P9633J38036J99295K63840L22436L46394K91131J42537
16404C888810m2406j91113k87013l45485l61662l23350k52971k02658k08527k55479
16394A418146k93706k92940k60144j99075r8973K6933J38477K04009K16645J88806
16384A048178J48506J40345J95346K81846L29210L06100K46189K11884K37425
16375C145029K93503L11959K50453J36469L4421k6469o0980q9116j30304j97732
16365C667233k68099k93937k50260j55981o2449j9748l4352n8655m2930J0937
$$ plain form
16434 648764 839913 1029911 1188788 1316934 1431669 1532657 1593822 1591506 1528788 1432567
16424 1432567 1337367 1280353 1295199 1394668 1556378 1730776 1877797 1984818 2048948 2071668
16414 2071668 2076857 2105508 2185141 2323177 2522472 2786312 3108748 3455142 3746273 3888810
16404 3888810 3846404 3655291 3368278 3022793 2661131 2337781 2084810 1882152 1673625 1418146
16394 1418146 1124440 831500 571356 372281 273308 300241 438718 642727 859372 1048178
16384 1048178 1196684 1337029 1532375 1814221 2143431 2449531 2695720 2907604 3145029
16375 3145029 3438532 3750491 4000944 4137413 4171834 4145365 4084385 3995269 3864965 3667233
16365 3667233 3399134 3105197 2854937 2698956 2636507 2616759 2582407 2523752 2480822 2491759
16355B491759O1769P4904N7727M1941L0606O674k3150l1068o771L0149N9932P9740
16343B874212Q9084Q0522N3220J8856j7702o7624j42621k27973k71799k21786
16333B166389q4914O7161J64006J93217J86344J80064K01653K53477L05319L22152
16323C954868L01981K78569K84870L22954L56653L34345K46448J43223Q7184J03186
16313F414281J73295K58272L11153K83868J30545j40462l85685m41336l20202
16304F283729j53488l6347R623J7335M0171R9144J57648J67759J33885J03439
16294F822898J16529J81405K62466K96508K57746J88328J57953K17104L67090
16285H868027N61267P42843Q88312J015740J159345J337887J538885J725160J858395
$$ plain form
16355 2491759 2553528 2628432 2686159 2728100 2758706 2765380 2742230 2711162 2704391 2734540 2794472 2874212
16343 2874212 2963296 3043818 3097038 3115894 3098192 3030568 2887947 2659974 2388175 2166389
16333 2166389 2081475 2148636 2312642 2505859 2692203 2872267 3073920 3327397 3632716 3954868
16323 3954868 4256849 4535418 4820288 5143242 5499895 5834240 6080688 6223911 6311095 6414281
16313 6414281 6587576 6845848 7157001 7440869 7571414 7430952 7045267 6603931 6283729
16304 6283729 6130241 6093894 6103517 6120852 6161023 6260167 6417815 6585574 6719459 6822898
16294 6822898 6939427 7120832 7383298 7679806 7937552 8125880 8283833 8500937 8868027
16285 8868027 9429294 10172137 11060449 12076189 13235534 14573421 16112306 17837466 19695861
16276A9695861J923024J911357J788743J494231R97042L42912l75528j063495
16268B6714147j638265k037736k236838k257524k163395k025982j880718j718964
16260A0754725j522754j306837j111643r52021q04176o56713n34301m52566l86804
16251C026910k99403j79345m4977P5989J45617J23769J4792j12825j89916k15441
16241B345170k21954k08920j57888q2063k5548j7524m2087o2025n8517l0563K0812
16230A458893Q9212J59662K22225K80615L33966L57282L16476K05912N9099p8054
16220C405288j71799k11743k08666j75129j07828o198R2530J28741P4732l7817
16210B782111j50672k29305k61114k30236j33391q990Q2852J10138Q7539M6481
$$ plain form
16276 19695861 21618885 23530242 25318985 26813216 27810258 28153170 27777642 26714147
16268 26714147 25075882 23038146 20801308 18543784 16380389 14354407 12473689 10754725
16260 10754725 9231971 7925134 6813491 5861470 5057294 4400581 3866280 3413714 3026910
16251 3026910 2727507 2548162 2503185 2579174 2724791 2848560 2863352 2750527 2560611 2345170
16241 2345170 2123216 1914296 1756408 1674345 1648797 1631273 1589186 1527161 1468644 1438081 1458893
16230 1458893 1548105 1707767 1929992 2210607 2544573 2901855 3218331 3424243 3483342 3405288
16220 3405288 3233489 3021746 2813080 2637951 2530123 2523925 2616455 2745196 2819928 2782111
16210 2782111 2631439 2402134 2141020 1910784 1777393 1768403 1851255 1961393 2048932 2095413
16200B095413N781k1666k9444j8024K5172J06153J90641K25761J85706P9347o6476
16189B778364j96532k37971j69067m3694O8726J26622J22768P4559l766j06934
16179B413075k17733k99002l13415k52727j40203j4482R0335J55412J70443J38863
16169A730566Q1686K2367j3023M13M9070Q6703Q5908L9357m4474j20154j36660
16158A781759r3223m4704m0313p1561j01730j09354q8797l7835M7447J59411K66275
16147A667375L39556L78935L90053L75286L46846L19425K97287K70338K26610
16138D611711J70559J19182Q0395N0547K7294R946p359k9352m8349n2907m0903
16127D890764j8075j094j3640m7522m5810L7858J71216K76579L14007K92065K26882
$$ plain form
16200 2095413 2101194 2079528 2050084 2032060 2057232 2163385 2354026 2579787 2765493 2844840 2778364
16189 2778364 2581832 2343861 2174794 2131100 2199826 2326448 2449216 2523775 2520009 2413075
16179 2413075 2195342 1896340 1582925 1330198 1189995 1175513 1265848 1421260 1591703 1730566
16169 1730566 1812252 1834619 1821596 1822009 1871079 1957782 2043690 2083047 2038573 1918419 1781759
16158 1781759 1688536 1643832 1603519 1531958 1430228 1320874 1232077 1194242 1241689 1401100 1667375
16147 1667375 2006931 2385866 2775919 3151205 3498051 3817476 4114763 4385101 4611711
16138 4611711 4782270 4901452 4981847 5032394 5059688 5069634 5062275 5032923 4984574 4931667 4890764
16127 4890764 4872689 4871595 4857955 4810433 4764623 4802481 4973697 5250276 5564283 5856348 6083230
16116F083230J31462K6145o6619j27707j38078q4179K8404J63424K73445L34373
16106F623900L46570L28553L04248K76164K34964J86270J42945J03999O2381K4149
16096H634143m910m2033j12475k16564l11693l33190k52632j22238l5476l8590
16086G164342j06906j90595k53620k74618k40281j47745j0477J22754J86690J65570
16076F415114R3143o24r5829j75890k40214k89112k95086k15593n3392J15379
16066E257896K06877K05140J54529J02933O3307J6934n2166j34720k14075k81865
16056E324790l23926l12478k31047r8708M4660J63420K40597K79423K91366K77769
16046E655866K33815J73635J19199Q1743P8074J30231K26489L20879L76527L91264
$$ plain form
16116 6083230 6214692 6240837 6174218 6046511 5908433 5824254 5852658 6016082 6289527 6623900
16106 6623900 6970470 7299023 7603271 7879435 8114399 8300669 8443614 8547613 8609994 8634143
16096 8634143 8629233 8587200 8474725 8258161 7946468 7613278 7360646 7238408 7202932 7164342
16086 7164342 7057436 6866841 6613221 6338603 6098322 5950577 5940100 6062854 6249544 6415114
16076 6415114 6508257 6507633 6411804 6235914 5995700 5706588 5411502 5195909 5142517 5257896
16066 5257896 5464773 5669913 5824442 5927375 5990682 6007616 5955450 5820730 5606655 5324790
16056 5324790 5000864 4688386 4457339 4358631 4403291 4566711 4807308 5086731 5378097 5655866
16046 5655866 5889681 6063316 6182515 6264258 6342332 6472563 6699052 7019931 7396458 7787722
16036G787722L87024L74478L32650K39371J15345J1321m0416l8977r002Q809l57
16025I167968j2670o422K0314O2810J08881J37183J44576J62614K20998L07893
16015A0314145L83409M25622M46429M63812M76485M73957M54520M00326K67941
16006A4106646M8887j93636l80198m82056n10560m81213m16038l49088l11982
15997A1030762l09385l22698l38123l54591l77201m04619m15415l74611k59399
15988G874720q2216J06582K44489K94539K69823K25713K18566K57623L07810L39585
15978A0057234L62342M00157M45559M64084M27265L36348K30791J62143J45935
15969A3031858J38371Q3153k4852j47804k51930l17256l31475l09316k93958l20931
$$ plain form
16036 7787722 8174746 8549224 8881874 9121245 9236590 9247911 9207495 9168518 9159516 9168325 9167968
16025 9167968 9155298 9148876 9169190 9232000 9340881 9478064 9622640 9785254 10006252 10314145
16015 10314145 10697554 11123176 11569605 12033417 12509902 12983859 13438379 13838705 14106646
16006 14106646 14155533 13961897 13581699 13099643 12589083 12107870 11691832 11342744 11030762
15997 11030762 10721377 10398679 10060556 9705965 9328764 8924145 8508730 8134119 7874720
15988 7874720 7792504 7899086 8143575 8438114 8707937 8933650 9152216 9409839 9717649 10057234
15978 10057234 10419576 10819733 11265292 11729376 12156641 12492989 12723780 12885923 13031858
15969 13031858 13170229 13253382 13228530 13080726 12828796 12511540 12180065 11870749 11576791 11255860
15959A1255860l87793m58317m81462m26793l15844k06058j43231j25070j16637
15950H594655r9756r4563j25668j82433k31404k44631k03192j04569K0847J15841
15940G445127J29402N4663o1071j49272j60707r4313j918O0243Q4346R5320R9351
15929G501171P9065L5914m064k4593k8342k0933j285K6122L0538j5917q1752j02432
15917G393492o0693N171M7808L5363l5382j28989j92889j88502j06984K3480J57864
15906F949739K72612L62521M07400L77584K67925J02940p2505j96210k28017j88762
15896H055227j34027j00802q5006o4995m4337n7851j32635k48389l47653l82910
15886F456622l48949k74615j88958j00077n504Q2039J33904J30584Q4058L6177
$$ plain form
15959 11255860 10868067 10409750 9928288 9501495 9185651 8979593 8836362 8711292 8594655
15950 8594655 8494899 8400336 8274668 8092235 7860831 7616200 7413008 7308439 7329286 7445127
15940 7445127 7574529 7629192 7568121 7418849 7258142 7163829 7161911 7222154 7306500 7401820 7501171
15929 7501171 7580236 7616150 7612086 7587493 7559151 7538218 7536933 7563055 7593593 7577676 7495924 7393492
15917 7393492 7332799 7337970 7385778 7421141 7385759 7256770 7063881 6875379 6768395 6791875 6949739
15906 6949739 7222351 7584872 7992272 8369856 8637781 8740721 8668216 8472006 8243989 8055227
15896 8055227 7921200 7820398 7735392 7670397 7626060 7568209 7435574 7187185 6839532 6456622
15886 6456622 6107673 5833058 5644100 5544023 5538519 5620558 5754462 5885046 5969104 6005281
15876F005281J4106m426n0547j16276j67722j82814j55628q6667J4302J19191
15866E388800J84052J88159J54587J13708P3118K6881k0827n3769n8934l5708
15856E960067L356N1907J16669J92510K56334K88630K72988K02660R9380L91n9359
15845G385533n8246N613J21570K63409L86290M58556M96407N42687O16906P02794
15835A0921519P69127P96373Q03230Q28819Q73557Q95325Q66388P97734P28657
15826A8280729P03407P31624P71255P61523O72351N22910L50329J60207p2514
15817B2881821l55367o52491r05331j069802j143548j159548j152015j124525
15809A5319194j060175r55839q31895p16968o20582n27853m23009l00265j65034
$$ plain form
15876 6005281 6019387 6014961 5964414 5848138 5680416 5497602 5341974 5255307 5269609 5388800
15866 5388800 5572852 5761011 5915598 6029306 6102424 6129305 6108478 6054709 5995775 5960067
15856 5960067 5963423 6015330 6131999 6324509 6580843 6869473 7142461 7345121 7444501 7444892 7385533
15845 7385533 7327287 7332900 7454470 7717879 8104169 8562725 9059132 9601819 10218725 10921519
15835 10921519 11690646 12487019 13290249 14119068 14992625 15887950 16754338 17552072 18280729
15826 18280729 18984136 19715760 20487015 21248538 21920889 22443799 22794128 22954335 22881821
15817 22881821 22526454 21873963 20968632 19898830 18755282 17595734 16443719 15319194
15809 15319194 14259019 13303180 12471285 11754317 11133735 10605882 10182873 9882608 9717574
15800I717574l9777N0331R9055J24425J51540J88681K25887K43805K35918K28543
15790A1225982K53100L05295L51367L63969L29072K42279J36032P2445Q0333J35289
15780A3495163K00151K55675K93176L08068L06762K99802L00203L17406L32296
15771A6108702L06763K24493J01773k7330j31144j86240j79886j17853k3437P2325
15761A6148166J57831K51780L55440M33350M64425M67589M73255M92575N07312
15752A9751723M93658M58050M29683M30465M64722N18335N68129O06351O53524
15743B4374640P47750R15488J145305J395917J634793J858121K081288K326674
15735C6479976K609778K929319L281679L662173M025141M275084M319300M097294
$$ plain form
15800 9717574 9677797 9728128 9827183 9951608 10103148 10291829 10517716 10761521 10997439 11225982
15790 11225982 11479082 11784377 12135744 12499713 12828785 13071064 13207096 13279541 13359874 13495163
15780 13495163 13695314 13950989 14244165 14552233 14858995 15158797 15459000 15776406 16108702
15771 16108702 16415465 16639958 16741731 16714401 16583257 16397017 16217131 16099278 16075841 16148166
15761 16148166 16305997 16557777 16913217 17346567 17810992 18278581 18751836 19244411 19751723
15752 19751723 20245381 20703431 21133114 21563579 22028301 22546636 23114765 23721116 24374640
15743 24374640 25122390 26037878 27183183 28579100 30213893 32072014 34153302 36479976
15735 36479976 39089754 42019073 45300752 48962925 52988066 57263150 61582450 65679744
15727F5679744L544602K601780J319646q6242j335499k245956k779329k970063
15719F3728683k875757k574257k156300j710128j309598r92172p42523n15526
15711E0852422k86601n8479J69096L94400N95854P54891Q92559J072027J358540
15702E5744709J777589K309126K909189L556361M285056N149220O161914P299075
15694H9192239Q550572R943249J1517143J3275586J5151963J7011012J8664050
15687A83305814J9872759K0332583J9653980J7413275J3342947P585023Q25123
15680B82331504n858316j1405741j5171558j7050754j7337963j6500741j5007883
15673A83998548j3228011j1402541r658055q028740o520388n164406m017156l140068
$$ plain form
15727 65679744 69224346 71826126 73145772 73059530 71724031 69478075 66698746 63728683
15719 63728683 60852926 58278669 56122369 54412241 53102643 52110471 51367948 50852422
15711 50852422 50565821 50507342 50676438 51070838 51666692 52421583 53314142 54386169 55744709
15702 55744709 57522298 59831424 62740613 66296974 70582030 75731250 81893164 89192239
15694 89192239 97742811 107686060 119203203 132478789 147630752 164641764 183305814
15687 183305814 203178573 223511156 243165136 260578411 273921358 281506381 282331504
15680 282331504 276473188 265067447 249895889 232845135 215507172 199006431 183998548
15673 183998548 170770537 159367996 149709941 141681201 135160813 129996407 125979251 122839183
15665A22839183k571516k293643k233610k309386k468622k693748k980552l318775
15657A01969331l687683m049304m346075m529609m595477m571325m480463m322284
15649F7387111m082583l768737l425746l108626k843062k616734k396849k152201
15641D2992573j876778j583224j285437j011377p88297o05132m24382k18316K2146
15632C5221776K96313N95922Q89811J129415J297576J432599J594866J821041
15624D4279319K118339K483316K894584L316513L722808M097669M419177M656516
15616G1988241M779714M742626M479842L946964L131207K048279P72928n60129
15608I5329672j811877k880941l707133m267645m572482m652450m549637m311826
$$ plain form
15665 122839183 120267667 117974024 115740414 113431028 110962406 108268658 105288106 101969331
15657 101969331 98281648 94232344 89886269 85356660 80761183 76189858 71709395 67387111
15649 67387111 63304528 59535791 56110045 53001419 50158357 47541623 45144774 42992573
15641 42992573 41115795 39532571 38247134 37235757 36447460 35842328 35417946 35199630 35221776
15632 35221776 35518089 36114011 37003822 38133237 39430813 40863412 42458278 44279319
15624 44279319 46397658 48880974 51775558 55092071 58814879 62912548 67331725 71988241
15616 71988241 76767955 81510581 85990423 89937387 93068594 95116873 95889801 95329672
15608 95329672 93517795 90636854 86929721 82662076 78089594 73437144 68887507 64575681
15600F4575681l986308l612461l232771k892195k604624k350295k105392j855203
15592D1936432j595354j333194j074432p98801m83053j48051J53409L78341N30270
15583C7565567O61567Q23860J012877J166676J225219J171506R98401O82867K28904
15574D5537444k97012p88138j151251j353015j420336j406606j351000j266564
15566C6503522j167344j070861r87158r39572r58924j051298j189485j331008
15558B7807872j428909j443949j374686j263241j160874j093420j064165j044843
15550A7933785r74108q20913o19459m34394l13486k63248k59366k76530k99532
15541A3672749l16113l30686l70289m45342n19073n46901n28768m86360m25635
$$ plain form
15600 64575681 60589373 56976912 53744141 50851946 48247322 45897027 43791635 41936432
15592 41936432 40341078 39007884 37933452 37134651 36651598 36503547 36656956 37035297 37565567
15583 37565567 38227134 39050994 40063871 41230547 42455766 43627272 44625673 45308540 45537444
15574 45537444 45240432 44452294 43301043 41948028 40527692 39121086 37770086 36503522
15566 36503522 35336178 34265317 33278159 32338587 31379663 30328365 29138880 27807872
15558 27807872 26378963 24935014 23560328 22297087 21136213 20042793 18978628 17933785
15550 17933785 16959677 16138764 15519305 15084911 14771425 14508177 14248811 13972281 13672749
15541 13672749 13356636 13025950 12655661 12210319 11691246 11144345 10615577 10129217 9703582
15532I703582l47062k57194j67179r2389n2155o1481j11965j64951j75134j25488
15522H148584m8855j2191o2721j80345k82671k89990j96860p7436j1200l592M897
15511F987620N3761J16099J38421R8092J6012o2468j01060j01363p9235l6900
15501G028979Q680K8508K8994L3442L8697M7250Q7266J64508K43758K96908L34158
15490H341148L78544M25108M40335M12725L68370L28519K93296K73634K96045
15481A1557724L59159M28941M77877M98015M84084M20298K96536J37241p829j01162
15471A4550884j38406j42355j29400r1167j6543Q4149J70305J97235J65269J29661
15461A4779632J60583K97160N18860P50730R11590R52621Q79363P46206N96916
$$ plain form
15532 9703582 9356520 9099326 8932147 8839758 8787603 8726122 8614157 8449206 8274072 8148584
15522 8148584 8099729 8087538 8024817 7844472 7561801 7271811 7074951 6997515 6986315 6982723 6987620
15511 6987620 7041381 7157480 7295901 7393993 7410005 7347537 7246477 7145114 7065879 7028979
15501 7028979 7037659 7066167 7095161 7128603 7167300 7214550 7301816 7466324 7710082 8006990 8341148
15490 8341148 8719692 9144800 9585135 9997860 10366230 10694749 10988045 11261679 11557724
15481 11557724 11916883 12345824 12823701 13321716 13805800 14226098 14522634 14659875 14652046 14550884
15471 14550884 14412478 14270123 14140723 14049556 14033013 14117162 14287467 14484702 14649971 14779632
15461 14779632 14940215 15237375 15756235 16506965 17418555 18371176 19250539 19996745 20593661
15452B0593661M24546K09781k1147k06894l09470l20689k31981n2172J64271L48422
15442B0598328M60471M95901M73866M29289L97238L86373L74731L36090K67742
15433B4220029J84069Q6770m5809k39357m93913p75043j019745j155517j140005
15424A9621479r84883p61775n78875n03304n15108n53847n88980o23835o50655
15415A3860217o45565n95471m97632l53163j80816j5807J20875K29587L12478
15406A2234703L66293L91335M05902M36462M92893N73768O74198P74365Q51281
15397A7201200R02073R28379R07611Q14145O54564M59255K57747Q1682l9370j02754
15387B2064532j23373j13300q7451o7436o3413n8703k7997L9195J26734J91556
$$ plain form
15452 20593661 21018207 21227988 21206841 20999947 20690477 20369788 20137807 20085635 20249906 20598328
15442 20598328 21058799 21554700 22028566 22457855 22855093 23241466 23616197 23952287 24220029
15433 24220029 24404098 24490868 24445059 24205702 23711789 22936746 21917001 20761484 19621479
15424 19621479 18636596 17874821 17295946 16792642 16277534 15723687 15134707 14510872 13860217
15415 13860217 13214652 12619181 12121549 11768386 11587570 11571763 11692638 11922225 12234703
15406 12234703 12600996 12992331 13398233 13834695 14327588 14901356 15575554 16349919 17201200
15397 17201200 18103273 19031652 19939263 20753408 21407972 21867227 22124974 22206656 22167286 22064532
15387 22064532 21941159 21827859 21740408 21672972 21609559 21550856 21522859 21562054 21688788 21880344
15377B1880344J97367J63379J55647K20247L50827N09523O64742Q02554R11897
15368B5856527R95926J072458J139478J179378J200350J236740J305529J395104
15360C5381490J486626J573446J673021J800055J934975K041829K100002K109105
15352E0100549K071380J967859J773033J491340J147004P55054L32418q2105m50326
15343E9106206p53495r72886j092786j114217j050585r36909q33390p90830q04026
15334E0757082q15004p74717o99483o51985o67708p26909p94846q59795r26446
15325D3840189r88333j012695r67515q51522o96952n56164m68998m34354m11545
15316C7452111l57050k61942j44488k1510R7695K05196K88870L36522L49073L46786
$$ plain form
15377 21880344 22077711 22241090 22396737 22616984 22967811 23477334 24142076 24944630 25856527
15368 25856527 26852453 27924911 29064389 30243767 31444117 32680857 33986386 35381490
15360 35381490 36868116 38441562 40114583 41914638 43849613 45891442 47991444 50100549
15352 50100549 52171929 54139788 55912821 57404161 58551165 59306219 59638637 59556532 59106206
15343 59106206 58352711 57379825 56287039 55172822 54122237 53185328 52351938 51561108 50757082
15334 50757082 49942078 49167361 48467878 47815893 47148185 46421276 45626430 44766635 43840189
15325 43840189 42851856 41839161 40871646 40020124 39323172 38767008 38298010 37863656 37452111
15316 37452111 37095061 36833119 36688631 36667121 36764816 36970012 37258882 37595404 37944477 38291263
15306C8291263L58094L99641M74445N85087P32135R05800J099062J320445J562329
15297D5728301J772695J905766J983867K055161K129258K204904K307538K458516
15289F2546006K639210K806279K919614K948155K866791K644073K245776J669886
15281H3285790R65010K09539n28213j215855j843492k399372k865885l222712
15273G2384810l456681l569871l574635l498628l387811l271898l146333l007542
15265D5471411k855848k668089k424023k150578j899407j698765j546250j417367
15257B8811084j281946j141845j044409j024677j043130j021320r39693q51216
15249B0462848p95612p65770p55175p68723p99354q25286q21781p89063p52878
$$ plain form
15306 38291263 38649357 39048998 39523443 40108530 40840665 41746465 42845527 44165972 45728301
15297 45728301 47500996 49406762 51390629 53445790 55575048 57779952 60087490 62546006
15289 62546006 65185216 67991495 70911109 73859264 76726055 79370128 81615904 83285790
15281 83285790 84250800 84460339 83932126 82716271 80872779 78473407 75607522 72384810
15273 72384810 68928129 65358258 61783623 58284995 54897184 51625286 48478953 45471411
15265 45471411 42615563 39947474 37523451 35372873 33473466 31774701 30228451 28811084
15257 28811084 27529138 26387293 25342884 24318207 23275077 22253757 21314064 20462848
15249 20462848 19667236 18901466 18146291 17377568 16578214 15752928 14931147 14142084 13389206
15240A3389206p18221o61247n67851m47900l17313j90181r2945n8883r0373j44481
15230A0099811j68775j51181j26441j28586j56802j86066j96072j94578j96444
15221H594866j94612j77758j47467j17709j04811j01611p5162l403R9634J90122
15211G962089K25909K00156J34974O5693K7874K3496J7196j8937p8309j47564
15201H412577k23617k84844l01952k72336k04915j07239l33Q1899J14580J00622
15191G314442P5280P6622J07302J44980J78387K05630K16375K09631K00488J87922
15181H917059J43870L9197j19437k82252l98728m58542m71551m27203l22020j97060
15171F423333r6340j8634N0689R6913R6992N5602N557j2882K3577J07363K04051
$$ plain form
15240 13389206 12670985 12009738 11441887 10993987 10676674 10486493 10393548 10334665 10244292 10099811
15230 10099811 9931036 9779855 9653414 9524828 9368026 9181960 8985888 8791310 8594866
15221 8594866 8400254 8222496 8075029 7957320 7852509 7750898 7675736 7672333 7771967 7962089
15211 7962089 8187998 8388154 8523128 8588821 8616695 8640191 8657387 8638450 8560141 8412577
15201 8412577 8188960 7904116 7602164 7329828 7124913 7017674 7017341 7099240 7213820 7314442
15191 7314442 7389722 7466344 7573646 7718626 7897013 8102643 8319018 8528649 8729137 8917059
15181 8917059 9060929 9100126 8980689 8698437 8299709 7841167 7369616 6942413 6620393 6423333
15171 6423333 6326993 6308359 6359048 6455961 6552953 6608555 6614112 6601230 6624807 6732170 6936221
15160F936221K64625K60266K07383J41387Q6470N4801L7976j234q1859j63581
15150G742455j96274j72149j23519p9476l7046P337M3161O9215Q9677Q8656L9760
15139G471797n7239j63210k26319k15933j39418l7699L9116O6707O1014N4395
15129F853211O4118P9365Q0473O1476L1361N296j2507k3640j9456j78R254n992
15117G122781k5442k4092k324K2850M0299L9971L924p4663j76361k62813l03688
15106F360442k87622k23173j42515p6827k9210P724L1804M1298N0856P6973J03123
15095E912873R5632M9201q534m2700l4031P799N8435J04920J37309J42113J18247
15084F541264O7841j6223j29407k30826k74499k53404j90264j08234j6378P9251
$$ plain form
15160 6936221 7200846 7461112 7668495 7809882 7896352 7951153 7989129 7987895 7906036 7742455
15150 7742455 7546181 7374032 7250513 7171037 7133991 7141328 7184489 7253704 7343381 7432037 7471797
15139 7471797 7414558 7251348 7025029 6809096 6669678 6631979 6671095 6737802 6798816 6853211
15129 6853211 6917329 6996694 7077167 7138643 7170004 7175300 7162793 7139153 7119697 7119519 7128773 7122781
15117 7122781 7097339 7073247 7070923 7093773 7134072 7174043 7177967 7103304 6926943 6664130 6360442
15106 6360442 6072820 5849647 5707132 5630305 5601095 5608819 5640623 5681921 5732777 5809750 5912873
15095 5912873 6008505 6057706 6049172 6006472 5972441 5980240 6038675 6143595 6280904 6423017 6541264
15084 6541264 6609105 6592882 6463475 6232649 5958150 5704746 5514482 5406248 5389870 5469121
15074E469121J55094J78967J40199O3523j34j0097L6856J18876K02212K55148
15064F609765K65098K38687J90546J31695P3186K9352J467k7333p0391j23495
15054G318577j71442j97262j92149j65150j36640j17748r8920o2886j4925J5187
15044F176642J0567k1840o0339n6559L1457J73516K90469L34777L10141K41327
15034G430158J60649J09929J16087J60163J86176J44033L2913r1072j61921j61779
15024G925336j23278r2149r6907j35502j78410j95695j74032j15940m0885K3164
15014F795702N9231O9049O4583N9861O7516R6036J44729J87884J99226J92781
15004G936598J90812J90941J88370J93627K13910K33960K32795K11600J88039
$$ plain form
15074 5469121 5624215 5803182 5943381 6006904 6006770 5996673 6033529 6152405 6354617 6609765
15064 6609765 6874863 7113550 7304096 7435791 7508977 7538329 7539796 7512463 7442072 7318577
15054 7318577 7147135 6949873 6757724 6592574 6455934 6338186 6239266 6176380 6161455 6176642
15044 6176642 6187209 6165369 6105030 6048471 6079928 6253444 6543913 6878690 7188831 7430158
15034 7430158 7590807 7700736 7816823 7976986 8163162 8307195 8340108 8249036 8087115 7925336
15024 7925336 7802058 7709909 7613002 7477500 7299090 7103395 6929363 6813423 6772538 6795702
15014 6795702 6854933 6923982 6988565 7048426 7115942 7211978 7356707 7544591 7743817 7936598
15004 7936598 8127410 8318351 8506721 8700348 8914258 9148218 9381013 9592613 9780652
14995I780652J67977J47797J38181J56617K01516K42453K36972J76627J03188
14986A1351980N7235M5197O3567J03916J46147J86927K42176L14705L81154M04797
14976A3297801L68713L03743K77352L36351M54820N66781O37602O66933O60618
14967A7570714O40227O43809O93380P82434R03078J051383J200174J310043J370279
14958B6165521J410745J476390J580475J695247J790283J859343J915722J968685
14950C9862411K004975J993538J905887J720732J419961J014691N66028J46506
14942E0634729j92039m14802n14502n28606n04867m49441l49032k19396j01710
14933D7360334l9403o8501k06736m37165p17551j008332j281788j513659j679335
$$ plain form
14995 9780652 9948629 10096426 10234607 10391224 10592740 10835193 11072165 11248792 11351980
14986 11351980 11409215 11454412 11517979 11621895 11768042 11954969 12197145 12511850 12893004 13297801
14976 13297801 13666514 13970257 14247609 14583960 15038780 15605561 16243163 16910096 17570714
14967 17570714 18210941 18854750 19548130 20330564 21233642 22285025 23485199 24795242 26165521
14958 26165521 27576266 29052656 30633131 32328378 34118661 35978004 37893726 39862411
14950 39862411 41867386 43860924 45766811 47487543 48907504 49922195 50488223 50634729
14942 50634729 50442690 50027888 49513386 48984780 48479913 48030472 47681440 47462044 47360334
14933 47360334 47320931 47252430 47045694 46608529 45890978 44882646 43600858 42087199 40407864
14924D0407864j757490j744110j668190j575267j493652j421692j338332j235420
14916B8173711j135825j068906j034798r95687r06816p64631o07006m67547l58501
14907B0833994k85243k51309k54546k90529l50748m29249n20981n98578o13928
14898A7238883n39414l99557k34618n0198J47373K86863K91395J81456M6226m5632
14888A6922777q3991q4621l8523P2047K16554L22342L39123K69366J51753L4982
14878A8121809m3467p3714p4850n8392j7406L2319N0962K3357k0756l2169J0183
14867A7917876Q9552J85781K73339L11411K73123J57689j8888k27582m26301n63653
14857A7972347o05539n61686m74695l84177k97811k01716r9204l4660o3576j92314
$$ plain form
14924 40407864 38650374 36906264 35238074 33662807 32169155 30747463 29409131 28173711
14916 28173711 27037886 25968980 24934182 23938495 23031679 22267048 21660042 21192495 20833994
14907 20833994 20548751 20297442 20042896 19752367 19401619 18972370 18451389 17852811 17238883
14898 17238883 16699469 16299912 16065294 16015096 16162469 16449332 16740727 16922183 16968409 16922777
14888 16922777 16838786 16754165 16715642 16787689 17004243 17326585 17665708 17935074 18086827 18121809
14878 18121809 18078342 18004628 17929778 17871386 17853980 17886299 17937261 17960618 17939862 17907693 17917876
14867 17917876 18007428 18193209 18466548 18777959 19051082 19208771 19189883 18962301 18536000 17972347
14857 17972347 17366808 16805122 16330427 15946250 15648439 15446723 15347519 15312859 15249283 15056969
14847A5056969l55072m58004m51180l57219k34416j15006m806P4469R9667Q7604
14837A3343006Q0560J05160J53306J83573J63447J08239N4960K9098M3703R6024
14827A4361076J59230J92027J68301J08213N8274M1668N1313P0048P0700J4034
14817A5294884j13402k67822l88203m51381m60415m15404l27461k37730j93232
14808A2439834j97290k07149j91123j66040j60906j61486j32104q1898n8151q7027
14798A0996660j55662k28874k63768k35477j65115r2602l3160J2856L8393K8120
14788I901371j8965o8121p9084n3770l3153m6002p9510j04643j00669o3600j2135
14777I241719K6182M3655N9586R5051J57585K46863L56533M83219O22198P37713
$$ plain form
14847 15056969 14701897 14243893 13792713 13435494 13201078 13086072 13081266 13155735 13255402 13343006
14837 13343006 13423566 13528726 13682032 13865605 14029052 14137291 14192251 14221349 14265052 14361076
14827 14361076 14520306 14712333 14880634 14988847 15047121 15088789 15140102 15210150 15280850 15294884
14817 15294884 15181482 14913660 14525457 14074076 13613661 13198257 12870796 12633066 12439834
14808 12439834 12242544 12035395 11844272 11678232 11517326 11355840 11223736 11141838 11083687 10996660
14798 10996660 10840998 10612124 10348356 10112879 9947764 9855162 9822002 9834858 9873251 9901371
14788 9901371 9882406 9814285 9735201 9681431 9648278 9602276 9522766 9418123 9317454 9253854 9241719
14777 9241719 9267901 9311556 9371142 9466193 9623778 9870641 10227174 10710393 11332591 12070304
14767A2070304P84108P59667O94668O12198N23009M21274K90476J31523l6992
14758A6250235k01881l55820m82002n53196n55936n12348m60869m18527l71286
14749A2338370l03799k27910j67120j27527r8681p6206o6426p2519r3418j21772
14739A0982992j35260j15308p1822j7796O4408J86999L15968M16208N00840N86026
14729A2713255O46792O60435O34592N80195M99852L95354K78374J73606J04263
14720A6686718Q4974J13343J55996J77224J83890K08624K65097L38427M06817
14711A8621110M73615N69371P14933Q93099J050029J139950J168173J187357J273478
14702B7091115J464619J706675J904244K026953K133044K280041K456707K613942
$$ plain form
14767 12070304 12854412 13614079 14308747 14920945 15443954 15865228 16155704 16287227 16250235
14758 16250235 16048354 15692534 15210532 14657336 14101400 13589052 13128183 12709656 12338370
14749 12338370 12034571 11806661 11639541 11512014 11413333 11337127 11270701 11198182 11104764 10982992
14739 10982992 10847732 10732424 10660602 10642806 10707214 10894213 11210181 11626389 12127229 12713255
14729 12713255 13360047 14020482 14655074 15235269 15735121 16130475 16408849 16582455 16686718
14720 16686718 16771692 16885035 17041031 17218255 17402145 17610769 17875866 18214293 18621110
14711 18621110 19094725 19664096 20379029 21272128 22322157 23462107 24630280 25817637 27091115
14702 27091115 28555734 30262409 32166653 34193606 36326650 38606691 41063398 43677340
14694D3677340K711893K707945K544727K188354J657419J020665L74507j93569
14686E6689281o33876r47462j178689j375024j532053j597507j542797j405132
14678D6476741j248711j101345r60014q37012p61136p51384q08388r00202r65661
14669C8142888r58850q87162q06524p73373p97507q41017q66930q69089q40689
14660C0501747p67359o58645n32214l87057k20238n2955Q0070J71558K47753L34029
14650B8716689M43481N89122P81490J026464J342243J742885K210688K708990
14642C9562052L188439L590156L854539L899072L619368K956451J936528O39848
14634F3246453q07154k194065l270249l877458m025397l851125l526544l175500
$$ plain form
14694 43677340 46389233 49097178 51641905 53830259 55487678 56508343 56882850 56689281
14686 56689281 56055405 55107943 53929254 52554230 51022177 49424670 47881873 46476741
14678 46476741 45228030 44126685 43166671 42329659 41568523 40817139 40008751 39108549 38142888
14669 38142888 37184038 36296876 35490352 34716979 33919472 33078455 32211525 31342436 30501747
14660 30501747 29734388 29075743 28543529 28156472 27936234 27883279 27963349 28134907 28382660 28716689
14650 28716689 29160170 29749292 30530782 31557246 32899489 34642374 36853062 39562052
14642 39562052 42750491 46340647 50195186 54094258 57713626 60670077 62606605 63246453
14634 63246453 62439299 60245234 56974985 53097527 49072130 45221005 41694461 38518961
14626C8518961k836888k502572k187255j928463j737602j595133j475669j363140
14618B2892239j242901j098413r35562p87664o82321o21583n99076o13705o52293
14609A5658721o75157o38677n31043l78362k26490j12666m9667l2532m7093p2633
14599A2894401q1236n5588r834L4272P3468J20009J89119K64038K85963K28901
14589A3943513J46903J05787J16292J57830K25361L14825L89695M13393L98265
14580A6211864L85609L92812M07575M25689M60857N12058N53773N59289N27936
14571B0437462M85989M46998M03223L63423L45444L33333K91109K08406J04717
14562B3420104K785r6614k12450l49612m78863n66309o10803o32143o38314o29860
$$ plain form
14626 38518961 35682073 33179501 30992246 29063783 27326181 25731048 24255379 22892239
14618 22892239 21649338 20550925 19615363 18827699 18145378 17523795 16924719 16311014 15658721
14609 15658721 14983564 14344887 13813844 13435482 13208992 13096326 13046659 13014127 12967034 12894401
14599 12894401 12813165 12757577 12747743 12782015 12855483 12975492 13164611 13428649 13714612 13943513
14589 13943513 14090416 14196203 14312495 14470325 14695686 15010511 15400206 15813599 16211864
14580 16211864 16597473 16990285 17397860 17823549 18284406 18796464 19350237 19909526 20437462
14571 20437462 20923451 21370449 21773672 22137095 22482539 22815872 23106981 23315387 23420104
14562 23420104 23422889 23326275 23113825 22764213 22285350 21719041 21108238 20476095 19837781 19207921
14552A9207921o12131n75299m93854l65684k32238j47508j32127j52689j51230
14543A6345161j09308o0490l9909m5784n0908m6342o4247j43866k63914l48648
14533A5171745l55589l11126k63520k33741k07849j66832j13752p0297p0669j45781
14523A3232589k74990l85656m26568m00675l34700k54427j82066j35158j12947
14514A0725402q3128k1449M3114O1407J8262n5351j06954j05275o5125k4765j4723
14503A0371415m8871j18924j87044k13428k02547j79531j40454o7719L1974J29042
14493I373913J92481K03800J66971J06951M7884j2082q1451j43667j75746j77578
14483I501476j71209j86248k40668l22375l79758l43213j83583L9875K23410L15464
$$ plain form
14552 19207921 18595790 18020491 17526637 17160953 16928715 16781207 16649080 16496391 16345161
14543 16345161 16235853 16175363 16135454 16089670 16038762 15992420 15928173 15784307 15520393 15171745
14533 15171745 14816156 14505030 14241510 14007769 13799920 13633088 13519336 13449039 13378370 13232589
14523 13232589 12957599 12571943 12145375 11744700 11410000 11155573 10973507 10838349 10725402
14514 10725402 10642274 10620825 10663939 10725346 10743608 10688257 10581303 10476028 10410903 10386138 10371415
14503 10371415 10322544 10203620 10016576 9803148 9600601 9421070 9280616 9212897 9244871 9373913
14493 9373913 9566394 9770194 9937165 10044116 10092000 10079918 9998467 9854800 9679054 9501476
14483 9501476 9330267 9144019 8903351 8580976 8201218 7858005 7674422 7714297 7937707 8253171
14473H253171L21010K54377J51950O6040J3363l0648q8578j47059j69917j43249
14463H480460q1965J1136J34926K43790K83020K50481J78485Q8701j0588j10739
14453I467707j94975k39602k31533j84507j26758o7331J1099J23802K54461L60500
14443I172863M01697L54249K17247K8532j39320k24158k10522j24685p583J07081
14433I575401J93822K34447K21482J70708J16419Q2352O2556L4457k065k2134
14423A0667445r426L5090J00776J57741J62136R8768N395o4542q5004o2610j1007
14412A0994762O0704J33508J91518K32811K51010K34391J76953Q3293j7505q1489
14402A2259956q3160k5518O2110J40734J89377J99392J64058P9669n3702k11807
$$ plain form
14473 8253171 8574181 8828558 8980508 9046548 9059911 9029263 8940685 8793626 8623709 8480460
14463 8480460 8398495 8409631 8544557 8788347 9071367 9321848 9500333 9589034 9578446 9467707
14453 9467707 9272732 9033130 8801597 8617090 8490332 8423001 8434100 8557902 8812363 9172863
14443 9172863 9574560 9928809 10146056 10174588 10035268 9811110 9600588 9475903 9468320 9575401
14433 9575401 9769223 10003670 10225152 10395860 10512279 10594631 10657187 10691644 10689579 10667445
14423 10667445 10658019 10693109 10793885 10951626 11113762 11212530 11217925 11153383 11068379 11005769 10994762
14412 10994762 11055466 11188974 11380492 11613303 11864313 12098704 12275657 12358950 12341445 12259956
14402 12259956 12176796 12151278 12213388 12354122 12543499 12742891 12906949 12986618 12932916 12721109
14392A2721109l40427l93607l54122k40608j11290k2641J1005O136j9895o1397
14382A1194263j22739k09045l07793l74559l59125k61647j37598m0579J1365K4069
14372I416612J3252j0736l5554k3110N1610J55199K27802K36104J91332J41740
14362A0364251J25772J29011J13606P0504J4196m9648j10589j41648j31133r5892
14352A0288430o2625n3695p7710j20584j57992j88549k28773k66233k61222k04082
14342H666965j17726q561J21016K40589L15480L32290K88933J89893N9951n1862
14332A0036968r5614n5865L0470R9575J10763P3816K1876k5399n4342n2919l6594
14321A0052735m4620q4476j20655j29475j20504j17715j40372j79576k00722j83625
$$ plain form
14392 12721109 12380682 11987075 11632953 11392345 11281055 11258414 11269419 11275555 11255660 11194263
14382 11194263 11071524 10862479 10554686 10180127 9821002 9559355 9421757 9381178 9392543 9416612
14372 9416612 9429864 9419128 9383574 9360464 9412074 9567273 9795075 10031179 10222511 10364251
14362 10364251 10490023 10619034 10732640 10803144 10817340 10767692 10657103 10515455 10384322 10288430
14352 10288430 10225805 10172110 10094400 9973816 9815824 9627275 9398502 9132269 8871047 8666965
14342 8666965 8549239 8540678 8661694 8902283 9217763 9550053 9838986 10028879 10088830 10036968
14332 10036968 9941354 9885489 9915959 10015534 10126297 10200113 10221989 10196590 10142248 10089329 10052735
14321 10052735 10008115 9923639 9802984 9673509 9553005 9435290 9294918 9115342 8914620 8730995
14311H730995j39360r7997r0905j32039k04569k69385k92972k60702j72156m9692
14301G021218N4244J00492R3223N1351q206o4099r7218j13409j37203j67361j67739
14290F565293j21000o0764k3251M772N9941J44870K15082K23107J70497R8808
14280G277355M7122L4729O7566J46089K58822L70741M32730M11420L05474J46075
14270I498123r019j03493j26902j21812j33599j66309j95537k10847k17368k10188
14260H003049j87145j64473j49053j25537q2113l4988k4438p3672j51990k07523
14250F802117k24035k22432k23662k27468k16163j75483j20350q0839o2657m7650
14240E201378k5367j4829m2693r9219j41474j36798r8387o5836n2655m0284j2719
$$ plain form
14311 8730995 8591635 8493638 8402733 8270694 8066125 7796740 7503768 7243066 7070910 7021218
14301 7021218 7075462 7175954 7269177 7320528 7312322 7248223 7151005 7037596 6900393 6733032 6565293
14290 6565293 6444293 6383529 6360278 6365050 6424991 6569861 6784943 7008050 7178547 7277355
14280 7277355 7324477 7359206 7426772 7572861 7831683 8202424 8635154 9046574 9352048 9498123
14270 9498123 9489104 9385611 9258709 9136897 9003298 8836989 8641452 8430605 8213237 8003049
14260 8003049 7815904 7651431 7502378 7376841 7294728 7259740 7235302 7161630 7009640 6802117
14250 6802117 6578082 6355650 6131988 5904520 5688357 5512874 5392524 5311685 5249028 5201378
14240 5201378 5176011 5161182 5118489 5019270 4877796 4740998 4642611 4576775 4524120 4483836 4471117
14229D471117K7215P2574J27079J80920J95003J49178P0610N648k1136k5077l3375
14218E219756n1519o4312n1822n409N5368Q7490N9786j5415r5140j47107j59681
14207D831995j30785p3839k2423n533j5181j2031K3005N4654L4449l4384r6286
14196D553641j02217o0348l3656p7964j87196l05381l79323l80940l02319j75011
14186B549286o5340j0193J3806L4120M1679K3246j2458n3745r4514j24130j28182
14175B173575r7400l9947K4864Q3091J21689J28496J04485N8059R85m9293q8683
14164B419921j27653j55137j48714j13222p3699m3787j8258Q897L9735O9796Q4662
14153A942541Q0921P2698O8238N8053L2601K290k1798m5170p8830j17455j19877
$$ plain form
14229 4471117 4498332 4570906 4697985 4878905 5073908 5223086 5293696 5299344 5278208 5253131 5219756
14218 5219756 5168237 5103925 5052103 5046694 5102062 5189552 5249338 5233923 5138783 4991676 4831995
14207 4831995 4701210 4627371 4604948 4599415 4584234 4572203 4595208 4649862 4684311 4649927 4553641
14196 4553641 4451424 4391076 4357420 4279456 4092260 3786879 3407556 3026616 2724297 2549286
14186 2549286 2483946 2473753 2487559 2521679 2563358 2586604 2574146 2520401 2425887 2301757 2173575
14175 2173575 2076175 2036228 2061092 2144183 2265872 2394368 2498853 2556912 2557897 2508604 2419921
14164 2419921 2292268 2137131 1988417 1875195 1801496 1757709 1739451 1748348 1788083 1857879 1942541
14153 1942541 2023462 2096160 2164398 2222451 2255052 2257342 2235544 2190374 2111544 1994089 1874212
14142A874212m8569P2260J84565K46918K36999J55789L3394r3678j90866k28751
14132B242273k07694j62951j36740j52218k06339k65246k80824k34057j63058
14123D33146j31109j53318j82629j72911j24118p6373o5203p9267p7509m3581
14113f72872L466N0832J01028J51157J89594J96184J62974J11166O7510M5212
14103D06251N0603P9387J12119J37574J72483K27892K81019L06772K92736K33740
14093B300576J43492N5827J593j9350m0310q8801j52511j90626j77798j32611
14083A699481j03773j32673k13618l01064l53678l55107l16692k65245k16097
14074e58466j54920n6377P0933J88696K75495L30786L48656L27515K85090K41452
$$ plain form
14142 1874212 1825643 1897903 2082468 2329386 2566385 2722174 2755568 2661890 2471024 2242273
14132 2242273 2034579 1871628 1734888 1582670 1376331 1111085 830261 596204 433146
14123 433146 302037 148719 -33910 -206821 -330939 -407312 -472515 -551782 -629291 -672872
14113 -672872 -669406 -618574 -517546 -366389 -176795 19389 182363 293529 361039 406251
14103 406251 456854 536241 648360 785934 958417 1186309 1467328 1774100 2066836 2300576
14093 2300576 2444068 2499895 2501488 2482138 2441828 2353027 2200516 2009890 1832092 1699481
14083 1699481 1595708 1463035 1249417 948353 594675 239568 -77124 -342369 -558466
14074 -558466 -713386 -769763 -698830 -510134 -234639 96147 444803 772318 1057408 1298860
14064A298860K02469J60925J14734P8278O4309O0217L6488k4490j19150k24535
14054A648105k94658k73907j54556o118R1537J23320J18704J00006P9039O8634
14044A500106P9118J05512J18024Q0253k950p6130r7166q1140o0560l9601m378
14033A521088M7677J07011J64862K11416K49707L10735M05938M80652M57351L10567
14023D267004R7149p9710j53508j42567j13772j06891j10436r9942p0169k7990
14013C459168J6468M2598K6988l2363j10998j86663k49001k92711l28763l67151
14003A977572l88117l70560l17111k37011j53189j00087q3919p9261o7649n5283
13993A25385n2895m4631P145J20075K60066L56016L55562K59453J08729m4611
$$ plain form
14064 1298860 1501329 1662254 1776988 1855266 1919575 1979792 2016280 1991790 1872640 1648105
14054 1648105 1353447 1079540 924984 918866 1010403 1133723 1252427 1352433 1431472 1500106
14044 1500106 1579224 1684736 1802760 1883013 1880063 1803933 1706767 1625627 1565067 1525466 1521088
14033 1521088 1568765 1675776 1840638 2052054 2301761 2612496 3018434 3499086 3956437 4267004
14023 4267004 4364153 4284443 4130935 3988368 3874596 3767705 3657269 3557327 3487158 3459168
14013 3459168 3475636 3518234 3545222 3512859 3401861 3215198 2966197 2673486 2344723 1977572
14003 1977572 1589455 1218895 901784 664773 511584 411497 327578 248317 180668 125385
13993 125385 72490 27859 35004 155079 415145 771161 1126723 1386176 1494905 1450294
13983A450294j59032k15335k19957j93378j55110j10753m8300L1496R4989J18648
13973E93562J35780J99308L09074M09954M48866M10440L14618J92148O4592n6910
13963C021432j61303k29855k48151k26430j91161j55979j14759p3737o3804j08064
13953A448189j93900k75238l05468k66555j76680p8544o055L7025O8429J03230
13943C54433J26963J06267M7816R709K5775N9351N1947m173o0433p0299l0880
13932F16476L3606R1270J10711Q1564K9550p607k6447m7541p0850p6386n2088
13921F82258l831O2221J44206K15843K35348J98955J38803O8141k0735j19653
13911A601556k05483k59522k77222k68973k47046k17115j86041j56608j13896
$$ plain form
13983 1450294 1291262 1075927 855970 662592 507482 396729 348429 379925 474914 593562
13973 593562 729342 928650 1237724 1647678 2096544 2506984 2821602 3013750 3078342 3021432
13963 3021432 2860129 2630274 2382123 2155693 1964532 1808553 1693794 1620057 1556253 1448189
13953 1448189 1254289 979051 673583 407028 230348 151804 145749 182774 251203 354433
13943 354433 481396 587663 635479 645188 670963 730314 782261 778088 717655 647356 616476
13932 616476 650082 741352 852063 933627 963177 955570 929123 881582 810732 734346 682258
13921 682258 678427 740648 884854 1100697 1336045 1535000 1673803 1741944 1721209 1601556
13911 1601556 1396073 1136551 859329 590356 343310 126195 -59846 -216454 -330350
13902c30350l9502N4612J18961J22049R8312R7609J27574J72542K09800K07981
13892H39588J58523R4609N3512L4972J9810r04k9057o2275r2273j14520j34526
13881G67459j57779j76163j77996j58587j17044o1859r150L0851M9745L6859L077
13870B9413k1127j0457M2768J21005J92550K27701K08866J44390O0333j5059n3807
13859I26576m5363j4988J716j1850m9479q7270j08949j22354j35046j45564j48326
13848E9103j24873o9431q920K5943K1890j7239p0385j09485j19961j03731o8940
13837e86029k7280O204J7750J1646Q036J7416M2145P2382P8090M9800K0701K3117
13825b66022N2632R4854J52207K12312K22906J38524j5616j53701k01432j52089
$$ plain form
13902 -330350 -369852 -315240 -196279 -74230 24082 121691 249265 421807 631607 839588
13892 839588 998111 1092720 1146232 1181204 1201014 1200110 1171053 1108778 1016505 901985 767459
13881 767459 609680 433517 255521 96934 -20110 -81969 -91119 -60268 -10523 26336 29413
13870 29413 8286 -2171 40597 161602 354152 581853 790719 935109 995442 980383 926576
13859 926576 881213 866225 867941 856091 806612 719342 610393 488039 352993 207429 59103
13848 59103 -65770 -135201 -144121 -118178 -96288 -113527 -183912 -293397 -413358 -517089 -586029
13837 -586029 -613309 -607105 -589355 -577709 -569673 -552257 -510112 -437730 -359640 -309840 -289139 -266022
13825 -266022 -213390 -118536 33671 245983 468889 607413 591797 438096 236664 84575
13815H4575n9426J4816M7173N0201M4075M7895O4291O8967L7437j9920o5581p9410
13803B35093o5842l0596K5903R4340J50495J77177J77494J58748J19414N1251
13793A093477m5614j50080k30335k56277k13631j25592n2043m5350r9754j58981
13783b84180j74306j44823j04318p9103n4439N315R4729J63235J78437J53661
13773b45792J16305P4553J3643q0473j92479k75471k94686k53267j68876o6757
13763a373300K0377P7637J15974J50143J82505K06635K11339J86666J39344R1357
13753H677P1842J02679J69537K16767K00497J52000J37403J67317K05105K23664
13743A655488K04128J27762K002j32851k26053k45381j96836j13410l3172K8505
$$ plain form
13815 84575 25149 39965 87138 137339 181414 229309 293600 362567 400004 380084 314503 235093
13803 235093 169251 138655 164558 258898 409393 586570 764064 922812 1042226 1093477
13793 1093477 1047863 897783 667448 411171 197540 71948 19905 -25445 -125199 -284180
13783 -284180 -458486 -603309 -707627 -786730 -841169 -835854 -741125 -577890 -399453 -245792
13773 -245792 -129487 -54934 -41291 -121764 -314243 -589714 -884400 -1137667 -1306543 -1373300
13763 -1373300 -1352923 -1275286 -1159312 -1009169 -826664 -620029 -408690 -222024 -82680 8677
13753 8677 80519 183198 352735 569502 769999 921999 1059402 1226719 1431824 1655488
13743 1655488 1859616 1987378 1989380 1856529 1630476 1385095 1188259 1074849 1041677 1070182
13733A070182R5210J82374K60073K93466K80904K39113J74170P8437n0663j91959
13723B431307l02899l55363l48962k86375j78876o5248J7987P0059J10273J44332
13713A236235J57983J49838J43000J48760J46664J20034Q2333N0905J3094o2321
13703B186525j75985k89291l65007l84297l44011k66813j89961j34065j00105
13694f3010q6677q6444p8937m6702O344M7281K5343q1593k29925l41292l68331
13683a303943l18250k27336j33074n5894J154L8427O0468R1965J62924K64562
13673a418997L52728L93559L82969L26558K32923J34650O3454J6414k0628n5724
13663D07906r5788j35134j52072j36231j04516q0310o4692m0400m941K2773L6595
$$ plain form
13733 1070182 1165392 1347766 1607839 1901305 2182209 2421322 2595492 2673929 2623266 2431307
13723 2431307 2128408 1773045 1424083 1137708 958832 893584 911571 981630 1091903 1236235
13713 1236235 1394218 1544056 1687056 1835816 1982480 2102514 2184847 2235752 2248846 2186525
13703 2186525 2010540 1721249 1356242 971945 627934 361121 171160 37095 -63010
13694 -63010 -149687 -236131 -315068 -361770 -355426 -308145 -282802 -364395 -594320 -935612 -1303943
13683 -1303943 -1622193 -1849529 -1982603 -2038497 -2037343 -1998916 -1938448 -1846483 -1683559 -1418997
13673 -1418997 -1066269 -672710 -289741 36817 269740 404390 467844 484258 463630 407906
13663 407906 312118 176984 24912 -111319 -215835 -296145 -360837 -401237 -406178 -383405 -346810
13652c46810N3388P2013O0634O993o0426j13084j43746j41878q4715K0925J28837
13641e47869J95025J82922Q1683n6798j50321j62142j28738j08933j26711j64041
13631i85923j86608j74382j21621j9609J23114K60799L43745L60623L35840L02504
13621B38482K77242K52828K16881J72722J34612J13326J12643J26790J33678J03552
13611A882756L5591k9092n2105l8853j7185p06L691k8050j18407k43658l48450
13600A045532m05303m16484l87573l27519k48685j63466p6586J5174J09507K02744
13590f52659K92194L58692L75278L37084K57710J43460j345j44863k39198k55546
13580D70807j85792m1994J34656K84975L50048L02734J79972N0149m6059j03723
$$ plain form
13652 -346810 -293422 -221409 -160775 -153782 -214208 -327292 -471038 -612916 -697631 -676706 -547869
13641 -547869 -352844 -169922 -88239 -145037 -295358 -457500 -586238 -695171 -821882 -985923
13631 -985923 -1172531 -1346913 -1468534 -1488143 -1365029 -1104230 -760485 -399862 -64022 238482
13621 238482 515724 768552 985433 1158155 1292767 1406093 1518736 1645526 1779204 1882756
13611 1882756 1918347 1889255 1837150 1798297 1781112 1780406 1784097 1756047 1637640 1393982 1045532
13600 1045532 640229 223745 -163828 -491347 -740032 -903498 -980084 -964910 -855403 -652659
13590 -652659 -360465 -1773 373505 710589 968299 1111759 1110414 965551 726353 470807
13580 470807 285015 243021 377677 662652 1012700 1315434 1495406 1545555 1499496 1395773
13570A395773j27826j27298j18033j16462j33430j59728j69987j46309r5776n5322
13560A45602o2475j14007j69041j89036j64577j04616k7445L1251M3328J4208
13550e96808k4824l2956J4054R9325J69138J75443J23738P1972O7705J10511J74593
13539C51891K36161K81654K94790K56397J73142Q6587L9623M1556P0122J04600
13529A936523J34397J42247J16022O6618J9760j7402o8542j51515k58130l64341
13519A555637m35156m33041l44089k06114q9786l6458k4706k28N8605J20416J43663
13508C08743J10379L5267k9522k5704N0579J39163J80250J66523J30729J06693
13498A173100J09920J38680J70636J61006P7621n3516j62119j96742j62211j04690
$$ plain form
13570 1395773 1267947 1140649 1022616 906154 772724 612996 443009 296700 200924 145602
13560 145602 83127 -30880 -199921 -388957 -553534 -658150 -685595 -654344 -611016 -596808
13550 -596808 -621632 -654588 -640534 -541209 -372071 -196628 -72890 -918 66787 177298 351891
13539 351891 588052 869706 1164496 1420893 1594035 1680622 1720245 1761801 1831923 1936523
13529 1936523 2070920 2213167 2329189 2395807 2415567 2398165 2329623 2178108 1919978 1555637
13519 1555637 1120481 687440 343351 137237 47451 10993 -13713 -13941 44664 165080 308743
13508 308743 419122 454389 424867 399163 449742 588905 769155 935678 1066407 1173100
13498 1173100 1283020 1421700 1592336 1753342 1830963 1777447 1615328 1418586 1256375 1151685
13488A151685p0577p2490r2961j04903q9585n0353k464M2086O3095L8475k2659
13477G89349q3504j15488j14246q9027n3326j8324J1479L5491O3686J16798J91474
13466G34362K42562K30071J64394Q7771M0296M1339P3244Q6988M5645m7747j63560
13455A535365k51025k63399k20700j92112k12610k58903k84801k71635k42294
13446f62114k22529k08968j85056j41499p4723J3503J09417J83844K15396K09142
13436g63587J76169J21500N2815j9964r4254j77779k76368l78456m48444m45432
13426b253800l54791j95261m335J71958K89657L30076L07311K50996J80667J06552
13416a170970M8651K0849J1392L426j2159m1527q6403j39025j63772j10295K6092
$$ plain form
13488 1151685 1081108 1008618 915657 810754 721169 670816 668352 710438 773533 812008 789349
13477 789349 705845 590357 476111 387084 333758 315434 326913 362404 426090 542888 734362
13466 734362 976924 1206995 1371389 1459160 1499456 1540795 1614039 1701027 1746672 1698925 1535365
13455 1535365 1284340 1020941 800241 608129 395519 136616 -148185 -419820 -662114
13446 -662114 -884643 -1093611 -1278667 -1420166 -1494889 -1481386 -1371969 -1188125 -972729 -763587
13436 -763587 -587418 -465918 -413103 -433067 -527321 -705100 -981468 -1359924 -1808368 -2253800
13426 -2253800 -2608591 -2803852 -2808187 -2636229 -2346572 -2016496 -1709185 -1458189 -1277522 -1170970
13416 -1170970 -1122319 -1101470 -1090078 -1086652 -1098811 -1140338 -1226741 -1365766 -1529538 -1639833 -1613741
13405a613741J84048K91752L20967K89171K36018J87349J36729P1683n844q1974
13395A6158j30543j30212q8687k8389L4462P8821Q3216N0112L682l2718m6036
13384a90134l5218j0833Q778J1099M862K30p738j3626J953M2449Q8985J20410
13372B1217J19815Q0790K1356k6713l2751K3278J26701K19383K41947J84424P9682
13361A059129l1438j19360j66181j63264j24170p7207l4046N418L0960L0429P785
13350D18055j5056j6135J0824N1101O9775M6800R318K309N7771J79199L19660
13339A133621L99551L65190K30495N6318r7643j99171k47520k52530k24567j86277
13329I77467j61832j45274j09514n5349j7744j8882m2854o5488q0390q1230o4245
$$ plain form
13405 -1613741 -1429693 -1137941 -816974 -527803 -291785 -104436 32293 103976 98132 16158
13395 16158 -114385 -244597 -333284 -361673 -327211 -248390 -165174 -115062 -111380 -144098 -190134
13384 -190134 -225352 -236185 -227407 -216308 -211446 -211216 -218954 -232580 -230627 -188178 -99193 21217
13372 21217 141032 221822 243178 216465 183714 206992 333693 553076 795023 979447 1059129
13361 1059129 1027691 908331 742150 578886 454716 377509 343463 348881 379841 410270 418055
13350 418055 402999 386864 397688 448789 518564 565364 574682 576991 634762 813961 1133621
13339 1133621 1533172 1898362 2128857 2185175 2087532 1888361 1640841 1388311 1163744 977467
13329 977467 815635 670361 560847 505498 487754 468872 426018 360530 280140 198910 134665
13318A34665m6734m0608k8949J0655P2153J25038J50232J58058J64309J66556
13308H65375J53979J21232O6766j5246j23567k23499k64630k30562j43448l6211
13298A70189O0593J20312J33860J17861R0614N1673L004l7293n7622p1157j06961
13287D75073j73251k37183k56869k30430j95890j75756j59607j30564p1222L1583
13277a124116J56617K49287K73442K45173K24846K65823L46374L82022L39554
13268A359022K73397K18158J43013K7530q9429j41288j06827m1707j3125k7521
13258A601223m6719m6725j8771O2018J96893L18411L49021K76101J48172K0184
13248B859808p8019j32774j46279j40704j44103j75870k31787k81997k89556k41459
$$ plain form
13318 134665 87931 47323 18374 29029 101182 226220 376452 534510 698819 865375
13308 865375 1019354 1140586 1207352 1192106 1068539 845040 580410 349848 206400 170189
13298 170189 230782 351094 484954 602815 693429 745102 748106 710813 653191 582034 475073
13287 475073 301822 64639 -192230 -422660 -618550 -794306 -953913 -1084477 -1155699 -1124116
13277 -1124116 -967499 -718212 -444770 -199597 25249 291072 637446 1019468 1359022
13268 1359022 1632419 1850577 1993590 2021120 1931691 1790403 1683576 1641869 1628744 1601223
13258 1601223 1554504 1507779 1489008 1551026 1747919 2066330 2415351 2691452 2839624 2859808
13248 2859808 2781789 2649015 2502736 2362032 2217929 2042059 1810272 1528275 1238719 997260
13238I97260j70553j21153j09521j32356j71036j89020j61291r4978j4990O0913
13228a06725J34920K03397K33030J99380J26074O1354L3565L7177M4280K3075
13218I89527l3343r2668j18988j07090p5813o1367q9062j33214j40922j04887
13208C2173p2874p0653o7189k7800L9039J02463J45976J69807J76534J66651J45253
13197G39380J17238P8842K3231m4071j01924j31221j28854j04045p0012l7508
13187C41056j5290j874K4730P6510J28582J48530J36388J09003N7620l5748j46907
13176H22600k25491k55687k49378k13220j59048j10183q2369p3373p9677j03297
13166g29123j33154j44413j22101p2474j4111L4060O2766O8867M4471m263m1757
$$ plain form
13238 997260 826707 705554 596033 463677 292641 103621 -57670 -152648 -167638 -106725
13228 -106725 28195 231592 464622 664002 790076 851430 884995 922172 966452 989527
13218 989527 956184 863516 744528 637438 561625 500258 411196 277982 137060 32173
13208 32173 -40701 -111354 -178543 -206343 -167304 -64841 81135 250942 427476 594127 739380
13197 739380 856618 935460 958691 914620 812696 681475 552621 448576 378564 341056
13187 341056 325766 323892 348622 425132 553714 702244 838632 947635 1005255 969507 822600
13176 822600 597109 341422 92044 -121176 -280224 -390407 -472776 -546149 -625826 -729123
13166 -729123 -862277 -1006690 -1128791 -1201265 -1215376 -1181316 -1118550 -1049683 -1005212 -1009475 -1051232
13155a051232l4443J5250P4448J08552J09987J04696J23456J67900K07450K12836
13145C8900J86567J52626J27696J09606Q5414M9499J7518R72j8104n3192q7784
13134F09718j08238j27479j63279k11332k43508k23266j32897K218J27074J97625
13124b73364J99116J36269K7601r6014j95412k25420j62021l0754J12316K10858
13114b96825K25903J62965Q3588N0780O6854R3269J09897J22435J27928J09282
13104H56076O0553r319r1776j63778j92805j82198j64074j56613j59658j62510
13094c66102j48357j07011k9112Q7461K07683K75836K65177J90799Q9051n789
13084D59636p6134j12591r9819l2449N7742J24587J56378J72415J84572J81289
$$ plain form
13155 -1051232 -1085675 -1070425 -995977 -887425 -777438 -672742 -549286 -381386 -173936 38900
13145 38900 225467 378093 505789 615395 700809 750308 767826 768798 750694 697502 609718
13134 609718 501480 374001 210722 -610 -244118 -467384 -600281 -598063 -470989 -273364
13124 -273364 -74248 62021 89622 -6392 -201804 -427224 -589245 -619999 -507683 -296825
13114 -296825 -70922 92043 175631 226411 293265 386534 496431 618866 746794 856076
13104 856076 916629 907310 815534 651756 458951 276753 112679 -43934 -203592 -366102
13094 -366102 -514459 -621470 -650582 -563121 -355438 -79602 185575 376374 465425 459636
13084 459636 383502 270911 171092 138643 196385 320972 477350 649765 834337 1015626
13074A015626J50791J04470O5682N2504O9448J03565J40814J82447K31215K77421
13064B393983K99610K68479J73694L7776j04358k18446k86782l12440k96926k36701
13054A717889j42549m0173M7012J02278J16738J01820Q5235Q9167J14603J43925
13044B335945J53954J29816P1448j9001j30834k26008k69511k72156k71063k79675
13034A222915k84360k75017k49329k08177j63989j28587r6735o2635l2098j4541
13024b92553k2585n9741j03484j17583q3478k2516K4304L8131K7915K560l4080
13013f43110o4884o7977m1455m211K3316L1821K5492K4965N4749J06791J38658
13002d15845J23332Q0807M4408K3341N272l0756q5659j26193j16953n4240K8510
$$ plain form
13074 1015626 1166417 1270887 1336569 1389073 1458521 1562086 1702900 1885347 2116562 2393983
13064 2393983 2693593 2962072 3135766 3173542 3069184 2850738 2563956 2251516 1954590 1717889
13054 1717889 1575340 1535167 1582179 1684457 1801195 1903015 1988250 2077417 2192020 2335945
13044 2335945 2489899 2619715 2691163 2672162 2541328 2315320 2045809 1773653 1502590 1222915
13034 1222915 938555 663538 414209 206032 42043 -86544 -183279 -245914 -278012 -292553
13024 -292553 -315138 -374879 -478363 -595946 -679424 -701940 -677636 -639505 -611590 -609030 -643110
13013 -643110 -707994 -775971 -817426 -821637 -798321 -766500 -741008 -716043 -661294 -554503 -415845
13002 -415845 -292513 -211706 -167298 -143957 -138685 -169441 -255100 -381293 -498246 -552486 -523976
12991e23976P9695O5762O275m5814o9138q1329r6245j16279j40442j51125j19642
12980a192258l1151J07076K69230M19565N23701N53479M93339L61108K05163O6790
12970A776042k8120n6974j9452L7249N3861J8515l8823q7561j19154j39244j53713
12959A242626j73284k06848k35394k12566j05684N5145J77549J87390R8017k6832
12949H00119j50168k61780l39574l62206l31258k68224j96150j11296N008J37539
12939a077990K42980K97562L01157K66297K20448J90142J85371J92826J75680
12930I94473J11158J6534p6925j43502j62770j25045m9139J1343J4602l1620r4529
12919D64580j48148j90840k38311k86402l00927k58986j70514n1557Q2854J99945
$$ plain form
12991 -523976 -444281 -378519 -372244 -418058 -487196 -568525 -664770 -781049 -921491 -1072616 -1192258
12980 -1192258 -1223409 -1116333 -847103 -427538 96163 649642 1142981 1504089 1709252 1776042
12970 1776042 1747922 1690948 1671496 1708745 1762606 1781121 1742298 1654737 1535583 1396339 1242626
12959 1242626 1069342 862494 627100 414534 308850 363995 541544 728934 826951 800119
12949 800119 649951 388171 48597 -313609 -644867 -913091 -1109241 -1220537 -1215529 -1077990
12939 -1077990 -835010 -537448 -236291 30006 250454 440596 625967 818793 994473
12930 994473 1105631 1122165 1045240 901738 738968 613923 564784 576127 590729 559109 464580
12919 464580 316432 125592 -112719 -399121 -700048 -959034 -1129548 -1181105 -1098251 -898306
12909h98306K57322K41423J83009J24378P9148L0193l1918p8983p7647l2901K4904
12898a79378P4268J08570J31355J58146J98623K31360K21295J64005Q7251K5110
12888A220605J332K2241P5334J18880J02654L2244k8087l3241J5566R3724J56177
12877A777429J59669R4617j9555j58857l02507m24222n00603n34298n41979n14947
12867i65253m18372k42113l5016J34282K28641K52554K41737K27739K00279J21388
12857b54134j2453j36539j74937j27496n9048p827L9620Q7479J16968J30057J45088
$$ plain form
12909 -898306 -640984 -399561 -216552 -92174 -13026 17167 -14751 -93734 -171381 -204282 -179378
12898 -179378 -105110 3460 134815 292961 491584 722944 944239 1108244 1195495 1220605
12888 1220605 1221937 1244178 1319512 1438392 1541046 1573290 1545203 1511962 1527528 1621252 1777429
12877 1777429 1937098 2031715 2012160 1853303 1550796 1126574 625971 91673 -450306 -965253
12867 -965253 -1383625 -1625738 -1660754 -1526472 -1297831 -1045277 -803540 -575801 -375522 -254134
12857 -254134 -266587 -403126 -578063 -705559 -764607 -772434 -732814 -645335 -528367 -398310 -253222
$$ [...]
##END NTUPLES=NMR SPECTRUM
##END=
