##TITLE=31P ikalashn
DE-77rm_3h(nlock)
14.11.2024
##JCAMPDX= 6.0         $$ Bruker NMR JCAMP-DX V2.0
##DATA TYPE= NMR SPECTRUM
##DATA CLASS= NTUPLES
##ORIGIN= UXNMR, Bruker Analytische Messtechnik GmbH
##OWNER= root
$$ TOPSPIN		Version 1.3
$$ 2024-11-14 14:34:21.390 +0400  Irina@DPX200
$$ Compression mode = diff/dup
##.OBSERVE FREQUENCY= 81.01967998063
##.OBSERVE NUCLEUS= ^31P
##.ACQUISITION MODE= SIMULTANEOUS
##.ACQUISITION SCHEME= undefined
##.AVERAGES= 64
##.DIGITISER RES= 17
##SPECTROMETER/DATA SYSTEM= spect
##.PULSE SEQUENCE= zgpg
##.SOLVENT NAME= D2O
##.SHIFT REFERENCE= INTERNAL, D2O, 1, 298.5841
##AUDIT TRAIL= $$ (NUMBER, WHEN, WHO, WHERE, WHAT)
$$ ##TITLE= Audit trail, TOPSPIN		Version 1.3
$$ ##JCAMPDX= 5.01
$$ ##ORIGIN= Bruker BioSpin GmbH
$$ ##OWNER= Irina
$$ $$ F:/spectra/data/iren/nmr/P31dec/1/pdata/1/auditp.txt
$$ ##AUDIT TRAIL=  $$ (NUMBER, WHEN, WHO, WHERE, VERSION, WHAT)
(   1,<2024-11-14 14:32:16.750 +0400>,<Irina>,<DPX200>,<TOPSPIN 1.3>,
      <acquisition in progress>)
(   2,<2024-11-14 14:33:59.015 +0400>,<Irina>,<DPX200>,<TOPSPIN 1.3>,
      <Start of raw data processing
       efp BC_mod = 2 LB = 10 FT_mod = 6 PKNL = 1 PHC0 = 69.01218 PHC1 = 338.2631 SI = 32K 
       data hash MD5: 32K
       10 5B D4 F1 01 27 48 71 47 4C 92 27 92 C6 CD DC>)
(   3,<2024-11-14 14:34:01.515 +0400>,<Irina>,<DPX200>,<TOPSPIN 1.3>,
      <apk 
       data hash MD5: 32K
       77 B2 53 72 79 24 4D 90 4C 1F 66 55 6D 75 16 F7>)
(   4,<2024-11-14 14:34:08.671 +0400>,<Irina>,<DPX200>,<TOPSPIN 1.3>,
      <pk fgphup PHC0 = 7.4 PHC1 = 0 
       data hash MD5: 32K
       5E E7 20 ED CB 5A 0C BB 26 C7 BF 42 01 02 69 8E>)
(   5,<2024-11-14 14:34:10.500 +0400>,<Irina>,<DPX200>,<TOPSPIN 1.3>,
      <abs n ABSG = 5 
       data hash MD5: 32K
       86 0C 2B 71 3C 84 6F 31 EC 0A 8D B7 E7 CA 38 A3>)
$$ ##END=
$$ 
$$ $$ hash MD5
$$ $$ 65 61 A1 F2 43 6C 72 14 E6 3A D2 1A C9 0F F9 DE
##$RELAX= 
##$RELAX= 
##$RELAX= 
##$RELAX= 
##$RELAX= 
##$RELAX= 
##$RELAX= 
##$RELAX= 
##$RELAX= 
##$RELAX= 
##$RELAX= 
$$ Bruker specific parameters
$$ --------------------------
##$DU= <F:/spectra>
##$EXPNO= 1
##$NAME= <P31dec>
##$PROCNO= 1
##$TYPE= <nmr>
##$USER= <iren>
##$AMP= (0..31)
100 100 100 100 100 100 100 100 100 100 100 100 100 100 100 100 100 100 
100 100 100 100 100 100 100 100 100 100 100 100 100 100 
##$ANAVPT= -1
##$AQSEQ= 0
##$AQ_mod= 1
##$AUNM= <au_zg>
##$AUTOPOS= <>
##$BF1= 81.014009
##$BF2= 200.13
##$BF3= 200.13
##$BF4= 200.13
##$BF5= 200.13
##$BF6= 200.13
##$BF7= 200.13
##$BF8= 200.13
##$BYTORDA= 1
##$CFDGTYP= 0
##$CFRGTYP= 5
##$CHEMSTR= <none>
##$CNST= (0..63)
1 1 145 1 1 1 1 1 1 1 1 1 1 1 1 1 1 1 1 1 1 1 1 1 1 1 1 1 1 1 1 1 1 1 
1 1 1 1 1 1 1 1 1 1 1 1 1 1 1 1 1 1 1 1 1 1 1 1 1 1 1 1 1 1 
##$CPDPRG= <waltz16>
##$CPDPRG1= <>
##$CPDPRG2= <waltz16>
##$CPDPRG3= <>
##$CPDPRG4= <mlev>
##$CPDPRG5= <mlev>
##$CPDPRG6= <mlev>
##$CPDPRG7= <mlev>
##$CPDPRG8= <mlev>
##$CPDPRGB= <>
##$CPDPRGT= <>
##$D= (0..63)
$$ [...]
##$SW_h= 37037.037037037
##$TD= 32768
##$TD0= 1
##$TE= 300
##$TE2= 300
##$TE3= 300
##$TEG= 300
##$TL= (0..7)
0 120 53 12 22 120 120 120 
##$TP= (0..7)
150 150 150 150 150 150 150 150 
##$TP07= 0
##$TPNAME0= <>
##$TPNAME1= <>
##$TPNAME2= <>
##$TPNAME3= <>
##$TPNAME4= <>
##$TPNAME5= <>
##$TPNAME6= <>
##$TPNAME7= <>
##$TPOAL= (0..7)
0.5 0.5 0.5 0.5 0.5 0.5 0.5 0.5 
##$TPOFFS= (0..7)
0 0 0 0 0 0 0 0 
##$TUNHIN= 0
##$TUNHOUT= 0
##$TUNXOUT= 0
##$USERA1= <user>
##$USERA2= <user>
##$USERA3= <user>
##$USERA4= <user>
##$USERA5= <user>
##$V9= 5
##$VALIST= <valist>
##$VCLIST= <CCCCCCCCCCCCCCC>
##$VD= 0
##$VDLIST= <DDDDDDDDDDDDDDD>
##$VPLIST= <PPPPPPPPPPPPPPP>
##$VTLIST= <TTTTTTTTTTTTTTT>
##$WBST= 1024
##$WBSW= 4
##$XGAIN= (0..3)
0 0 0 0 
##$XL= 0
##$YL= 0
##$YMAX_a= 7589
##$YMIN_a= -9676
##$ZGOPTNS= <>
##$ZL1= 120
##$ZL2= 120
##$ZL3= 120
##$ZL4= 120
##$ABSF1= 298.5841
##$ABSF2= -158.5842
##$ABSG= 5
##$ABSL= 5
##$ALPHA= 0
##$AQORDER= 0
##$ASSFAC= 0
##$ASSFACI= 0
##$ASSFACX= 0
##$ASSWID= 0
##$AUNMP= <proc_1d>
##$AXLEFT= 0
##$AXRIGHT= 0
##$AXTYPE= 0
##$AXUNIT= <>
##$AZFE= 0.1
##$AZFW= 0.5
##$BCFW= 0
##$BC_mod= 2
##$BYTORDP= 0
##$COROFFS= 0
##$CY= 12.5935478210449
##$DATMOD= 1
##$DC= 0
##$DFILT= <>
##$DTYPP= 0
##$F1P= 47.1127640792319
##$F2P= -24.0371245302204
##$FCOR= 0.5
##$FTSIZE= 32768
##$FT_mod= 6
##$GAMMA= 0
##$GB= 0
##$INTBC= 1
##$INTSCL= 7.269226e-011
##$ISEN= 30
##$LB= 10
##$LEV0= 0
##$LPBIN= 0
##$MAXI= 12.09355
##$MC2= 0
##$MEAN= 0
##$ME_mod= 0
##$MI= 0.7550151
##$NCOEF= 0
##$NC_proc= -11
##$NLEV= 6
##$NOISF1= 298.5841
##$NOISF2= 270.0111
##$NSP= 0
##$NTH_PI= 0
##$NZP= 0
##$OFFSET= 298.5841
##$PC= 1.4
##$PHC0= 241.2667
##$PHC1= -14.09473
##$PH_mod= 1
##$PKNL= yes
##$PPARMOD= 0
##$PPDIAG= 0
##$PPIPTYP= 0
##$PPMPNUM= 100
##$PPRESOL= 1
##$PSCAL= 0
##$PSIGN= 0
##$REVERSE= no
##$SF= 81.014009
##$SI= 32768
##$SIGF1= 270.0111
##$SIGF2= -158.5842
##$SINO= 77.54984
##$SIOLD= 32768
##$SREGLST= <31P.CDCl3>
##$SSB= 0
##$STSI= 32768
##$STSR= 0
##$SW_p= 37037.037037037
##$SYMM= 0
##$S_DEV= 0
##$TDeff= 32768
##$TDoff= 0
##$TI= <>
##$TILT= no
##$TM1= 0
##$TM2= 0
##$TOPLEV= 0
##$USERP1= <user>
##$USERP2= <user>
##$USERP3= <user>
##$USERP4= <user>
##$USERP5= <user>
##$WDW= 1
##$XDIM= 32768
##$YMAX_p= 465549180
##$YMIN_p= -21187550
$$ End of Bruker specific parameters
$$ ---------------------------------
##NTUPLES= NMR SPECTRUM
##VAR_NAME=  FREQUENCY,     SPECTRUM/REAL,   SPECTRUM/IMAG
##SYMBOL=    X,             R,               I
##VAR_TYPE=  INDEPENDENT,   DEPENDENT,       DEPENDENT
##VAR_FORM=  AFFN,          ASDF,            ASDF
##VAR_DIM=   32768,         32768,           32768
##UNITS=     HZ,            ARBITRARY UNITS, ARBITRARY UNITS
##FACTOR=    1.13031516577767, 1,            1
##FIRST=     37037.037037037, 689244,        8192444
##LAST=      0,             -2308974,        -5314662
##MIN=       0,             -21187550,       0
##MAX=       37037.037037037, 465549180,     0
$$ Real data points
##PAGE= N=1
##DATA TABLE= (X++(R..R)), XYDATA
$$ [...]
18424B945940l73431l16216k17789j50302j67319k71097l84749m02212l17157
$$ 2945940 2572509 2256293 2038504 1888202 1720883 1449786 1065037 662825 345668
18415C45668k30168k06157k14902k10857j84341j37964p6822k5409q921j0327
$$ 345668 115500 -90657 -305559 -516416 -700757 -838721 -915543 -940952 -949873 -960200
18405i60200K3995J12785K03122K35656K09343J60948J20543J08564J42849K15358
$$ -960200 -936205 -823420 -620298 -384642 -175299 -14351 106192 214756 357605 572963
18395E72963K82219K83864J77306k5622k54979m35513n45623o15952o70807o78181
$$ 572963 855182 1139046 1316352 1290730 1035751 600238 54615 -561337 -1232144 -1910325
18385a910325n64736l03924J1417K33998L06876K79562K18345J68647J51315J45501
$$ -1910325 -2475061 -2778985 -2767568 -2533570 -2226694 -1947132 -1728787 -1560140 -1408825 -1263324
18375a263324J27053J19476J67615K87683M45471N68035N69225L94906Q5691k40831
$$ -1263324 -1136271 -1016795 -849180 -561497 -116026 452009 1021234 1416140 1501831 1261000
18365A261000n13187p47789r43422j034474r91416q68531p04314m72401j65928
$$ 1261000 747813 24 -943398 -1977872 -2969288 -3837819 -4542133 -5014534 -5180462
18356e180462J47324L91984N45494O00688N56503M52587L39356K33262J27823
$$ -5180462 -5033138 -4641154 -4095660 -3494972 -2938469 -2485882 -2146526 -1913264 -1785441
18347a785441K3911n5360q7775r9955j36150j83294j94277j53865p8153K3741
$$ -1785441 -1761530 -1816890 -1904665 -2004620 -2140770 -2324064 -2518341 -2672206 -2750359 -2726618
18337b726618J44147K29028K06534P2805q6893j55392r3731p699l2557j48764
$$ -2726618 -2582471 -2353443 -2146909 -2074104 -2160997 -2316389 -2410120 -2417819 -2450376 -2599140
18327b599140k14087j46371J1306J72952K92831L75994M40644M69915M28485L14382
$$ -2599140 -2813227 -2959598 -2948292 -2775340 -2482509 -2106515 -1665871 -1195956 -767471 -453089
18317d53089J62842J9101p5979j11086j24626j66098k28169k61606k63818k60383
$$ -453089 -290247 -271146 -347125 -458211 -582837 -748935 -977104 -1238710 -1502528 -1762911
18307a762911k44271j94535j00116K9264J68530K84854L41410L15176K36428J85119
$$ -1762911 -2007182 -2201717 -2301833 -2272569 -2104039 -1819185 -1477775 -1162599 -926171 -741052
18297g41052K05820K60326K78598K25041J12766q293p4078n4765J5985Q3547J47381
$$ -741052 -535232 -274906 3692 228733 341499 333206 259128 204363 220348 303895 451276
18286D51276K47611L64501M13764L56983K37386Q8793j04784l15706m54329m90164
$$ 451276 698887 1063388 1477152 1834135 2071521 2160314 2055530 1739824 1285495 795331
18276G95331m68891m37167m12034l81077l07441j43706J04900L35803M29714L65783
$$ 795331 326440 -110727 -522761 -903838 -1211279 -1354985 -1250085 -914282 -484568 -118785
18266a18785K25355R8700K2798k336K1181P1927R2444L2593j04611k60591l46849
$$ -118785 106570 205270 228068 225732 246913 318840 411284 443877 339266 78675 -268174
18255b68174k85399p5502J80201L51564L76440K78354J15550o0153k02304k73794
$$ -268174 -553573 -629075 -448874 -97310 279130 557484 673034 612881 410577 136783
18245A36783k54348j41327J0413J12717J39799J31360J26377J31264J31055J20960
$$ 136783 -117565 -258892 -248479 -135762 4037 135397 261774 393038 524093 645053
18235F45053J34274J98441K81695L24465K84725J59626m325j35472j73424r7580
$$ 645053 779327 977768 1259463 1583928 1868653 2028279 2023954 1888482 1715058 1617478
18225A617478K8831P5911k6909k10846l55144m08562l88029l18337k12955q4942
$$ 1617478 1646309 1722220 1695311 1484465 1129321 720759 332730 14393 -198562 -283504
18215b83504L8100J06142P6722k9998j26885j38333p8228n539O4817J46914K29196
$$ -283504 -245404 -139262 -62540 -92538 -219423 -357756 -435984 -441523 -376706 -229792 -596
18204e96K72510K24953L8959k59915n43047p03537p49552p15906o05337m48523
$$ -596 271914 496867 535826 275911 -267136 -970673 -1720225 -2436131 -3041468 -3489991
18194c489991k88245j26695L2275J39461J55217J14271P3194M8972N8150J51637
$$ -3489991 -3778236 -3904931 -3872656 -3733195 -3577978 -3463707 -3390513 -3341541 -3283391 -3131754
18184c131754L57348O18003Q37079R60024R75275Q80036O82848M41027K51493
$$ -3131754 -2774406 -2156403 -1319324 -359300 615975 1496011 2178859 2619886 2871379
18175B871379J66609J62778J88687J82188Q5005r7584k88193m23319m92062n07169
$$ 2871379 3037988 3200766 3389453 3571641 3656646 3559062 3270869 2847550 2355488 1848319
18165A848319m89430m50619m02701l68899l56377l52470l32960k54675p4896J76547
$$ 1848319 1358889 908270 505569 136670 -219707 -572177 -905137 -1159812 -1234708 -1058161
18155a058161L76540M27528L33937J55765l9316j86448k48462k53910k73528l42530
$$ -1058161 -681621 -254093 79844 235609 196293 9845 -238617 -492527 -766055 -1108585
18145a108585m25662m60466m05348k53495j7179L14033P56879J209371J466425
$$ -1108585 -1534247 -1994713 -2400061 -2653556 -2670735 -2356702 -1599823 -390452 1075973
18136A075973J449714J262970R97391O45707K14975j93273m71759o20793p05082
$$ 1075973 2525687 3788657 4786048 5431755 5646730 5453457 4981698 4360905 3655823
18127C655823p47804p19794o07056m54951l47522l34485l91649m83131n88825
$$ 3655823 2908019 2188225 1581169 1126218 778696 444211 52562 -430569 -1019394
18118a019394o63471o55439n41741l26056n8104J70570L05093L50155L09049J93406
$$ -1019394 -1682865 -2338304 -2880045 -3206101 -3264205 -3093635 -2788542 -2438387 -2129338 -1935932
18108a935932O0839l0237o6068n3577n387M9022Q9931J47163K59900L93760M46099
$$ -1935932 -1875093 -1905330 -1971398 -2024975 -2030362 -1981340 -1891409 -1744246 -1484346 -1090586 -644487
18097f44487L48826J37866p1194j64130j17472o954O8996O7270k149r4877j28642
$$ -644487 -295661 -157795 -228989 -393119 -510591 -517545 -448549 -381279 -383428 -478305 -606947
18086f06947n1059R9737K39535L17776L20789K27376M9857j33752k36923k13914
$$ -606947 -658006 -558269 -318734 -958 319831 547207 597064 463312 226389 12475
18076A2475p7632J08220K83726M25470N23951N75238N68049M64276K41639m7290
$$ 12475 -65157 43063 326789 752259 1276210 1851448 2419497 2883773 3125412 3078122
18066C078122l20622n56048p70141r42228r97556q77708o14158k92120J8138K69270
$$ 3078122 2757500 2201452 1431311 489083 -508473 -1386181 -2000339 -2292459 -2274321 -2005051
18056b005051M36447N23642N28596M36462K92696J92987J80194K18523K28092
$$ -2005051 -1568604 -1044962 -516366 -79904 212792 405779 585973 804496 1032588
18047A032588J41418j8882j43027j45620o5205k7622j09600k83746m77733o15141
$$ 1032588 1174006 1155124 1012097 866477 801272 773650 664050 380304 -97429 -712570
18037g12570o38206n28575k82860N9656L68417N14364M73865L07111J00032r1128
$$ -712570 -1350776 -1879351 -2162211 -2102555 -1734138 -1219774 -745909 -438798 -338766 -429894
18027d29894k50711l58148l99821l84894l30417k76610k72776l11848l15790k04495
$$ -429894 -680605 -1038753 -1438574 -1823468 -2153885 -2430495 -2703271 -3015119 -3330909 -3535404
18017c535404K0168K62873M28710M91703M65662L79868K81837K14073J75268J40616
$$ -3535404 -3515236 -3252363 -2823653 -2331950 -1866288 -1486420 -1204583 -990510 -815242 -674626
18007f74626J24514J48299J80994J82789J47988R2722L0973l0582q4061j17615
$$ -674626 -550112 -401813 -220819 -38030 109958 202680 233653 203071 119010 1395
17997A395j19044j04250j23111j95906k69563k98448l09006l21599l11516k75587
$$ 1395 -117649 -221899 -345010 -540916 -810479 -1108927 -1417933 -1739532 -2051048 -2326635
17987b326635k47321k44918k47780k13534r6997J34861M55972P57161R01187Q13209
$$ -2326635 -2573956 -2818874 -3066654 -3280188 -3377185 -3242324 -2786352 -2029191 -1128004 -314795
17977c14795N66263L31349K05663J47652O8509n4017j60955j93409j54396r3593
$$ -314795 251468 582817 788480 936132 1004641 950624 789669 596260 441864 348271
17967C48271n9630o2072p8001j00596j38072j81945k17286k47421k97820l82874
$$ 348271 288641 226569 148568 47972 -90100 -272045 -489331 -736752 -1034572 -1417446
17957a417446m65936m71848l64637k04970q1601j1967L8226R0696J33444J37435
$$ -1417446 -1883382 -2355230 -2719867 -2924837 -3006438 -3018405 -2980179 -2889483 -2756039 -2618604
17947b618604R7499M1607K858J4226R3925K02989K86493L48060M01582M01406
$$ -2618604 -2521105 -2479498 -2476640 -2462414 -2368489 -2165500 -1879007 -1530947 -1129365 -727959
17937g27959L10225J71837N9752P955k231J414L7400J20819J94283J82941P2489
$$ -727959 -417734 -245897 -186145 -178190 -180421 -179007 -141607 -20788 173495 356436 428925
17926D28925r0090k46240l40497l16738j80480j6552J06227J80761K10131J86013
$$ 428925 338835 92595 -247902 -564640 -745120 -761672 -655445 -474684 -264553 -78540
17916g8540J14017L8050J5536M6517P5647P8170R0392J35824J49159L4989k04738
$$ -78540 35477 73527 89063 135580 211227 289397 379789 515613 664772 699761 495023
17905D95023m37250m97819l39414p9160J17562J88243J97732K16673K32708K14035
$$ 495023 57773 -440046 -779460 -858620 -741058 -552815 -355083 -138410 94298 308333
17895C08333J82319J79041J97416J90825J33931L3607r5293k26516l06098k79394
$$ 308333 490652 669693 867109 1057934 1191865 1225472 1130179 903663 597565 318171
17885C18171j55551j2938Q4944J22158Q9493J159r9334j73639j88984j32178l3474
$$ 318171 162620 149682 234626 356784 446277 447436 348102 174463 -14521 -146699 -180173
17874a80173O4548J35674J84820K45722L31493M07282M20670L58170K73099K33598
$$ -180173 -115625 20049 204869 450591 782084 1189366 1610036 1968206 2241305 2474903
17864B474903K41371K36547J74663O1545o9263j80549k58791k99417k81645k03261
$$ 2474903 2716274 2952821 3127484 3189029 3119766 2939217 2680426 2381009 2099364 1896103
17854A896103r7577J5299J24292J63545Q1956n3340j33839j40084j32894j61358
$$ 1896103 1798526 1813825 1938117 2101662 2183618 2130278 1996439 1856355 1723461 1562103
17844A562103k29869l16193l85324m29755m87232n80883o77076p02064n97529
$$ 1562103 1332234 1016041 630717 200962 -286270 -867153 -1544229 -2246293 -2843822
17835b843822l66260o4369K21230M00563M21505K88861N5201k00162l83484m20247
$$ -2843822 -3210082 -3274451 -3053221 -2652658 -2231153 -1942292 -1887091 -2087253 -2470737 -2890984
17825b890984l38200k72967l15554m01619l92716k32218R838K21934L27950L09861
$$ -2890984 -3229184 -3502151 -3817705 -4219324 -4612040 -4844258 -4834420 -4612486 -4284536 -3974675
17815c974675K15230J23635Q3261O9873K2524o1171j17564r5883p216R7758J86749
$$ -3974675 -3759445 -3635810 -3552549 -3482676 -3460152 -3521323 -3638887 -3734770 -3741986 -3644228 -3457479
17804c457479K56904L16544L79174M44836M93752N16308N40842O01316O89726
$$ -3457479 -3200575 -2884031 -2504857 -2060021 -1566269 -1049961 -509119 92197 781923
17795G81923P70324P93266P12993N24740K59672r344k01307l12147l84969m17168
$$ 781923 1552247 2345513 3058506 3583246 3842918 3833574 3632267 3320120 2935151 2517983
17785B517983m01211l94814m36625m78197m65067l92227k80717j58699o3215l2308
$$ 2517983 2116772 1721958 1285333 807136 342069 -50158 -330875 -489574 -552789 -585097
17775e85097o4644j21239j59436j27342L676J81085L29504M33760N02945N14586
$$ -585097 -649741 -770980 -930416 -1057758 -1054082 -872997 -543493 -109733 393212 907798
17765I07798M38042K71225K9486k38989m51597n55460n50819m53801k89949j35313
$$ 907798 1345840 1617065 1646551 1407562 955965 400505 -150314 -604115 -894064 -1029377
17755a029377p7070j04736j07456J4504K39119M39626N14791M76254M14749L88491
$$ -1029377 -1106447 -1211183 -1318639 -1304135 -1065016 -625390 -110599 365655 780404 1168895
17745A168895L73480L18930K14955J16857Q9860J20255J35432J07901P1832L9269
$$ 1168895 1542375 1861305 2076260 2193117 2282977 2403232 2538664 2646565 2718397 2757666
17735B757666k7451j43337k41699k37447j16119P2791K40735K97151K25286R0602
$$ 2757666 2730215 2586878 2345179 2107732 1991613 2064404 2305139 2602290 2827576 2918178
17725B918178m3020j57874k39176k66010k61093k71352k97752k98097k60974k28332
$$ 2918178 2875158 2717284 2478108 2212098 1951005 1679653 1381901 1083804 822830 594498
17715E94498k26496k30590k19479j94425j49435q9789l5268J5971Q4138J54646
$$ 594498 368002 137412 -82067 -276492 -425927 -515716 -550984 -535013 -450875 -296229
17705b96229J65443Q7725k2892j02903j37568j32390j02535o9561l3480J0397
$$ -296229 -130786 -43061 -65953 -168856 -306424 -438814 -541349 -610910 -644390 -633993
17695f33993K2605l3003j12198j39772j08805o9284n3680n7073o1067n9734n2406
$$ -633993 -611388 -644391 -756589 -896361 -1005166 -1074450 -1128130 -1185203 -1246270 -1306004 -1358410
17684a358410l1452O524M9771P1800P4791J15178K21713L40516M03630L93983
$$ -1358410 -1389862 -1383338 -1333567 -1261767 -1186976 -1071798 -850085 -509569 -105939 288044
17674B88044L15912J78856M8670J6732R7197K02277K26482J40129L10j06644j23061
$$ 288044 603956 782812 831482 848214 945411 1147688 1374170 1514299 1514609 1407965 1284904
17663A284904o0625L438O276m1583r1078r3077l1252M6866P6745N3621L0076J9736
$$ 1284904 1224279 1227717 1233993 1192410 1101332 1008255 977003 1023869 1100614 1154235 1184311 1204047
17651A204047k5249j13032j90957k32325k69782l21532l39642k80579j72983o9588
$$ 1204047 1178798 1065766 874809 642484 372702 51170 -288472 -569051 -742034 -811622
17641h11622Q927N4417N3452m057j15788k42746l09728k77952j79383m3887J18122
$$ -811622 -802695 -748278 -694826 -698883 -814671 -1057417 -1367145 -1645097 -1824480 -1868367 -1750245
17630a750245K62147L26896L13955K70896J90763M8080r7465j40758l7977J48975
$$ -1750245 -1488098 -1161202 -847247 -576351 -385588 -337508 -434973 -575731 -613708 -464733
17620d64733K84660K63427J09248m5907r6563o8972m7445l2995L3387J62909K92872
$$ -464733 -180073 83354 192602 146695 50132 -18840 -66285 -99280 -65893 97016 389888
17609C89888L49862L19091K48705J89386J39715O6197k4960q8488j16654j46111
$$ 389888 739750 1058841 1307546 1496932 1636647 1702844 1677884 1589396 1472742 1326631
17599A326631j82693j77752q2887R7579L04271M60488N01286L98675J86046m6075
$$ 1326631 1143938 966186 883299 980878 1285149 1745637 2246923 2645598 2831644 2785569
17589B785569k00800k46601k33944k21229k10837j66763p6807R816J4225r6736
$$ 2785569 2584769 2338168 2104224 1882995 1672158 1505395 1428588 1438404 1452629 1355893
17579A355893k67349m16252n16126n65354n58515n23046n12369n30278n10157
$$ 1355893 1088544 672292 156166 -409188 -967703 -1490749 -2003118 -2533396 -3043553
17570c043553l96555k09789j6776J61515L54080N44006O50397O14607M54453K26750
$$ -3043553 -3440108 -3649897 -3666673 -3505158 -3151078 -2607072 -1956675 -1342068 -887615 -660865
17560f60865J0720r3102n8140J5877L7080L4690O8130J12137J07352O3888M5794
$$ -660865 -650145 -743247 -801387 -785510 -748430 -713740 -645610 -533473 -426121 -362233 -316439
17549c16439R3489J76765K26133K09651J52781J02525Q0076P7058Q7511R7875
$$ -316439 -222950 -46185 179948 389599 542380 644905 724981 802039 889550 987425
17539I87425P8198K429j34199k84869l57977l08083j93546j11493j26741k49254
$$ 987425 1065623 1068052 933853 648984 291007 -17076 -210622 -322115 -448856 -698110
17529f98110m01220m56009l73130k29384j00116J0259J20556K14792K25428Q2774
$$ -698110 -1099330 -1555339 -1928469 -2157853 -2257969 -2247710 -2127154 -1912362 -1686934 -1604160
17519a604160j93431m78210o38552o42914n43853l91375k28426r1398L111M9734
$$ -1604160 -1797591 -2275801 -2914353 -3557267 -4101120 -4492495 -4720921 -4812319 -4809208 -4759474
17509d759474O0262N1093L5878N1163J20191K00673K47965K70181K77582K72151
$$ -4759474 -4699212 -4648119 -4612241 -4561078 -4440887 -4240214 -3992249 -3722068 -3444486 -3172335
17499c172335K74858L14648M07271N22908N66414M44890J74803j12593k69694
$$ -3172335 -2897477 -2582829 -2175558 -1652650 -1086236 -641346 -466543 -579136 -848830
17490h48830k46401j31349o0484q8361j42591j16467N105J47269K33142K43682
$$ -848830 -1095231 -1226580 -1287064 -1375425 -1518016 -1634483 -1629378 -1482109 -1248967 -1005285
17480a005285J85103N9219r1040j97368k44987k53270k06188q4413P8596K18124
$$ -1005285 -820182 -760963 -852003 -1049371 -1294358 -1547628 -1753816 -1838229 -1759633 -1541509
17470a541509K84373K65289K08852J98124K66120L66295M06828L26264J61124
$$ -1541509 -1257136 -991847 -782995 -584871 -318751 47544 454372 780636 941760
17461I41760K606j08626k07986l45370n00078n73133n05485l47764j85954p2051
$$ 941760 944366 835740 627754 282384 -217694 -790827 -1296312 -1644076 -1830030 -1902081
17451a902081k6520m8928j11041j65969j80791j71469j82624k14038j94033p7356
$$ -1902081 -1928601 -1977529 -2088570 -2254539 -2435330 -2606799 -2789423 -3003461 -3197494 -3274850
17441c274850P3946J88774K69007L35221L90102M32566M42463L78257K51595J46971
$$ -3274850 -3200904 -3012130 -2743123 -2407902 -2017800 -1585234 -1142771 -764514 -512919 -365948
17431c65948J18366J14100M2728j27437l42639m93498m91177l58854k10064j15253
$$ -365948 -247582 -133482 -90754 -218191 -560830 -1054328 -1545505 -1904359 -2114423 -2229676
17421b229676m6407M8144J59878K22646J85401P1317l4695r0127j39062k22823
$$ -2229676 -2276083 -2227939 -2068061 -1845415 -1660014 -1588697 -1623392 -1713519 -1852581 -2075404
17411b075404l21046l73914l16620j10544K17588N44693O98282N88759K79454
$$ -2075404 -2396450 -2770364 -3086984 -3197528 -2979940 -2435247 -1736965 -1148206 -868752
17402h68752p6424l23010l71974k72208j37686J596J73752L57028M73853M78172
$$ -868752 -945176 -1268186 -1640160 -1912368 -2050054 -2048458 -1874706 -1517678 -1043825 -565653
17392e65653M02694L01033K00323J02355k2332k00999l98820n35911n51689m35616
$$ -565653 -162959 138074 338397 440752 418420 217421 -181399 -717310 -1268999 -1704615
17382a704615k29639j9591J06011J13997O1749O1532J62619K73747K54255R4863
$$ -1704615 -1934254 -1953845 -1847834 -1733837 -1672088 -1610556 -1447937 -1174190 -919935 -825072
17372h25072p1190j47171j64980j88122k01050j41609m368J50040K72826L37509
$$ -825072 -896262 -1043433 -1208413 -1396535 -1597585 -1739194 -1743562 -1593522 -1320696 -983187
17362i83187L18413K33850J49843R8149N9057J0969o5150j76749k85161l26723
$$ -983187 -664774 -430924 -281081 -182932 -123875 -112906 -178056 -354805 -639966 -966689
17352i66689k60411q3214J59655M10387O36513P89905Q17807P36960O04419M27779
$$ -966689 -1227100 -1310314 -1150659 -740272 -103759 686146 1503953 2240913 2845332 3273111
17342C273111J92493p6325l25014m68709m33151k64913j26701j51546l33957n70905
$$ 3273111 3465604 3389279 3064265 2595556 2162405 1897492 1770791 1619245 1285288 714383
17332G14383p58362q27380p62557o18943m43537k08322J03229M10162O05126O59109
$$ 714383 -43979 -871359 -1633916 -2252859 -2696396 -2904718 -2801489 -2391327 -1786201 -1127092
17322a127092O18468N36131M18591K51076O7506n7190j05854j30470j61316j73345
$$ -1127092 -508624 27507 446098 697174 764680 707490 601636 471166 309850 136505
17312A36505j33214o1775m5265j44228k98880l98439l87325k60978n9410J38616
$$ 136505 3291 -58484 -103749 -247977 -546857 -945296 -1332621 -1593599 -1653009 -1514393
17302a514393K78603L50235L38526K45877J32545N0254j9391j20705k63314m13902
$$ -1514393 -1235790 -885555 -547029 -301152 -168607 -118353 -137744 -258449 -521763 -935665
17292i35665n28527n82154n77493n36242m57631l22685j54282q820Q7376J50818
$$ -935665 -1464192 -2046346 -2623839 -3160081 -3617712 -3940397 -4094679 -4103499 -4016123 -3865305
17282c865305K03949K44606K69045K90360L12568L35812L71642M12990M13274
$$ -3865305 -3661356 -3416750 -3147705 -2857345 -2544777 -2208965 -1837323 -1424333 -1011059
17273a011059L27758J71582J7561q4316j62274k50462l16979l14182k28247r6433
$$ -1011059 -683301 -511719 -494158 -578474 -740748 -991210 -1308189 -1622371 -1850618 -1947051
17263a947051Q777N6687O6533P2482J00761J32706J21034L4985j33079l47474
$$ -1947051 -1938274 -1881587 -1815054 -1742572 -1641811 -1509105 -1388071 -1353086 -1486165 -1833639
17253a833639n26145n99532n62132m69150l89979l29211k18237k4038J80224K83706
$$ -1833639 -2359784 -2959316 -3521448 -3990598 -4380577 -4709788 -4928025 -4952063 -4771839 -4488133
17243d488133K49703J44265Q4748J42145K72087L77670M13092L94405L50103L07369
$$ -4488133 -4238430 -4094165 -4009417 -3867272 -3595185 -3217515 -2804423 -2410018 -2059915 -1752546
17233a752546K94986L08690L24295L38062L32964K47086L4967k57688n13662o37638
$$ -1752546 -1457560 -1148870 -824575 -486513 -153549 93537 128504 -129184 -642846 -1280484
17223a280484o17436m87091k82838p7611K7713k216j06987j94919k17905j85763
$$ -1280484 -1897920 -2385011 -2667849 -2745460 -2717747 -2719963 -2826950 -3021869 -3239774 -3425537
17213c425537j10213m960P2198R9005J44852K61029M04339N00381N23685M97381
$$ -3425537 -3535750 -3540710 -3468512 -3369507 -3224655 -2963626 -2559287 -2058906 -1535221 -1037840
17203a037840M58575M35607M25328L96548L14731J62215n9629l22908n51066o67988
$$ -1037840 -579265 -143658 281670 678218 992949 1155164 1095535 772627 221561 -446427
17193d46427o68158n96527n03167m21505l50906k64838j50579m8578k5184p8112
$$ -446427 -1114585 -1711112 -2214279 -2635784 -2986690 -3251528 -3402107 -3450685 -3475869 -3553981
17183c553981j17193o4381O9847K32522L94057N22400N55359M44518J99375q8608
$$ -3553981 -3671174 -3735555 -3665708 -3433186 -3039129 -2516729 -1961370 -1516852 -1317477 -1406085
17173a406085k83929l02934j68864N092J11310J28966J04702R4608R9980O9978
$$ -1406085 -1690014 -1992948 -2161812 -2156720 -2045410 -1916444 -1811742 -1717134 -1617154 -1547176
17163a547176j1448r0719j07966m0830R1506K34481L29533L46212K83367J49785
$$ -1547176 -1558624 -1649343 -1757309 -1798139 -1706633 -1472152 -1142619 -796407 -513040 -363255
17153c63255m996q2350k1319J48521L63519N59805O33773M94503K00035o8857
$$ -363255 -368251 -450601 -471920 -323399 40120 599925 1233698 1728201 1928236 1859379
17143A859379j97678k15771k07009k10709k09548j92541k01273k84248l99186
$$ 1859379 1661701 1445930 1238921 1028212 818664 626123 424850 140602 -258584
17134b58584m23291l00763j06553N5455J39397J53396J47803K08002L68438N33249
$$ -258584 -681875 -982638 -1089191 -1033736 -894339 -740943 -593140 -385138 -16700 516549
17124E16549N66346M37370K33736P0678N980J6132L8922L5821J5928L026j983
$$ 516549 1082895 1520265 1754001 1824679 1830659 1846791 1885713 1921534 1937462 1940488 1938505
17113A938505q441j7438l7680q9484j68375k32698k64980l06753l79261m34722
$$ 1938505 1930064 1912626 1874946 1785462 1617087 1384389 1119409 812656 433395 -1327
17103a327m41518m35062m41896m40090m17765l96452l88540l82020l52731k62794
$$ -1327 -442845 -877907 -1319803 -1759893 -2177658 -2574110 -2962650 -3344670 -3697401 -3960195
17093c960195r8547Q4971K24828K99536K99066K35613J50616P3487K1556K8095
$$ -3960195 -4058742 -3973771 -3748943 -3449407 -3150341 -2914728 -2764112 -2690625 -2669069 -2640974
17083b640974J09668K30210L54062M81865O03203O73508O60510N62218L76350
$$ -2640974 -2531306 -2301096 -1947034 -1465169 -861966 -188458 472052 1034270 1410620
17074A410620J35922p2675j85739k06455j77626j51893j71200k28484k73988k96832
$$ 1410620 1546542 1473867 1288128 1081673 904047 752154 580954 352470 78482 -218350
17064b18350l28809l62030l59424l03626j87893k2339J23455J46484L0536j11620
$$ -218350 -547159 -909189 -1268613 -1572239 -1760132 -1782471 -1659016 -1512532 -1481996 -1593616
17054a593616j56771j01458m4930o7170j50888k18094k21733j70975r2394j9703
$$ -1593616 -1750387 -1851845 -1896775 -1963945 -2114833 -2332927 -2554660 -2725635 -2818029 -2837732
17044b837732L770l9602j27341k19102k75285k53253j27632R7521L95230O82155
$$ -2837732 -2833962 -2873564 -3000905 -3220007 -3495292 -3748545 -3876177 -3778656 -3383426 -2701271
17034b701271Q29489P61688N26255K38333m3574k98856m57181m50637l19157j88968
$$ -2701271 -1871782 -1110094 -583839 -345506 -389080 -687936 -1145117 -1595754 -1914911 -2103879
17024b103879j33741j11038m5383O2862J33040J09199J5805r9449k02837k54433
$$ -2103879 -2237620 -2348658 -2394041 -2331179 -2198139 -2088940 -2073135 -2172584 -2375421 -2629854
17014b629854k10617p2621R8863K21545K34368J28196k9459j35627j51903j02445
$$ -2629854 -2840471 -2913092 -2814229 -2592684 -2358316 -2230120 -2259579 -2395206 -2547109 -2649554
17004b649554j081J49915L29926M94279N72349N11763L44154J70406Q3269J14117
$$ -2649554 -2650635 -2500720 -2170794 -1676515 -1104166 -592403 -248249 -77843 5426 119543
16994A19543K27815L43196L75228K89118J25016m5109j79481k71014l14962l12930
$$ 119543 347358 690554 1065782 1354900 1479916 1434807 1255326 984312 669350 356420
16984C56420l00603l08017l07222k41404j00349P1577K20491K87860K24730N5142
$$ 356420 55817 -252200 -559422 -800826 -901175 -829598 -609107 -321247 -96517 -41375
16974d1375j14143j80319j15624L2969J72046K25106J93529J18688K6292n7885
$$ -41375 -155518 -335837 -451461 -418492 -246446 -21340 172189 290877 317169 259284
16964B59284r7451q4653l4661K8199N6763J5169q2579j83346k39950k63534k91991
$$ 259284 161833 77180 42519 70718 127481 142650 60071 -123275 -363225 -626759 -918750
16953i18750l13142k86681k15036j39677p4351P785J21909K49084L35993L07670
$$ -918750 -1231892 -1518573 -1733609 -1873286 -1947637 -1939852 -1817943 -1568859 -1232866 -925196
16943i25196J51614m5911j99947k97007l51399l45509k36855j9013K25814L84683
$$ -925196 -773582 -819493 -1019440 -1316447 -1667846 -2013355 -2250210 -2269223 -2043409 -1658726
16933a658726M26088L88725K97532J65593K8043o3388o7509J2130J19789J83003
$$ -1658726 -1232638 -843913 -546381 -380788 -352745 -416133 -483642 -471512 -351723 -168720
16923a68720J48705K173k12289m14560n32373n43569m79758l56321j69000M6176
$$ -168720 -20015 -17842 -230131 -644691 -1177064 -1720633 -2200391 -2556712 -2725712 -2679536
16913b679536K32793L64229M35774M39910L67122K26902N2531j20890k52782k84882
$$ -2679536 -2446743 -2082514 -1646740 -1206830 -839708 -612806 -560275 -681165 -933947 -1218829
16903a218829j94254k8987J44523K97092M08754M29475L21567J18108q7297k27209
$$ -1218829 -1413083 -1442070 -1297547 -1000455 -591701 -162226 159341 277449 190152 -37057
16893c7057l04560l33475k95308j56461O6968K59526L02511K10499Q4109k5170
$$ -37057 -341617 -675092 -970400 -1126861 -1059893 -800367 -497856 -287357 -203248 -228418
16883b28418j25322k09873k41213j94454q3173M6756J38030J49127Q6834P051
$$ -228418 -353740 -563613 -804826 -999280 -1082453 -1035697 -897667 -748540 -661706 -654655
16873f54655l5824m0143l0638n237M7962Q6702L2991j15296k84037m07068m37695
$$ -654655 -690479 -730622 -761260 -766497 -718535 -631833 -598842 -714138 -998175 -1405243 -1842938
16862a842938l52143j63988R3797L86087O78605R23809J048760R93445P74191
$$ -1842938 -2195081 -2359069 -2265272 -1879185 -1200580 -276771 771989 1765434 2539625
16853B539625M90158K37511L6417j33777k73611l56272l86696m00911l74542k47815
$$ 2539625 3029783 3267294 3303711 3169934 2896323 2540051 2153355 1752444 1377902 1130087
16843A130087n1472J08856J93441K44539K92340L08357K46869J15490o499l2748
$$ 1130087 1078615 1187471 1380912 1625451 1917791 2226148 2473017 2588507 2582008 2549260
16833B549260J9787K9611r3430l20015n37393o49231o55271o29510o24266o10013
$$ 2549260 2569047 2598658 2505228 2185213 1647820 998589 343318 -286192 -910458 -1520471
16823a520471n26221l67467j87386k9888J07447K40826L62566M51257M95292M84180
$$ -1520471 -2046692 -2414159 -2601545 -2631433 -2523986 -2283160 -1920594 -1469337 -974045 -489865
16813d89865M25997L74006L79415M22874M37482L85378K91315K00412J14413J2025
$$ -489865 -63868 310138 689553 1112427 1549909 1935287 2226602 2427014 2541427 2553452
16803B553452r8255k03014l26656n03037o99841q06427p52172n73619l39822j05652
$$ 2553452 2455197 2252183 1925527 1422490 722649 -83778 -835950 -1409569 -1749391 -1855043
16793a855043Q1396K02546K70841L12899L40809L24771K36122R4040m8209j28754
$$ -1855043 -1773647 -1571101 -1300260 -987361 -646552 -321781 -85659 8381 -39828 -168582
16783a68582j10994j4654R4831J61713J74563J43308O3318q4662l00081n16754
$$ -168582 -279576 -294230 -199399 -37686 136877 280185 343503 258841 -41240 -557994
16773e57994o29436o07872n08465l70847j95470k278J60097K60614K95723K62989
$$ -557994 -1187430 -1795302 -2303767 -2674614 -2870084 -2872362 -2712265 -2451651 -2155928 -1892939
16763a892939J87177J43172J83270K77476L56178L55228K46225O9837q4516j47550
$$ -1892939 -1705762 -1562590 -1379320 -1101844 -745666 -390438 -144213 -74376 -158892 -306442
16753c06442j19106n8027l4871r2835k26683l86745n22115o04549o09264n15784
$$ -306442 -425548 -483575 -518446 -611281 -837964 -1224709 -1746824 -2351373 -2960637 -3476421
16743c476421l57162k20691j55412j10989M509K22954M87390P05507P95617P11246
$$ -3476421 -3833583 -4054274 -4209686 -4320675 -4316166 -4093212 -3605822 -2900315 -2104698 -1393452
16733a393452M77378J93944k4306j03868l0464J40732K95925L27476K29001Q3493
$$ -1393452 -916074 -722130 -746436 -850304 -880768 -740036 -444111 -116635 112366 195859
16723A95859k9529o1506J3518J88948M11549O09727P36773P77215P36856O39882
$$ 195859 166330 104824 118342 307290 718839 1328566 2065339 2842554 3579410 4219292
16713D219292N07615L24837P2570j85847l42455l73132l15458j84705J1669K38931
$$ 4219292 4726907 5051744 5124314 4938467 4596012 4222880 3907422 3722717 3734386 3973317
16703C973317M40718N86646P04937Q23393R11346R18926Q31649O73792M78312
$$ 3973317 4414035 5000681 5705618 6529011 7440357 8359283 9190932 9864724 10343036
16694A0343036K52823o406k71609m93151o39252p10866p35630p34327o95657o05812
$$ 10343036 10595859 10589453 10317844 9824693 9185441 8474575 7738945 7004618 6308961 5703149
16684E703149m90107l84580k93670k10794j44947j09384j03864j14605j15664
$$ 5703149 5213042 4828462 4534792 4323998 4179051 4069667 3965803 3851198 3735534
16675C735534r0706p6062j37696k82176m32141m98489m68929m28169m53969n05156
$$ 3735534 3644828 3568766 3431070 3148894 2716753 2218264 1749335 1321166 867197 362041
16665C62041m73745l28983j70224j31381k44662m12525n05411m69420l40774j93167
$$ 362041 -111704 -440687 -610911 -742292 -986954 -1399479 -1904890 -2374310 -2715084 -2908251
16655b908251p6140J9195J36993K79348L85400M27330M38048M20793L36540J80565
$$ -2908251 -2984391 -2965196 -2828203 -2548855 -2163455 -1736125 -1298077 -877284 -540744 -360179
16645c60179J1609r9148j32168j36826j74757k33871k36055j33556M0178K02912
$$ -360179 -348570 -447718 -579886 -716712 -891469 -1125340 -1361395 -1494951 -1454773 -1251861
16635a251861K97320L24547K89613J81552P175j90249l28993l39740k22544k5243
$$ -1251861 -954541 -629994 -340381 -158829 -151654 -341903 -670896 -1010636 -1233180 -1258423
16625a258423J99362L86640M76519M69358M06582L16434K22113J51116J06654
$$ -1258423 -1059061 -672421 -195902 273456 680038 996472 1218585 1369701 1476355
16616A476355Q0139P0917N5217l080j02344k03608k73602l04782k86396j80001
$$ 1476355 1556494 1627411 1682628 1679548 1577204 1373596 1099994 795212 508816 328815
16606C28815L0800K73783M49109N28513N37106M80895L43577J55233j3011j33044
$$ 328815 359615 633398 1082507 1611020 2148126 2629021 2972598 3127831 3114820 2981776
16596B981776k17950k70842k96742l01726k76676k33254k16356k36712k76772
$$ 2981776 2763826 2492984 2196242 1894516 1617840 1384586 1168230 931518 654746
16587F54746l52774m48723m83300m16357k84629j51509n9547K0465J43266K94048
$$ 654746 301972 -146751 -630051 -1046408 -1331037 -1482546 -1542093 -1521628 -1378362 -1084314
16577a084314M15143M66871M06829J84412j75282n29263p33214p61308o68581
$$ -1084314 -669171 -202300 204529 388941 213659 -315604 -1048818 -1810126 -2478707
16568b478707n28307m02579k81620r2587J76713M27998N36775M52864K31146j5486
$$ -2478707 -3007014 -3409593 -3691213 -3783800 -3607087 -3179089 -2642314 -2189450 -1958304 -1973790
16558a973790j79320k11173j57228j07978j02666j21077j17650m8162Q6926K34335
$$ -1973790 -2153110 -2364283 -2521511 -2629489 -2732155 -2853232 -2970882 -3019044 -2932118 -2697783
16548b697783L59221M77609N78039N76681M04074J14294j54771l16269l62125
$$ -2697783 -2338562 -1860953 -1282914 -706233 -302159 -187865 -342636 -658905 -1021030
16539a021030l14284k17324j41682j41735k06418k79655l15728l03524k58260
$$ -1021030 -1335314 -1552638 -1694320 -1836055 -2042473 -2322128 -2637856 -2941380 -3199640
16530c199640j75948k8271J70594L49848M54429M79418M23702K70858K2225k59523
$$ -3199640 -3375588 -3403859 -3233265 -2883417 -2428988 -1949570 -1525868 -1255010 -1232785 -1492308
16520a492308m58288m93451l76816j82036J3076J48654J92996J51480O5124o419
$$ -1492308 -1950596 -2444047 -2820863 -3002899 -2989823 -2841169 -2648173 -2496693 -2431569 -2437988
16510b437988m1031o4741p8648m3436L9346J12285J39086J46295J74147K14125
$$ -2437988 -2479019 -2543760 -2622408 -2665844 -2626498 -2514213 -2375127 -2228832 -2054685 -1840560
16500a840560K33711K16301J57239P1195l901l3925k0119L5785J67516L73610
$$ -1840560 -1606849 -1390548 -1233309 -1162114 -1166015 -1199940 -1220059 -1184274 -1016758 -643148
16490f43148N69669O78955P00468O59382N61966M03822J95278j9486j73719k18068
$$ -643148 -73479 605476 1305944 1965326 2527292 2931114 3126392 3106906 2933187 2715119
16480B715119j59925n8254J4264L940q4691j96707k78236l11370l09753k64487
$$ 2715119 2555194 2496940 2511204 2515144 2430453 2233746 1955510 1644140 1334387 1069900
16470A069900j35324P1901K88981M68948O29048Q21488J074327J338145J481481
$$ 1069900 934576 1006477 1295458 1764406 2393454 3214942 4289269 5627414 7108895
16461G108895J342883Q52131J71283l92970o75817p02435n57470l52414k16763
$$ 7108895 8451778 9303909 9475192 9082222 8406405 7703970 7146500 6794086 6577323
16452F577323k33623l80723n54746o49490o39984n86414n33774m71366l98517
$$ 6577323 6343700 5962977 5408231 4758741 4118757 3532343 2998569 2527203 2128686
16443B128686l36149k78335k01605j03636l536O4751P7196N8981M8412K2859q5606
$$ 2128686 1792537 1514202 1312597 1208961 1205425 1270176 1347372 1406353 1454765 1477624 1392018
16432A392018k85823m87088n78630n11066l20129r8791O6279J47687J70603J64683
$$ 1392018 1106195 619107 40477 -470589 -790718 -889509 -823230 -675543 -504940 -340257
16422c40257J38085R3106O1037Q9262J70859K41947K63788K57858K66427L03881
$$ -340257 -202172 -109066 -48029 41233 212092 454039 717827 975685 1242112 1545993
16412A545993L58410M09337M13895L44825K39148J46296Q0822M5718L6468J4759
$$ 1545993 1904403 2313740 2727635 3072460 3311608 3457904 3538726 3584444 3620912 3635671
16402C635671o0271j74805k76516l48909m24372n12728n60885n28320m60857m37316
$$ 3635671 3575400 3400595 3124079 2775170 2350798 1838070 1277185 748865 288008 -149308
16392a49308m82576n52407o05283o88796q94268j169299j262322r23056j52065
$$ -149308 -631884 -1184291 -1789574 -2478370 -3372638 -4541937 -5804259 -6727315 -6879380
16383f879380P23672J304225J449197J256173Q68240M38757J27320J7532N3230
$$ -6879380 -6155708 -4851483 -3402286 -2146113 -1277873 -839116 -711796 -694264 -641034
16374f41034J03928R5256K0682j21434l08233m77402n83321n92215m54697j62426
$$ -641034 -537106 -441850 -421168 -542602 -850835 -1328237 -1911558 -2503773 -2958470 -3120896
16364c120896J98308M99883O68769O83842N36713K66541k8786k61185m05518m78728
$$ -3120896 -2922588 -2422705 -1753936 -1070094 -533381 -266840 -295626 -556811 -962329 -1441057
16354a441057m97096m60088l62675k19540o6038N4240J26157J71354J74273Q8257
$$ -1441057 -1938153 -2398241 -2760916 -2980456 -3046494 -2992254 -2866097 -2694743 -2520470 -2432213
16344b432213p0043k29828l20196k89385j63923m7079k718j1994l3324l1253J6224
$$ -2432213 -2502256 -2732084 -3052280 -3341665 -3505588 -3552667 -3555385 -3567379 -3600703 -3631956 -3615732
16333c615732P3340O2012n2431k13155l20232l19822k13917k5911J89644L35622
$$ -3615732 -3542392 -3480380 -3532811 -3745966 -4066198 -4386020 -4599937 -4625848 -4436204 -4100582
16323d100582L25661J61430o7473k61289m01486n59055p90681j069830j368749
$$ -4100582 -3774921 -3613491 -3680964 -3942253 -4343739 -4902794 -5693475 -6763305 -8132054
16314h132054j715963k115705k487598k684671k479804j571755Q4043J871467
$$ -8132054 -9848017 -11963722 -14451320 -17135991 -19615795 -21187550 -21103507 -19232040
16306a9232040K993657L277340L045955K627691K217176J908084J683577J445945
$$ -19232040 -16238383 -12961043 -9915088 -7287397 -5070221 -3162137 -1478560 -32615
16298c2615J145617Q37464O11074N08843N06185N62071O53243P44297P65863O71567
$$ -32615 1113002 1950466 2561540 3070383 3576568 4138639 4791882 5536179 6302042 6973609
16288F973609N09221L77526L14301K82721K42921J82394R1079k8989j37255j88182
$$ 6973609 7482830 7860356 8174657 8457378 8700299 8882693 8973772 8944783 8807528 8619346
16278H619346j74424j35740j35440k06065l15689l94212m01944l56581k92943
$$ 8619346 8444922 8309182 8173742 7967677 7651988 7257776 6855832 6499251 6206308
16269F206308k42284k21965k07453j72041j41072j72152k84641m14495m68454
$$ 6206308 5964024 5742059 5534606 5362565 5221493 5049341 4764700 4350205 3881751
16260C881751m13924k99829j94129j27480r5186p8964q1146j27061k07783k48887
$$ 3881751 3467827 3167998 2973869 2846389 2751203 2672239 2591093 2464032 2256249 2007362
16250B007362j73596J7285K46752M21453M81854M10168K40098N7138n4521n9192
$$ 2007362 1833766 1851051 2097803 2519256 3001110 3411278 3651376 3708514 3653993 3594801
16240C594801J7592J20253K22170L30555M38866N14892N30072M57849K63379k9721
$$ 3594801 3612393 3732646 3954816 4285371 4724237 5239129 5769201 6227050 6490429 6460708
16230F460708k89805l59341j91334J01380L34396L82289K44315j4038l11487n33185
$$ 6460708 6170903 5811562 5620228 5721608 6056004 6438293 6682608 6668570 6357083 5823898
16220E823898n90904n12543l97605k94191j72883q748J71748L34167M48552M74727
$$ 5823898 5232994 4720451 4322846 4028655 3855772 3847024 4018772 4352939 4801491 5276218
16210E276218M02870K60456R3586k1932m8487l7827l5320k6541j5507m6251j10807
$$ 5276218 5679088 5939544 6033130 6011198 5962711 5924884 5889564 5863023 5847516 5801265 5690458
16199E690458j44643j25531r3579o7777k5949L5501R7487J35118J25905Q6744
$$ 5690458 5545815 5420284 5326705 5258928 5232979 5268480 5365967 5501085 5626990 5713734
16189E713734O5543N7098j539j21005k16299k00161q0146M1834Q3417O6447M2716
$$ 5713734 5779277 5836375 5834836 5713831 5497532 5297371 5217225 5259059 5342476 5408923 5451639
16178E451639K1000J8303Q5610K32700L99424N30361O23582O87875P10350P01002
$$ 5451639 5472639 5490942 5576552 5809252 6208676 6739037 7362619 8050494 8760844 9461846
16168I461846O95231O85458O20102M63268K09008j19179m29626n81311n14662
$$ 9461846 10157077 10842535 11462637 11925905 12134913 12015734 11586108 11004797 10490135
16159A0490135l26202j88565k08105l37207m30996m10715l33397k86694k76479
$$ 10490135 10163933 9975368 9767263 9430056 8999060 8588345 8254948 7968254 7691775
16150G691775k69378k81411l38792m02823m08624l43960k26890p8418L8229N0777
$$ 7691775 7422397 7140986 6802194 6399371 5990747 5646787 5419897 5341479 5379708 5430485
16140E430485l1267j34738k04209k19758j71985o0780J01873L06901N30462P08383
$$ 5430485 5399218 5264480 5060271 4840513 4668528 4607748 4709621 5016522 5546984 6255367
16130F255367P60730O43070L94768J18430j05606k54383l22209k89952j60701
$$ 6255367 7016097 7659167 8053935 8172365 8066759 7812376 7490167 7200215 7039514
16121G039514K0227J86125K55048J94664P7130n484k2151J4890Q4115J57214K14685
$$ 7039514 7059741 7245866 7500914 7695578 7772708 7767224 7745073 7759963 7844078 8001292 8215977
16110H215977K82162M02571N65955O93401O94314N41236K95817O4180n1735j932
$$ 8215977 8498139 8900710 9466665 10160066 10854380 11395616 11691433 11755613 11703878 11701946
16100A1701946J59582L18423M24338N08216N71003N56878M34846K37482M0229
$$ 11701946 11861528 12179951 12604289 13112505 13683508 14240386 14675232 14912714 14952943
16091A4952943q9215j31739r7750n108R8636J47960J18927M3418l6775r3088j06910
$$ 14952943 14863728 14731989 14634239 14629131 14727767 14875727 14994654 15038072 15001297 14908209 14801299
16080A4801299r5875j25161k44327m10615n34772n74792n31077m25162k87481
$$ 14801299 14705424 14580263 14335936 13925321 13390549 12815757 12284680 11859518 11572037
16071A1572037j30240L1061J54994J88820J10373m3811k19265l71273m52762m27032
$$ 11572037 11441797 11472858 11627852 11816672 11927045 11883234 11663969 11292696 10839934 10412902
16061A0412902l20709j99133p6649O1292J94782K84231L08258K89030K97440L98157
$$ 10412902 10092193 9893060 9816411 9877703 10072485 10356716 10664974 10954004 11251444 11649601
16051A1649601N72493P16842P70552P94930Q64446R64402J013160R54478Q35875
$$ 11649601 12222094 12938936 13709488 14504418 15368864 16333266 17346426 18300904 19136779
16042A9136779P52720P17285O57467N47029M60093M56018M74364M07125K55118
$$ 19136779 19889499 20606784 21264251 21811280 22271373 22727391 23201755 23608880 23863998
16033B3863998J54023K22822M38703O73125Q06019P90697O42662M17764J78102
$$ 23863998 24018021 24240843 24679546 25352671 26158690 26949387 27592049 28009813 28187915
16024B8187915m1643k15640l07150l09861k64376j78817o395K61127N64295Q40555
$$ 28187915 28146272 27930632 27623482 27313621 27049245 26870428 26864033 27125160 27689455 28530010
16014B8530010J055475J216826J372150J549401J717393J827382J886890J980391
$$ 28530010 29585485 30802311 32174461 33723862 35441255 37268637 39155527 41135918
16006D1135918K166750K384025K511372K493237K370941K191827J946249J613650
$$ 41135918 43302668 45686693 48198065 50691302 53062243 55254070 57200319 58813969
15998E8813969J221675Q15312M30288J11918j33719l62343n87870p24052p09588
$$ 58813969 60035644 60850956 61281244 61393162 61259443 60897100 60309230 59585178 58875590
15989E8875590o11820n47753n59963n64862m16790m9051M93105J137792J821356
$$ 58875590 58263770 57716017 57156054 56591192 56174402 56125351 56618456 57756248 59577604
15980E9577604K468691K994223L333957L477889L467648L372827L276260L217548
$$ 59577604 62046295 65040518 68374475 71852364 75320012 78692839 81969099 85186647
15972H5186647L150659L010479K796878K545165K228627J763397J094648K46068
$$ 85186647 88337306 91347785 94144663 96689828 98918455 100681852 101776500 102022568
15964A02022568o91937j640991k603909l612167m596430n366594n767379n795433
$$ 102022568 101330631 99689640 97085731 93473564 88877134 83510540 77743161 71947728
15956G1947728n558935n181401m756606m346631l970822l621278l294836k995426
$$ 71947728 66388793 61207392 56450786 52104155 48133333 44512055 41217219 38221793
15948C8221793k713354k438126k168939j881462j534073j134002p74262n69023
$$ 38221793 35508439 33070313 30901374 29019912 27485839 26351837 25577575 25008552
15940B5008552n47577o16724o21406m67654k09654j0030J5286r4341k03879k16246
$$ 25008552 24460975 23844251 23222845 22755191 22545537 22535507 22550793 22456452 22252573 22036327
15930B2036327j28350P750J27133J94434K25771K32079J97839J17445n281j43957
$$ 22036327 21907977 21915727 22042860 22237294 22463065 22695144 22892983 23010428 23005147 22861190
15920B2861190k35650k39495j69348n4956O7213J41186J41165J01747O0918M5899
$$ 22861190 22625540 22386045 22216697 22161741 22228954 22370140 22511305 22613052 22673970 22719869
15910B2719869J13996K98934N34932P09714P55149O70397N16216M03264M22659
$$ 22719869 22833865 23132799 23667731 24377445 25132594 25802991 26319207 26722471 27145130
15901B7145130N50089O62793O76242O02968M91934L97922L78605M40328N16606
$$ 27145130 27695219 28358012 29034254 29637222 30129156 30527078 30905683 31346011 31862617
15892C1862617N17575L75293Q5294k84856o49437r41918j115441j158425j090277
$$ 31862617 32380192 32755485 32840779 32555923 31906486 30964568 29849127 28690702 27600425
15883B7600425r57141q32369p65745p44391p28767p05187o94038p10319p35994
$$ 27600425 26643284 25810915 25045170 24300779 23572012 22866825 22172787 21462468 20726474
15874B0726474p43624p09774o23503n05176m03992l68241m22268n40422o45840
$$ 20726474 19982850 19273076 18649573 18144397 17740405 17372164 16949896 16409474 15763634
15865A5763634o80300o56268o11513n58643m97203m36382l89726l70632l95117
$$ 15763634 15083334 14427066 13815553 13256910 12759707 12323325 11933599 11562967 11167850
15856A1167850m48578m63955l80466k09636j4634J64508L20739M33424M83170
$$ 11167850 10719272 10255317 9874851 9665215 9650581 9815089 10135828 10569252 11052422
15847A1052422M81130M30425L30024K18544J33708M9976o6034j74051j90356p9005
$$ 11052422 11533552 11963977 12294001 12512545 12646253 12696229 12630195 12456144 12265788 12186783
15837A2186783J09677L00195M55453N67907O49129P31065Q16643Q77844R43378
$$ 12186783 12296460 12596655 13052108 13620015 14269144 15000209 15816852 16694696 17638074
15828A7638074J067192J216041J302878J301587J293442J410403J712481K122464
$$ 17638074 18705266 19921307 21224185 22525772 23819214 25229617 26942098 29064562
15820B9064562K482759K687188K744028K689463K512407K176537J642469Q86876
$$ 29064562 31547321 34234509 36978537 39668000 42180407 44356944 45999413 46886289
15812D6886289m9074j030803j899047k553922k941110l044555k932082k725991
$$ 46886289 46837215 45806412 43907365 41353443 38412333 35367778 32435696 29709705
15804B9709705k501570k267028j999778j664932j255792q33849m98789l19496
$$ 29709705 27208135 24941107 22941329 21276397 20020605 19186756 18687967 18368471
15796A8368471l05644m21736o05395p71448q31837p49625n65619l69970k29404
$$ 18368471 18062827 17641091 17035696 16264248 15432411 14682786 14117167 13747197 13517793
15787A3517793j45658r5535o9282p0881j14209k11276l46561m74255n34682m62503
$$ 13517793 13372135 13276600 13207318 13136437 13022228 12810952 12464391 11990136 11455454 10992951
15777A0992951k30467Q4753L41862M57662M43895L66482L07988L25117M16936
$$ 10992951 10762484 10847237 11189099 11646761 12090656 12457138 12765126 13090243 13507179
15768A3507179N10220N05327L77878K07175R4484O7740P4462N7236R013n3866
$$ 13507179 14017399 14522726 14900604 15107779 15202263 15270003 15344465 15401701 15410714 15356848
15758A5356848r8676o0620R3213L17671N59305P78673Q85105P78125M68116Q7435
$$ 15356848 15258172 15197552 15290765 15608436 16167741 16946414 17831519 18609644 19077760 19165195
15748A9165195j98365k77429j68086p042J01701J63212K16109K88917M10920N80502
$$ 19165195 18966830 18689401 18521315 18514273 18615974 18779186 18995295 19284212 19695132 20275634
15738B0275634P45000Q80722J038628J248157J450863J575493J599839J517917
$$ 20275634 21020634 21901356 22939984 24188141 25639004 27214497 28814336 30332253
15730C0332253J322920J048606P89529O27524N44797M56440L16885J58697K6279
$$ 30332253 31655173 32703779 33493308 34120832 34665629 35122069 35438954 35597651 35623930
15721C5623930o9518r2998J5196K44281N11437P83594J117566J547590J992518
$$ 35623930 35554412 35461414 35476610 35720891 36232328 37015922 38133488 39681078 41673596
15712D1673596K278125K214015J691298Q04730j74794r89544j497454j668034
$$ 41673596 43951721 46165736 47857034 48661764 48486970 47497426 45999972 44331938
15704D4331938j539801j187565p27559k80978R7645M23126P11158R37223J060628
$$ 44331938 42792137 41604572 40877013 40596035 40693680 41116806 41827964 42765187 43825815
15695D3825815J066834R86045Q72488P80367P48450P97562R37180J157510J429413
$$ 43825815 44892649 45878694 46751182 47531549 48279999 49077561 50014741 51172251 52601664
15686E2601664J745698K140661K620617L122728L568287L923975M240421M643102
$$ 52601664 54347362 56488023 59108640 62231368 65799655 69723630 73964051 78607153
15678G8607153N234067N989111O792317P569385Q341941R164187J0046655J0922554
$$ 78607153 83841220 89830331 96622648 104192033 112533974 121698161 131744816 142667370
15670A42667370J1678673J2238734J2585607J2719597J2675531J2571858J2601055
$$ 142667370 154346043 166584777 179170384 191889981 204565512 217137370 229738425
15663B29738425J2966309J3812133J5180586J7017944J9205887K1537522K3679391
$$ 229738425 242704734 256516867 271697453 288715397 307921284 329458806 353138197
15656C53138197K5181131K5485640K3953543J9998920J3363953M427796n689339
$$ 353138197 378319328 403804968 427758511 447757431 461121384 465549180 459859841
15649D59859841j5422382k3362035k8750798l1540194l2138104l1130275k9085068
$$ 459859841 444437459 421075424 392324626 360784432 328646328 297516053 268430985
15642B68430985k6474996k3664576k0896517j8294298j5918066j3811321j2000871
$$ 268430985 241955989 218291413 197394896 179100598 163182532 149371211 137370340
15635A37370340j0490987r252016q223796p338730o547909n828956n173623m606459
$$ 137370340 126879353 117627337 109403541 102064811 95516902 89687946 84514323 79907864
15627G9907864m165795l829801l518609l188264k865354k570610k251849j844259
$$ 79907864 75742069 71912268 68393659 65205395 62340041 59769431 57517582 55673323
15619E5673323j391256j020091q05373p37848p93831r35946j070466j084352r16188
$$ 55673323 54282067 53261976 52456603 51718755 50924924 49988978 48918512 47834160 46917972
15610D6917972n82495j73193J90775M45055O41291Q94693J232875J555063J786622
$$ 46917972 46335477 46162284 46353059 46798114 47439405 48334098 49566973 51122036 52908658
15601E2908658J987712K289482K770371L396382M088123M808091N546797O292685
$$ 52908658 54896370 57185852 59956223 63352605 67440728 72248819 77795616 84088301
15593H4088301P030071P743481Q452754R211761J0018347J0735871J1130283J0976154
$$ 84088301 91118372 98861853 107314607 116526368 126544715 137280586 148410869 159387023
15585A59387023J0155007Q679252O630418M114744J278800j648781m352877o539573
$$ 159387023 169542030 178221282 184851700 188966444 190245244 188596463 184243586 177704013
15577A77704013q063536q953874r352268r407808r199984q762280q151232p454722
$$ 177704013 169640477 160686603 151334335 141926527 132726543 123964263 115813031 108358309
15569A08358309o768926o178516n708600n316196m975966m706322m498652m306221
$$ 108358309 101589383 95410867 89702267 84386071 79410105 74703783 70205131 65898910
15561F5898910m097068l864075l599203l304574l001815k703567k423253k201050
$$ 65898910 61801842 57937767 54338564 51033990 48032175 45328608 42905355 40704305
15553D0704305k074216k032811k007971j908258j709175j477290j287566j175614
$$ 40704305 38630089 36597278 34589307 32681049 30971874 29494584 28207018 27031404
15545B7031404j137195j135506j120230j038061q63463o50986m86452l86721l20908
$$ 27031404 25894209 24758703 23638473 22600412 21736949 21085963 20599511 20212790 19891882
15536A9891882l01123l67068m86431n72533n92076n85660o00045o22347o01047
$$ 19891882 19590759 19223691 18737260 18164727 17572651 16986991 16386946 15764599 15163552
15527A5163552n12701l86759k84642k39660k24253k17234k54539l62881m94790
$$ 15163552 14650851 14264092 13979450 13739790 13515537 13298303 13043764 12680883 12186093
15518A2186093n63372n20340l89424k24429n1052J15641K39025K78780K21848
$$ 12186093 11622721 11102381 10712957 10488528 10437476 10553117 10792142 11070922 11292770
15509A1292770J11844K6437N279M9113J57968K94201L71941L65272L47088L63470
$$ 11292770 11404614 11431051 11436330 11485443 11643411 11937612 12309553 12674825 13021913 13385383
15499A3385383L73868L54255L54334M25805N32612N85760N48233M38440K81758
$$ 13385383 13759251 14113506 14467840 14893645 15426257 16012017 16560250 16998690 17280448
15490A7280448J30364N0535L6598K3458k3282j07750k34845l79831m90475n15272
$$ 17280448 17410812 17461347 17497945 17521403 17498121 17390371 17155526 16775695 16285220 15769948
15480A5769948m27976k59605q5799L991m5691j83114k81600k86439k64050k81709
$$ 15769948 15341972 15082367 14996568 15000559 14954868 14771754 14490154 14203715 13939665 13657956
15470A3657956l18314l06184k16026q0634M8378J17795Q7110k7365j67298k93020
$$ 13657956 13339642 13033458 12817432 12736798 12785176 12902971 12990081 12962716 12795418 12502398
15460A2502398l99750m83627n21421m91569m03402l04487k44762k43042l14528
$$ 12502398 12102648 11619021 11097600 10606031 10202629 9898142 9653380 9410338 9095810
15451I095810m62723o21462o82361o16312n13245m65464m60699m14017k82601
$$ 9095810 8633087 8011625 7329264 6712952 6199707 5734243 5273544 4859527 4576926
15442D576926j06614N9968K12637L75688N41305O65167P00425O09482L92440J23172
$$ 4576926 4470312 4530280 4742917 5118605 5659910 6325077 7025502 7634984 8027424 8150596
15432H150596r1724k01177k31131k26052k10503j93883j73643j36781p8508j1122
$$ 8150596 8058872 7857695 7626564 7400512 7190009 6996126 6822483 6685702 6607194 6596072
15422F596072M3471P7372J16879J86718K64431L01529K74937J93223Q8477Q407
$$ 6596072 6639543 6716915 6833794 7020512 7284943 7586472 7861409 8054632 8143109 8151516
15412H151516j5563r3R075Q536N1200J66778L12591M11177M10499L23294K04545
$$ 8151516 8135953 8135860 8144935 8153471 8204671 8371449 8684040 9095217 9505716 9829010 10033555
15401A0033555R3552K009o4574j08795j28084j03319m8335o547J7377M8736Q9093
$$ 10033555 10127107 10129116 10064542 9955747 9827663 9724344 9676009 9669462 9686839 9735575 9824668
15390I824668J16369J07473M7740n4026j49317j68417q6988M2280J43108J86494
$$ 9824668 9941037 10048510 10096250 10042224 9892907 9724490 9637502 9679782 9822890 10009384
15380A0009384K11724K47283K58541K20860J58984R8706N2328M9700J28400L02734
$$ 10009384 10221108 10468391 10726932 10947792 11106776 11205482 11257810 11307510 11435910 11738644
15370A1738644N57485Q45793J087857J197790J164826J088017J076283J119727
$$ 11738644 12296129 13141922 14229779 15427569 16592395 17680412 18756695 19876422
15362A9876422J095849Q88716M89011M307m19940o81656p71433p91706q54728
$$ 19876422 20972271 21860987 22349998 22354305 21934365 21252709 20481276 19689570 18834842
15353A8834842r64855j051293j069073j039287r93342r24093q17639o67440m65579
$$ 18834842 17869987 16818694 15749621 14710334 13716992 12792899 11975260 11307820 10842241
15344A0842241k47695j05615p0711o0917o593P4843J49043K04524K10429J21557
$$ 10842241 10594546 10488931 10418220 10357303 10350710 10425553 10574596 10779120 10989549 11111106
15334A1111106n1592k17307k70750j78402P299K02036L38654L78361L27549K48685
$$ 11111106 11059514 10842207 10571457 10393055 10400354 10602390 10941044 11319405 11646954 11895639
15324A1895639K24180K68299K92465K01672j3657k95582n67124p48966p78416
$$ 11895639 12119819 12388118 12680583 12882255 12868598 12573016 12005892 11256926 10478510
15315A0478510o39448l68041k3412L42655O95064R85799J116061J002138O90500
$$ 10478510 9839062 9471021 9447609 9790264 10485328 11471127 12587188 13589326 14279826
15306A4279826L22543L376k28039l49937l48234k32938l4594K13100M79659P24904
$$ 14279826 14602369 14605745 14377706 14027769 13679535 13446597 13412003 13625103 14104762 14829666
15296A4829666Q96384R40599Q26133N86344L17537R7122n8408j54403k16259k92086
$$ 14829666 15726050 16666649 17492782 18079126 18396663 18493785 18435377 18280974 18064715 17772629
15286A7772629l97127m96465n60117o13612o99500p90165p87769o16418k91009
$$ 17772629 17375502 16879037 16318920 15705308 15005808 14215643 13427874 12811456 12520447
15277A2520447R1574M19567O42800P69662Q22309Q39027Q67485R27601R97764
$$ 12520447 12612021 13031588 13674388 14444050 15266359 16105386 16972871 17900472 18898236
15268A8898236J023436R49734P71671N45902L32350J59554M3060l0122r1273j25070
$$ 18898236 19921672 20871406 21643077 22188979 22521329 22680883 22723943 22693821 22602548 22477478
15258B2477478p8532O5762K58671M07503M53644M42143M67324N60891O62245O78233
$$ 22477478 22398946 22464708 22723379 23130882 23584526 24026669 24493993 25054884 25717129 26395362
15248B6395362N92979N09388N22741N98723O50869O72281P25119Q63625J090404
$$ 26395362 26988341 27497729 28020470 28619193 29270062 29942343 30667462 31531087 32621491
15239C2621491J335881J476926J409426J118181P01329L37875J79516K36396L92433
$$ 32621491 33957372 35434298 36843724 37961905 38663234 39001109 39180625 39417021 39809454
15230C9809454N28784O16582O92432P72269Q23735P93033O20256L12398k3506
$$ 39809454 40338238 40954820 41647252 42419521 43243256 44036289 44656545 44968943 44945437
15221D4945437l05799n59671q23790j039903j120471j077287r66863p98472o10532
$$ 44945437 44639638 44079967 43256177 42216274 41095803 40018516 39051653 38253181 37642649
15212C7642649n09654n34566n88201n63781m71024m10677m74910o81281r47638
$$ 37642649 37132995 36598429 36010228 35446447 34975423 34564746 34089836 33408555 32460917
15203C2460917j140976j195062j134108j002274q37053o72325n22049l85700k61500
$$ 32460917 31319941 30124879 28990771 27988497 27151444 26479119 25957070 25571370 25309870
15194B5309870j35734J0761J71908L04694L63029L37126K63669J96037J64333
$$ 25309870 25174136 25184897 25356805 25661499 26024528 26361654 26625323 26821360 26985693
15185B6985693J63955J88881K32416K53195K04350J06442M3447O3163J20880J41616
$$ 26985693 27149648 27338529 27570945 27824140 28028490 28134932 28178379 28241542 28362422 28504038
15175B8504038J05123M8505K2898M4376O5535K0669j04764k63882l78442l95073
$$ 28504038 28609161 28657666 28680564 28724940 28790475 28811144 28706380 28442498 28064056 27668983
15165B7668983l27036k19598j23383q8181j08027j01842m485J57785L09976M02190
$$ 27668983 27341947 27122349 26998966 26910785 26802758 26700916 26696431 26854216 27164192 27566382
15155B7566382M32306M13878L36590K03174O0173o3038j81214k85278l40607l46333
$$ 27566382 27998688 28412566 28749156 28952330 29012503 28949465 28768251 28482973 28142366 27796033
15145B7796033l13645k30661p7778J51936M03316N67498N95613N23552M06077
$$ 27796033 27482388 27251727 27173949 27325885 27729201 28296699 28892312 29415864 29821941
15136B9821941K94299K18344J70771J47213J72619K58338L94521N76420P83078
$$ 29821941 30116240 30334584 30505355 30652568 30825187 31083525 31478046 32054466 32837544
15127C2837544R58188J045407J050544J046824J090519J160664J215874J248874
$$ 32837544 33795732 34841139 35891683 36938507 38029026 39189690 40405564 41654438
15119D1654438J257648J231333J178568J107785J020296R58218R86387J114234
$$ 41654438 42912086 44143419 45321987 46429772 47450068 48408286 49394673 50508907
15111E0508907J261092J303529J179261R45755O90927M20305J02066k23306m63075
$$ 50508907 51769999 53073528 54252789 55198544 55889471 56309776 56411842 56188536 55725461
15102E5725461n82122o43327p46545r29301j133439j289885j390295j452167j474519
$$ 55725461 55143339 54500012 53753467 52824166 51690727 50400842 49010547 47558380 46083861
15093D6083861j445097j335237j112163q21686n76715m21635k99382j56890j6009
$$ 46083861 44638764 43303527 42191364 41369678 40792963 40371328 40071946 39915056 39899047
15084C9899047L8294m1542j84937k85688l03402k43014j38342o2886o6111j27655
$$ 39899047 39937341 39895799 39710862 39425174 39121772 38878758 38740416 38677530 38611419 38483764
15074C8483764k10377k87676l32436l30596k93444k56065k55487l27243m82847
$$ 38483764 38273387 37985711 37653275 37322679 37029235 36773170 36517683 36190440 35707593
15065C5707593o50540p25685o93632o21758n48343m68778m11206m18821m65539
$$ 35707593 35057053 34331368 33637736 33015978 32467635 31998857 31587651 31168830 30703291
15056C0703291m71069l95288k86542k39373l16297n03958p16014q60481r07028
$$ 30703291 30232222 29836934 29550392 29311019 28994722 28490764 27774750 26914269 26007241
15047B6007241q64151p53839o16545m74580l48243k88629l15261l72033l87837
$$ 26007241 25143090 24389251 23772706 23298126 22949883 22661254 22345993 21973960 21586123
15038B1586123l53277l11611k91935k72877k29570j96174k33291l44451m83912
$$ 21586123 21232846 20921235 20629300 20356423 20126853 19930679 19697388 19352937 18869025
15029A8869025o12196p07442p57097p43050o60890n32039l80541k33313j21110
$$ 18869025 18256829 17549387 16792290 16049240 15388350 14856311 14475770 14242457 14121347
15020A4121347m9996j744L5368N8952N5384J0109p1462j55145j89534j42112l6479
$$ 14121347 14071351 14069607 14104975 14163927 14219311 14229420 14157958 14002813 13813279 13671167 13634688
15009A3634688N7394Q3422M6508j1418m8599k5369M9947J10332J12636O9822P438
$$ 13634688 13692082 13775504 13822012 13810594 13761995 13736626 13786573 13896905 14009541 14079363 14086801
14998A4086801o1364j16474j23975o3911K8808P1067K1778m7067j7337J49859
$$ 14086801 14025437 13908963 13784988 13721077 13749885 13820952 13842730 13795663 13778326 13928185
14988A3928185L87868O30990Q66824J045932J063265Q70365N35330J98540k0632
$$ 13928185 14316053 14947043 15813867 16859799 17923064 18793429 19328759 19527299 19506667
14979A9506667r6580r0271p9390q1913n9366N002P5874J11676J18689J50469K32879
$$ 19506667 19410087 19319816 19240426 19158513 19099147 19104149 19180023 19291699 19410388 19560857 19793736
14968A9793736L07619L16770L08056L51685M33757N21421O38978P90113Q90272
$$ 19793736 20101355 20418125 20726181 21077866 21511623 22033044 22672022 23462135 24352407
14959B4352407Q59731P02502M85669L01866K39202L50945O17351R20430J122948
$$ 24352407 25212138 25914640 26400309 26702175 26941377 27292322 27909673 28830103 29953051
14950B9953051J194984J213049J278751J468181J790986K189033K606265L025794
$$ 29953051 31148035 32361084 33639835 35108016 36899002 39088035 41694300 44720094
14942D4720094L433978L823182M241110M742211N279091N711765N942686N992051
$$ 44720094 48154072 51977254 56218364 60960575 66239666 71951431 77894117 83886168
14934H3886168N908909N675548N212398M445507L398532K203513J030209M1399
$$ 83886168 89795077 95470625 100683023 105128530 108527062 110730575 111760784 111802183
14926A11802183o32666r30379q86232o32104l51337k15899l29901o90277j213623
$$ 111802183 111169517 110239138 109352906 108720802 108369465 108153566 107823665 107133388 105919765
14917A05919765j793925k369302k942613l506317m009506m402433m649395m729461
$$ 105919765 104125840 101756538 98813925 95307608 91298102 86895669 82246274 77516813
14909G7516813m670237m550339m444638m393851m379700m297137m036296l601355
$$ 77516813 72846576 68296237 63851599 59457748 55078048 50780911 46744615 43143260
14901D3143260l093790k599270k129913j657534j178176p42772m24487k66986
$$ 43143260 40049470 37450200 35320287 33662753 32484577 31741805 31317318 31050332
14893C1050332k33780k37164k34501k31463k35421k68430l64423n12628o33903
$$ 31050332 30816552 30579388 30344887 30113424 29878003 29609573 29245150 28732522 28098619
14884B8098619o35393n10922l50917k41273j92010j57052r9218j5334Q2977J61964
$$ 28098619 27463226 26952304 26601387 26360114 26168104 26011052 25911834 25896500 25979477 26141441
14874B6141441J72975J26525J00772J39261K01459K48856L04757M16850O27525
$$ 26141441 26314416 26440941 26541713 26680974 26882433 27131289 27436046 27852896 28480421
14865B8480421R38488J269650J476260J441873J168256P45645K66741k02358o26543
$$ 28480421 29418909 30688559 32164819 33606692 34774948 35520593 35787334 35584976 34958433
14856C4958433r83879j236998j361486j363133j270830j153206j065932r87440
$$ 34958433 33974554 32737556 31376070 30012937 28742107 27588901 26522969 25535529
14848B5535529q93875q38813q62466r09811q92245p63161n63899l97644l22161
$$ 25535529 24641654 23802841 22940375 22030564 21138319 20375158 19811259 19413615 19091454
14839A9091454k94750k33528j15693j207M8082L6261K401k1335k4410j0108J1615
$$ 19091454 18796704 18563176 18447483 18446276 18494358 18530619 18533020 18511685 18487275 18477167 18488782
14828A8488782J5313k4333p4260m5422R2137K63069L81471M08452L66322L24412
$$ 18488782 18504095 18479762 18405502 18360080 18452217 18715286 19096757 19505209 19871531 20195943
14818B0195943L08840K66734J69415Q4446R4642K11717L79776N13093N46436M84864
$$ 20195943 20504783 20771517 20940932 21025378 21120020 21331737 21711513 22224606 22771042 23255906
14808B3255906L84909K90476K11836J43379Q3747J9997q3278k22829l28096l47706
$$ 23255906 23640815 23931291 24143127 24286506 24370253 24390250 24306972 24084143 23756047 23408341
14798B3408341l10009k77683k79597k92077k69672j77674l4701Q2812J16961R1992
$$ 23408341 23098332 22820649 22541052 22248975 21979303 21801629 21766928 21849740 21966701 22058693
14788B2058693O7800N5504L8592J8738j3994r0433k05286l13195l90434m37045
$$ 22058693 22126493 22181997 22220589 22239327 22225333 22134900 21929614 21616419 21225985 20788940
14778B0788940m47688m16180l43803k27740p4933P4320J73574J92982J19249l9263
$$ 20788940 20341252 19925072 19581269 19353529 19278596 19352916 19526490 19719472 19838721 19799458
14768A9799458k08100k67539j62678M3405K00871J84858K5222j17436j05211O4460
$$ 19799458 19591358 19323819 19161141 19204546 19405417 19590275 19615497 19498061 19392850 19457310
14758A9457310K94441N17237P23403Q84778R51320R23104Q49558P88147P72541
$$ 19457310 19751751 20268988 20992391 21877169 22828489 23751593 24601151 25389298 26161839
14749B6161839P75379P49411P09406O94660O93274O52114N47679M49543M76616
$$ 26161839 26937218 27686629 28396035 29090695 29783969 30436083 30983762 31433305 31909921
14740C1909921O55732Q86663J061426J161226J245535J363496J495058J621899
$$ 31909921 32565653 33452316 34513742 35674968 36920503 38283999 39779057 41400956
14732D1400956J792618K042968K319035K523085K635546K765352L016373L362847
$$ 41400956 43193574 45236542 47555577 50078662 52714208 55479560 58495933 61858780
14724F1858780L710887L984057M151657M248296M330347M398480M408539M320977
$$ 61858780 65569667 69553724 73705381 77953677 82284024 86682504 91091043 95412020
14716I5412020M088500L694227L216534K761309K367825K013204J654151J241229
$$ 95412020 99500520 103194747 106411281 109172590 111540415 113553619 115207770 116448999
14708A16448999P46075K00148l28243p96055j210483j594470j967119k338924
$$ 116448999 117195074 117395222 117066979 116270924 115060441 113465971 111498852 109159928
14700A09159928k659479k818519k730842k405857j946589j476425j068473p34478
$$ 109159928 106500449 103681930 100951088 98545231 96598642 95122217 94053744 93319266
14692I3319266m65956k80882k08114k17874k48755l27166n51659r56961j475975
$$ 93319266 92853310 92572428 92364314 92146440 91897685 91570519 91018860 90061899 88585924
14683H8585924k017309k515598k908919l140115l202260l149557l045656k908964
$$ 88585924 86568615 84053017 81144098 78003983 74801723 71652166 68606510 65697546
14675F5697546k717397k457064k143790j819014j550308j378271j275891j218698
$$ 65697546 62980149 60523085 58379295 56560281 55009973 53631702 52355811 51137113
14667E1137113j238833j350195j469192j487263j371222j156224q99475o55233
$$ 51137113 49898280 48548085 47078893 45591630 44220408 43064184 42164709 41509476
14659D1509476m70717l83035l86807m21128m32951m28684m31796m25850l83013
$$ 41509476 41038759 40655724 40268917 39847789 39414838 38986154 38554358 38128508 37745495
14650C7745495l31910l27324l58830l61546l20799l03992l58840m40260m77094
$$ 37745495 37413585 37086261 36727431 36365885 36045086 35741094 35382254 34941994 34464900
14641C4464900m43420l42847j98097p4025n0636j23913j69207o3575J96037N05766
$$ 34464900 34021480 33678633 33480536 33406511 33355875 33231962 33062755 32999180 33195217 33700983
14631C3700983P48243Q82978R53018J018254J094925J151091J146187J062017
$$ 33700983 34449226 35332204 36285222 37303476 38398401 39549492 40695679 41757696
14623D1757696R16623P59352O25035N13564M32768M04037M21723M55912M80869
$$ 41757696 42674319 43433671 44058706 44572270 45005038 45409075 45830798 46286710 46767579
14614D6767579M96737N37445O27526P18425P28302O40596M96920L18887J06836
$$ 46767579 47264316 47801761 48429287 49147712 49876014 50516610 51013530 51332417 51439253
14605E1439253j26256l58454n63998p13363p85947p90163p51506o84356n84766
$$ 51439253 51312997 50954543 50390545 49677182 48891235 48101072 47349566 46665210 46080444
14596D6080444m37974k51318n5984J25504K81555L96428M42628L99933K83493
$$ 46080444 45642470 45391152 45335168 45460672 45742227 46138655 46581283 46981216 47264709
14587D7264709J41154R300j17579k67398m37331n60617n76063n07857m16987l35762
$$ 47264709 47405863 47415163 47297584 47030186 46592855 46032238 45456175 44948318 44531331 44195569
14577D4195569k84172k82959l18740l34259k87203j95437j07609o2259q4083k05410
$$ 44195569 43911397 43628438 43309698 42975439 42688236 42492799 42385190 42322931 42238848 42033438
14567D2033438m51131p54627r83952j075944j057914r83194q76383p30135n54178
$$ 42033438 41582307 40827680 39843728 38767784 37709870 36726676 35850293 35120158 34565980
14558C4565980l91055k71481k02751k05791k94401m06293m46788l98758l31041
$$ 34565980 34174925 33903444 33700693 33494902 33200501 32794208 32347420 31948662 31617621
14549C1617621l18809l65020m00973l72551k83106j61562l4899O8849J07360N0826
$$ 31617621 31298812 30933792 30532819 30160268 29877162 29715600 29680701 29749550 29856910 29907736
14539B9907736o4904j69009k38198k86637l14498l04631k48298j63108p8878m034
$$ 29907736 29842832 29673823 29435625 29148988 28834490 28529859 28281561 28118453 28039575 28035541
14529B8035541P4208J48186J85150J57571M5800j41154l42105m90311n49181n02933
$$ 28035541 28109749 28257935 28443085 28600656 28646456 28505302 28163197 27672886 27123705 26620772
14519B6620772l84962k81331k50842k83699l47802m27094n16671o02872o47376
$$ 26620772 26235810 25954479 25703637 25419938 25072136 24645042 24128371 23525499 22878123
14510B2878123o10327n07695l83896k43985q5615Q1615K56340L87910L71371J90889
$$ 22878123 22267796 21760101 21376205 21132220 21046605 21128220 21384560 21772470 22143841 22334730
14500B2334730l9771k21905l52949m65479n49830n56697m74282l72256l28318
$$ 22334730 22294959 22073054 21720105 21254626 20704796 20148099 19673817 19301561 18973243
14491A8973243l23886k52825n0813K15620M27029N28740N30519M47486K86771
$$ 18973243 18649357 18396532 18345719 18561339 18988368 19517108 20047627 20495113 20781884
14482B0781884P6375j18686k28063k34815j74346q0817L0747J43300K32155K94193
$$ 20781884 20858259 20739573 20511510 20276695 20102349 20021532 20052279 20195579 20427734 20721927
14472B0721927L41856L64359L28441K15153N2479r7609j81166j81243j25808n9914
$$ 20721927 21063783 21428142 21756583 21971736 22024215 21926606 21745440 21564197 21438389 21378475
14462B1378475N344Q5722J65034K03912K12824K55760L64212M97969N82511N62031
$$ 21378475 21383819 21469541 21634575 21838487 22051311 22307071 22671283 23169252 23751763 24313794
14452B4313794M56176L42887K72426K30660J69723M7090j42246l34759m28046
$$ 24313794 24769970 25112857 25385283 25615943 25785666 25832756 25690510 25355751 24927705
14443B4927705l58966j54499P3943K18069K85698L83047N52533O94265O98559
$$ 24927705 24568739 24414240 24488183 24706252 24991950 25374997 25927530 26621795 27320354
14434B7320354N76393M11200K67991J66692J14849J27853J77554J94002J62424
$$ 27320354 27896747 28307947 28575938 28742630 28857479 28985332 29162886 29356888 29519312
14425B9519312J35651J48774J83396K06086K13898K45521L27611L94778L37285
$$ 29519312 29654963 29803737 29987133 30193219 30407117 30652638 30980249 31375027 31712312
14416C1712312J39188j01414k78881l65028l99579m39309n01851n53745n58650
$$ 31712312 31851500 31750086 31471205 31106177 30706598 30267289 29765438 29211693 28653043
14407B8653043n10410m37939l71963k92988j57531K9163K00206K87169K76321
$$ 28653043 28142633 27704694 27332731 27039743 26882212 26911375 27111581 27398750 27675071
14398B7675071K10856J46886J05723Q1053P6308J18378K45001M67367P34839R64764
$$ 27675071 27885927 28032813 28138536 28219589 28295897 28414275 28659276 29126643 29861482 30826246
14388C0826246J114426J206149J298466J430606J585784J715372J800075J877698
$$ 30826246 31940672 33146821 34445287 35875893 37461677 39177049 40977124 42854822
14380D2854822J992504K119767K192220K197576K154909K042468J854161J645848
$$ 42854822 44847326 46967093 49159313 51356889 53511798 55554266 57408427 59054275
14372E9054275J481722J388571J330115J208430R52276O07246K82554L0749j82698
$$ 59054275 60535997 61924568 63254683 64463113 65415389 66022635 66305189 66335938 66153240
14363F6153240m47344q80708j542541k331923l031362l452750l533508l356227
$$ 66153240 65705896 64825188 63282647 60950724 57919362 54466612 50933104 47576877
14355D7576877l061437k724957k379290k073910j830529j613141j363736j055775
$$ 47576877 44515440 41790483 39411193 37337283 35506754 33893613 32529877 31474102
14347C1474102p14176l91270j41129j063K6366k7004j18665k25210l55452n18413
$$ 31474102 30759926 30368656 30227527 30226464 30252830 30225826 30107161 29881951 29526499 29008086
14337B9008086o97545q75071j032552j126358j112430r94335q23690o47366m88451
$$ 29008086 28310541 27435470 26402918 25276560 24164130 23169795 22346105 21698739 21210288
14328B1210288l93392m19277n43357o54991o67215n77508m15177k06402J376J53290
$$ 21210288 20816896 20397619 19854262 19199271 18532056 17954548 17539371 17332969 17334345 17487635
14318A7487635K32970K53172K21517J37407Q428j42450k78757l71048m23526m59283
$$ 17487635 17720605 17973777 18195294 18332701 18341129 18198679 17919922 17548874 17125348 16666065
14308A6666065m73407m18859k75575j00526L4166J00260J06484Q2202M2801l2274
$$ 16666065 16192658 15773799 15498224 15397698 15431864 15532124 15638608 15720810 15763611 15731337
14298A5731337j44194k37388k53267j83503n4358Q7478J69379J60270J14751J00070
$$ 15731337 15587143 15349755 15096488 14912985 14858627 14946105 15115484 15275754 15390505 15490575
14288A5490575J19362J21069M4091j26083l22002m30175l90726k59715j50203
$$ 15490575 15609937 15731006 15775097 15649014 15327012 14896837 14506111 14246396 14096193
14279A4096193j33910k10187l30418m24678m20851k90129r0919Q3201J83140J95982
$$ 14096193 13962283 13752096 13421678 12997000 12576149 12286020 12195101 12278302 12461442 12657424
14269A2657424J24893J5895p4580j33174j75188k35178l51813n16153o65563p44846
$$ 12657424 12782317 12798212 12723632 12590458 12415270 12180092 11828279 11312126 10646563 9901717
14259I901717p53046p15084o05184l71289m5896K45871L96364L95273L18969K56776
$$ 9901717 9148671 8433587 7828403 7457114 7411218 7657089 8053453 8448726 8767695 9024471
14249I024471K37176K43071K52539K42497J99572J38901J19291J92398L22478
$$ 9024471 9261647 9504718 9757257 9999754 10199326 10338227 10457518 10649916 10972394
14240A0972394M11798L78358K09059m3677k92520m56018n38498o10512o87244
$$ 10972394 11384192 11762550 11971609 11927932 11635412 11179394 10640896 10030384 9343140
14231I343140p18183o87997o28895n47045m18008k42204n6866R6588K14484L28666
$$ 9343140 8624957 7936960 7308065 6761020 6343012 6100808 6043942 6140530 6355014 6683680
14221F683680M45372N23561N11570L94370K34258J25375Q5423N2176k9148j49160
$$ 6683680 7129052 7652613 8164183 8558553 8792811 8918186 9003609 9055785 9026637 8877477
14211H877477k46030k80870k78682k82251l11002l49064l41873k41475o1002J28381
$$ 8877477 8631447 8350577 8071895 7789644 7478642 7129578 6787705 6546230 6485228 6613609
14201F613609K51749K79115K31321J55171J01980J11531J90101L01478L85097
$$ 6613609 6865358 7144473 7375794 7530965 7632945 7744476 7934577 8236055 8621152
14192H621152L91226L03667J35772p2812k55517l66546m13841m40256m81518n15231
$$ 8621152 9012378 9316045 9451817 9379005 9123488 8756942 8343101 7902845 7421327 6906096
14182F906096m80412l65140k26039j32455j02747q2314l0976O3l1614p5701p0686
$$ 6906096 6425684 6060544 5834505 5702050 5599303 5516989 5486013 5486076 5454462 5378761 5308075
14171E308075o320J04236K29615L34071M13245M67050M57229L39890J30174j07069
$$ 5308075 5301755 5405991 5635606 5969677 6382922 6849972 7307201 7647091 7777265 7670196
14161G670196l18727m70235n30681m87280l48248j38961R4750K93418M02841L99980
$$ 7670196 7351469 6881234 6350553 5863273 5515025 5376064 5470814 5764232 6167073 6567053
14151F567053L15042K16048J30327K7326r3805j97488k84926l88232n16074o16597
$$ 6567053 6882095 7098143 7228470 7255796 7161991 6964503 6679577 6291345 5775271 5158674
14141E158674o04828m57799k35949j904K13612L70434M31225M11259L58322K77293
$$ 5158674 4553846 4096047 3860098 3858194 4071806 4442240 4873465 5284724 5643046 5920339
14131E920339J34758m4311j68038j86789j24022j0790J27185K53126L37847L57201
$$ 5920339 6055097 6010786 5842748 5655959 5531937 5521147 5648332 5901458 6239305 6596506
14121F596506K87498J55079K0831r1806j91579k80001l57097m39682n43551o49186
$$ 6596506 6884004 7039083 7059914 6968108 6776529 6496528 6139431 5699749 5156198 4507012
14111D507012p13125p10576o38161n00925l37869k07612j34275j02603o9401K890
$$ 4507012 3793887 3083311 2445150 1944225 1606356 1398744 1264469 1161866 1092465 1095355
14101A095355J04661K04857K86457L44146L78221L89476L78694L34521K50221
$$ 1095355 1200016 1404873 1691330 2035476 2413697 2803173 3181867 3516388 3766609
14092C766609J63420J31599J67302K26324K56794K36373J72689Q1578k0290r8030
$$ 3766609 3930029 4061628 4228930 4455254 4712048 4948421 5121110 5202688 5182398 5084368
14082E084368j14603p4187j9235P377n334j7749J5078Q7190J69903K48016L12123
$$ 5084368 4969765 4895578 4876343 4883720 4878386 4860637 4875715 4962905 5132808 5380824 5692947
14071E692947L54590L56654K92783J75832N4991n0585j67086l02731m07409m22370
$$ 5692947 6047537 6404191 6696974 6872806 6927797 6877212 6710126 6407395 5999986 5577616
14061E577616l63152k99750k57063j87929p2173K2621M3212K0414q493o3735j83940
$$ 5577616 5214464 4914714 4657651 4469722 4397549 4420170 4463382 4483796 4475303 4411568 4227628
14050D227628l41672m34043l69259j55428Q9262K42744L01669L44332L94967M03355
$$ 4227628 3885956 3451913 3082654 2927226 3016488 3259232 3560901 3905233 4300200 4703555
14040D703555L51473K95912K90159L38525M26893N34920O14561N95930M48116
$$ 4703555 5055028 5350940 5641099 5979624 6406517 6941437 7555998 8151928 8600044
14031H600044J99060j00059l71679n19073n00640l96887l47761m11017n25518
$$ 8600044 8799104 8699045 8327366 7808293 7307653 6910766 6563005 6151988 5626470
14022E626470n87828n33838l67195j46508N0544J78842K37633K44558K10606J40969
$$ 5626470 5038642 4504804 4137609 3991101 4041645 4220487 4458120 4702678 4913284 5054253
14012E054253M1852q3060k19819l23675l43004k75298j70259p8044k8787m8998
$$ 5054253 5096105 5013045 4793226 4469551 4126547 3851249 3680990 3602946 3574159 3525161
14002C525161j45169k69120l44005l51060l52086l77503l63481k26890K0745K65296
$$ 3525161 3379992 3110872 2766867 2415807 2063721 1686218 1322737 1095847 1116592 1381888
13992A381888M08380M07018K46883r151k21445k86272k01149m1820P3300M6832
$$ 1381888 1790268 2197286 2444169 2435018 2213573 1927301 1726152 1684332 1757632 1804464
13982A804464j24881l25846l93313k63464j8504J93237K59577J63306j9915j62887
$$ 1804464 1679583 1353737 960424 696960 678456 871693 1131270 1294576 1274661 1111774
13972A111774j50857M1813L28867N77479O82359N91907L42665O5338j12953j61418
$$ 1111774 960917 1002730 1331597 1909076 2591435 3183342 3526007 3591345 3478392 3316974
13962C316974j43359j25316j14759q8933l7687J4674L7582M1541O8584J34656
$$ 3316974 3173615 3048299 2933540 2844607 2806920 2821594 2859176 2900717 2969301 3103957
13952C103957J86204J54916P8775O6490J37355K14207K28631J60174N1088m969
$$ 3103957 3290161 3445077 3523852 3590342 3727697 3941904 4170535 4330709 4381797 4376828
13942D376828L7598J19616J59460J33789O7887M866k5659k3652j0455j6577o7615
$$ 4376828 4414426 4534042 4693502 4827291 4895178 4900044 4874385 4850733 4840278 4823701 4756086
13931D756086j59395k50844l09738l35475l08564j91867j472J82433K64845K04871
$$ 4756086 4596691 4345847 4036109 3700634 3392070 3200203 3198731 3381164 3646009 3850880
13921C850880N9486q2356j93912k96534l89993m20920l42994k23452j97464l08672
$$ 3850880 3910366 3828010 3634098 3337564 2947571 2526651 2183657 1960205 1762741 1454069
13911A454069m72157n77872n91699n51669m75521l44639j93935j22703j63818
$$ 1454069 981912 404040 -187659 -739328 -1214849 -1559488 -1753423 -1876126 -2039944
13902b039944k07367j11814J39178M34685O48192P05507O17880M60185K92349
$$ -2039944 -2247311 -2359125 -2219947 -1785262 -1137070 -431563 186317 646502 938851
13893I38851J38133P720r6718j60500j44332m0713R2242J84191K00117J57898
$$ 938851 1076984 1084704 987986 827486 683154 642441 734683 918874 1118991 1276889
13883A276889J20821J48269K41510L36560L82973L95580L84276L05582J20064
$$ 1276889 1397710 1545979 1787489 2124049 2507022 2902602 3286878 3592460 3712524
13874C712524j39787m00530o03616p09082o93365n77623m34823l37162l01454
$$ 3712524 3572737 3172207 2568591 1859509 1166144 588521 153698 -183464 -484918
13865d84918k93712k74928k23255j23866J7313J55039K30651K33079K00278J62168
$$ -484918 -778630 -1053558 -1276813 -1400679 -1383366 -1228327 -997676 -764597 -564319 -402151
13855d02151J49208J99593L08781M34729N43785N97321N60535M66532L85759L27766
$$ -402151 -252943 -53350 255431 690160 1233945 1831266 2391801 2858333 3244092 3571858
13845C571858K54702J75583J40687J58852J90837J92576J39975L1406j24618k87967
$$ 3571858 3826560 4002143 4142830 4301682 4492519 4685095 4825070 4856476 4731858 4443891
13835D443891l68580k92562r4283J08095K20530K14002J11728k5317j14683j07092
$$ 4443891 4075311 3782749 3688466 3796561 4017091 4231093 4342821 4317504 4202821 4095729
13825D095729m3452o747m3711j39403k29000k52440k03009j26739q5853j27957
$$ 4095729 4052277 4045530 4001819 3862416 3633416 3380976 3177967 3051228 2965375 2837418
13815B837418k52645l96836n04514n71262o00282n79901m90346l16326r8444P8455
$$ 2837418 2584773 2187937 1683423 1112161 511879 -68022 -558368 -874694 -973138 -894683
13805h94683J86665K61011L14901L20888K39871N2005j87990l58886l79768k80714
$$ -894683 -708018 -447007 -132106 188782 428653 480658 292668 -66218 -445986 -726700
13795g26700j55336o0515K0331J24632K53403L56040L72247L13802K52590K20150
$$ -726700 -882036 -942551 -922220 -797588 -544185 -188145 184102 497904 750494 970644
13785I70644J93331J76400J97992K38415K26014J17560l6847j39091j29232l3496
$$ 970644 1163975 1340375 1538367 1776782 2002796 2120356 2083509 1944418 1815186 1781690
13775A781690N2685O3922J9076l6644o3194k1944P1792J28205Q8267q645r2713
$$ 1781690 1834375 1898297 1917373 1880729 1817535 1795591 1867383 1995588 2083855 2075210 1982497
13764A982497j33201j45352j42342j04969l9069J0273K1763K806k7916n1536o1527
$$ 1982497 1849296 1703944 1561602 1456633 1417564 1427837 1449600 1452406 1424490 1372954 1311427
13753A311427o1531o3484q1225j31316k09103k59596k26167j25992m8917p5347
$$ 1311427 1249896 1186412 1105187 973871 764768 505172 279005 153013 104096 28749
13743B8749j87107k91268l16520k59291j65838p6485N049R2718J95824L17196
$$ 28749 -158358 -449626 -766146 -1025437 -1191275 -1267760 -1262711 -1169993 -974169 -656973
13733f56973M53792N68224N95815N00002K96149N4049j12375j08660M1855K10468
$$ -656973 -203181 365043 960858 1460860 1757009 1811058 1698683 1590023 1631878 1842346
13723A842346L12872L59559L62325L13642K20637R8320l5997j59430k37813k26861
$$ 1842346 2155218 2514777 2877102 3190744 3411381 3509701 3473704 3314274 3076461 2849600
13713B849600j31804m3034m6974j40495k64112l72761m38198m17353k69851k1640
$$ 2849600 2717796 2674762 2627788 2487293 2223181 1850420 1412222 994869 725018 703378
13703G03378K18726L55223L95431L99013L94201M03101M58086N33313N44455M45884
$$ 703378 922104 1277327 1672758 2071771 2465972 2869073 3327159 3860472 4404927 4850811
13693D850811K60026N1995q1537r1969n6808q6976j71630k06157j68229j53263
$$ 4850811 5110837 5162832 5081295 4989326 4932518 4845542 4673912 4467755 4299526 4146263
13683D146263k24293l52168m86579n96117o50539o14850m97377l65645k93084
$$ 4146263 3921970 3569802 3083223 2487106 1836567 1221717 724340 358695 65611
13674F5611l16428m05478m75150m57119l44781j85627l7425P4552J61654K45200
$$ 65611 -250817 -656295 -1131445 -1588564 -1933345 -2118972 -2156397 -2081845 -1920191 -1674991
13664a674991L27956L82843L80175L35004K92401K81536K92443K68952J66414
$$ -1674991 -1347035 -964192 -584017 -249013 43388 324924 617367 886319 1052733
13655A052733J3771j02941q8448R3677L72598O17979P29209O71708M86852K88274
$$ 1052733 1066504 963563 875115 968792 1341390 1959369 2688578 3360286 3847138 4135412
13645D135412J67719J14298P0706K0521j1960k598O7573J94163L15161L76366
$$ 4135412 4303131 4417429 4488135 4508656 4496696 4494098 4561671 4755834 5070995 5447361
13635E447361L86211L52542K63516J40126M0977J2264L5051K9290o8691k58129
$$ 5447361 5833572 6186114 6449630 6589756 6630733 6642997 6678048 6707338 6638647 6380518
13625F380518n04713p53514r21520r52752q60016o94190m90717k50447J9046K66348
$$ 6380518 5875805 5122291 4200771 3248019 2388003 1693813 1203096 952649 971695 1238043
13615A238043M19305M35842L31825J77100O0953k07j03078k94199m54133m50791
$$ 1238043 1657348 2093190 2425015 2602115 2663068 2662861 2559783 2265584 1811451 1360660
13605A360660k89526o1016J46227K70142L02960K95538K92507K83821K35844J53393
$$ 1360660 1071134 1010118 1156345 1426487 1729447 2024985 2317492 2601313 2837157 2990550
13595B990550P4399J8654l3202j12747j97726k26155j88955j55137j95897l04782
$$ 2990550 3064949 3083603 3050401 2937654 2739928 2513773 2324818 2169681 1973784 1669002
13585A669002l99655l97988l03407j96869j38635j45172k11051l03139l62086
$$ 1669002 1269347 871359 567952 371083 232448 87276 -123775 -426914 -789000
13576g89000l26900j74815P1169L52299N74258O47464N37515K61896r7180l94414
$$ -789000 -1115900 -1290715 -1219546 -867247 -292989 354475 891990 1153886 1056706 662292
13566F62292n33406n30723m24316k20190L1778K34859L48900M03447M30118M24928
$$ 662292 128886 -401837 -826153 -1046343 -1014565 -779706 -430806 -27359 402759 827687
13556H27687L58729K44489J55419J57704K42531L15167K64466O5617j88248l66137
$$ 827687 1186416 1430905 1586324 1744028 1986559 2301726 2566192 2631809 2443561 2077424
13546B077424m00929l18608k17923k09183l11776m38719n10044n12710m55885
$$ 2077424 1676495 1357887 1139964 930781 619005 180286 -329758 -842468 -1298353
13537a298353l47108k02130k6640J92706M33205O26321P26848P56971P48599O84175
$$ -1298353 -1645461 -1847591 -1874231 -1681525 -1248320 -621999 104849 861820 1610419 2294594
13527B294594N41964L53810J91056R7074M0122m7310j87664l26405l82904l28436
$$ 2294594 2836558 3190368 3381424 3478498 3518620 3471310 3283646 2957241 2574337 2245901
13517B245901k21736j38708p5043K4099J49529J99208J02528o6584j77909j83457
$$ 2245901 2024165 1885457 1810414 1834513 1984042 2183250 2285778 2219194 2041285 1857828
13507A857828j07385j0302K6435l6430j74556l38039m81126n67425n65016m53410
$$ 1857828 1750443 1740141 1766576 1730146 1555590 1217551 736425 169000 -396016 -849426
13497h49426k34012M8224K98330M17130L62452J87755J2676n8697J1693J80435
$$ -849426 -1083438 -1035214 -736884 -319754 42698 230453 243129 184432 196125 376560
13487C76560L36598L70748K51563L0719k13155m32736o19773p50600p39553n06993
$$ 376560 713158 1083906 1335469 1366188 1153033 720297 100524 -650076 -1389629 -1896622
13477a896622j15124K52401M70050N41302N33532N13551N08357N22247N62248
$$ -1896622 -2011746 -1759345 -1289295 -747993 -214461 299090 807447 1329694 1891942
13468A891942O01382N60583L87753J48250l0090j10167j89766l75388o43537q59703
$$ 1891942 2493324 3053907 3441660 3589910 3559820 3449653 3259887 2884499 2240962 1381259
13458A381259q88952o68548k59904J82631N43019Q04324R95505J116779J120734
$$ 1381259 492307 -176241 -436145 -253514 289505 1093829 2089334 3206113 4326847
13449D326847R72139O97431L75742J04892o3542j70556k91485m65332o80647q64268
$$ 4326847 5298986 5996417 6372159 6477051 6413509 6242953 5951468 5486136 4805489 3941221
13439C941221r18465q26132o81435n92179n75254n64620n02483l80835k19223
$$ 3941221 3022756 2196624 1515189 923010 347756 -216864 -719347 -1100182 -1319405
13430a319405o1950L4811O2376N9678M6618J8451Q152N8214J37921J79413J57408
$$ -1319405 -1381355 -1346544 -1284168 -1224490 -1177872 -1159421 -1151269 -1093055 -955134 -775721 -618313
13419f18313R3411L8343M7392J19425J87688J96099J66631J52660J54968J48034
$$ -618313 -524902 -486559 -439167 -319742 -132054 64045 230676 383336 538304 686338
13409F86338J31446J13807Q0241k284j44539k97531l65550k94026j28236K2626
$$ 686338 817784 931591 1011832 1009548 865009 567478 201928 -92098 -220334 -197708
13399a97708O1850j1892j00880j16468n7020K4850R0094J17725R0826L2060J0866
$$ -197708 -135858 -147750 -248630 -365098 -422118 -397268 -307174 -189449 -98623 -66563 -55697
13388e5697P3645J84027K65533K94481L06902L17294K94287K21569J23716L3964
$$ -55697 17948 201975 467508 761989 1068891 1386185 1680472 1902041 2025757 2059721
13378B059721m7758j44776k33870k47055j61088k0225J04987J38846N4283o1696
$$ 2059721 2011963 1867187 1633317 1386262 1225174 1204949 1309936 1448782 1503065 1441369
13368A441369p9894L9544K31554M06970N15055N33111M63573L56049K61330J63220
$$ 1441369 1361475 1401019 1632573 2039543 2554598 3087709 3551282 3907331 4168661 4331881
13358D331881J8946j70242l65279n19870o12970o68672o97079o63402n58558m21267
$$ 4331881 4350827 4180585 3815306 3295436 2682466 2013794 1316715 653313 94755 -326512
13348c26512k85017j50949m615J61456L30104M37765M19585K82135P5243j36900
$$ -326512 -611529 -762478 -767093 -605637 -275533 162232 581817 863952 939195 802295
13338H02295k83306l28275k66819j01294J49936M26438O23802O75278N92148L94842
$$ 802295 518989 190714 -76105 -177399 -27463 398975 1022777 1698055 2290203 2685045
13328B685045J04864j83488l47610l72602l35804k75265j71271k9376J03290J78654
$$ 2685045 2789909 2606421 2258811 1886209 1550405 1275140 1103869 1074493 1177783 1356437
13318A356437J79473J19514O95j81615l81416n16996n39719m65211l44530k18279
$$ 1356437 1535910 1655424 1656119 1474504 1093088 576092 36373 -428838 -773368 -991647
13308i91647q8774N2494J73598K19909J82058J09670N8961N7736Q8509R4905L3171
$$ -991647 -1080421 -1027927 -854329 -634420 -452362 -342692 -283731 -225995 -137486 -42581 -9410
13297i410q3830j86727j97935q6628J29151M26076P78984J101445J268465J212253
$$ -9410 -93240 -279967 -477902 -564530 -435379 -9303 769681 1871126 3139591 4351844
13287D351844R39310N32513J60897l7770r1387j39664k52375l58411l87651l73299
$$ 4351844 5291154 5823667 5984564 5946794 5855407 5715743 5463368 5104957 4717306 4344007
13277D344007l71905l93613m20695m28146m08349m01581m46367n05365n06155
$$ 4344007 3972102 3578489 3157794 2729648 2321299 1919718 1473351 967986 461831
13268D61831m21264k64533o4884J27846K48020K54826J67974N6369k0422o6766
$$ 461831 40567 -223966 -288850 -161004 87016 341842 509816 566185 545763 478997
13258D78997j14263j53046j47457r0838q707Q6461K09009L59822M98834N95003
$$ 478997 364734 211688 64231 -26607 -35314 51147 260156 619978 1118812 1713815
13248A713815O62484P03355O48284M06500J7630l24028m82028n10662n24431n37620
$$ 1713815 2376299 3079654 3727938 4134438 4152068 3828040 3346012 2835350 2310919 1773299
13238A773299m91390l75716k32710r0482M0401J45122K14321K29318J45232l3630
$$ 1773299 1281909 906193 673483 583001 623402 768524 982845 1212163 1357395 1323765
13228A323765k06611k59791j58569L3448K05031K87749K85889K18201Q9277o9537
$$ 1323765 1117154 857363 698794 732242 937273 1225022 1510911 1729112 1818389 1748852
13218A748852j94840k50805k62366k72092k76542k44391j85051j39609j22474
$$ 1748852 1554012 1303207 1040841 768749 492207 247816 62765 -76844 -199318
13209a99318j06495n9753K5767J40572K67524L75909M36205M55011M29702L16069
$$ -199318 -305813 -365566 -339799 -199227 68297 444206 880411 1335422 1765124 2081193
13199B081193J15730n5168n3198J23786L16798L72937K57911M6105j25768j44442
$$ 2081193 2196923 2141755 2088557 2212343 2529141 2902078 3159989 3206094 3080326 2935884
13189B935884J2181K77406N37046O72868O19741L98493P4619k97324o61502r20642
$$ 2935884 2948065 3225471 3762517 4435385 5055126 5453619 5528238 5230914 4569412 3648770
13179C648770r85826q59827o40483m45190l36493l21924l53533l38798k35130
$$ 3648770 2662944 1803117 1162634 717444 380951 59027 -294506 -633304 -868434
13170h68434r1106L7498J55956K84883L87864M03031L33347K57598K41906K80941
$$ -868434 -959540 -922042 -766086 -481203 -93339 309692 643039 900637 1142543 1423484
13160A423484L32548L55761L38697L15972L26317L51754L20530J98792N1616m8543
$$ 1423484 1756032 2111793 2450490 2766462 3092779 3444533 3765063 3963855 4015471 3966928
13150C966928j00150j32068j81511k74339l76988m39409m47877l84097k32735
$$ 3966928 3866778 3734710 3553199 3278860 2901872 2462463 2014586 1630489 1397754
13141A397754l5346J32328K17008K16744J86454J85541J96584J49649K8466j13691
$$ 1397754 1362408 1494736 1711744 1928488 2114942 2300483 2497067 2646716 2675182 2561491
13131B561491k18008k46369k07321j63899j55302j50885j04952j9989M3128J3195
$$ 2561491 2343483 2097114 1889793 1725894 1570592 1419707 1314755 1294766 1337894 1351089
13121A351089j16325k59603l22760k81899j41537Q7688L55996N94207P35444P07479
$$ 1351089 1234764 975161 652401 370502 228965 316653 672649 1266856 2002300 2709779
13111B709779M82650J42702j63785l33992l70241l45182l36986l64402l66442
$$ 2709779 3192429 3335131 3171346 2837354 2467113 2121931 1784945 1420543 1054101
13102A054101k98934j97137j13470o6987n3967o0081o5239o0525n8952p8343j09487
$$ 1054101 755167 558030 444560 377573 323606 263525 198286 137761 78809 466 -109021
13091a09021j15684o9805K5207J49096K82177L92763M31066L53389J41377j63677
$$ -109021 -224705 -294510 -269303 -120207 161970 554733 985799 1339188 1480565 1316888
13081A316888m48455n96726n70744m25448k50061j08006l6029n4155j35952k07736
$$ 1316888 868433 271707 -299037 -724485 -974546 -1082552 -1118581 -1172736 -1308688 -1516424
13071a516424k10110j40396k5028J04974K11340K71676K97616L08644K92464K11869
$$ -1516424 -1726534 -1866930 -1891958 -1786984 -1575644 -1303968 -1006352 -697708 -405244 -193375
13061a93375Q4328P902N2913J73061K52779K19045R6208m8458j66270k22249k10115
$$ -193375 -109047 -101145 -48232 124829 377608 596653 692861 644403 478133 255884 45769
13050D5769j77402j61936j37770r7905q8161j10483j11058o2597R051P9963J48050
$$ 45769 -131633 -293569 -431339 -529244 -617405 -727888 -838946 -901543 -892492 -812529 -664479
13039f64479K08163K65359L44387M35182M44927K85526K394k48898l41926k66582
$$ -664479 -456316 -190957 153430 588612 1033539 1319065 1321459 1072561 730635 464053
13029D64053r4375R5865K42049L05822K87652K18938J22456M144q3175n6290P6488
$$ 464053 369678 465543 707592 1013414 1301066 1520004 1642460 1646604 1563429 1507139 1583627
13018A583627K03405K19593J10027o3336k13232k70152k32692j82500j88340k17575
$$ 1583627 1787032 2006625 2116652 2053316 1840084 1569932 1337240 1154740 966400 748825
13008G48825j97365q8095J10284L41161N08911N55280M78270K92523J8473l00827
$$ 748825 551460 463365 573649 914810 1423721 1979001 2457271 2749794 2768267 2467440
12998B467440n78576p09936o61558n02726l26834j79227p8609m4604n0519j791
$$ 2467440 1888864 1178928 517370 14644 -312190 -491417 -570026 -614630 -665149 -666940
12988f66940J55288L37587M22055L76931K50154J29750J06531J90719K98191L53630
$$ -666940 -511652 -174065 247990 624921 875075 1004825 1111356 1302075 1600266 1953896
12978A953896L48928K96120J94987M9334j15956k46654k74936j78867k8445Q7979
$$ 1953896 2302824 2598944 2793931 2843265 2727309 2480655 2205719 2026852 1998407 2086386
12968B086386J52695J65983J16209L4465k2843n3419q8202j10066r3049o7467
$$ 2086386 2239081 2405064 2521273 2555738 2532895 2479476 2391274 2281208 2188159 2120692
12958B120692p3678r7225q7822l6757J2044L2140M9056Q4523J02945O3341k9143
$$ 2120692 2047014 1949789 1861967 1825210 1837254 1869394 1918450 2002973 2105918 2169259 2140116
12947B140116j48476k81073m10765m85425m55204l37858j93222n4926P2888J73890
$$ 2140116 1991640 1710567 1299802 814377 359173 21315 -171907 -226833 -153945 19945
12937A9945K09836J71167J06155P3012P1578N8529J2304o1882j55556k42574k78603
$$ 19945 229781 400948 507103 580115 651693 710222 722526 660644 505088 262514 -16089
$$ [...]
##END NTUPLES=NMR SPECTRUM
##END=
