##TITLE=31P ikalashn
DE-77rm_1d(nlock)
15.11.2024
##JCAMPDX= 6.0         $$ Bruker NMR JCAMP-DX V2.0
##DATA TYPE= NMR SPECTRUM
##DATA CLASS= NTUPLES
##ORIGIN= UXNMR, Bruker Analytische Messtechnik GmbH
##OWNER= root
$$ TOPSPIN		Version 1.3
$$ 2024-11-15 10:12:24.500 +0400  Irina@DPX200
$$ Compression mode = diff/dup
##.OBSERVE FREQUENCY= 81.01967998063
##.OBSERVE NUCLEUS= ^31P
##.ACQUISITION MODE= SIMULTANEOUS
##.ACQUISITION SCHEME= undefined
##.AVERAGES= 64
##.DIGITISER RES= 17
##SPECTROMETER/DATA SYSTEM= spect
##.PULSE SEQUENCE= zgpg
##.SOLVENT NAME= D2O
##.SHIFT REFERENCE= INTERNAL, D2O, 1, 298.5841
##AUDIT TRAIL= $$ (NUMBER, WHEN, WHO, WHERE, WHAT)
$$ ##TITLE= Audit trail, TOPSPIN		Version 1.3
$$ ##JCAMPDX= 5.01
$$ ##ORIGIN= Bruker BioSpin GmbH
$$ ##OWNER= Irina
$$ $$ F:/spectra/data/iren/nmr/P31dec/1/pdata/1/auditp.txt
$$ ##AUDIT TRAIL=  $$ (NUMBER, WHEN, WHO, WHERE, VERSION, WHAT)
(   1,<2024-11-15 10:08:55.687 +0400>,<Irina>,<DPX200>,<TOPSPIN 1.3>,
      <created by zg
	started at 2024-11-15 10:07:12.656 +0400,
	POWCHK disabled, PULCHK disabled
       configuration hash MD5:
       BE 6D 3F 07 2A EA 11 49 91 17 2B D3 AF B3 58 0D
       data hash MD5: 32K
       BB 2A D5 06 5F 0A D6 9C 52 C4 05 AA FD 06 A5 25>)
(   2,<2024-11-15 10:11:57.984 +0400>,<Irina>,<DPX200>,<TOPSPIN 1.3>,
      <Start of raw data processing
       efp BC_mod = 2 LB = 10 FT_mod = 6 PKNL = 1 PHC0 = 228.164 PHC1 = 4.358885 SI = 32K 
       data hash MD5: 32K
       A7 3D 55 96 0C 81 91 94 ED 10 FD B9 B0 57 6B 1B>)
(   3,<2024-11-15 10:12:05.343 +0400>,<Irina>,<DPX200>,<TOPSPIN 1.3>,
      <apk 
       data hash MD5: 32K
       04 BE 9E E1 10 87 DF 28 92 00 C3 11 A5 BA 27 9D>)
(   4,<2024-11-15 10:12:07.046 +0400>,<Irina>,<DPX200>,<TOPSPIN 1.3>,
      <abs n ABSG = 5 
       data hash MD5: 32K
       53 91 0C 61 90 D3 2F FC BB 11 A3 41 23 D0 B7 D1>)
(   5,<2024-11-15 10:12:13.406 +0400>,<Irina>,<DPX200>,<TOPSPIN 1.3>,
      <pk fgphup PHC0 = 5.4 PHC1 = 0 
       data hash MD5: 32K
       D7 63 E6 92 05 59 FB 54 71 9D 58 88 BB 14 E6 1F>)
(   6,<2024-11-15 10:12:14.953 +0400>,<Irina>,<DPX200>,<TOPSPIN 1.3>,
      <abs n ABSG = 5 
       data hash MD5: 32K
       07 2B 8E BB E4 E2 B2 BC C6 97 AD F0 E5 E0 23 AB>)
$$ ##END=
$$ 
$$ $$ hash MD5
$$ $$ 3F CF 00 E4 C0 6B 29 F2 00 D5 1D 3F 01 F6 74 FA
##$RELAX= 
##$RELAX= 
##$RELAX= 
##$RELAX= 
##$RELAX= 
##$RELAX= 
##$RELAX= 
##$RELAX= 
##$RELAX= 
##$RELAX= 
##$RELAX= 
$$ Bruker specific parameters
$$ --------------------------
##$DU= <F:/spectra>
##$EXPNO= 1
##$NAME= <P31dec>
##$PROCNO= 1
##$TYPE= <nmr>
##$USER= <iren>
##$AMP= (0..31)
100 100 100 100 100 100 100 100 100 100 100 100 100 100 100 100 100 100 
100 100 100 100 100 100 100 100 100 100 100 100 100 100 
##$ANAVPT= -1
##$AQSEQ= 0
##$AQ_mod= 1
##$AUNM= <au_zg>
##$AUTOPOS= <>
##$BF1= 81.014009
##$BF2= 200.13
##$BF3= 200.13
##$BF4= 200.13
##$BF5= 200.13
##$BF6= 200.13
##$BF7= 200.13
##$BF8= 200.13
##$BYTORDA= 1
##$CFDGTYP= 0
##$CFRGTYP= 5
##$CHEMSTR= <none>
$$ [...]
##$SW_h= 37037.037037037
##$TD= 32768
##$TD0= 1
##$TE= 300
##$TE2= 300
##$TE3= 300
##$TEG= 300
##$TL= (0..7)
0 120 53 12 22 120 120 120 
##$TP= (0..7)
150 150 150 150 150 150 150 150 
##$TP07= 0
##$TPNAME0= <>
##$TPNAME1= <>
##$TPNAME2= <>
##$TPNAME3= <>
##$TPNAME4= <>
##$TPNAME5= <>
##$TPNAME6= <>
##$TPNAME7= <>
##$TPOAL= (0..7)
0.5 0.5 0.5 0.5 0.5 0.5 0.5 0.5 
##$TPOFFS= (0..7)
0 0 0 0 0 0 0 0 
##$TUNHIN= 0
##$TUNHOUT= 0
##$TUNXOUT= 0
##$USERA1= <user>
##$USERA2= <user>
##$USERA3= <user>
##$USERA4= <user>
##$USERA5= <user>
##$V9= 5
##$VALIST= <valist>
##$VCLIST= <CCCCCCCCCCCCCCC>
##$VD= 0
##$VDLIST= <DDDDDDDDDDDDDDD>
##$VPLIST= <PPPPPPPPPPPPPPP>
##$VTLIST= <TTTTTTTTTTTTTTT>
##$WBST= 1024
##$WBSW= 4
##$XGAIN= (0..3)
0 0 0 0 
##$XL= 0
##$YL= 0
##$YMAX_a= 11905
##$YMIN_a= -5210
##$ZGOPTNS= <>
##$ZL1= 120
##$ZL2= 120
##$ZL3= 120
##$ZL4= 120
##$ABSF1= 298.5841
##$ABSF2= -158.5842
##$ABSG= 5
##$ABSL= 5
##$ALPHA= 0
##$AQORDER= 0
##$ASSFAC= 0
##$ASSFACI= 0
##$ASSFACX= 0
##$ASSWID= 0
##$AUNMP= <proc_1d>
##$AXLEFT= 0
##$AXRIGHT= 0
##$AXTYPE= 0
##$AXUNIT= <>
##$AZFE= 0.1
##$AZFW= 0.5
##$BCFW= 0
##$BC_mod= 2
##$BYTORDP= 0
##$COROFFS= 0
##$CY= 12.5935478210449
##$DATMOD= 1
##$DC= 0
##$DFILT= <>
##$DTYPP= 0
##$F1P= 47.1127640792319
##$F2P= -24.0371245302204
##$FCOR= 0.5
##$FTSIZE= 32768
##$FT_mod= 6
##$GAMMA= 0
##$GB= 0
##$INTBC= 1
##$INTSCL= 7.269226e-011
##$ISEN= 30
##$LB= 10
##$LEV0= 0
##$LPBIN= 0
##$MAXI= 12.09355
##$MC2= 0
##$MEAN= 0
##$ME_mod= 0
##$MI= 0.7550151
##$NCOEF= 0
##$NC_proc= -11
##$NLEV= 6
##$NOISF1= 298.5841
##$NOISF2= 270.0111
##$NSP= 0
##$NTH_PI= 0
##$NZP= 0
##$OFFSET= 298.5841
##$PC= 1.4
##$PHC0= 199.6774
##$PHC1= 55.71121
##$PH_mod= 1
##$PKNL= yes
##$PPARMOD= 0
##$PPDIAG= 0
##$PPIPTYP= 0
##$PPMPNUM= 100
##$PPRESOL= 1
##$PSCAL= 0
##$PSIGN= 0
##$REVERSE= no
##$SF= 81.014009
##$SI= 32768
##$SIGF1= 270.0111
##$SIGF2= -158.5842
##$SINO= 77.54984
##$SIOLD= 32768
##$SREGLST= <31P.CDCl3>
##$SSB= 0
##$STSI= 32768
##$STSR= 0
##$SW_p= 37037.037037037
##$SYMM= 0
##$S_DEV= 0
##$TDeff= 32768
##$TDoff= 0
##$TI= <>
##$TILT= no
##$TM1= 0
##$TM2= 0
##$TOPLEV= 0
##$USERP1= <user>
##$USERP2= <user>
##$USERP3= <user>
##$USERP4= <user>
##$USERP5= <user>
##$WDW= 1
##$XDIM= 32768
##$YMAX_p= 390758995
##$YMIN_p= -7729177
$$ End of Bruker specific parameters
$$ ---------------------------------
##NTUPLES= NMR SPECTRUM
##VAR_NAME=  FREQUENCY,     SPECTRUM/REAL,   SPECTRUM/IMAG
##SYMBOL=    X,             R,               I
##VAR_TYPE=  INDEPENDENT,   DEPENDENT,       DEPENDENT
##VAR_FORM=  AFFN,          ASDF,            ASDF
##VAR_DIM=   32768,         32768,           32768
##UNITS=     HZ,            ARBITRARY UNITS, ARBITRARY UNITS
##FACTOR=    1.13031516577767, 1,            1
##FIRST=     37037.037037037, 2400523,       2947344
##LAST=      0,             -5254986,        -10203080
##MIN=       0,             -7729177,        0
##MAX=       37037.037037037, 390758995,     0
$$ Real data points
##PAGE= N=1
##DATA TABLE= (X++(R..R)), XYDATA
$$ [...]
$$ plain form
18391 -1301970 -1664994 -1893311 -1979532 -1952102 -1857978 -1731616 -1599611 -1538924 -1672999 -2063334
18381 -2063334 -2627634 -3175410 -3511757 -3531216 -3274965 -2923946 -2691279 -2680122 -2840082 -3043904
18371 -3043904 -3204939 -3332723 -3474035 -3624201 -3729913 -3774736 -3823557 -3948585 -4131604 -4268721
18361 -4268721 -4243613 -3998458 -3569857 -3061546 -2567893 -2099743 -1601993 -1056534 -528694 -117829
18351 -117829 117875 189429 129760 -37678 -272602 -514905 -717655 -862236 -937139 -922353
18341 -922353 -805165 -589962 -304085 -19847 170268 239812 247631 255092 267085 242556 116315
18330 116315 -186311 -697317 -1353556 -2037661 -2667084 -3203979 -3602497 -3805506 -3790712 -3596777
18320 -3596777 -3310040 -3015255 -2743145 -2475194 -2207607 -1990484 -1896112 -1961547 -2168098 -2438501
$$ packed form
18391a301970l63024k28317q6221K7430R4124J26362J32005O0687j34075l90335
18381b063334n64300n47776l36347j9459K56251L51019K32667J1157j59960k03822
18371c043904j61035j27784j41312j50166j05712m4823m8821j25028j83019j37117
18361d268721K5108K45155M28601N08311M93653M68150M97750N45459N27840M10865
18351a17829K35704P1554n9669j67438k34924k42303k02750j44581p4903J4786
18341i22353J17188K15203K85877K84238J90115O9544P819P461J1993k4529j26241
18330A16315l02626n11006o56239o84105o29423n36895l98518k03009J4794J93935
18320c596777K86737K94785K72110K67951K67587K17123R4372o5435k06551k70403
$$ plain form
18310 -2438501 -2652222 -2724922 -2685683 -2650559 -2719696 -2907017 -3136779 -3293597 -3303387 -3188339
18300 -3188339 -3039951 -2922390 -2820431 -2708770 -2629232 -2647358 -2762671 -2917897 -3091236 -3324992
18290 -3324992 -3639324 -3965993 -4204909 -4314018 -4321208 -4261054 -4131956 -3920115 -3646711 -3383228
18280 -3383228 -3186562 -3022973 -2801978 -2473807 -2066277 -1645620 -1280894 -1030330 -916500
18271 -916500 -902874 -898147 -816124 -648866 -444000 -215018 73882 442710 868609 1322735
18261 1322735 1800341 2289162 2725084 3016459 3099061 2969222 2695781 2382335 2080972 1762756
18251 1762756 1385684 976075 662059 590882 779959 1083761 1298839 1277181 988934 507735
18241 507735 -62498 -607092 -997408 -1150280 -1081650 -881179 -653701 -451751 -235253 66792
$$ packed form
18310b438501k13721p2700L9239L5124o9137j87321k29762j56818r790J15048
18300c188339J48388J17561J01959J11661P9538j8126j15313j55226j73339k33756
18290c324992l14332l26669k38916j09109p190O0154J29098K11841K73404K63483
18280c383228J96666J63589K20995L28171M07530M20657L64726K50564J13830
18271i16500J3626M727Q2023J67258K04866K28982K88900L68828M25899M54126
18261A322735M77606M88821M35922K91375Q2602j29839k73441l13446l01363l18216
18251A762756l77072m09609l14016p1177J89077L03802K15078k1658k88247m81199
18241E07735n70233n44594l90316j52872O8630K00471K27478K01950K16498L02045
$$ plain form
18231 66792 465521 909689 1335298 1683027 1876856 1812283 1417281 748240 -1718 -611002
18221 -611002 -960405 -1077432 -1066127 -997218 -865537 -651509 -390841 -162027 -38999 -59297
18211 -59297 -224162 -521935 -924406 -1359105 -1724958 -1951029 -2012184 -1884443 -1532345 -965192
18201 -965192 -283105 341800 727802 756044 416270 -188855 -891779 -1559246 -2132345 -2575413
18191 -2575413 -2838256 -2863392 -2611939 -2109781 -1464541 -823777 -339975 -131152 -216329 -502172
18181 -502172 -850419 -1153244 -1343467 -1378002 -1244780 -972069 -624867 -271146 64511 403563
18171 403563 773180 1179232 1598111 1970498 2238089 2415058 2586957 2816446 3073757 3267556
18161 3267556 3318960 3191660 2896061 2494123 2080554 1748697 1550456 1462150 1391934 1246718
$$ packed form
18231F6792L98729M44168M25609L47729J93829o4573l95002o69041p49958o09284
18221f11002l49403j17027J1305O8909J31681K14028K60668K28814J23028k0298
18211e9297j64865k97773m02471m34699l65853k26071o1155J27741L52098N67153
18201i65192O82087O24905L86002K8242l39774o05125p02924o67467n73099m43068
18191b575413k62843k5136K51453N02158O45240O40764M83802K08823q5177k85843
18181e02172l48247l02825j90223l4535J33222K72711L47202L53721L35657L39052
18171D03563L69617M06052M18879L72387K67591J76969J71899K29489K57311J93799
18161C267556N1404j27300k95599m01938m13569l31857j98241q8306p0216j45216
$$ plain form
18151 1246718 1003880 706394 401242 119319 -106812 -257568 -339721 -356944 -287672 -111043
18141 -111043 148250 417173 620470 719602 717184 658668 624455 691066 876776 1128717 1373177
18130 1373177 1559848 1657432 1642921 1520149 1332722 1149942 1028290 974155 953039 936762
18120 936762 924856 922409 936321 985391 1074665 1169072 1216474 1188350 1091446 955550 817667
18109 817667 694063 547510 326838 45818 -251038 -577257 -976149 -1442136 -1928636 -2394344
18099 -2394344 -2809430 -3134485 -3328139 -3397070 -3401286 -3400189 -3419656 -3462202 -3526107 -3586500 -3580392
18088 -3580392 -3474280 -3335850 -3288553 -3391891 -3587934 -3792778 -3991450 -4183700 -4314907 -4332529
18078 -4332529 -4259137 -4157536 -4065864 -3999995 -3964404 -3928079 -3836235 -3671020 -3474687 -3315598
$$ packed form
18151A246718k42838k97486l05152k81923k26131j50756q2153j7223O9272J76629
18141a11043K59293K68923K03297R9132k418n8516l4213O6611J85710K51941K44460
18130A373177J86671R7584j4511j22772j87427j82780j21652n4135k1116j6277
18120I36762j1906k447J3912M9070Q9274R4407M7402k8124r6904j35896j37883
18109H17667j23604j46553k20672k81020k96856l26219l98892m65987m86500m65708
18099b394344m15086l25055j93654o8931m216J097j9467m2546o3905o0393O108
18088c580392J06112J38430M7297j03338j96043k04844j98672j92250j31207j7622
18078d332529P3392J01601R1672O5869L5591L6325R1844J65215J96333J59089
$$ plain form
18068 -3315598 -3248826 -3289698 -3421681 -3627109 -3867510 -4049140 -4068455 -3887967 -3555226 -3180373
18058 -3180373 -2884144 -2736616 -2736820 -2827481 -2939995 -3057243 -3193442 -3296032 -3246980 -2971172
18048 -2971172 -2497611 -1960498 -1553580 -1422946 -1580200 -1896888 -2180936 -2322749 -2364677 -2403020
18038 -2403020 -2469230 -2516367 -2484814 -2381540 -2281671 -2228506 -2177540 -2067606 -1898977 -1717318
18028 -1717318 -1564504 -1453112 -1355589 -1212946 -976531 -646131 -272058 68982 327586 530481
18018 530481 759005 1096350 1580206 2181792 2825123 3422837 3898689 4190196 4288146 4264581
18008 4264581 4211717 4165519 4097772 3964769 3747102 3455451 3109953 2734037 2385368 2140672
17998 2140672 2015692 1933461 1785557 1515983 1144746 721499 283242 -131161 -457253 -632987
$$ packed form
18068c315598O6772m0872j31983k05428k40401j81630j9315J80488L32741L74853
18058c180373K96229J47528k04r0661j12514j17248j36199j02590M9052K75808
18048b971172M73561N37113M06918J30634j57254l16688k84048j41813m1928l8343
18038b403020o6210m7137L1553J03274R9869N3165N0966J09934J68629J81659
18028a717318J52814J11392R7523J42643K36415L30400L74073L41040K58604K02895
18018E30481K28524L37345M83856O01586O43331N97714M75852K91507R7950k3565
18008D264581n2864m6198o7747j33003k17667k91651l45498l75916l48669k44696
17998B140672j24980q2231j47904k69574l71237m23247m38257m14403l26092j75734
$$ plain form
17988 -632987 -632032 -485237 -301678 -214662 -268375 -390934 -478517 -469989 -353931 -140592 152842
17977 152842 505773 892622 1258564 1493265 1474707 1170272 682859 190610 -166164 -345963
17967 -345963 -389936 -379563 -376759 -373196 -314280 -153547 139878 579221 1131310 1704144 2170164
17956 2170164 2427650 2453062 2291885 2024119 1748308 1549791 1449193 1396679 1324541 1195026
17946 1195026 993796 704968 334719 -57208 -370606 -497560 -366737 17857 566232
17937 566232 1108984 1451389 1474328 1192140 741262 321937 91052 72635 183124 318642
17927 318642 401441 397371 312565 155766 -80246 -398981 -774285 -1142468 -1426288 -1571216
17917 -1571216 -1572635 -1468431 -1291057 -1027362 -632985 -96241 531689 1163788 1699431 2052931
$$ packed form
17988f32987R55J46795J83559Q7016n3713j22559q7583Q528J16058K13339K93434
17977A52842L52931L86849L65942K34701j8558l04435m87413m92249l56774j79799
17967c45963m3973J0373K804L563N8916J60733K93425M39343N52089N72834M66020
17956B170164K57486K5412j61177k67766k75811j98517j00598n2514p2138j29515
17946A195026k01230k88828l70249l91927l13398j26954J30823L84594N48375
17937E66232N42752L42405K2939k82188m50878m19325k30885j8417J10489J35518
17927C18642Q2799m070q4806j56799k36012l18735l75304l68183k83820j44928
17917a571216j419J04204J77374K63695L94377N36744O27930O32099N35643L53500
$$ plain form
17907 2052931 2190879 2130758 1908267 1557233 1127429 705926 376870 157631 4516 -129224
17897 -129224 -258952 -379844 -497833 -629258 -766934 -895834 -1049464 -1283056 -1587130 -1885333
17887 -1885333 -2126047 -2340259 -2589035 -2890358 -3197918 -3414519 -3442915 -3250190 -2901776 -2529944
17877 -2529944 -2243504 -2063643 -1934039 -1761921 -1459490 -995626 -432830 105534 529175
17868 529175 813923 940376 860264 542345 37822 -527336 -1028076 -1403357 -1682649 -1943045
17858 -1943045 -2222763 -2511456 -2801976 -3103141 -3407542 -3664524 -3801238 -3777967 -3599805 -3285390
17848 -3285390 -2875374 -2448173 -2084562 -1814231 -1599076 -1388908 -1206584 -1139511 -1234160 -1439572
17838 -1439572 -1640540 -1733690 -1709712 -1644399 -1590474 -1513191 -1334761 -1015332 -590766 -137963
$$ packed form
17907B052931J37948o0121k22491l51034m29804m21503l29056k19239j53115j33740
17897a29224j29728j20892j17989j31425j37676j28900j53630k33592l04074k98203
17887a885333k40714k14212k48776l01323l07560k16601k8396J92725L48414L71832
17877b529944K86440J79861J29604J72118L02431M63864N62796N38364M23641
17868E29175K84748J26453q0112l17919n04523n65158n00740l75281k79292k60396
17858a943045k79718k88693k90520l01165l04401k56982j36714K3271J78162L14415
17848c285390M10016M27201L63611K70331K15155K10168J82324O7073r4649k05412
17838a439572k00968r3150K3978O5313N3925P7283J78430L19429M24566M52803
$$ plain form
17828 -137963 270638 564631 692345 679703 631027 648934 755388 867621 849032 636106
17818 636106 325518 110512 135456 410148 841134 1306557 1679280 1834002 1690443 1233637
17808 1233637 514625 -333944 -1140709 -1788826 -2247399 -2557445 -2802478 -3030813 -3208716
17799 -3208716 -3279719 -3244640 -3155538 -3056701 -2956891 -2847666 -2725959 -2583966 -2397982 -2149359
17789 -2149359 -1835169 -1455432 -1038590 -682176 -514657 -587938 -827350 -1103415 -1329586 -1474239
17779 -1474239 -1512606 -1412483 -1146862 -713864 -183308 301678 601979 646805 456051 139011
17769 139011 -171638 -408831 -583867 -730851 -864748 -991924 -1123705 -1271168 -1449741 -1677926
17759 -1677926 -1946743 -2209698 -2441860 -2673984 -2935628 -3206742 -3466422 -3746185 -4086785
$$ packed form
17828a37963M08601K93993J27714j2642m8676J7907J06454J12233j8589k12926
17818F36106l10588k15006K4944K74692M30986M65423L72723J54722j43559m56806
17808A233637p19012q48569q06765o48117m58573l10046k45033k28335j77903
17799c208716p1003L5079Q9102R8837R9810J09225J21707J41993J85984K48623
17789b149359L14190L79737M16842L56414J67519p3281k39412k76065k26171j44653
17779a474239l8367J00123K65621M32998N30556M84986L00301M4826j90754l17040
17769A39011l10649k37193j75036j46984j33897j27176j31781j47463j78573k28185
17759a677926k68817k62955k32162k32124k61644k71114k59680k79763l40600
$$ plain form
17750 -4086785 -4474021 -4843001 -5109578 -5194910 -5056483 -4698781 -4159526 -3516498 -2908966 -2510946
17740 -2510946 -2453962 -2750524 -3262317 -3770494 -4129347 -4338179 -4464212 -4549763 -4608861 -4660289
17730 -4660289 -4722882 -4797461 -4850124 -4807775 -4622689 -4343426 -4064162 -3822289 -3598046 -3394750
17720 -3394750 -3259422 -3216506 -3240618 -3321624 -3503735 -3813507 -4190548 -4528267 -4744143 -4810211
17710 -4810211 -4761476 -4681684 -4659519 -4727400 -4842496 -4934828 -4944076 -4826278 -4598793 -4357310 -4200422
17699 -4200422 -4169865 -4261205 -4431655 -4593821 -4634112 -4449929 -4002456 -3367142 -2700681 -2142221
17689 -2142221 -1772651 -1622404 -1659896 -1795271 -1922482 -1952906 -1839913 -1604460 -1326795 -1098246
17679 -1098246 -975339 -968957 -1042573 -1105945 -1060538 -889790 -667328 -459039 -265226 -62324
$$ packed form
17750d086785l87236l68980k66577q5332J38427L57702N39255O43028O07532L98020
17740b510946N6984k96562n11793n08177l58853k08832j26033q5551n9098n1428
17730d660289o2593p4579n2663M2349J85086K79263K79264K41873K24243K03296
17720c394750J35328M2916k4112q1006j82111l09772l77041l37719k15876o6068
17710d810211M8735P9792K2165o7881j15096r2332r248J17798K27485K41483J56888
17699d200422L0557r1340j70450j62166m0291J84183M47473O35314O66461N58460
17689b142221L69570J50247l7492j35375j27211l0424J12993K35453K77665K28549
17679a098246J22907O382p3616o3372M5407J70748K22462K08289J93813K02902
$$ plain form
17669 -62324 130123 246600 256821 234047 287673 426422 561235 628441 651264 698717 817479
17658 817479 1010976 1251150 1457838 1517342 1394099 1180808 1008348 941589 963972 1019293
17648 1019293 1054343 1062074 1099806 1225157 1425243 1647435 1879733 2156434 2469925 2737228
17638 2737228 2875046 2841283 2626685 2255644 1776634 1251740 752235 329385 -18968 -337514
17628 -337514 -657140 -956206 -1191137 -1334481 -1359978 -1236959 -971410 -637351 -357174 -244543
17618 -244543 -338530 -591983 -939422 -1345320 -1773436 -2147996 -2378610 -2429095 -2340216 -2188881
17608 -2188881 -2053525 -1990100 -2020219 -2156236 -2389329 -2652101 -2863317 -2988944 -3016816 -2931470
17598 -2931470 -2761415 -2602977 -2549677 -2602637 -2672341 -2682674 -2646810 -2609084 -2565891 -2489044 -2372896
$$ packed form
17669f2324J92447J16477J0221k2774N3626J38749J34813O7206K2823M7453J18762
17658H17479J93497K40174K06688N9504j23243k13291j72460o6759K2383N5321
17648A019293L5050P731L7732J25351K00086K22192K32298K76701L13491K67303
17638B737228J37818l3763k14598l71041m79010n24894m99505m22850l48353l18546
17628c37514l19626k99066k34931j43344k5497J23019K65549L34059K80177J12631
17618b44543r3987k53453l47439m05898m28116l74560k30614n0485Q8879J51335
17608b188881J35356O3425l0119j36017k33093k62772k11216j25627k7872Q5346
17598b931470J70055J58438N3300n2960o9704j0333L5864L7726M3193P6847J16148
$$ plain form
17587 -2372896 -2232447 -2103807 -2039819 -2064633 -2137312 -2179895 -2138052 -1976717 -1638674 -1092448
17577 -1092448 -412858 231843 674024 845976 806064 666857 519982 428279 430641 532654
17567 532654 715878 942377 1145555 1264622 1300613 1313719 1351145 1389375 1367343 1256539
17557 1256539 1075144 860447 638693 393996 94419 -221719 -450041 -529532 -481920 -356792
17547 -356792 -215271 -151245 -248510 -517329 -916651 -1417929 -1984089 -2493640 -2758709 -2674735
17537 -2674735 -2334918 -1940561 -1613577 -1319021 -931043 -367756 310792 932446 1330354
17528 1330354 1421977 1227121 858534 464086 165016 32996 78829 269537 552511 867033
17518 867033 1178510 1492834 1832713 2201329 2558269 2846700 3041455 3139859 3134356 3026011
$$ packed form
17587b372896J40449J28640O3988k4814p2679m2583M1843J61335L38043N46226
17577a092448O79590O44701M42181J71952l9912j39207j46875r1703K362J02013
17567E32654J83224K26499K03178J19067L5991J3106L7426L8230k2032j10804
17557A256539j81395k14697k21754k44697k99577l16138k28322p9491M7612J25128
17547c56792J41521O4026r7265k68819l99322n01278n66160n09551k65069Q3974
17537b674735L39817L94357L26984K94556L87978N63287O78548O21654L97908
17528A330354R1623j94856l68587l94448k99070j32020M5833J90708K82974L14522
17518H67033L11477L14324L39879L68616L56940K88431J94755R8404n503j08345
$$ plain form
17508 3026011 2831884 2573557 2272062 1959570 1695818 1536181 1457544 1342172 1070540 618851
17498 618851 59640 -491673 -933723 -1232667 -1435084 -1602311 -1740953 -1818922 -1815493 -1727504
17488 -1727504 -1552069 -1307588 -1077107 -998320 -1186002 -1643412 -2257833 -2900958 -3505386 -4031019
17478 -4031019 -4427153 -4672879 -4808589 -4883056 -4898952 -4836605 -4706894 -4552129 -4398542 -4227966
17468 -4227966 -4009606 -3750031 -3491367 -3266395 -3057571 -2797608 -2429069 -1953156 -1410846
17459 -1410846 -826566 -199525 444529 1050349 1584089 2047165 2440762 2735507 2881058
17450 2881058 2829003 2567870 2150490 1653995 1140262 658147 232449 -129123 -401600 -556841
17440 -556841 -611196 -624465 -639148 -631914 -530667 -275988 137464 654678 1174529 1606062
$$ packed form
17508C026011j94127k58327l01495l12492k63752j59637p8637j15372k71632m51689
17498F18851n59211n51313m42050k98944k02417j67227j38642p7969L429Q7989
17488a727504J75435K44481K30481P8787j87682m57410o14421o43125o04428n25633
17478d031019l96134k45726j35710p4467j5896O2347J29711J54765J53587J70576
17468d227966K18360K59575K58664K24972K08824K59963L68539M75913N42310
17459a410846N84280O27041O44054O05820N33740M63076L93597K94745J45551
17450B881058n2055k61133m17380m96495n13733m82115m25698l61572k72477j55241
17440e56841n4355j3269j4683P234J01247K54679M13452N17214N19851M31533
$$ plain form
17430 1606062 1903488 2061839 2125581 2161973 2203683 2247059 2285243 2317211 2344329 2359629 2331606
17419 2331606 2199268 1882688 1325208 546082 -368793 -1298703 -2092271 -2597500 -2725626
17410 -2725626 -2514577 -2137625 -1797704 -1594436 -1515214 -1527730 -1632836 -1818188 -2005487 -2102669
17400 -2102669 -2106409 -2092004 -2108728 -2146021 -2175361 -2161912 -2047530 -1798100 -1481971 -1241130 -1181690
17389 -1181690 -1314211 -1552816 -1753358 -1788229 -1611570 -1266310 -828632 -351720 132161 568147
17379 568147 873542 1003606 991276 895343 746455 572805 421028 314154 244376 236418
17369 236418 345680 578898 875375 1148160 1296157 1216766 866908 308811 -321997 -898289
17359 -898289 -1353376 -1676007 -1871743 -1925105 -1801813 -1498673 -1078532 -639211 -253487 42436
$$ packed form
17430A606062K97426J58351O3742L6392M1710M3376L8184L1968K7118J5300k8023
17419B331606j32338l16580n57480p79126r14875r29910p93568n05229j28126
17410b725626K11049L76952L39921K03268P9222j2516j05106j85352j87299r7182
17400b102669l740J4405j6724l7293k9340J3449J14382K49430L16129K40841N9440
17389a181690j32521k38605k00542l4871J76659L45260M37678M76912M83881M35986
17379E68147L05395J30064j2330r5933j48888j73650j51777j06874o9778p958
17369B36418J09262K33218K96477K72785J47997p9391l49858n58097o30808n76292
17359h98289m55087l22631j95736n3362J23292L03140M20141M39321L85724K95923
$$ plain form
17349 42436 199364 143024 -163913 -668935 -1242030 -1753290 -2146078 -2406771 -2478418 -2267982
17339 -2267982 -1764070 -1105030 -489912 -41382 246311 454758 644225 798677 830842 631711
17329 631711 173244 -417069 -924141 -1195267 -1212172 -1037052 -742442 -410990 -153696 -76980
17319 -76980 -221176 -563325 -1075841 -1723452 -2410618 -3016736 -3485808 -3822560 -4040361 -4164725
17309 -4164725 -4218171 -4190296 -4086390 -3978870 -3967251 -4077041 -4216202 -4262729 -4166337 -3948750
17299 -3948750 -3646499 -3286788 -2912829 -2586230 -2369480 -2324005 -2483404 -2827101 -3296503 -3804045
17289 -3804045 -4219429 -4411848 -4328766 -3990070 -3448831 -2799923 -2153100 -1574035 -1081446 -690707
17279 -690707 -446929 -406709 -595605 -978720 -1446946 -1839788 -2018230 -1942604 -1670755 -1292375
$$ packed form
17349D2436J56928n6340l06937n05022n73095n11260l92788k60693p1647K10436
17339b267982N03912O59040O15118M48530K87693K08447J89467J54452L2165j99131
17329F31711m58467n90313n07072k71126j6905J75120K94610L31452K57294P6716
17319g6980j44196l42149n12516o47611o87166o06118m69072l36752k17801j24364
17309d164725n3446K7875J03906J07520J1619j09790j39161m6527R6392K17587
17299c948750L02251L59711L73959L26599K16750M5475j59399l43697m69402n07542
17289c804045m15384j92419Q3082L38696N41239O48908O46823N79065M92589L90739
17279f90707K43778M0220j88896l83115m68226l92842j78442P5626K71849L78380
$$ plain form
17269 -1292375 -889081 -523098 -211274 68393 321012 530375 692379 792651 787984 654712
17259 654712 433214 204270 31755 -66075 -119015 -186723 -342003 -656322 -1152377 -1757545
17249 -1757545 -2314127 -2645549 -2635379 -2298790 -1784771 -1258357 -785719 -361031 -15661 161038
17239 161038 112191 -118967 -401146 -583260 -591286 -465578 -304020 -198995 -208184 -327468
17229 -327468 -483883 -591029 -619668 -618126 -667907 -802266 -964100 -1053432 -1021329 -912488 -836612
17218 -836612 -901056 -1144134 -1536078 -2009211 -2458496 -2767659 -2867323 -2755259 -2466694 -2041505
17208 -2041505 -1503895 -866613 -175998 475752 1009866 1390679 1605388 1660219 1593991 1472920
17198 1472920 1356845 1279499 1270591 1353053 1508784 1689111 1860642 2012054 2118352 2146518
$$ packed form
17269a292375M03294L65983L11824K79667K52619K09363J62004J00272m667j33272
17259F54712k21498k28944j72515r7830n2940o7708j55280l14319m96055o05168
17249a757545n56582l31422J0170L36589N14019N26414M72638M24688L45370J76699
17239A61038m8847k31158k82179j82114q026J25708J61558J05025r189j19284
17229c27468j56415j07146k8639J542m9781j34359j61834q9332L2103J08841P5876
17218h36612o4444k43078l91944m73133m49285l09163r9664J12064K88565M25189
17208b041505N37610O37282O90615O51750N34114L80813K14709N4831o6228j21071
17198A472920j16075p7346q908Q2462J55731J80327J71531J51412J06298K8166
$$ plain form
17188 2146518 2111811 2072349 2035613 1928881 1703101 1406147 1110897 834340 567443 333540
17178 333540 192203 194484 327796 501332 610706 630453 618890 633352 679408 752480 857116
17167 857116 956823 962094 778303 357125 -259322 -946880 -1581657 -2087195 -2400522 -2468145
17157 -2468145 -2291927 -1939182 -1522027 -1174050 -1001862 -1041200 -1265148 -1612339 -1992270 -2300853
17147 -2300853 -2475287 -2533782 -2546375 -2567750 -2593197 -2556567 -2375958 -2033862 -1620624 -1269826
17137 -1269826 -1041732 -880826 -673121 -345146 75112 486278 800440 1009069 1170629
17128 1170629 1347434 1543385 1705441 1795161 1811825 1746506 1568729 1253971 823051 370877
17118 370877 26499 -122045 -59935 182425 565264 1029495 1478914 1819064 2019642 2115899
$$ packed form
17188B146518l4707l9462l6736j06732k25780k96954k95250k76557k66897k33903
17178C33540j41337K281J33312J73536J09374J9747j1563J4462M6056P3072J04636
17167H57116R9707N271j83791m21178o16447o87558o34777n05538l13327o7623
17157b468145J76218L52745M17155L47977J72188l9338k23948l47191l79931l08583
17147b300853j74434n8495j2593k1375k5447L6630J80609L42096M13238L50798
17137a269826K28094J60906K07705L27975M20258M11166L14162K08629J61560
17128A170629J76805J95951J62056Q9720J6664o5319j77777l14758m30920m52174
17118C70877l44378j48544O2110K42360L82839M64231M49419L40150K00578R6257
$$ plain form
17108 2115899 2149001 2136957 2100785 2081511 2112653 2184746 2253516 2291876 2315935 2347627 2377578
17097 2377578 2371732 2310427 2229089 2213237 2312224 2445285 2449012 2246789 1923709 1619610 1399299
17086 1399299 1245541 1128627 1056528 1065540 1172498 1337556 1475369 1506313 1409778 1251571
17076 1251571 1149310 1191143 1395005 1743208 2223909 2810859 3415872 3897562 4133685 4083288
17066 4083288 3785269 3319855 2771504 2209346 1677709 1170201 630143 25514 -594148
17057 -594148 -1152888 -1622393 -2031416 -2448315 -2927812 -3436899 -3846647 -4022077 -3925650 -3627370
17047 -3627370 -3235869 -2842025 -2497075 -2215249 -2009191 -1910076 -1931584 -2040790 -2187916 -2325265
17037 -2325265 -2374153 -2218800 -1786544 -1121137 -353295 393426 1066946 1659668 2139799 2434343
$$ packed form
17108B115899L3102j2044l6172j9274L1142P2093O8770L8360K4059L1692K9951
17097B377578n846o1305q1338j5852R8987J33061L727k02223l23080l04099k20311
17086A399299j53758j16914p2099R012J06958J65058J37813L0944r6535j58207
17076A251571j02261M1833K03862L48203M80701N86950O05013M81690K36123n0397
17066D083288k98019m65414n48351n62158n31637n07508n40058o04629o19662
17057e94148n58740m69505m09023m16899m79497n09087m09748j75430R6427K98280
17047c627370L91501L93844L44950K81826K06058R9115k1508j09206j47126j37349
17037b325265m8888J55353M32256O65407P67842P46721O73520N92722M80131K94544
$$ plain form
17027 2434343 2491399 2348064 2121026 1942334 1900387 2021454 2278330 2602190 2902112 3097146
17017 3097146 3136675 3001634 2712918 2338442 1954405 1595879 1277458 1033695 903472 877476
17007 877476 860669 714083 382131 -29592 -329966 -396886 -242313 66091 494138 1036214
16997 1036214 1663978 2301360 2859497 3290992 3585312 3745261 3782980 3702255 3488747 3128080
16987 3128080 2626387 2025920 1398488 808192 295881 -105354 -352299 -396380 -238983 21588
16977 21588 241891 341255 326350 204387 -77954 -565486 -1186922 -1769245 -2157446 -2292594
16967 -2292594 -2209138 -2010244 -1820652 -1704733 -1620124 -1463547 -1154497 -686645 -111304 521657
16957 521657 1188665 1864244 2506368 3095302 3654535 4205737 4709658 5055605 5140931 4968093
$$ packed form
17027B434343N7056j43335k27038j78692m1947J21067K56876L23860K99922J95034
17017C097146L9529j35041k88716l74476l84037l58526l18421k43763j30223k5996
17007H77476j6807j46586l31952m11723l00374o6920J54573L08404M28047N42076
16997A036214O27764O37382N58137M31495K94320J59949L7719q0725k13508l60667
16987C128080n01693o00467o27432n90296n12311m01235k46945m4081J57397K60571
16977B1588K20303R9364j4905j21963k82341m87532o21436n82323l88201j35148
16967b292594Q3456J98894J89592J15919Q4609J56577L09050M67852N75341O32961
16957E21657O67008O75579O42124N88934N59233N51202N03921L45947Q5326j72838
$$ plain form
16947 4968093 4627933 4215917 3781219 3313463 2787737 2227896 1705307 1293423 1028265
16938 1028265 903061 901914 1015478 1219498 1474897 1752553 2029231 2271769 2469132 2664619
16928 2664619 2902734 3168322 3422160 3653885 3857911 3998409 4045077 4007039 3894716 3688869
16918 3688869 3372712 2976328 2571621 2234867 2031593 1998348 2129680 2389249 2710224 3033628
16908 3033628 3371531 3774321 4238214 4695019 5068526 5307079 5378817 5269716 5005057 4646949
16898 4646949 4254289 3868976 3525342 3243370 3003181 2732839 2355873 1860852 1316395
16889 1316395 819788 443526 228926 181999 238709 267927 165247 -43844 -229732 -292012
16879 -292012 -231518 -95040 100510 380389 766689 1227091 1691032 2110570 2464697 2702958
$$ packed form
16947D968093l40160m12016m34698m67756n25726n59841n22589m11884k65158
16938A028265j25204j147J13564K04020K55399K77656K76678K42538J97363J95487
16928B664619K38115K65588K53838K31725K04026J40498M6668l8038j12323k05847
16918C688869l16157l96384m04707l36754k03274l3245J31332K59569L20975L23404
16908C033628L37903M02790M63893M56805L73507K38553P1738j09101k64659l58108
16898D646949l92660l85313l43634k81972k40189k70342l76966m95021n44457
16889A316395m96607l76262k14600m6927N6710K9218j02680k09091j85888o2280
16879b92012O0494J36478J95550K79879L86300M60402M63941M19538L54127K38261
$$ plain form
16869 2702958 2748283 2600546 2373350 2198486 2138291 2180986 2295832 2482849 2763502 3139758
16859 3139758 3577611 4011567 4351662 4501205 4383100 3979065 3388468 2812108 2413299
16850 2413299 2225309 2212969 2334974 2523279 2690689 2781393 2794079 2784496 2828138 2953230
16840 2953230 3144115 3392105 3704843 4101497 4601546 5166014 5665713 5955314 5957089 5687222
16830 5687222 5248386 4763374 4298668 3859815 3436692 3040516 2724744 2587518 2704119
16821 2704119 3044398 3522232 4097175 4773208 5551490 6435523 7441055 8558151 9709487
16812 9709487 10740464 11445854 11647457 11306798 10574527 9697757 8869121 8159188 7550405
16803 7550405 6999180 6484851 6023953 5626234 5241073 4795947 4283692 3771710 3346121
$$ packed form
16869B702958M5325j47737k27196j74864o0195M2695J14846J87017K80653L76256
16859C139758M37853M33956L40095J49543j18105m04035n90597n76360l98809
16850B413299j87990j2340J22005J88305J67410R0704J2686r583M3642J25092
16840B953230J90885K47990L12738L96654N00049N64468M99699K89601J775k69867
16830E687222m38836m85012m64706m38853m23123l96176l15772j37226J16601
16821B704119L40279M77834N74943O76033P78282Q84033J005532J117096J151336
16812I709487J030977P05390K01603l40659p32271q76770q28636p09933o08783
16803G550405n51225n14329m60898l97719l85161m45126n12255n11982m25589
$$ plain form
16794 3346121 3052023 2872736 2761951 2692464 2684521 2785079 3015682 3335734 3653416 3887992
16784 3887992 4027804 4103784 4119957 4046019 3870657 3639648 3440948 3360468 3453032 3745993
16774 3745993 4253865 4971867 5846465 6768960 7620277 8327274 8875515 9279236 9571421
16765 9571421 9830234 10175506 10691947 11356867 12074126 12788975 13543155 14407910 15390330
16756 15390330 16398010 17290516 17974798 18423657 18606228 18459994 17949704 17132365 16154693
16747 16154693 15201141 14433856 13917246 13570918 13238846 12825414 12329941 11774016 11175031
16738 11175031 10573145 10021489 9570829 9266347 9111951 9072953 9145518 9353849 9658493 9930266
16728 9930266 10036866 9949320 9778298 9693728 9783255 9992968 10202910 10325810 10315771 10138489
$$ packed form
16794C346121k94098j79287j10785o9487p943J00558K30603L20052L17682K34576
16784C887992J39812P5980J6173p3938j75362k31009j98700q0480R2564K92961
16774C745993N07872P18002Q74598R22495Q51317P06997N48241M03721K92185
16765I571421K58813L45272N16441O64920P17259P14849P54180Q64755R82420
16756A5390330J007680Q92506O84282M48859J82571j46234n10290q17339r77672
16747A6154693r53552p67285n16610l46328l32072m13432m95473n55925n98985
16738A1175031o01886n51656m50660l04482j54396l8998P2565K08331L04644K71773
16728I930266J06600q7546j71022q4570Q9527K09713K09942J22900j0039j77282
$$ plain form
16718 10138489 9784758 9284994 8706004 8145390 7696654 7402885 7257085 7229409 7288972 7435918
16708 7435918 7696612 8069990 8504822 8940668 9354895 9761315 10157810 10492245 10717942
16699 10717942 10853650 10938407 10968752 10925499 10829988 10740749 10707036 10749624 10854541 10958929
16689 10958929 10967021 10799538 10438756 9938563 9392704 8870511 8395683 8007716 7795336 7849115
16679 7849115 8204668 8810862 9540569 10263671 10907709 11447072 11879048 12219322 12483065
16670 12483065 12671455 12776945 12764963 12575938 12168205 11534361 10685766 9658268 8534167
16661 8534167 7422447 6402503 5498784 4708242 4042310 3554225 3321990 3383257 3686924
16652 3686924 4097240 4458781 4662266 4657654 4472421 4221683 4051349 4054513 4230795 4507335
$$ packed form
16718A0138489l53731m99764n78990n60614m48736k93769j45800k7676N9563J46946
16708G435918K60694L73378M34832M35846M14227M06420L96495L34435K25697
16699A0717942J35708Q4757L0345m3253r5511q9239l3713M2588J04917J04388
16689A0958929Q092j67483l60782n00193n45859n22193m74828l87967k12380N3779
16679G849115L55553O06194P29707P23102O44038N39363M31976L40274K63743
16670A2483065J88390J05490j1982j89025m07733o33844q48595j027498j124101
16661H534167j111720j019944r03719p90542o65932m88085k32235O1267L03667
16652C686924M10316L61541K03485m612j85233k50738j70334L164J76282K76540
$$ plain form
16642 4507335 4794671 5034353 5218214 5379729 5555597 5747893 5905926 5938884 5793409 5530922
16632 5530922 5276891 5092229 4943543 4785682 4601518 4356307 3996146 3536300 3090284
16623 3090284 2766326 2563826 2385863 2138367 1822967 1520682 1297364 1178981 1189034 1346527
16613 1346527 1611911 1870947 2026118 2083257 2126247 2245827 2506377 2930883 3478517 4041843
16603 4041843 4479937 4691112 4666980 4477823 4225473 3965935 3659716 3266117 2862423 2612978
16593 2612978 2639031 2936393 3393105 3851435 4183993 4336671 4285340 3998430 3496561 2902223
16583 2902223 2367170 1970513 1698201 1489729 1303484 1155891 1103287 1184046 1357025 1482031
16573 1482031 1402275 1083839 658284 319841 182362 235436 410293 639213 869921 1089022
$$ packed form
16642D507335K87336K39682J83861J61515J75868J92296J58033L2958j45475k62487
16632E530922k54031j84662j48686j57861j84164k45211l60161m59846m46016
16623C090284l23958k02500j77963k47496l15400l02285k23318j18383J0053J57493
16613A346527K65384K59036J55171N7139M2990J19580K60550M24506N47634N63326
16603D041843M38094K11175k4132j89157k52350k59538l06219l93599m03694k49445
16593B612978K6053K97362M56712M58330L32558J52678n1331k86910n01869n94338
16583B902223n35053l96657k72312k08472j86245j47593n2604Q0759J72979J25006
16573A482031p9756l18436m25555l38443j37479N3074J74857K28920K30708K19101
$$ plain form
16563 1089022 1323152 1567533 1754151 1840125 1870389 1915285 1994347 2079157 2141231 2189847 2294795
16552 2294795 2542943 2918964 3281846 3493668 3525492 3440657 3326217 3246096 3241778 3341239
16542 3341239 3537126 3798416 4120001 4525484 5027663 5607536 6219083 6806943 7340393
16533 7340393 7802852 8144337 8316946 8377576 8504477 8877571 9541581 10380734 11221328 11946540
16523 11946540 12513385 12904321 13109638 13164595 13164023 13213945 13375170 13621584 13829991 13836485
16513 13836485 13537880 12965328 12252079 11517245 10790971 10043230 9242340 8390091 7532328
16504 7532328 6750490 6140544 5771318 5644123 5684588 5781531 5843710 5821648 5690552 5457515
16494 5457515 5185350 4961006 4836418 4821551 4919227 5151191 5548738 6105147 6740103 7333960
$$ packed form
16563A089022K34130K44381J86618Q5974L0264M4896P9062Q4810O2074M8616J04948
16552B294795K48148L76021L62882K11822L1824q4835j14440q0121m318R9461
16542C341239J95887K61290L21585M05483N02179N79873O11547N87860N33450
16533G340393M62459L41485J72609O0630J26901L73094O64010Q39153Q40594P25212
16523A1946540N66845L90936K05317N4957n72M9922J61225K46414K08407O494
16513A3836485k98605n72552p13249p34834p26274p47741q00890q52249q57763
16504G532328p81838o09946l69226j27195M0465R6943O2179k2062j31096k33037
16494E457515k72165k24344j24588j4867R7676K31964L97547N56409O34956N93857
$$ plain form
16484 7333960 7792727 8064233 8141272 8067873 7893307 7635991 7324805 7027356 6817492 6742910
16474 6742910 6806539 6969733 7199255 7511831 7959855 8563889 9262879 9944502 10497970 10814773
16464 10814773 10778637 10297114 9392185 8314445 7522326 7400898 7957419 8898015 9928518
16455 9928518 10847730 11493590 11777617 11753190 11587346 11441921 11374904 11342754 11265516 11100901
16445 11100901 10878565 10655137 10439340 10171296 9773578 9218731 8565080 7958515 7570263
16436 7570263 7482834 7660577 8030536 8546491 9163565 9749911 10068639 9912726 9254537 8247075
16426 8247075 7103772 5989264 4999281 4189541 3584955 3186053 3006277 3088679 3454624
16417 3454624 4039131 4713336 5363659 5913009 6297039 6473897 6469994 6386258 6316145 6275863
$$ packed form
16484G333960M58767K71506P7039p3399j74566k57316l11186k97449k09864p4582
16474F742910O3629J63194K29522L12576M48024O04034O98990O81623N53468L16803
16464A0814773l6136m81523r04929j077740p92119j21428N56521R40596J030503
16455I928518R19212O45860K84027k4427j65844j45425o7017l2150p7238j64615
16445A1100901k22336k23428k15797k68044l97718n54847o53651o06565l88252
16436G570263q7429J77743L69959N15955O17074N86346L18728j55913o58189j007462
16426H247075j143303j114508r89983q09740o04586l98902j79776Q2402L65945
16417C454624N84507O74205O50323N49350L84030J76858l903q3736p0113m0282
$$ plain form
16407 6275863 6248773 6253490 6335019 6515207 6779321 7131688 7639338 8374523 9340869 10483941
16397 10483941 11739581 13056509 14397046 15731876 17041736 18336321 19657372 21049026
16389 21049026 22549736 24182819 25934461 27775045 29679450 31572509 33251205 34413293
16381 34413293 34807076 34353273 33128203 31283438 29020589 26607181 24327827 22352086
16373 22352086 20671740 19186951 17814531 16520876 15316522 14261819 13430276 12820655
16365 12820655 12371175 12063511 11957460 12119521 12522982 13034824 13490091 13753422 13715646
16356 13715646 13296442 12489736 11365391 10038540 8655410 7353603 6225408 5331301
16348 5331301 4734733 4497830 4630698 5051914 5600922 6094445 6389723 6441469 6312936 6111194
$$ packed form
16407F275863k7090M717Q1529J80188K64114L52367N07650P35185R66346J143072
16397A0483941J255640J316928J340537J334830J309860J294585J321051J391654
16389B1049026J500710J633083J751642J840584J904405J893059J678696J162088
16381C4413293L93783m53803j225070j844765k262849k413408k279354j975741
16373B2352086j680346j484789j372420j293655j204354j054703q31543o09621
16365A2820655m49480l07664j06051J62061M03461N11842M55267K63331l7776
16356A3715646m19204q06706j124345j326851j383130j301807j128195q94107
16348E331301n96568k36903J32868M21216N49008M93523K95278N1746j28533k01742
$$ plain form
16338 6111194 5914820 5751918 5622511 5529619 5480003 5485109 5557827 5665800 5720585 5649295 5463574
16327 5463574 5244555 5072823 4971738 4902277 4823855 4760464 4797395 5023464 5470046 6079958
16317 6079958 6730582 7294344 7705049 8000638 8276098 8588834 8952052 9379506 9860694
16308 9860694 10315234 10642866 10798552 10798820 10706134 10603418 10562377 10636358 10841402 11121827
16298 11121827 11369450 11495528 11476105 11337798 11127521 10898338 10712705 10644059 10745563 10985021
16288 10985021 11232261 11350032 11291344 11123864 10988062 11016125 11263940 11709102 12280668 12877742
16278 12877742 13413798 13852771 14181404 14385349 14477860 14521086 14583942 14678560 14747230 14702489
16268 14702489 14487812 14120878 13688179 13302222 13049803 12941028 12896674 12813977 12642400 12387416
$$ packed form
16338F111194j96374j62902j29407r2892m9616N106P2718J07973N4785p1290j85721
16327E463574k19019j71732j01085o9461p8422o3391L6931K26069M46582O09912
16317F079958O50624N63762M10705K95589K75460L12736L63218M27454M81188
16308I860694M54540L27632J55686K68r2686j02716m1041P3981K05044K80425
16298A1121827K47623J26078j9423j38307k10277k29183j85633o8646J01504K39458
16288A0985021K47240J17771n8688j67480j35802K8063K47815M45162N71566N97074
16278A2877742N36056M38973L28633K03945R2511M3226O2856R4618O8670m4741
16268A4702489k14677l66934m32699l85957k52419j08775m4354q2697j71577k54984
$$ plain form
16258 12387416 12077848 11753400 11465645 11255832 11118191 11015246 10931858 10889571 10912594 10993946
16248 10993946 11104465 11226710 11363536 11516394 11670055 11790906 11860509 11917234 12018931 12166168
16238 12166168 12291110 12310174 12163781 11838212 11382043 10884987 10434615 10082271 9842101
16229 9842101 9710803 9668777 9680028 9726668 9833207 10021856 10260287 10476962 10613704 10641036
16219 10641036 10537785 10294851 9941887 9547695 9175371 8835792 8488413 8077550 7574689
16210 7574689 7006705 6448128 5992634 5734595 5725514 5925216 6228433 6548404 6871615 7232914
16200 7232914 7644406 8068999 8471516 8852930 9222095 9551282 9781268 9895365 9984504 10215429
16190 10215429 10716330 11511960 12540958 13665945 14673642 15331993 15522454 15339882 15021102
$$ packed form
16258A2387416l09568l24448k87755k09813j37641j02945q3388m2287K3023Q1352
16248A0993946J10519J22245J36826J52858J53661J20851O9603N6725J01697J47237
16238A2166168J24942J9064j46393l25569m56169m97056m50372l52344k40170
16229I842101j31298m2026J1251M6640J06539J88649K38431K16675J36742K7332
16219A0641036j03251k42934l52964l94192l72324l39579l47379m10863n02861
16210G574689n67984n58577m55494k58039r081J99702L03217L19971L23211L61299
16200G232914M11492M24593M02517L81414L69165L29187K29986J14097Q9139K30925
16190A0215429N00901P95630J028998J124987J007697O58351J90461j82572l18780
$$ plain form
16181 15021102 14755394 14562734 14338837 13985671 13484070 12871643 12192745 11487385 10798426
16172 10798426 10179984 9699829 9403971 9284669 9319693 9524447 9916227 10457101 11079813
16163 11079813 11735308 12355174 12822942 13045970 13003381 12715191 12238961 11689511 11186427
16154 11186427 10778778 10453722 10201089 10040996 9993786 10045892 10151693 10257779 10337745 10403489
16144 10403489 10494004 10661329 10937597 11311690 11734554 12140699 12494950 12828811 13207622
16135 13207622 13665922 14203290 14820610 15518689 16291492 17139734 18054440 19002633 19954796
16126 19954796 20919593 21952182 23139955 24580673 26338838 28419213 30785925 33405657
16118 33405657 36290950 39496286 43061415 46976420 51180859 55563833 59988638 64345502
$$ packed form
16181A5021102k65708j92660k23897l53166n01601o12427o78898p05360o88959
16172A0798426o18442m80155k95858j19302L5024K04754L91780N40874O22712
16163A1079813O55495O19866M67768K23028m2589k88190m76230n49450n03084
16154A1186427m07649l25056k52633j60093m7210N2106J05801J06086P9966O5744
16144A0403489R0515J67325K76268L74093M22864M06145L54251L33861L78811
16135A3207622M58300N37368O17320O98079P72803Q48242R14706R48193R52163
16126A9954796R64797J032589J187773J440718J758165K080375K366712K619732
16118C3405657K885293L205336L565129L915005M204439M382974M424805M356864
$$ plain form
16110 64345502 68581425 72648246 76414645 79690284 82319835 84192319 85187713 85184077 84124066
16101 84124066 82044431 79086246 75527113 71720981 67956206 64417216 61234533 58486076
16093 58486076 56150900 54094075 52127697 50112653 47998097 45771992 43418178 40951874
16085 40951874 38473639 36150264 34127146 32449697 31057899 29870402 28871653 28103798
16077 28103798 27596399 27312271 27142280 26938682 26570548 25993393 25290311 24633903 24183014
16068 24183014 23966137 23847955 23640083 23248518 22710007 22110844 21502408 20892250 20260830
16059 20260830 19577709 18846373 18127677 17497900 16997187 16619817 16341925 16164757 16099773
16050 16099773 16100854 16075576 15975315 15830777 15697964 15591769 15489335 15382363 15292728 15245326
$$ packed form
16110F4345502M235923M066821L766399L275639K629551J872484R95394l636j060011
16101H4124066k079635k958185l559133l806132l764775l538990l182683k748457
16093E8486076k335176k056825j966378k015044k114556k226105k353814k466304
16085D0951874k478235k323375k023118j677449j391798j187497r98749p67855
16077B8103798n07399k84128j69991k03598l68134n77155p03082o56408m50889
16068B4183014k16877j18182k07872l91565n38511n99163o08436o10158o31420
16059B0260830o83121p31336p18696o29777n00713l77370k77892j77168o4984
16050A6099773J081k5278j00261j44538j32813j06195j02434j06972q9635m7402
$$ plain form
16040 15245326 15232740 15211323 15143814 15028704 14862397 14618718 14301907 13963850 13647854 13363214
16030 13363214 13120832 12945170 12848573 12812344 12819199 12909879 13164849 13616377 14211226 14868450
16020 14868450 15541094 16215019 16876567 17508748 18107042 18641545 19008745 19095829 18893287
16011 18893287 18515656 18123455 17829175 17652423 17537003 17417359 17282786 17189550 17207469 17339825
16001 17339825 17516962 17674603 17776295 17771648 17626675 17388371 17159857 17027395 17020182 17111432
15991 17111432 17265773 17491097 17832665 18306177 18850814 19356718 19737600 19968557 20041600
15982 20041600 19917053 19568421 19055623 18497307 17978741 17521452 17108354 16701878 16259353
15973 16259353 15753088 15201903 14682250 14282176 14051901 13997413 14085616 14251278 14437114 14636997
$$ packed form
16040A5245326j2586k1417o7509j15110j66307k43679l16811l38057l15996k84640
16030A3363214k42382j75662r6597l6229O855R0680K54970M51528N94849O57224
16020A4868450O72644O73925O61548O32181N98294N34503L67200Q7084k02542
16011A8893287l77631l92201k94280j76752j15420j19644j34573r3236J7919J32356
16001A7339825J77137J57641J01692m647j44973k38304k28514j32462p213R1250
15991A7111432J54341K25324L41568M73512N44637N05904L80882K30957P3043
15982B0041600j24547l48632n12798n58316n18566m57289m13098m06476m42525
15973A6259353n06265n51185n19653m00074k30275n4488Q8203J65662J85836J99883
$$ plain form
15963 14636997 14873628 15156990 15485444 15861843 16300982 16815343 17382602 17943024 18451864
15954 18451864 18934346 19461873 20074091 20745397 21410258 21997704 22458317 22785902 23014610
15945 23014610 23190989 23350360 23486774 23540779 23428899 23096350 22568677 21934844 21274606
15936 21274606 20620538 19968044 19293859 18574785 17791837 16930579 16011138 15122805 14395314
15927 14395314 13914186 13677828 13623341 13669917 13762906 13903660 14116905 14391059 14682925 14961574
15917 14961574 15208248 15398990 15541002 15714018 16039097 16607502 17442727 18508614 19738084
15908 19738084 21056373 22383565 23652678 24842663 25988458 27169496 28470750 29910229
15900 29910229 31392354 32750603 33833459 34540874 34813601 34636419 34058929 33185201 32122190
$$ packed form
15963A4636997K36631K83362L28454L76399M39139N14361N67259N60422N08840
15954A8451864M82482N27527O12218O71306O64861N87446M60613L27585K28708
15945B3014610J76379J59371J36414N4005j11880l32549n27673o33833o60238
15936B1274606o54068o52494o74185p19074p82948q61258r19441q88333p27491
15927A4395314m81128k36358n4487M6576R2989J40754K13245K74154K91866K78649
15917A4961574K46674J90742J42012J73016L25079N68405Q35225J065887J229470
15908A9738084J318289J327192J269113J189985J145795J181038J301254J439479
15900B9910229J482125J358249J082856P07415K72727j77182n77490q73728j063011
$$ plain form
15891 32122190 30947681 29728141 28519274 27356590 26290490 25395834 24717044 24223920
15883 24223920 23828650 23441954 23018724 22558585 22091207 21674368 21372706 21220962 21207704
15874 21207704 21280089 21373005 21441862 21479367 21529287 21657171 21869628 22093068 22239955 22255971
15864 22255971 22108099 21756961 21187035 20486531 19832757 19339057 18962742 18609779 18272880
15855 18272880 18019975 17900339 17912146 18016665 18143411 18210987 18174703 18077447 18043784 18184869
15845 18184869 18518751 18981474 19467449 19846512 20000976 19905860 19666904 19455751 19383808 19427005
15835 19427005 19480069 19476753 19426706 19348998 19240064 19115863 19032696 19053299 19235018 19639683
15825 19639683 20286382 21116750 22061674 23108049 24261577 25488670 26744149 28043646
$$ packed form
15891C2122190j174509j219540j208867j162684j066100q94656o78790m93124
15883B4223920l95270l86696m23230m60139m67378m16839l01662j51744j3258
15874B1207704P2385R2916O8857L7505M9920J27884K12457K23440J46887J6016
15864B2255971j47872l51138n69926p00504o53774m93700l76315l52963l36899
15855A8272880k52905j19636J1807J04519J26746O7576l6284r7256l3663J41085
15845A8184869L33882M62723M85975L79063J54464r5116k38956k11153p1943M3197
15835A9427005N3064l316n0047p7708j08934j24201q3167K0603J81719M04665
15825A9639683O46699Q30368R44924J046375J153528J227093J255479J299497
$$ plain form
15817 28043646 29468227 31080025 32867317 34787932 36840331 39070690 41517224 44166447
15809 44166447 46953178 49769794 52442613 54716907 56342718 57184058 57200092 56365545 54677464
15800 54677464 52255795 49402676 46505880 43856261 41533918 39455675 37519148 35684385
15792 35684385 33948223 32318982 30848478 29640279 28770822 28207115 27828406 27525966 27266322
15783 27266322 27053936 26874644 26691669 26466782 26158977 25718149 25136847 24509026 23981228
15774 23981228 23662880 23598103 23768486 24112650 24558562 25039573 25503244 25906205 26198124
15765 26198124 26343926 26371719 26389057 26552191 26986672 27692963 28544391 29395829 30163920 30831144
15755 30831144 31440416 32062511 32737468 33469816 34246415 35015492 35664572 36045856 36065450
$$ packed form
15817B8043646J424581J611798J787292J920615K052399K230359K446534K649223
15809D4166447K786731K816616K672819K274294J625811Q41340J6034q34547j688081
15800E4677464k421669k853119k896796k649619k322343k078243j936527j834763
15792C5684385j736162j629241j470504j208199q69457n63707l78709l02440k59644
15783B7266322k12386j79292j82975k24887l07805m40828n81302o27821n27798
15774B3981228l18348o4777J70383L44164M45912M81011M63671M02961K91919
15765B6198124J45802K7793J7338J63134M34481P06291Q51428Q51438P68091O67224
15755C0831144O09272O22095O74957P32348P76599P69077O49080L81284J9594
$$ plain form
15746 36065450 35759372 35256395 34690315 34182991 33854850 33788320 33974969 34318899 34717211
15737 34717211 35122507 35524800 35909887 36256891 36551884 36772077 36886569 36897512 36849564 36795431
15727 36795431 36768764 36763649 36747259 36727739 36794731 37059588 37568791 38287216 39134150 40061385
15717 40061385 41113524 42365501 43812429 45366066 46950261 48543988 50127328 51659614
15709 51659614 53129659 54576796 56071537 57693593 59509429 61551064 63797904 66195873
15701 66195873 68704960 71306839 73979628 76685633 79343470 81773379 83677018 84708015
15693 84708015 84622887 83396697 81212375 78389303 75317806 72350478 69694746 67426008
15685 67426008 65562636 64072951 62857639 61814194 60915503 60181238 59627074 59297553 59302430
$$ packed form
15746C6065450l06078n02977n66080n07324l28141o6530J86649L43930L98312
15737C4717211M05296M02293L85087L47004K94993K20193J14492J0943m7948n4133
15727C6795431k6667n115j6390j9520O6992K64857N09203P18425Q46934R27235
15717D0061385J052139J251977J446928J553637J584195J593727J583340J532286
15709E1659614J470045J447137J494741J622056J815836K041635K246840K397969
15701F6195873K509087K601879K672789K706005K657837K429909J903639J030997
15693H4708015q5128j226190k184322k823072l071497k967328k655732k268738
15685F7426008j863372j489685j215312j043445q98691p34265n54164l29521M877
$$ plain form
15676 59302430 59766708 60731477 62104626 63708971 65395249 67129734 68979095 71039244
15668 71039244 73378797 75994222 78811521 81768951 84888078 88258789 91979142 96108188
15660 96108188 100672545 105708966 111291815 117541923 124616158 132669065 141875353 152511232
15652 152511232 164913370 179323714 195852918 214551037 235405626 258258086 282678490
15645 282678490 307825627 332398128 354733007 372994559 385437207 390758995 388455732
15638 388455732 378971582 363519166 343684965 321062570 297028229 272653875 248744134
15631 248744134 225899057 204526998 184861529 167016195 151042156 136937984 124624814
15624 124624814 113948779 104725947 96788503 89984099 84152382 79130755 74781685 71003765
$$ packed form
15676E9302430M64278R64769J373149J604345J686278J734485J849361K060149
15668G1039244K339553K615425K817299K957430L119127L370711L720353M129046
15660I6108188M564357N036421N582849O250108P074235Q052907R206288J0635879
15652A52511232J2402138J4410344J6529204J8698119K0854589K2852460K4420404
15645B82678490K5147137K4572501K2334879J8261552J2442648N321788k303263
15638C88455732r484150j5452416j9834201k2622395k4034341k4374354k3909741
15631B48744134k2845077k1372059j9665469j7845334j5974039j4104172j2313170
15624A24624814j0676035r222832p937444o804404n831717n021627m349070l777920
$$ plain form
15616 71003765 67691918 64713313 61962565 59417783 57138820 55179114 53491107 51982725
15608 51982725 50630948 49471094 48525787 47810831 47384741 47337840 47736261 48598654 49917233
15599 49917233 51669218 53798038 56224713 58900978 61815420 64934127 68225298 71733925
15591 71733925 75527333 79581356 83768507 87945438 92031257 96018638 99916914 103652050
15583 103652050 106997461 109625849 111248370 111711472 111009561 109244808 106579586 103207879
15575 103207879 99334293 95157022 90863691 86620526 82529384 78623312 74942852 71588719
15567 71588719 68701111 66421366 64844355 63957309 63631936 63708206 64072297 64644439 65345616
15558 65345616 66111087 66893325 67619786 68174780 68423615 68240362 67530037 66251586 64439637
$$ packed form
15616G1003765l311847k978605k750748k544782k278963j959706j688007j508382
15608E1982725j351777j159854r45307p14956m26090m6901L98421Q62393J318579
15599D9917233J751985K128820K426675K676265K914442L118707L291171L508627
15591G1733925L793408M054023M187151M176931M085819L987381L898276L735136
15583A03652050L345411K628388J622521M63102p01911j764753k665222l371707
15575A03207879l873586m177271m293331m243165m091142l906072l680460l354133
15567G1588719k887608k279745j577011q87046l25373P6270L64091N72142P01177
15558F5345616P65471P82238P26461N54994K48835j83253p10325j278451j811949
$$ plain form
15549 64439637 62228111 59853042 57573474 55546814 53782690 52205623 50737794 49325252
15541 49325252 47915942 46457452 44939019 43413883 41936788 40490941 39020215 37501707
15533 37501707 35953834 34418868 32951049 31588505 30329673 29132943 27959551 26826968
15525 26826968 25793549 24888028 24073307 23287184 22506159 21764524 21109226 20532619 19954073
15516 19954073 19273390 18462926 17596453 16770377 16025507 15360601 14795941 14371590 14081132
15507 14081132 13879326 13763736 13792097 13995812 14305295 14593056 14801404 14996345 15273772
15498 15273772 15632339 15954293 16096964 16002425 15740020 15453802 15282253 15315662 15592784 16098323
15488 16098323 16776517 17586101 18535523 19654004 20925206 22246804 23475098 24521015
$$ packed form
15549F4439637k211526k375069k279568k026660j764124j577067j467829j412542
15541D9325252j409310j458490j518433j525136j477095j445847j470726j518508
15533C7501707j547873j534966j467819j362544j258832j196730j173392j132583
15525B6826968j033419r05521q14721p86123p81025p41635o55298n76607n78546
15516A9954073o80683q10464q66473q26076p44870o64906n64660m24351k90458
15507A4081132k01806j15590K8361K03715L09483K87761K08348J94941K77427
15498A5273772L58567L21954J42671r4539k62405k86218j71549L3409K77122N05539
15488A6098323O78194Q09584R49422J118481J271202J321598J228294J045917
$$ plain form
15480 24521015 25385297 26091454 26634854 27016209 27279195 27493475 27716697 27981399 28292669
15471 28292669 28623717 28931120 29180324 29375908 29553694 29734194 29912024 30076922 30222857
15462 30222857 30364592 30571306 30958543 31596692 32403512 33162567 33673948 33873381 33819695
15453 33819695 33632234 33464713 33481495 33771690 34261032 34761765 35133070 35360526 35506893
15444 35506893 35654341 35870570 36172688 36541159 36959937 37398345 37782128 38028964 38100553
15435 38100553 38003140 37774657 37493479 37253708 37098316 36998457 36905186 36787728 36619684 36376272
15425 36376272 36048636 35646687 35206797 34797131 34475756 34238885 34044511 33867397 33694514
15416 33694514 33492408 33227117 32906997 32566423 32231396 31942832 31769275 31729380 31742892 31708488
$$ packed form
15480B4521015Q64282P06157N43400L81355K62986K14280K23222K64702L11270
15471B8292669L31048L07403K49204J95584J77786J80500J77830J64898J45935
15462C0222857J41735K06714L87237O38149Q06820P59055N11381J99433n3686
15453C3819695j87461j67521J6782K90195M89342N00733L71305K27456J46367
15444C5506893J47448K16229L02118L68471M18778M38408L83783K46836P1589
15435C8100553r7413k28483k81178k39771j55392r9859r3271j17458j68044k43412
15425C6376272l27636m01949m39890m09666l21375k36871j94374j77114j72883
15416C3694514k02106k65291l20120l40574l35027k88564j73557l9895J3512l4404
$$ plain form
15406 31708488 31595245 31435552 31275475 31160129 31100298 31043402 30924932 30715190 30417658 30072657
15396 30072657 29767701 29608118 29657471 29907440 30296119 30764030 31298867 31931091 32697955
15387 32697955 33609028 34637880 35718005 36722208 37481930 37883669 37945521 37790669 37572056
15378 37572056 37432665 37505728 37888476 38599596 39585138 40774380 42135387 43696387 45534717
15369 45534717 47718988 50255283 53114117 56270413 59674268 63194886 66608303 69619935
15361 69619935 71917394 73276172 73659389 73219610 72221580 70967885 69738182 68746955 68140128
15352 68140128 67994442 68333714 69182751 70583154 72541936 74992693 77788456 80685391
15344 80685391 83361843 85528502 87044016 87896350 88093342 87621801 86515290 84915445
$$ packed form
15406C1708488j13243j59693j60077j15346n9831n6896j18470k09742k97532l45001
15396C0072657l04956j59583M9353K49969L88679M67911N34837O32224P66864
15387C2697955R11073J028852J080125J004203P59722M01739O1852j54852k18613
15378C7572056j39391P3063L82748P11120R85542J189242J361007J561000J838330
15369D5534717K184271K536295K858834L156296L403855L520618L413417L011632
15361F9619935K297459J358778L83217m39779r98030j253695j229703r91227o06827
15352F8140128j45686L39272Q49037J400403J958782K450757K795763K896935
15344H0685391K676452K166659J515514Q52334J96992m71541j106511j599845
$$ plain form
15336 84915445 83043549 81134296 79372889 77839662 76529809 75431432 74571602 74005761
15328 74005761 73768652 73838483 74158533 74683322 75371757 76166513 77023912 77947752 78972588
15319 78972588 80135258 81472655 83007042 84721731 86557900 88421385 90190900 91721396
15311 91721396 92878022 93582742 93816008 93626027 93143491 92529522 91905890 91340326 90847911
15302 90847911 90400598 89973635 89580135 89265349 89068959 88954863 88796982 88475169 87962803
15293 87962803 87322053 86646309 85990647 85332434 84604716 83767965 82853869 81948477 81127328
15284 81127328 80405466 79760581 79180373 78655910 78168132 77722609 77362563 77130543 77037411
15275 77037411 77039845 77036878 76917160 76617049 76146154 75548326 74842958 74040625 73196605 72414030
$$ packed form
15336H4915445j871896j909253j761407j533227j309853j098377q59830n65841
15328G4005761k37109O9831L20050N24789O88435P94756Q57399R23840J024836
15319G8972588J162670J337397J534387J714689J836169J863485J769515J530496
15311I1721396J156626P04720K33266j89981m82536o13969o23632n65564m92415
15302I0847911m47313m26963l93500l14786j96390j14096j57881l21813n12366
15293H7962803o40750o75744o55662o58213p27718q36751r14096r05392q21149
15284H1127328p21862o44885n80208n24463m87778m45523l60046k32020r3132
15275G7037411K434k967j19718l00111m70895n97828p05368q02333q44020p82575
$$ plain form
15265 72414030 71783442 71321577 70979793 70705541 70495363 70398210 70463657 70687396 71000517 71296752
15255 71296752 71458014 71371157 70974940 70317864 69539338 68766808 68049236 67399863 66863651
15246 66863651 66498509 66303384 66232622 66262437 66395045 66640216 67011658 67517712 68159025 68937603
15236 68937603 69855080 70895496 72010300 73137209 74272081 75525549 77083757 79091328
15228 79091328 81545096 84296595 87163877 90038451 92881035 95651118 98292594 100760297
15220 100760297 103017893 105035063 106772297 108137287 108989630 109213990 108783302 107724533
15212 107724533 106028853 103666773 100719603 97418407 94006308 90605146 87235617 83941649
15204 83941649 80884059 78290103 76299132 74882608 73896538 73181883 72623996 72142708 71644187
$$ packed form
15265G2414030o30588m61865l41784k74252k10178r7153O5447K23739L13121K96235
15255G1296752J61262q6857l96217o57076p78526p72530p17572o49373n36212
15246F6863651l65142j95125p0762K9815J32608K45171L71442N06054O41313P78578
15236F8937603R17477J040416J114804J126909J134872J253468J558208K007571
15228G9091328K453768K751499K867282K874574K842584K770083K641476K467703
15220A00760297K257596K017170J737234J364990Q52343K24360m30688j058769
15212A07724533j695680k362080k947170l301196l412099l401162l369529l293968
15204H3941649l057590k593956j990971j416524r86070p14655n57887m81288m98521
$$ plain form
15195 71644187 71000654 70077927 68753366 66916527 64508896 61594299 58372755 55120844
15187 55120844 52106661 49514164 47392262 45652152 44151447 42803647 41604538 40552304
15179 40552304 39578271 38596150 37588601 36616328 35766220 35113628 34724369 34640714 34832873
15170 34832873 35177275 35516402 35761371 35939658 36158862 36535341 37152999 38054125 39210286
15161 39210286 40498350 41755478 42882218 43900511 44909490 45979920 47092315 48174068
15153 48174068 49169462 50059127 50871638 51667244 52436124 53064819 53447897 53553396 53388817
15144 53388817 52992459 52420644 51700208 50837134 49854770 48786340 47655848 46484155 45310716
15135 45310716 44187480 43132485 42106786 41038623 39855619 38505260 36976594 35303235
$$ packed form
15195G1644187o43533r22727j324561j836839k407631k914597l221544l251911
15187E5120844l014183k592497k121902j740110j500705j347800j199109j052234
15179D0552304r74033r82121j007549r72273q50108o52592l89259q3655J92159
15170C4832873L44402L39127K44969J78287K19204L76479O17658R01126J156161
15161C9210286J288064J257128J126740J018293J008979J070430J112395J081753
15153D8174068R95394Q89665Q12511P95606P68880O28695L83078J05499j64579
15144E3388817l96358n71815p20436q63074r82364j068430j130492j171693j173439
15135D5310716j123236j054995j025699j068163j183004j350359j528666j673359
$$ plain form
15127 35303235 33536060 31726548 29929807 28206956 26613509 25173202 23875946 22714837
15119 22714837 21710557 20904599 20330871 19989294 19834746 19776837 19717320 19610771 19486964
15110 19486964 19414267 19431041 19517014 19613829 19640847 19522275 19240218 18835597 18353131 17830830
15100 17830830 17330086 16934530 16706528 16639079 16658960 16677025 16637670 16552755 16495650 16552405
15090 16552405 16766431 17107513 17495613 17856800 18146893 18352765 18494464 18624671 18815527
15081 18815527 19107682 19462329 19781010 19971918 20017080 19989821 20007508 20179613 20572712 21155446
15071 21155446 21773638 22246353 22483340 22479120 22266930 21921545 21556694 21278081 21129662 21085956
15061 21085956 21080516 21042720 20927608 20722634 20421150 20012264 19529161 19058773 18667721 18381294
$$ packed form
15127C5303235j767175j809512j796741j722851j593447j440307j297256j161109
15119B2714837j004280q05958n73728l41577j54548n7909n9517j06549j23807
15110A9486964p2697J6774Q5973R6815K7018j18572k82057m04621m82466n22301
15100A7830830n00744l95556k28002o7449J9881J8065l9355q4915n7105N6755
15090A6552405K14026L41082L88100L61187K90093K05872J41699J30207J90856
15081A8815527K92155L54647L18681J90908M5162k7259J7687J72105L93099N82734
15071B1155446O18192M72715K36987m220k12190l45385l64851k78613j48419m3706
15061B1085956n440l7796j15112k04974l01484m08886m83103m70388l91052k86427
$$ plain form
15051 18381294 18229828 18239083 18385597 18609369 18855509 19060068 19132443 19019256 18778553 18560522
15041 18560522 18513890 18702838 19096012 19613796 20178312 20750890 21318102 21804422 22035260
15032 22035260 21863479 21323874 20620001 19969092 19481403 19178093 19043908 19014163 18998167 18971608
15022 18971608 18985673 19057048 19102753 19013376 18755978 18391156 18025116 17749944 17584501 17426719
15012 17426719 17093313 16443811 15466379 14294613 13158104 12257524 11701930 11535498 11721287
15003 11721287 12121054 12577536 13032532 13544223 14200341 15016669 15904571 16729515 17370611
14994 17370611 17733001 17780194 17584814 17322865 17174934 17221643 17417606 17641122 17801868 17923172
14984 17923172 18104253 18416779 18839018 19274314 19620213 19815882 19862894 19818321 19754016 19702447
$$ packed form
15051A8381294j51466R255J46514K23772K46140K04559P2375j13187k40703k18031
15041A8560522m6632J88948L93174N17784N64516N72578N67212M86320K30838
15032B2035260j71781n39605p03873o50909m87689l03310j34185k9745j5996k6559
15022A8971608J4065P1375M5705q9377k57398l64822l66040k75172j65443j57782
15012A7426719l33406o49502r77432j171766j136509r00580n55594j66432J85789
15003A1721287L99767M56482M54996N11691O56118Q16328Q87902Q24944O41096
14994A7370611L62390M7193j95380k61949j47931M6709J95963K23516J60746J21304
14984A7923172J81081L12526M22239M35296L45899J95669M7012m4573o4305n1569
$$ plain form
14974 19702447 19637400 19522645 19364089 19194937 19034418 18888111 18790797 18827596 19065673 19478958
14964 19478958 19973431 20465329 20928160 21407921 22015126 22824207 23752353 24605787 25262277
14955 25262277 25772488 26278622 26877084 27578620 28356122 29190648 30083086 31030541 32008201
14946 32008201 32975303 33881634 34694791 35440969 36198773 37047462 38049271 39258931 40707616
14937 40707616 42387924 44276924 46369230 48655641 51051526 53373114 55423623 57103223
14929 57103223 58419672 59413234 60107533 60512289 60628747 60466091 60070233 59510066 58832242
14920 58832242 58069640 57297717 56654296 56304200 56385828 56954996 57938167 59131855 60263109
14911 60263109 61082917 61437091 61265407 60576224 59442541 57991794 56378265 54734736 53121471
$$ packed form
14974A9702447o5047j14755j58556j69152j60519j46307r7314L6799K38077M13285
14964A9478958M94473M91898M62831M79761O07205Q09081R28146Q53434O56490
14955B5262277N10211N06134N98462P01536P77502Q34526Q92438R47455R77660
14946C2008201R67102R06331Q13157P46178P57804Q48689J001809J209660J448685
14937D0707616J680308J889000K092306K286411K395885K321588K050509J679600
14929E7103223J316449R93562O94299M04756J16458j62656l95858n60167o77824
14920E8832242p62602p71923o43421l50096Q1628N69168R83171J193688J131254
14911F0263109Q19808L54174j71684o89183j133683j450747j613529j643529j613265
$$ plain form
14902 53121471 51540452 49995944 48513193 47105595 45757368 44434229 43074236 41618925
14894 41618925 40111062 38705689 37552764 36687510 36010693 35373579 34701573 34037788 33496339
14885 33496339 33185065 33138474 33307092 33583155 33832514 33941220 33864779 33640766 33350765 33096324
14875 33096324 32978901 33019592 33120739 33157171 33089295 32984776 32960004 33098049 33392824 33744452
14865 33744452 34018136 34137892 34129052 34073954 34038522 34051388 34119214 34207782 34224843 34069421 33691964
14854 33691964 33111469 32402480 31657995 30958487 30353187 29853165 29474469 29275473 29313695
14845 29313695 29597060 30080215 30678128 31301748 31909003 32526774 33208736 33962872 34740684
14836 34740684 35492481 36190883 36808671 37304629 37630001 37742861 37632872 37347053 37004457
$$ packed form
14902E3121471j581019j544508j482751j407598j348227j323139j359993j455311
14894D1618925j507863j405373j152925q65254o76817o37114o72006o63785n41449
14885C3496339l11274m6591J68618K76063K49359J08706p6441k24013k90001k54441
14875C3096324j17423M0691J01147L6432o7876j04519k4772J38045K94775L51628
14865C3744452K73684J19756q840n5098l5432J2866O7826Q8568J7061j55422l77457
14854C3691964n80495p08989p44485o99508o05300n00022l78696j98996L8222
14845B9313695K83365M83155N97913O23620O07255O17771O81962P54136P77812
14836C4740684P51797O98402O17788M95958L25372J12860j09989k85819l42596
$$ plain form
14827 37004457 36779475 36832379 37239117 37984946 39009265 40265360 41755773 43491947 45416432
14818 45416432 47389678 49244921 50815016 51934821 52494010 52494424 52029309 51188578 49996728
14809 49996728 48471310 46715981 44912258 43213293 41664839 40243749 38940489 37783104
14801 37783104 36795446 35956949 35222248 34571967 34026241 33606237 33302672 33072182 32826009
14792 32826009 32440262 31820187 30949762 29889592 28774122 27789806 27069694 26605968 26306596
14783 26306596 26113401 26052428 26199900 26612585 27262292 28006607 28650720 29068017 29230340
14774 29230340 29150725 28847734 28338118 27646802 26815953 25901514 24981809 24164286 23537016
14765 23537016 23091987 22740366 22406262 22076105 21776326 21528232 21351966 21300763 21437864
$$ packed form
14827C7004457k24982N2904M06738P45829J024319J256095J490413J736174J924485
14818D5416432J973246J855243J570095J119805N59189M14m65115q40731j191850
14809D9996728j525418j755329j803723j698965j548454j421090j303260j157385
14801C7783104r87658q38497p34701o50281n45726m20004l03565k30490k46173
14792C2826009l85747o20075q70425j060170j115470r84316p20112m63726k99372
14783B6306596j93195o0973J47472M12685O49707P44315O44113M17297J62323
14774B9230340p9615l02991n09616o91316q30849r14439r19705q17523o27270
14765B3537016m45029l51621l34104l30157k99779k48094j76266n1203J37101
$$ plain form
14756 21437864 21768838 22204878 22593788 22813289 22861248 22834912 22829200 22908693 23137349 23572336
14746 23572336 24248783 25159197 26223768 27310032 28286076 29050350 29544127 29755804 29711973
14737 29711973 29471126 29117253 28749185 28466349 28352197 28453723 28771091 29269099 29895219
14728 29895219 30591926 31289642 31899990 32361283 32699590 33023355 33450002 34040881 34808860
14719 34808860 35751490 36853867 38056175 39224683 40219032 41027199 41782428 42620677 43570786
14710 43570786 44608684 45751251 47042700 48491177 50051597 51648215 53210004 54705113
14702 54705113 56165022 57679175 59358217 61309063 63623658 66342217 69432124 72838771
14694 72838771 76549684 80600096 85043591 89926598 95243264 100886699 106661687 112350994
$$ packed form
14756B1437864L30974M36040L88910K19501M7959k6336n712P9493K28656M34987
14746B3572336O76447R10414J064571J086264R76044P64274M93777K11677m3831
14737B9711973k40847l53873l68068k82836j14152J01526L17368M98008O26120
14728B9895219O96707O97716O10348M61293L38307L23765M26647N90879P67979
14719C4808860R42630J102377J202308J168508R94349Q08167P55229Q38249R50109
14710D3570786J037898J142567J291449J448477J560420J596618J561789J495109
14702E4705113J459909J514153J679042J950846K314595K718559L089907L406647
14694G2838771L710913M050412M443495M883007N316666N643435N774988N689307
$$ plain form
14686 112350994 117800443 122951719 127784613 132280554 136455731 140362731 144009776 147280148
14678 147280148 149944560 151722787 152351472 151674714 149712285 146646257 142733590 138209992
14670 138209992 133257478 128038794 122733417 117536912 112629821 108128244 104050846 100331685
14662 100331685 96853412 93479130 90077039 86555193 82924672 79323598 75924669 72813543
14654 72813543 69961271 67273497 64649513 62039613 59480369 57066442 54879098 52948541
14646 52948541 51266937 49799860 48504794 47349335 46301720 45337085 44463880 43735270
14638 43735270 43239070 43050343 43171744 43541692 44087333 44746111 45463166 46192771 46900341
14629 46900341 47558504 48138250 48612713 48969857 49214304 49349221 49374208 49314287 49236750 49229342
$$ packed form
14686A12350994N449449N151276M832894M495941M175177L907000L647045L270372
14678A47280148K664412J778227O28685o76758j962429l066028l912667m523598
14670A38209992m952514n218684n305377n196505m907091m501577m077398l719161
14662A00331685l478273l374282l402091l521846l630521l601074l398929l111126
14654G2813543k852272k687774k623984k609900k559244k413927k187344j930557
14646E2948541j681604j467077j295066j155459j047615r64635q73205p28610
14638D3735270m96200j88727J21401L69948N45641O58778P17055P29605P07570
14629D6900341O58163N79746M74463L57144K44447J34917K4987n9921p7537p408
$$ plain form
14619 49229342 49351714 49599474 49924772 50311841 50808272 51466223 52289525 53253846 54334801
14610 54334801 55480914 56608585 57679294 58731498 59804097 60879919 61919296 62906979
14602 62906979 63857197 64798125 65750524 66695920 67572475 68334124 69007435 69697283 70563166
14593 70563166 71775317 73458969 75678090 78502469 82053463 86449040 91748447 97988884
14585 97988884 105255496 113671898 123333174 134279771 146525793 160059013 174786491
14578 174786491 190471400 206693191 222843254 238170710 251881377 263223221 271495154
14571 271495154 276045007 276368366 272264642 263966719 252217823 238206894 223296895 208653139
14563 208653139 195005353 182652610 171614738 161798527 153069011 145228246 138036237
$$ packed form
14619D9229342J22372K47760L25298L87069M96431O57951Q23302R64321J080955
14610E4334801J146113J127671J070709J052204J072599J075822J039377R87683
14602F2906979R50218R40928R52399R45396Q76555P61649O73311O89848Q65883
14593G0563166J212151J683652K219121K824379L550994M395577N299407O240437
14585I7988884P266612Q416402R661276J0946597J2246022J3533220J4727478
14578A74786491J5684909J6221791J6150063J5327456J3710667J1341844Q271933
14571B71495154M549853L23359m103724q297923j1748896j4010929j4909999j4643756
14563B08653139j3647786j2352743j1037872r816211q729516p840765p192009
$$ plain form
14556 138036237 131320106 125044456 119231065 113839926 108780572 104001112 99516561 95363388
14548 95363388 91556485 88082996 84897064 81921077 79093707 76419506 73957833 71774673
14540 71774673 69905517 68334098 67005864 65868497 64901018 64110055 63459496 62808138 61985247
14531 61985247 60921243 59663788 58299789 56893353 55472644 54053101 52649826 51265767
14523 51265767 49909990 48626029 47454859 46385563 45392281 44499026 43780445 43295418 43012820
14514 43012820 42830285 42675553 42550323 42489904 42532796 42699466 42982306 43383458 43921312 44576579
14504 44576579 45288516 46022019 46778189 47509636 48077116 48329561 48216369 47818526 47284171
14495 47284171 46719710 46124327 45429406 44585242 43624165 42647348 41727066 40832959 39879326
$$ packed form
14556A38036237o716131o275650n813391n391139n059354m779460m484551m153173
14548I5363388l806903l473489l185932k975987k827370k674201k461673k183160
14540G1774673j869156j571419j328234j137367r67479p90963o50559o51358q22891
14531F1985247j064004j257455j363999j406436j420709j419543j403275j384059
14523E1265767j355777j283961j171170j069296r93282q93255p18581m85027k82598
14514D3012820j82535j54732j25230o0419M2892J66670K82840M01152N37854O55267
14504D4576579P11937P33503P56170P31447N67480K52445j13192l97843n34355
14495D7284171n64461n95383o94921q44164r61077r76817r20282q94107r53633
$$ plain form
14486 39879326 38841044 37805116 36926922 36364330 36201406 36372118 36664640 36828497 36706180
14477 36706180 36287052 35659440 34934446 34215192 33600232 33158406 32886734 32734342 32671387
14468 32671387 32714200 32886572 33174321 33524985 33891314 34262378 34638732 34987258 35244584
14459 35244584 35366761 35377580 35348249 35304962 35202222 35008183 34745521 34443282 34122951 33818336
14449 33818336 33557957 33356678 33240135 33228373 33316908 33513256 33857036 34363734 34979529 35631795
14439 35631795 36282252 36899879 37408889 37681712 37618999 37253253 36752459 36317265 36050501
14430 36050501 35888401 35679400 35335576 34869168 34330215 33746080 33098101 32375757 31654272
14421 31654272 31070265 30698293 30486310 30341694 30234304 30187402 30202809 30227066 30211292 30165679
$$ packed form
14486C9879326j038282j035928q78194n62592j62924J70712K92522J63857j22317
14477C6706180m19128o27612p24994p19254o14960m41826k71672j52392o2955
14468C2671387M2813J72372K87749L50664L66329L71064L76354L48526K57326
14459C5244584J22177J0819k9331m3287j02740j94039k62662l02239l20331l04615
14449C3818336k60379k01279j16543j1762Q8535J96348L43780N06698O15795O52266
14439C5631795O50457O17627N09010K72823o2713l65746n00794m35194k66764
14430C6050501j62100k09001l43824m66408n38953n84135o47979p22344p21485
14421C1654272n84007l71972k11983j44616j07390m6902J5407K4257j5774m5613
$$ plain form
14411 30165679 30133519 30173138 30381409 30839711 31496070 32172423 32707331 33065808 33363001 33796369
14401 33796369 34519829 35592548 37020962 38790631 40849596 43095785 45387559 47549159
14393 47549159 49387105 50750099 51594282 52005972 52164559 52245709 52335871 52409122 52332468 51906259
14383 51906259 50972492 49519106 47689995 45722143 43862145 42298415 41134462 40376311
14375 40376311 39918427 39568420 39114214 38411656 37452105 36348811 35242303 34205712 33228154
14366 33228154 32269128 31314099 30368571 29424047 28482800 27595938 26829264 26229306 25806459
14357 25806459 25505642 25230237 24911597 24540101 24135516 23718905 23317485 22981269 22797303
14348 22797303 22856603 23180114 23696091 24271600 24755459 25049020 25156010 25163369 25191593 25322012
$$ packed form
14411C0165679l2160L9619K08271M58302O56359O76353N34908L58477K97193M33368
14401C3796369P23460J072719J428414J769669K058965K246189K291774K161600
14393D7549159J837946J362994Q44183M11690J58587Q1150R0162P3251p6654m26209
14383E1906259r33767j453386j829111j967852j859998j563730j163953p58151
14375D0376311m57884l50007m54206p02558r59551j103294j106508j036591r77558
14366C3228154r59026r55029r45528r44524r41247q86862p66674n99958m22847
14357B5806459l00817k75405l18640l71496m04585m16611m01420l36216j83966
14348B2797303N9300L23511N15977N75509M83859K93561J06990P359K8224J30419
$$ plain form
14338 25322012 25539101 25762504 25916345 25947918 25827138 25573456 25276747 25035343 24853908
14329 24853908 24655587 24377520 24008584 23546019 22950376 22196355 21359357 20599111 20068987
14320 20068987 19851020 19922375 20155614 20395449 20573487 20734664 20943327 21212327 21533677
14311 21533677 21891871 22213296 22399107 22435144 22398671 22361244 22321913 22228618 22046023 21769188
14301 21769188 21390139 20904434 20350876 19834654 19489951 19376827 19427697 19513194 19541835 19521960
14291 19521960 19552532 19730753 20082192 20573500 21151764 21780158 22425972 23002368 23388279
14282 23388279 23547411 23567873 23564856 23594448 23673144 23816172 23995298 24101136 24026636 23770407
14272 23770407 23410658 23007786 22575514 22128165 21716695 21400613 21210691 21157927 21213394 21284334
$$ packed form
14338B5322012K17089K23403J53841L1573j20780k53682k96709k41404j81435
14329B4853908j98321k78067l68936m62565n95643p54021q36998p60246n30124
14320B0068987k17967P1355K33239K39835J78038J61177K08663K69000L21350
14311B1533677L58194L21425J85811L6037l6473l7427l9331r3295j82595k76835
14301B1769188l79049m85705n53558n16222l44703j13124N0870Q5497K8641j9875
14291A9521960L0572J78221L51439M91308N78264O28394O45814N76396L85911
14282B3388279J59132K0462l017K9592P8696J43028J79126J05838p4500k56229
14272B3770407l59749m02872m32272m47349m11470l16082j89922n2764N5467P0940
$$ plain form
14262 21284334 21301073 21297849 21364650 21555555 21848539 22158965 22396952 22545454 22656555 22759538
14252 22759538 22824634 22807171 22681253 22437059 22086545 21682870 21315592 21077094 21014832 21107565
14242 21107565 21283603 21455386 21570077 21655259 21796568 22056160 22409425 22765573 23045424
14233 23045424 23219467 23269436 23152217 22835900 22336462 21700820 20993737 20323479 19827865
14224 19827865 19576796 19518751 19554774 19624643 19690420 19699504 19634865 19541116 19450406 19323019 19072350
14213 19072350 18636857 18039200 17394182 16867822 16604311 16638102 16881661 17237265 17677598
14204 17677598 18206245 18821884 19517991 20269553 21000954 21558782 21750621 21464576 20776840
14195 20776840 19914410 19100782 18446136 17945812 17538170 17144169 16697740 16214236 15814565
$$ packed form
14262B1284334J6739l224O6801J90905K92984L10426K37987J48502J11101J02983
14252B2759538O5096j7463j25918k44194l50514m03675l67278k38498o2262R2733
14242B1107565J76038J71783J14691Q5182J41309K59592L53265L56148K79851
14233B3045424J74043M9969j17219l16317m99438o35642p07083o70258m95614
14224A9827865k51069n8045L6023O9869O5777R084o4639r3749r0710j27387k50669
14213A9072350m35493n97657o45018n26360k63511L3791K43559L55604M40333
14204A7677598N28647O15639O96107P51562P31401N57828J91839k86045o87736
14195B0776840q62430q13628o54646n00324m07642l94001m46429m83504l99671
$$ plain form
14186 15814565 15655396 15830828 16318393 16998489 17714627 18322050 18709380 18828718 18718056
14177 18718056 18466331 18142000 17753330 17283605 16766293 16304193 15981573 15771069 15558586
14168 15558586 15219333 14660117 13860307 12911708 11983293 11241632 10795968 10653397 10689284
14159 10689284 10694036 10514069 10158159 9754814 9439692 9271916 9206961 9151054 9053907 8945533
14149 8945533 8894855 8926687 8982214 8994491 8975213 8994146 9126334 9412661 9797245 10133009
14139 10133009 10297014 10287500 10198693 10125855 10091441 10043425 9941482 9822891 9776768 9881406
14129 9881406 10137702 10435959 10607239 10513919 10124297 9558344 9033804 8719166 8642225 8736584
14119 8736584 8929788 9150554 9302348 9293950 9112462 8875176 8776073 8952453 9397198 9977033
$$ packed form
14186A5814565j59169J75432M87565O80096P16138O07423L87330J19338j10662
14177A8718056k51725l24331l88670m69725n17312m62100l22620k10504k12483
14168A5558586l39253n59216p99810r48599r28415p41661m45664j42571L5887
14159A0689284M752j79967l55910m03345l15122j67776o4955n5907r7147j08374
14149H945533n0678L1832N5527J2277j9278J8933J32188K86327L84584L35764
14139A0133009J64005r514q8807p2838l4414m8016j01943j18591m6123J04638
14129I881406K56296K98257J71280r3320l89622n65953n24540l14638p6941R4359
14119H736584J93204K20766J51794q398j81488k37286r9103J76380M44745N79835
$$ plain form
14109 9977033 10507422 10830805 10885046 10721843 10463466 10231777 10069717 9914836 9694098 9423755
14099 9423755 9167388 8952722 8753875 8521786 8238371 7917279 7547181 7101515 6594215
14090 6594215 6091994 5696973 5492548 5476773 5575059 5721762 5897188 6105294 6354478 6647020
14080 6647020 6958609 7233584 7438060 7593903 7732855 7858504 7968337 8085484 8255678
14071 8255678 8495945 8750079 8916389 8907252 8668040 8164758 7397975 6435964 5414209 4484283
14061 4484283 3750975 3245990 2954730 2856679 2937486 3168733 3477711 3760267 3933154 3993568
14051 3993568 4027312 4144009 4415090 4865856 5489410 6242904 7050718 7825156 8478437 8927200
14041 8927200 9127023 9123629 9021348 8860575 8572022 8083898 7436950 6785697 6310176 6113896
$$ packed form
14109I977033N30389L23383N4241j63203k58377k31689j62060j54881k20738k70343
14099I423755k56367k14666j98847k32089k83415l21092l70098m45666n07300
14090F594215n02221l95021k04425j5775R8286J46703J75426K08106K49184K92542
14080F647020L11589K74975K04476J55843J38952J25649J09833J17147J70194
14071H255678K40267K54134J66310r137k39212n03282p66783r62011j021755r29926
14061D484283p33308n04985k91260r8051Q0807K31247L08978K82556J72887O0414
14051C993568L3744J16697K71081M50766O23554P53494Q07814P74438O53281M48763
14041H927200J99823l394j02281j60773k88553m88124o46948o51253m75521j96280
$$ plain form
14031 6113896 6182242 6426940 6757399 7099516 7362970 7464205 7424328 7389009 7523434 7895883
14021 7895883 8434704 8947291 9200070 9064315 8607989 8040950 7569170 7286131 7173790
14012 7173790 7126048 6992941 6687733 6243540 5758995 5313604 4930419 4589033 4256259 3902620
14002 3902620 3509986 3082215 2638771 2209859 1838611 1549355 1334962 1188395 1110908 1103549
13992 1103549 1175476 1329697 1518726 1633465 1561493 1274616 831771 285667 -339932 -958326
13982 -958326 -1400178 -1530260 -1349780 -993641 -630123 -333518 -60187 271367 698084 1201897
13972 1201897 1738188 2256395 2704118 3022284 3163986 3104192 2839924 2409024 1865167 1242718
13962 1242718 592341 9354 -394806 -545814 -445251 -153964 253125 698928 1110356
$$ packed form
14031F113896O8346K44698L30459L42117K63454J01235l9877l5319J34425L72449
14021G895883N38821N12587K52779j35755m56326n67039m71780k83039j12341
14012G173790m7742j33107l05208m44193m84545m45391l83185l41386l32774l53639
14002C902620l92634m27771m43444m28912l71248k89256k14393j46567p7487p359
13992A103549P1927J54221J89029J14739p1972k86877m42845n46104o25599o18394
13982i58326m41852j30082J80480L56139L63518K96605K73331L31554M26717N03813
13972A201897N36291N18207M47723L18166J41702n9794k64268m30900n43857o22449
13962A242718o50377n82987m04160j51008J00563K91287M07089M45803M11428
$$ plain form
13953 1110356 1454929 1745033 1995514 2196105 2335913 2451020 2611658 2852698 3157387
13944 3157387 3497307 3840279 4132966 4322437 4399181 4410104 4453366 4641614 5027402 5545398
13934 5545398 6034134 6328909 6348256 6126745 5794448 5506598 5339879 5237710 5074813 4773288
13924 4773288 4343522 3854673 3386938 3011613 2807637 2817491 2973707 3125633 3139944 2966594
13914 2966594 2662939 2361038 2168887 2116056 2190633 2366957 2593995 2805867 2945148 2980444
13904 2980444 2897999 2668436 2267592 1743071 1217490 804604 544291 407421 321224 220318
13894 220318 84412 -86517 -284919 -460019 -505325 -335381 4589 352379 553619 517174
13884 517174 207507 -339144 -980751 -1507025 -1774219 -1771330 -1561906 -1206007 -709655 -38194
$$ packed form
13953A110356L44573K90104K50481K00591J39808J15107J60638K41040L04689
13944C157387L39920L42972K92687J89471P6744J0923M3262J88248L85788N17996
13934E545398M88736K94775J9347k21511l32297k87850j66719j02169j62897l01525
13924D773288m29766m88849m67735l75325k03976R854J56216J51926J4311j73350
13914B966594l03655l01901j92151n2831P4577J76324K27038K11872J39281L5296
13904B980444q2445k29563m00844n24521n25581m12886k60313j36870q6197j00906
13894B20318j35906j70929j98402j75100m5306J69944L39970L47790K01240l6445
13884E17174l09667n46651o41607n26274k67194K889K09424L55899M96352O71461
$$ plain form
13874 -38194 806673 1732575 2566650 3128829 3343441 3259993 2959552 2505211 1969835 1439367
13864 1439367 994807 704993 597754 618425 665451 676188 645324 604576 574738 525838 427999
13853 427999 305697 204418 149531 167061 320019 696745 1354609 2247209 3173340 3832534
13843 3832534 3999667 3663094 2984547 2151374 1268999 356682 -566302 -1425010 -2150453
13834 -2150453 -2766185 -3354674 -3925770 -4352641 -4463641 -4207761 -3704462 -3145101 -2692198
13825 -2692198 -2394065 -2160838 -1875122 -1484838 -1019667 -567163 -213780 -26407 -67019 -371801
13815 -371801 -919419 -1621474 -2348921 -3032175 -3707032 -4415038 -5125170 -5770547 -6292938 -6655723
13805 -6655723 -6855063 -6892909 -6752501 -6459779 -6113470 -5806322 -5576757 -5417364 -5272472 -5051970
$$ packed form
13874c8194Q44867R25902Q34075N62179K14612q3448l00441m54341n35376n30468
13864A439367m44560k89814j07239K0671M7026J0737l0864m0748k9838m8900r7839
13853D27999j22302j01279n4887J7530J52958L76726O57864Q92600R26131O59194
13843C832534J67133l36573o78547q33173q82375r12317r22984q58708p25443
13834b150453o15732n88489n71096m26871j11000K55880N03299N59361M52903
13825b692198K98133K33227K85716L90284M65171M52504L53383J87373m0612l04782
13815c71801n47618p02055p27447o83254o74857p08006p10132o45377n22391l62785
13805f655723j99340l7846J40408K92722L46309L07148K29565J59393J44892K20502
$$ plain form
13795 -5051970 -4669687 -4088319 -3362448 -2628245 -2038631 -1713329 -1701484 -1927987 -2167236 -2137582
13785 -2137582 -1702475 -954926 -64691 859445 1721014 2378025 2698808 2638890 2256376 1689957
13775 1689957 1103731 607508 242005 25857 -52348 -73592 -139675 -300550 -531271 -737921
13765 -737921 -843122 -883617 -947896 -1030555 -1037108 -883466 -544426 -77749 403744 822571
13755 822571 1171280 1477310 1777349 2064347 2202601 2022106 1558375 1098435 953404 1234839
13745 1234839 1847919 2620867 3397300 4029417 4374682 4360835 4013751 3377687 2468363 1340982
13735 1340982 152708 -864030 -1492449 -1631299 -1369097 -917450 -418661 123098 744128
13726 744128 1442143 2179734 2898971 3505996 3876386 3937090 3738308 3395111 2958477 2400184
$$ packed form
13795e051970L82283N81368P25871P34203N89614L25302J1845k26503k39249K9654
13785b137582M35107P47549Q90235R24136Q61569O57011L20783n9918l82514n66419
13775A689957n86226m96223l65503k16148p8205k1244o6083j60875k30721k06650
13765g37921j05201m0495o4279q2659o553J53642L39040M66677M81493M18827
13755H22571L48709L06030L00039K86998J38254j80495m63731m59940j45031K81435
13745A234839O13080P72948P76433O32117L45265j3847l47084o36064r09324j127381
13735A340982j188274j016738o28419j38850K62202M51647M98789N41759O21030
13726G44128O98015P37591P19237O07025L70390O0704j98782l43197m36634n58293
$$ plain form
13716 2400184 1754178 1192392 910965 1000150 1427959 2071783 2745463 3261900 3505774 3471455
13706 3471455 3260736 3018002 2840736 2759749 2770995 2846531 2943018 3033369 3128285 3254089
13696 3254089 3426398 3650616 3921055 4183810 4317115 4209217 3882788 3495917 3206636
13687 3206636 3124043 3366300 3997495 4853160 5566802 5855399 5740317 5460125 5214613 5049086
13677 5049086 4911720 4714064 4347920 3741700 2938102 2103296 1447134 1101373 1084476 1363208
13667 1363208 1895813 2644409 3596297 4733793 5918683 6871777 7343697 7300721 6940749
13658 6940749 6542411 6281301 6138984 5975683 5660551 5141001 4484768 3860531 3437191
13649 3437191 3284251 3379878 3704314 4249786 4926231 5544929 5951399 6137068 6207929 6259829
$$ packed form
13716B400184o46006n61786k81427Q9185M27809O43824O73680N16437K43874l4319
13706C471455k10719k42734j77266q0987J1246P5536R6487R0351R4916J25804
13696C254089J72309K24218K70439K62755J33305j07898l26429l86871k89281
13687C206636q2593K42257O31195Q55665P13642K88597j15082k80192k45512j65527
13677E049086j37366j97656l66144o06220q03598q34806o56162l45761j6897K78732
13667A363208N32605P48596R51888J137496J184890R53094M71920m2976l59972
13658F940749l98338k61110j42317j63301l15132n19550o56233o24237m23340
13649C437191j52940R5627L24436N45472O76445O18698M06470J85669P0861N1900
$$ plain form
13639 6259829 6296421 6242542 6011302 5613660 5188829 4875511 4691499 4568452 4465940 4423029
13629 4423029 4502516 4699377 4949774 5218048 5508381 5801761 6047603 6234547 6428979 6717313
13619 6717313 7145986 7712175 8350383 8922067 9257613 9262414 8990674 8592392 8189274 7823989
13609 7823989 7502562 7231551 7022640 6890780 6843983 6879444 6998331 7195650 7429874 7651301
13599 7651301 7862410 8094749 8346757 8565365 8633361 8428817 7967680 7435448 7031838 6829135
13589 6829135 6767000 6686891 6405248 5871154 5231412 4648824 4156573 3757629 3519052 3509095
13579 3509095 3705546 3991049 4216036 4256112 4034173 3522757 2756269 1857215 1001094 284659
13569 284659 -350428 -1026655 -1799324 -2628551 -3408225 -4026440 -4458384 -4764260 -5002346 -5172811
$$ packed form
13639F259829L6592n3879k31240l97642m24831l13318j84012j23047j02512m2911
13629D423029P9487J96861K50397K68274K90333K93380K45842J86944J94432K88334
13619F717313M28673N66189O38208N71684L35546M801k71740l98282m03118l65285
13609G823989l21427k71011k08911j31860m6797L5461J18887J97319K34224K21427
13599G651301K11109K32339K52008K18608O7996k04544m61137n32232m03610k02703
13589F829135o2135q0109k81643n34094o39742n82588m92251l98944k38577r957
13579C509095J96451K85503K24987M0076k21939n11416p66488q99054q56121p16435
13569B84659o35087o76227p72669q29227p79674o18215m31944l05876k38086j70465
$$ plain form
13559 -5172811 -5208891 -5026841 -4637963 -4179214 -3772481 -3400263 -2967323 -2464471 -1990102 -1595619
13549 -1595619 -1223268 -819808 -393274 54726 569717 1187595 1848303 2380924 2620368
13540 2620368 2566115 2421529 2394467 2443138 2338389 1946407 1358335 799327 466852 377626
13530 377626 348221 169038 -241891 -819930 -1360189 -1590637 -1378967 -847868 -269917 117395
13520 117395 221685 63514 -270004 -633727 -912189 -1130185 -1441280 -1976929 -2716309 -3529441
13510 -3529441 -4323619 -5098022 -5846496 -6471762 -6834548 -6859262 -6583755 -6117040 -5574403 -5063221
13500 -5063221 -4655118 -4324525 -3943067 -3332528 -2361257 -1089494 187225 1137867 1637420
13491 1637420 1771961 1674435 1449484 1204754 990299 738312 386087 -6935 -322019 -486958
$$ packed form
13559e172811l6080J82050L88878M58749M06733L72218M32940N02852M74369L94483
13549a595619L72351M03460M26534M48000N14991O17878O60708N32621K39444
13540B620368n4253j44586k7062M8671j04749l91982n88072n59008l32475q9226
13530C77626k9405j79183m10929n78039n40259k30448K11670N31099N77951L87312
13520A17395J04290j58171l33518l63723k78462k17996l11095n35649p39380q13132
13510c529441p94178p74403p48474o25266l62786k4714K75507M66715N42637N11182
13500e063221M08103L30593L81458O10539R71271J271763J276719R50642M99553
13491A637420J34541r7526k24951k44730k14455k51987l52225l93022l15084j64939
$$ plain form
13481 -486958 -511738 -450655 -313189 -27997 492322 1266634 2201330 3108233 3764554 3977139
13471 3977139 3654802 2871481 1846768 845897 69680 -423338 -696511 -859370 -1025237
13462 -1025237 -1287985 -1696110 -2203129 -2661187 -2930373 -2959076 -2739134 -2295690 -1732856 -1189520
13452 -1189520 -773788 -562165 -602339 -897542 -1345929 -1735592 -1879049 -1703623 -1227508 -534978
13442 -534978 227683 876619 1279598 1436523 1430101 1350240 1285496 1307316 1435329 1623261
13432 1623261 1785970 1843221 1774286 1643720 1538482 1520983 1640945 1889792 2153436 2315336
13422 2315336 2370312 2389301 2462183 2658709 2968052 3325987 3687343 4041847 4383532 4647462
13412 4647462 4673498 4294159 3461702 2252933 801570 -723903 -2132530 -3259694 -4008207
$$ packed form
13481d86958k4780O1083J37466K85192N20319P74312R34696R06903O56321K12585
13471C977139l22337p83321j024713j000871p76217m93018k73173j62859j65867
13462a025237k62748m08125n07019m58058k69186k8703K19942M43444N62834N43336
13452a189520M15732K11623m0174k95203m48387l89663j43457J75426M76115O92530
13442e34978P62661O48936M02979J56925o422p9861o4744K1820J28013J87932
13432A623261J62709N7251o8935j30566j05238j7499J19962K48847K63644J61900
13422B315336N4976J8989P2882J96526L09343L57935L61356L54504L41685K63930
13412D647462K6036l79339q32457j208769j451363j525473j408627j127164p48513
$$ plain form
13403 -4008207 -4382940 -4481284 -4412517 -4244108 -3984341 -3573248 -2947596 -2149844 -1331442 -646127
13393 -646127 -159110 151363 303599 274738 81736 -202432 -513915 -787116 -928851 -876660
13383 -876660 -652667 -352032 -93289 35751 -16042 -265351 -666288 -1127773 -1581753 -1977278
13373 -1977278 -2209633 -2122811 -1601842 -671735 518296 1808069 3041582 4020656 4587612
13364 4587612 4711096 4456675 3982469 3535943 3335718 3432617 3698755 3950170 4087656 4141011
13354 4141011 4194144 4242643 4120859 3639653 2826221 1963072 1357675 1108866 1073133 1013735
13344 1013735 795449 433214 22700 -308275 -455179 -410920 -282538 -189526 -131795 17212
13334 17212 381686 964852 1677448 2435376 3122867 3529673 3483614 2975966 2094906 950204
$$ packed form
13403d008207l74733r8344O8767J68409K59767M11093O25652P97752Q18402O85315
13393f46127M87017L10473J52236k8861j93002k84168l11483k73201j41735N2191
13383h76660K23993L00635K58743J29040n1793k49309m00937m61485m53980l95525
13373a977278k32355Q6822N20969R30107J190031J289773J233513R79074N66956
13364D587612J23484k54421m74206m46526k00225R6899K66138K51415J37486N3355
13354D141011N3133M8499j21784m81206q13432q63149o05397k48809l5733n9398
13344A013735k18286l62235m10514l30975j46904M4259J28382R3012N7731J49007
13334A7212L64474N83166P12596P57928O87491M06806m6059n07648q81060j144702
$$ plain form
13324 950204 -283929 -1364780 -2090869 -2367986 -2189989 -1656481 -1001988 -472748 -136339
13315 -136339 86898 262454 425260 619080 846345 1019056 1033992 888837 659818 417510
13305 417510 238812 251653 559588 1091610 1627088 1987357 2128551 2092065 1945589 1776452
13295 1776452 1684506 1735071 1933634 2229572 2514964 2693784 2765706 2794266 2808934 2758503
13285 2758503 2552939 2126522 1477464 687174 -139019 -991267 -1949878 -3026720 -4084042
13276 -4084042 -4946240 -5521348 -5800104 -5830510 -5677835 -5333833 -4720631 -3834288 -2802888
13267 -2802888 -1771706 -797329 134834 1037226 1885064 2653247 3370086 4085887 4771583
13258 4771583 5270358 5372597 4938989 3946266 2466971 677276 -1121035 -2585798 -3526362
$$ packed form
13324I50204j234133j080851p26089k77117J77997N33508O54493N29240L36409
13315a36339K23237J75556J62806J93820K27265J72711J4936j45155k29019k42308
13305D17510j78698J2841L07935N32022N35478L60269J41194l6486j46476j69137
13295A776452r1946N0565J98563K95938K85392J78820P1922K8560J4668n0431
13285B758503k05564m26417o49058p90290q26193q52248r58611j076842j057322
13276d084042q62198n75108k78756l0406J52675L44002O13202Q86343J031400
13267b802888J031182R74377R32163R02392Q47838P68183P16839P15801O85696
13258D771583M98775J02239m33608r92723j479295j789695j798311j464763r40564
$$ plain form
13249 -3526362 -4000944 -4208950 -4280941 -4161149 -3690294 -2753395 -1338091 460410 2443239
13240 2443239 4369296 6063788 7457878 8523682 9192788 9375451 9072164 8402515 7503489
13231 7503489 6468850 5423453 4564246 4015677 3683952 3346868 2860259 2232195 1590829
13222 1590829 1134593 1030599 1364353 2156361 3339205 4742386 6120455 7237762 7965331
13213 7965331 8290762 8293671 8137368 7986244 7873502 7697511 7390406 6998944 6571143 6110572
13203 6110572 5648914 5247628 4943233 4767620 4769592 4907870 4986114 4821785 4448693 4097917
13193 4097917 3994808 4154666 4379129 4450162 4270155 3871925 3387377 2965204 2675802 2493970
13183 2493970 2340095 2132860 1866395 1650687 1632689 1904409 2487740 3346581 4384261
$$ packed form
13249c526362m74582k08006p1991J19792M70855R36899J415304J798501J982829
13240B443239J926057J694492J394090J065804O69106J82663l03287o69649q99026
13231G503489j034639j045397q59207n48569l31725l37084m86609o28064o41366
13222A590829m56236j03994L33754P92008J182844J403181J378069J117307P27569
13213G965331L25431K909j56303j51124j12742j75991l07105l91462m27801m60571
13203F110572m61658m01286l04395j75613J972J38278P8244j64329l73092l50776
13193D097917j03109J59858K24463P1033j80007l98230m84548m22173k89402j81832
13183B493970j53875k07235k66465k15708j7998K71720N83331Q58841J037680
$$ plain form
13174 4384261 5446579 6371167 7066472 7519592 7707018 7552922 6973861 5919852 4424789
13165 4424789 2696053 1101231 -24379 -563371 -602342 -288236 249499 878799 1412041
13156 1412041 1672388 1653963 1502029 1341363 1178678 939200 542130 -23785 -632513 -1095569
13146 -1095569 -1316938 -1280444 -935736 -227272 750368 1705836 2318177 2450337 2236749 1991526
13136 1991526 1958110 2133551 2357179 2481352 2435696 2234539 1993227 1878647 1990827 2312404
13126 2312404 2757580 3264917 3821878 4372499 4742848 4687624 4020158 2732243 1043649
13117 1043649 -664367 -2029861 -2858477 -3127880 -2918442 -2377917 -1707474 -1092064 -617982
13108 -617982 -254078 125264 656432 1385487 2295479 3370084 4526873 5578190 6348984
$$ packed form
13174D384261J062318R24588O95305M53120J87426j54096n79061j054009j495063
13165D424789j728736j594822j125610n38992l8971L14106N37735O29300N33242
13156A412041K60347j8425j51934j60666j62685k39478l97070n65915o08728m63056
13146a095569k21369L6494L44708P08464R77640R55468O12341J32160k13588k45223
13136A991526l3416J75441K23628J24173m5656k01157k41312j14580J12180L21577
13126B312404M45176N07337N56961N50621L70349n5224o67466j287915j688594
13117A043649j708016j365494q28616k69403K09438N40525O70443O15410M74082
13108f17982L63904L79342N31168P29055R09992J074605J156789J051317P70794
$$ plain form
13099 6348984 6768856 6850126 6670044 6342173 5948321 5537701 5180195 4923297 4695341 4317871
13089 4317871 3639346 2650437 1476100 285156 -785036 -1670674 -2378217 -2901340 -3152810
13080 -3152810 -3012046 -2444463 -1555784 -507058 585326 1662112 2682099 3563515 4208043
13071 4208043 4602269 4816406 4930935 5008449 5065166 5041706 4845524 4474583 4063673 3775096
13061 3775096 3695209 3857912 4280968 4883404 5437452 5710762 5645184 5335228 4862922 4243066
13051 4243066 3524147 2845465 2359267 2139363 2162308 2357188 2651128 2951756 3149110 3194871
13041 3194871 3151371 3144810 3252093 3416671 3508350 3465390 3358258 3330098 3462918 3710680
13031 3710680 3977980 4209443 4332241 4166557 3554276 2556487 1424409 429599 -230453
$$ packed form
13099F348984M19872Q1270j80082l27871l93852m10620l57506k56898k27956l77470
13089D317871o78525r88909j174337j190944j070192q85638p07543n23123k51470
13080c152810J40764N67583Q88679J048726J092384J076786J019987Q81416O44528
13071D208043L94226K14137J14529P7514N6717k3460j96182l70941m10910k88577
13061C775096p9887J62703M23056O02436N54048K73310o5578l09956m72306o19856
13051D243066p18919o78682m86198k19904K2945J94880K93940L00628J97354M5761
13041C194871m3500o561J07283J64578R1679m2960j07132k8160J32820K47762
13031C710680K67300K31463J22798j65684o12281r97789j132078r94810o60052
$$ plain form
13022 -230453 -463127 -284492 246577 1051196 1993950 2886961 3530878 3804660 3765425 3628509
13012 3628509 3626167 3866439 4272824 4635089 4742304 4506477 4025431 3548984 3320482 3398496
13002 3398496 3636269 3810839 3777310 3565029 3337147 3245648 3334727 3592052 4026195 4615640
$$ packed form
13022b30453k32674J78635N31069Q04619R42754Q93011O43917K73782l9235j36916
13012C628509k342K40272M06385L62265J07215k35827m81046m76447k28502P8014
13002C398496K37773J74570l3529k12281k27882r1499Q9079K57325M34143N89445
$$ [...]
##END NTUPLES=NMR SPECTRUM
##END=
