##TITLE=31P ikalashn
DE-77k
19.11.2024
##JCAMPDX= 6.0         $$ Bruker NMR JCAMP-DX V2.0
##DATA TYPE= NMR SPECTRUM
##DATA CLASS= NTUPLES
##ORIGIN= UXNMR, Bruker Analytische Messtechnik GmbH
##OWNER= root
$$ TOPSPIN		Version 1.3
$$ 2024-11-19 15:07:32.640 +0400  Irina@DPX200
$$ Compression mode = diff/dup
##.OBSERVE FREQUENCY= 81.01967998063
##.OBSERVE NUCLEUS= ^31P
##.ACQUISITION MODE= SIMULTANEOUS
##.ACQUISITION SCHEME= undefined
##.AVERAGES= 32
##.DIGITISER RES= 17
##SPECTROMETER/DATA SYSTEM= spect
##.PULSE SEQUENCE= zgpg
##.SOLVENT NAME= DMSO
##.SHIFT REFERENCE= INTERNAL, DMSO, 1, 298.5841
##AUDIT TRAIL= $$ (NUMBER, WHEN, WHO, WHERE, WHAT)
$$ ##TITLE= Audit trail, TOPSPIN		Version 1.3
$$ ##JCAMPDX= 5.01
$$ ##ORIGIN= Bruker BioSpin GmbH
$$ ##OWNER= Irina
$$ $$ F:/spectra/data/iren/nmr/P31dec/1/pdata/1/auditp.txt
$$ ##AUDIT TRAIL=  $$ (NUMBER, WHEN, WHO, WHERE, VERSION, WHAT)
(   1,<2024-11-19 15:07:13.421 +0400>,<Irina>,<DPX200>,<TOPSPIN 1.3>,
      <created by zg
	started at 2024-11-19 15:06:17.734 +0400,
	POWCHK disabled, PULCHK disabled
       terminated by command 'halt'
       configuration hash MD5:
       BE 6D 3F 07 2A EA 11 49 91 17 2B D3 AF B3 58 0D
       data hash MD5: 32K
       BB 37 0B A6 73 B6 7B E9 D6 60 AB 60 BA 27 18 87>)
(   2,<2024-11-19 15:07:16.171 +0400>,<Irina>,<DPX200>,<TOPSPIN 1.3>,
      <Start of raw data processing
       efp BC_mod = 2 LB = 12 FT_mod = 6 PKNL = 1 PHC0 = 235.9613 PHC1 = 28.00705 SI = 32K 
       data hash MD5: 32K
       CD 53 0E 6B CD AE E2 2C 54 04 9F 20 5C 9E 56 40>)
(   3,<2024-11-19 15:07:18.796 +0400>,<Irina>,<DPX200>,<TOPSPIN 1.3>,
      <apk 
       data hash MD5: 32K
       57 6A 29 BB DE B6 E9 73 34 04 3B 7B 27 01 33 88>)
(   4,<2024-11-19 15:07:21.250 +0400>,<Irina>,<DPX200>,<TOPSPIN 1.3>,
      <abs n ABSG = 5 
       data hash MD5: 32K
       3F 00 0A 7B 8A 28 A2 75 FC 40 B2 E3 CC 0D DE B7>)
$$ ##END=
$$ 
$$ $$ hash MD5
$$ $$ 21 FB 6E 67 3A D9 D2 DE 1E 65 D6 67 CD 87 73 BD
##$RELAX= 
##$RELAX= 
##$RELAX= 
##$RELAX= 
##$RELAX= 
##$RELAX= 
##$RELAX= 
##$RELAX= 
##$RELAX= 
##$RELAX= 
##$RELAX= 
$$ Bruker specific parameters
$$ --------------------------
##$DU= <F:/spectra>
##$EXPNO= 1
##$NAME= <P31dec>
##$PROCNO= 1
##$TYPE= <nmr>
##$USER= <iren>
##$AMP= (0..31)
100 100 100 100 100 100 100 100 100 100 100 100 100 100 100 100 100 100 
100 100 100 100 100 100 100 100 100 100 100 100 100 100 
##$ANAVPT= -1
##$AQSEQ= 0
##$AQ_mod= 1
##$AUNM= <au_zg>
##$AUTOPOS= <>
##$BF1= 81.014009
##$BF2= 200.13
##$BF3= 200.13
##$BF4= 200.13
##$BF5= 200.13
##$BF6= 200.13
##$BF7= 200.13
##$BF8= 200.13
##$BYTORDA= 1
##$CFDGTYP= 0
##$CFRGTYP= 5
##$CHEMSTR= <none>
##$CNST= (0..63)
1 1 145 1 1 1 1 1 1 1 1 1 1 1 1 1 1 1 1 1 1 1 1 1 1 1 1 1 1 1 1 1 1 1 
1 1 1 1 1 1 1 1 1 1 1 1 1 1 1 1 1 1 1 1 1 1 1 1 1 1 1 1 1 1 
##$CPDPRG= <waltz16>
##$CPDPRG1= <>
##$CPDPRG2= <waltz16>
##$CPDPRG3= <>
##$CPDPRG4= <mlev>
##$CPDPRG5= <mlev>
##$CPDPRG6= <mlev>
##$CPDPRG7= <mlev>
##$CPDPRG8= <mlev>
##$CPDPRGB= <>
##$CPDPRGT= <>
$$ [...]
##$SW_h= 37037.037037037
##$TD= 32768
##$TD0= 1
##$TE= 300
##$TE2= 300
##$TE3= 300
##$TEG= 300
##$TL= (0..7)
0 120 53 12 22 120 120 120 
##$TP= (0..7)
150 150 150 150 150 150 150 150 
##$TP07= 0
##$TPNAME0= <>
##$TPNAME1= <>
##$TPNAME2= <>
##$TPNAME3= <>
##$TPNAME4= <>
##$TPNAME5= <>
##$TPNAME6= <>
##$TPNAME7= <>
##$TPOAL= (0..7)
0.5 0.5 0.5 0.5 0.5 0.5 0.5 0.5 
##$TPOFFS= (0..7)
0 0 0 0 0 0 0 0 
##$TUNHIN= 0
##$TUNHOUT= 0
##$TUNXOUT= 0
##$USERA1= <user>
##$USERA2= <user>
##$USERA3= <user>
##$USERA4= <user>
##$USERA5= <user>
##$V9= 5
##$VALIST= <valist>
##$VCLIST= <CCCCCCCCCCCCCCC>
##$VD= 0
##$VDLIST= <DDDDDDDDDDDDDDD>
##$VPLIST= <PPPPPPPPPPPPPPP>
##$VTLIST= <TTTTTTTTTTTTTTT>
##$WBST= 1024
##$WBSW= 4
##$XGAIN= (0..3)
0 0 0 0 
##$XL= 0
##$YL= 0
##$YMAX_a= 3609
##$YMIN_a= -705
##$ZGOPTNS= <>
##$ZL1= 120
##$ZL2= 120
##$ZL3= 120
##$ZL4= 120
##$ABSF1= 298.5841
##$ABSF2= -158.5842
##$ABSG= 5
##$ABSL= 5
##$ALPHA= 0
##$AQORDER= 0
##$ASSFAC= 0
##$ASSFACI= 0
##$ASSFACX= 0
##$ASSWID= 0
##$AUNMP= <proc_1d>
##$AXLEFT= 0
##$AXRIGHT= 0
##$AXTYPE= 0
##$AXUNIT= <>
##$AZFE= 0.1
##$AZFW= 0.5
##$BCFW= 0
##$BC_mod= 2
##$BYTORDP= 0
##$COROFFS= 0
##$CY= 12.5935478210449
##$DATMOD= 1
##$DC= 0
##$DFILT= <>
##$DTYPP= 0
##$F1P= 47.1127640792319
##$F2P= -24.0371245302204
##$FCOR= 0.5
##$FTSIZE= 32768
##$FT_mod= 6
##$GAMMA= 0
##$GB= 0
##$INTBC= 1
##$INTSCL= 7.269226e-011
##$ISEN= 30
##$LB= 12
##$LEV0= 0
##$LPBIN= 0
##$MAXI= 12.09355
##$MC2= 0
##$MEAN= 0
##$ME_mod= 0
##$MI= 0.7550151
##$NCOEF= 0
##$NC_proc= -13
##$NLEV= 6
##$NOISF1= 298.5841
##$NOISF2= 270.0111
##$NSP= 0
##$NTH_PI= 0
##$NZP= 0
##$OFFSET= 298.5841
##$PC= 1.4
##$PHC0= 256.2087
##$PHC1= -68.95563
##$PH_mod= 1
##$PKNL= yes
##$PPARMOD= 0
##$PPDIAG= 0
##$PPIPTYP= 0
##$PPMPNUM= 100
##$PPRESOL= 1
##$PSCAL= 0
##$PSIGN= 0
##$REVERSE= no
##$SF= 81.014009
##$SI= 32768
##$SIGF1= 270.0111
##$SIGF2= -158.5842
##$SINO= 77.54984
##$SIOLD= 32768
##$SREGLST= <31P.CDCl3>
##$SSB= 0
##$STSI= 32768
##$STSR= 0
##$SW_p= 37037.037037037
##$SYMM= 0
##$S_DEV= 0
##$TDeff= 32768
##$TDoff= 0
##$TI= <>
##$TILT= no
##$TM1= 0
##$TM2= 0
##$TOPLEV= 0
##$USERP1= <user>
##$USERP2= <user>
##$USERP3= <user>
##$USERP4= <user>
##$USERP5= <user>
##$WDW= 1
##$XDIM= 32768
##$YMAX_p= 534023908
##$YMIN_p= -32553941
$$ End of Bruker specific parameters
$$ ---------------------------------
##NTUPLES= NMR SPECTRUM
##VAR_NAME=  FREQUENCY,     SPECTRUM/REAL,   SPECTRUM/IMAG
##SYMBOL=    X,             R,               I
##VAR_TYPE=  INDEPENDENT,   DEPENDENT,       DEPENDENT
##VAR_FORM=  AFFN,          ASDF,            ASDF
##VAR_DIM=   32768,         32768,           32768
##UNITS=     HZ,            ARBITRARY UNITS, ARBITRARY UNITS
##FACTOR=    1.13031516577767, 1,            1
##FIRST=     37037.037037037, -1289383,      7097681
##LAST=      0,             -5793517,        -2037183
##MIN=       0,             -32553941,       0
##MAX=       37037.037037037, 534023908,     0
$$ Real data points
##PAGE= N=1
##DATA TABLE= (X++(R..R)), XYDATA
$$ [...]
17028f392867n62214m04251k12207o5006K0505N5301M1354J646J6067J76120M85674
$$ -6392867 -6955081 -7359332 -7571539 -7636545 -7616040 -7560739 -7519385 -7517739 -7501672 -7325552 -6839878
17017f839878Q15792R77400Q58129N00816N8817l20498n78305p33028q23121q61305
$$ -6839878 -6024086 -5046686 -4188557 -3687741 -3628924 -3949422 -4527727 -5260755 -6083876 -6945181
17007f945181q14413o33225l19363L5486L06375M36956M67948N08142O76050J009510
$$ -6945181 -7759594 -8392819 -8712182 -8676696 -8370321 -7933365 -7465417 -6957275 -6281225 -5271715
16997e271715J438785J865272K220246K417277K319668J854257J137979M02119
$$ -5271715 -3832930 -1967658 252588 2669865 4989533 6843790 7981769 8383888
16989H383888j88395n83966p81649p87717o49260m71216l68742m11804o02725
$$ 8383888 8195493 7611527 6829878 6042161 5392901 4921685 4552943 4141139 3538414
16980C538414q76548j133006j304379j388183j394914j309665j123984q48875
$$ 3538414 2661866 1528860 224481 -1163702 -2558616 -3868281 -4992265 -5841140
16972e841140n06464j50873J53570M12741P02856J063615J425149J647907J635472
$$ -5841140 -6347604 -6498477 -6344907 -5932166 -5229310 -4165695 -2740546 -1092639 542833
16963E42833J405903J052045O68549L23790O1412r4299j43296j35628j85299m11129
$$ 542833 1948736 3000781 3669330 3993120 4054532 3960233 3816937 3681309 3496010 3084881
16953C084881q22854j280633j594727j650178j442484j050361n95936k03606L8063
$$ 3084881 2262027 981394 -613333 -2263511 -3705995 -4756356 -5352292 -5555898 -5517835
16944e517835R9148M047j90294m05096n42198n18115l18600p690L10449N23641
$$ -5517835 -5418687 -5414640 -5604934 -6010030 -6552228 -7070343 -7388943 -7396633 -7086184 -6562543
16934f562543N43253L45619j4447m34951q19216j107604j269983j301347j228209
$$ -6562543 -6019290 -5673671 -5688118 -6123069 -6942285 -8049889 -9319872 -10621219 -11849428
16925a1849428j086437q92990o50683l83974j70084j07863k26774m24170n23132
$$ -11849428 -12935865 -13828855 -14479538 -14863512 -15033596 -15141459 -15368233 -15792403 -16315535
16916a6315535m23235j85464M3838J77322K45464L37859N15997P66106J004621
$$ -16315535 -16738770 -16924234 -16880396 -16703074 -16457610 -16119751 -15603754 -14837648 -13833027
16907a3833027J144410J176368J166983J170770J172390J111837R36500O44689
$$ -13833027 -12688617 -11512249 -10345266 -9174496 -8002106 -6890269 -5953769 -5309080
16899e309080L12305N0275q3011r8836k3214J26603K98412L93635L52111K08761
$$ -5309080 -4996775 -4946500 -5029511 -5128347 -5151561 -5024958 -4726546 -4332911 -3980800 -3772039
16889c772039M2230j02431k25190l17033l24560j86480Q8671L93247O00338O67508
$$ -3772039 -3729809 -3832240 -4057430 -4374463 -4699023 -4885503 -4796832 -4403585 -3803247 -3135739
16879c135739O38088N55824M19304K31184M4689p0121p0338O2010L23847O69587
$$ -3135739 -2497651 -1941827 -1522523 -1291339 -1246650 -1316771 -1387109 -1325099 -1001252 -331665
16869c31665R99861J206655J246901J147954R51418O88972L83540M1513l27070
$$ -331665 668196 1874851 3121752 4269706 5221124 5910096 6293636 6335149 6008079
16860F008079o75416r33765j055919j046809r59797q74021q45723q68350r11256
$$ 6008079 5332663 4398898 3342979 2296170 1336373 462352 -383371 -1251721 -2162977
16851b162977r94901j168494j398507j544165j476664j192817q08618m70777k69723
$$ -2162977 -3157878 -4326372 -5724879 -7269044 -8745708 -9938525 -10747143 -11217920 -11487643
16842a1487643j93464j40306j49K45879N23878P71852R93270J196101J336572
$$ -11487643 -11681107 -11821413 -11821562 -11575683 -11051805 -10279953 -9286683 -8090582 -6754010
16833f754010J346806J196543R24181O13509L45634J87529J89437L30978M84852
$$ -6754010 -5407204 -4210661 -3286480 -2672971 -2327337 -2139808 -1950371 -1619393 -1134541
16824a134541M99733L40064J15045l7746q0585q3396j26982k24572l33896m02045
$$ -1134541 -634808 -294744 -179699 -217445 -298030 -381426 -508408 -732980 -1066876 -1468921
16814a468921l77809k31878P71K27995L74221M27365L99143K85317R5167j15534
$$ -1468921 -1846730 -2078608 -2077837 -1849842 -1475621 -1048256 -649113 -363796 -268629 -384163
16804c84163k60927k75343j68911l2546L3405o259j09154j89112j62449R697K97476
$$ -384163 -645090 -920433 -1089344 -1121890 -1088485 -1094744 -1203898 -1393010 -1555459 -1545762 -1248286
16793a248286O14105Q56925R49706Q59676O02958K49557j09939m15854o48429
$$ -1248286 -634181 222744 1172450 2032126 2635084 2884641 2774702 2358848 1710419
16784A710419p96353q38818p74291o39170m74284l23353k57347l20493m61133
$$ 1710419 914066 75248 -699043 -1338213 -1812497 -2135850 -2393197 -2713690 -3174823
16775c174823n64282n40047l66299p8436K41995M81487N52175M52884K66433J03235
$$ -3174823 -3739105 -4279152 -4645451 -4723887 -4481892 -4000405 -3448230 -2995346 -2728913 -2625678
16765b625678M3033R0289J52201R8548j12864l82186n57622n67131m57526l22848
$$ -2625678 -2582645 -2492356 -2340155 -2241607 -2354471 -2736657 -3294279 -3861410 -4318936 -4641784
16755d641784k18408j53244j19756r0202j9120J17733L00803M83321O18242O85033
$$ -4641784 -4860192 -5013436 -5133192 -5223394 -5242514 -5124781 -4823978 -4340657 -3722415 -3037382
16745c037382O95155O67030O09794N40510M99269N19803N92881O71330O93728
$$ -3037382 -2342227 -1675197 -1065403 -524893 -25624 494179 1087060 1758390 2452118
16736B452118O08993M26092K37827J38883J37089J79562K30074K81849L01608
$$ 2452118 3061111 3487203 3725030 3863913 4001002 4180564 4410638 4692487 4994095
16727D994095K13766k5210l65683o94089q96818r18150q07079o90906o58422o90163
$$ 4994095 5207861 5182651 4816968 4122879 3226061 2307911 1500832 809926 151504 -538659
16717e38659p26483p46154p41322o73220n03194k39958O1301L17562M49973M30824
$$ -538659 -1265142 -2011296 -2752618 -3425838 -3929032 -4168990 -4107689 -3790127 -3340154 -2909330
16707b909330K91994Q6972j28455k84726l12397j86605M3772K71429L98134M13292
$$ -2909330 -2617336 -2530364 -2658819 -2943545 -3255942 -3442547 -3398775 -3127346 -2729212 -2315920
16697b315920L97704M28911M88478M89735L91714K38497P9230r5164l10515n43776
$$ -2315920 -1918216 -1489305 -1000827 -511092 -119378 119119 198349 103185 -207330 -751106
16687g51106p17907p52017o31375m28017k39827j27392j05281j50789k04125j88566
$$ -751106 -1469013 -2221030 -2852405 -3280422 -3520249 -3647641 -3752922 -3903711 -4107836 -4296402
16677d296402o8547Q9391J38478k1219l41321o55384p92554o83733l94793o0841
$$ -4296402 -4364949 -4275558 -4137080 -4158299 -4499620 -5155004 -5947558 -6631291 -7026084 -7086925
16667g086925K07100L46922L27043J63094n9988k35085l00957k50358j07339Q4484
$$ -7086925 -6879825 -6532903 -6205860 -6042766 -6102754 -6337839 -6638796 -6889154 -6996493 -6912009
16657f912009K59006L28529K28763j7022k93394m50587l69483k2429M90690R83995
$$ -6912009 -6653003 -6324474 -6095711 -6112733 -6406127 -6856714 -7226197 -7248626 -6757936 -5773941
16647e773941J289014J335979J153361Q17795M29651J04811p3641j04793o2885
$$ -5773941 -4484927 -3148948 -1995587 -1177792 -748141 -643330 -716971 -821764 -884649
16638h84649n0056j33530l01185m69159n42271m89569l71553k90931l00022l56706
$$ -884649 -934705 -1068235 -1369420 -1838579 -2380850 -2870419 -3241972 -3532903 -3832925 -4189631
16628d189631l85116l60000l12569k85294l15080m32227o23551p96658q27952
$$ -4189631 -4574747 -4934747 -5247316 -5532610 -5847690 -6279917 -6903468 -7700126 -8528078
16619h528078o71443m04686j67686o8177j16649k20218k43704j05970J71801N12731
$$ -8528078 -9199521 -9604207 -9771893 -9840070 -9956719 -10176937 -10420641 -10526611 -10354810 -9842079
16609i842079Q42204J099151J242323J244418J071515P24395L06894m508o6417
$$ -9842079 -8999875 -7900724 -6658401 -5413983 -4342468 -3618073 -3311179 -3315687 -3382104
16600c382104J54894N72760J026202J348953J429478J240195Q33221L13752k06682
$$ -3382104 -3227210 -2654450 -1628248 -279295 1150183 2390378 3223599 3537351 3330669
16591C330669o52025r81772j169825j211904j130361r37710o29201k43143J13862
$$ 3330669 2678644 1696872 527047 -684857 -1815218 -2752928 -3382129 -3625272 -3511410
16582c511410L43836M32836M23858L29380J14567k14511n63864q16562r07972
$$ -3511410 -3167574 -2734738 -2310880 -1981500 -1866933 -2081444 -2645308 -3461870 -4369842
16573d369842q43838o76210m72076l01700k21305k38023k96369l09640k16658
$$ -4369842 -5213680 -5889890 -6361966 -6663666 -6884971 -7122994 -7419363 -7729003 -7945661
16564g945661k0485K17685M14573M98310M37367K77266J27355O7490R0159J55302
$$ -7945661 -7966146 -7748461 -7333888 -6835578 -6398211 -6120945 -5993590 -5926100 -5835941 -5680639
16554e680639K66274M70444Q01754J227418J628117J835452J736166J368702R02444
$$ -5680639 -5414365 -4943921 -4142167 -2914749 -1286632 548820 2284986 3653688 4556132
16545D556132N05751K38361L8670k15915n92529j017038j339088j491229j537247
$$ 4556132 5061883 5300244 5338914 5122999 4530470 3513432 2174344 683115 -854132
16536h54132j561613j570140j508400j345192j123316r14700p31058n14552k25968
$$ -854132 -2415745 -3985885 -5494285 -6839477 -7962793 -8877493 -9608551 -10123103 -10349071
16527a0349071Q1016K95734L66499L59631L98108N74492R18863J392372J870231
$$ -10349071 -10268055 -9972321 -9605822 -9246191 -8848083 -8273591 -7354728 -5962356 -4092125
16518d092125K142609K009878J463042P45265J53818j87475l31176l77317l87874
$$ -4092125 -1949516 60362 1523404 2268669 2422487 2235012 1903836 1526519 1138645
16509A138645l90776m15075m89798o05975o84976o32563m51326k51515j46940
$$ 1138645 747869 332794 -157004 -762979 -1447955 -2080518 -2531844 -2783359 -2930299
16500b930299j76935l13330m88281o12191o07744m46750j61548J76516M92127
$$ -2930299 -3107234 -3420564 -3908845 -4521036 -5128780 -5575530 -5737078 -5560562 -5068435
16491e068435P19401Q06635P36844N42360K98906J00083L755r36M2814J07632
$$ -5068435 -4349034 -3542399 -2805555 -2263195 -1964289 -1864206 -1860451 -1861387 -1818573 -1710941
16481a710941J81471K46885K66034J72523q6190m62397p94557r26456q33803o14135
$$ -1710941 -1529470 -1282585 -1016551 -844028 -930218 -1392615 -2187172 -3113628 -3947431 -4561566
16471d561566l91413k49196j96686j72669j09223K4431K55452O39829J217713
$$ -4561566 -4952979 -5202175 -5398861 -5571530 -5680753 -5656322 -5400870 -4761041 -3543328
16462c543328J917351K509557K704958K370155J669362R45162M69891L19263L95387
$$ -3543328 -1625977 883580 3588538 5958693 7628055 8573217 9043108 9362371 9757758
16453I757758N12004N14475L87780K40447J67020J52979J31745Q8141N3129J8043
$$ 9757758 10269762 10784237 11172017 11412464 11579484 11732463 11864208 11952349 12005478 12023521
16443A2023521q2425k90160n57199p60883p72921n54067k23218p42m3765l35108
$$ 12023521 11941096 11650936 11093737 10332854 9559933 9005866 8782648 8781906 8738141 8403033
16433H403033p33616j095014j310625j280377r34879l22317L52417Q39889J009433
$$ 8403033 7669417 6574403 5263778 3983401 3048522 2726205 3078622 3918511 4927944
16424D927944Q83860N72052K12400o7429k06495k33036k06547j49771n8637L7537
$$ 4927944 5811804 6383856 6596256 6528827 6322332 6089296 5882749 5732978 5674341 5711878
16414E711878O4442l1649k27744m49238o20766o86462o24978m54688k16959L0248
$$ 5711878 5776320 5744671 5516927 5067689 4446923 3760461 3135483 2680795 2463836 2494084
16404B494084K20428L11360L03862K29010J45929J51181L20572O05686Q48475
$$ 2494084 2714512 3025872 3329734 3558744 3704673 3855854 4176426 4782112 5630587
16395E630587R29552Q65689P73244P78750R38822J189974J355966J223065O49920
$$ 5630587 6560139 7425828 8199072 8977822 9916644 11106618 12462584 13685649 14335569
16386A4335569l16706j392188k192448k503099k407844k145458j884566j650589
$$ 14335569 14018863 12626675 10434227 7931128 5523284 3377826 1493260 -157329
16378a57329j401807j099884p23380k95833O8207K07455N6967k76746o03230p83574
$$ -157329 -1559136 -2659020 -3382400 -3678233 -3610026 -3402571 -3345604 -3622350 -4225580 -5009154
16368e009154p77656o27006m29789k84874k06699r8363J43752M97356Q20033R86011
$$ -5009154 -5786810 -6413816 -6843605 -7128479 -7335178 -7433541 -7289789 -6792433 -5972400 -4986389
16358d986389R97299R56320R55298J009350J067190J053077R14927O64063L73108
$$ -4986389 -3989090 -3032770 -2077472 -1068122 -932 1052145 1967072 2631135 3004243
16349C004243J33291K0396P5042K67467M90190O14566N57556L07716p7366m70985
$$ 3004243 3137534 3157930 3232972 3500439 3990629 4605195 5162751 5470467 5393101 4922116
16339D922116p08449o97401m96156k33924O006J95539L22739L77445L57103K82277
$$ 4922116 4213667 3516266 3020110 2786186 2792192 2987731 3310470 3687915 4045018 4327295
16329D327295K06479J98116L01849N07183P36014Q76739Q75260P85449P10170
$$ 4327295 4533774 4731890 5033739 5540922 6276936 7153675 8028935 8814384 9524554
16320I524554P22666Q16496Q86700Q11703N79326K84663J0616k29610m52985o74477
$$ 9524554 10247220 11063716 11950416 12762119 13341445 13626108 13636724 13407114 12954129 12279652
16310A2279652r02138j115237j245147j214730j021629p49689m82204k44892k4208
$$ 12279652 11377514 10262277 9017130 7802400 6780771 6031082 5548878 5303986 5279778
16301E279778J88716L63132M42630M13201L33656K77068K58429K27607J32361
$$ 5279778 5468494 5831626 6274256 6687457 7021113 7298181 7556610 7784217 7916578
16292G916578j2576j31700j76209j81320k14917k97322l99486n08428o63261r18520
$$ 7916578 7904002 7772302 7596093 7414773 7199856 6902534 6503048 5994620 5331359 4412839
16282D412839j273473j636027j857673j820999j530805j125233p80414o15465
$$ 4412839 3139366 1503339 -354334 -2175333 -3706138 -4831371 -5611785 -6227250
16274f227250o54135q04665r06272q38148n69166j41326L52254P93528J057812
$$ -6227250 -6881385 -7686050 -8592322 -9430470 -9999636 -10140962 -9788708 -8995180 -7937368
16265g937368J038504P23293K58812j14147k28591r2748J67210M32127O42191
$$ -7937368 -6898864 -6175571 -5916759 -6030906 -6259497 -6352245 -6185035 -5752908 -5110717
16256e110717P61671P94088Q57459J119876J584094K006988K130537J953740J677554
$$ -5110717 -4349046 -3554958 -2697499 -1577623 6471 2013459 4143996 6097736 7775290
16247G775290J450688J271152J083741Q72370O57253M68312L23749K10140R2256
$$ 7775290 9225978 10497130 11580871 12453241 13110494 13578806 13902555 14112695 14204951
16238A4204951n6126k24322l60732m16051l91709l38735l30323m41893p03601
$$ 14204951 14148825 13924503 13563771 13147720 12756011 12417276 12086953 11645060 10941459
16229A0941459j047112j333863j441403j329013j053315p40278n24191m67988
$$ 10941459 9894347 8560484 7119081 5790068 4736753 3996475 3472284 3004296
16221C004296n27679o07386o40386o05554m92486k91729l4840J84451K60421J43343
$$ 3004296 2476617 1869231 1228845 623291 130805 -160924 -195764 -11313 249108 392451
16211C92451j23518m07292n53454m86207k43668P3099L72802O15744P93127Q89517
$$ 392451 268933 -138359 -691813 -1178020 -1421688 -1348589 -975787 -360043 433084 1322601
16201A322601Q94145Q17032O74985M83880K64718M0504j81017m16151o66458q55413
$$ 1322601 2216746 3033778 3708763 4192643 4457361 4497865 4316848 3900697 3234239 2378826
16191B378826q65640o73207l96637j99074j69421k94705m97081o68600p17773
$$ 2378826 1513186 839979 443342 244268 74847 -219858 -716939 -1385539 -2103312
16182b103312o25289m40247k32661p7110l5633r8373j60182r5363J44109N13556
$$ -2103312 -2728601 -3168848 -3401509 -3478619 -3514252 -3612625 -3772807 -3868170 -3724061 -3210505
16172c210505R39356J360148J708854J918754J959066J847409J663788J530894
$$ -3210505 -2271149 -911001 797853 2716607 4675673 6523082 8186870 9717764
16164I717764J493372J417649J105255N15307j91244p95897j167538j306256j287470
$$ 9717764 11211136 12628785 13734040 14249347 14058103 13262206 12094668 10788412 9500942
16155I500942j178286j010280q15768o43212n21404m40537l68136k75773j76587
$$ 9500942 8322656 7312376 6496608 5853396 5331992 4891455 4523319 4247546 4070959
16146D070959j24823j52582k32708l19085l93259m51711m81921m83564m74619
$$ 4070959 3946136 3793554 3560846 3241761 2848502 2396791 1914870 1431306 956687
16137I56687m48143l66269k15029l2097J16409J71516J23824L0920k4147J1856
$$ 956687 508544 142275 -72754 -104851 11558 183074 306898 337818 313671 325527
16127C25527J30744K59542L12875K60012J23675m8802k03074l15155m10778n40081
$$ 325527 456271 715813 1028688 1288700 1412375 1363573 1160499 845344 434566 -105515
16117a05515p43468j013410j254658j326880j182069r19695o73957n01118l94686
$$ -105515 -848983 -1862393 -3117051 -4443931 -5626000 -6545695 -7219652 -7720770 -8115456
16108h115456l31383k60380j12110J45190M85201Q55730J197850J425010J438567
$$ -8115456 -8446839 -8707219 -8819329 -8674139 -8188938 -7333208 -6135358 -4710348 -3271781
16099c271781J218844Q81077O00088M77535M86415N15255M53452K62283p110k56455
$$ -3271781 -2052937 -1171860 -571772 -94237 392178 907433 1360885 1623168 1616058 1359603
16089A359603m07317m45517m25361m25910m87285n91491p03283q02016q55585
$$ 1359603 952286 506769 81408 -344502 -831787 -1423278 -2126561 -2928577 -3784162
16080c784162q01421o01648k96614L7901L60011O65180R46326J163449J248555
$$ -3784162 -4585583 -5187231 -5483845 -5445944 -5085933 -4420753 -3474427 -2310978 -1062423
16071a062423J148484Q86187N76151L57579K99622L47144L66661K72288Q8463
$$ -1062423 86061 972248 1548399 1905978 2205600 2552744 2919405 3191693 3280156
16062C280156r7751j97357j60804j8034J35019K17042K09988J30768N309j20246
$$ 3280156 3182405 2985048 2824244 2806210 2941229 3158271 3368259 3499027 3504336 3384090
16052C384090j94976k02430j57557q7628k8983j0013l4208r4175j76949k52314
$$ 3384090 3189114 2986684 2829127 2741499 2712516 2702503 2668295 2574120 2397171 2144857
16042B144857k99592l33123l80919m67723n92000o84285o45359m58981k30360
$$ 2144857 1845265 1512142 1131223 663500 71500 -612785 -1258144 -1717125 -1947485
16033a947485r4002r6104j79130k62131l04986l14870l18606l01178j86106P2775
$$ -1947485 -2041487 -2137591 -2316721 -2578852 -2883838 -3198708 -3517314 -3818492 -4004598 -3931823
16023c931823M09068O95182Q60098R27602R42468R02850P93530O42521N03486
$$ -3931823 -3522755 -2827573 -1967475 -1039873 -97405 805445 1598975 2241496 2744982
16014B744982M09662L67384L71737M14984M80429N39820N61756N19491M12249
$$ 2744982 3154644 3522028 3893765 4308749 4789178 5328998 5890754 6410245 6822494
16005F822494K81973J83771J42619J42573J33723M6390j63714m59022p21944q31201
$$ 6822494 7104467 7288238 7430857 7573430 7707153 7753543 7589829 7130807 6408863 5577662
15995E577662p40860m89946j61635J50684L73991M88789N25903N22842M83937
$$ 5577662 4836802 4346856 4185221 4335905 4709896 5198685 5724588 6247430 6731367
15986F731367L83444K08353j7673k62689n03035p18663r10443j085322j213389
$$ 6731367 7114811 7323164 7305491 7042802 6539767 5821104 4910661 3825339 2611950
15977B611950j240989j138142r27159o76069m54456k84327j28263P2491L53961
$$ 2611950 1370961 232819 -694340 -1370409 -1824865 -2109192 -2237455 -2164964 -1811003
15968a811003P04677J043794J226843J119025P04315J26056l93288o80095o88619
$$ -1811003 -1106326 -62532 1164311 2283336 2987651 3113707 2720419 2040324 1351705
15959A351705n03503k74205j22163q6628j33536k04017k51096k39941j51207q276
$$ 1351705 848202 573997 451834 365206 231670 27653 -223443 -463384 -614591 -622867
15949f22867J20769J72364J41494P3690j712r7805k21826l34550l75709l28762
$$ -622867 -502098 -329734 -188240 -114550 -116262 -214067 -435893 -770443 -1146152 -1474914
15939a474914k22938p5625J06365K93397M45145N33354N40677M63674L22807J54449
$$ -1474914 -1697852 -1773477 -1667112 -1373715 -928570 -395216 145461 609135 931942 1086391
15929A086391M24j04006j50377j57829j50426j42892j41880j53544j91833k70992
$$ 1086391 1086815 982809 832432 674603 524177 381285 239405 85861 -105972 -376964
15919c76964l85244n13409o46488p77482q65350q40014o47796l01644R7509M05983
$$ -376964 -762208 -1275617 -1922105 -2699587 -3564937 -4404951 -5052747 -5354391 -5256882 -4850899
15909d850899N29646M83980L69503K87522K75395L05041L25621K97953K12526
$$ -4850899 -4321253 -3837273 -3467770 -3180248 -2904853 -2599812 -2274191 -1976238 -1763712
15900a763712J23431J33979K87305N06560O73488P21022O46230M84738L00270
$$ -1763712 -1640281 -1506302 -1218997 -712437 -38949 682073 1328303 1813041 2113311
15891B113311J75131J62981K37419L11248L06652J82952p8398m63723r13265j355826
$$ 2113311 2288442 2451423 2688842 3000090 3306742 3489694 3411296 2947573 2034308 678482
15881F78482j737513j995903k051266j860510j476926j051810p47854o19111n65257
$$ 678482 -1059031 -3054934 -5106200 -6966710 -8443636 -9495446 -10243300 -10862411 -11427668
15872a1427668m07381l7823M92448J029624J431439J636961J672572J608254J513152
$$ -11427668 -11835049 -11872872 -11380424 -10350800 -8919361 -7282400 -5609828 -4001574 -2488422
15863b488422J429398J344708J215678J033285Q16759N53401K03264k29025o62004
$$ -2488422 -1059024 285684 1501362 2534647 3351406 3904807 4108071 3879046 3217042
15854C217042r92223j163633j183690j100976r60748p59283m58604p1232K82690
$$ 3217042 2224819 1061186 -122504 -1223480 -2184228 -2943511 -3402115 -3473347 -3190657
15845c190657M42971L57161J45249J340M3178K50729N11892O98895P17798N38909
$$ -3190657 -2747686 -2390525 -2245276 -2243936 -2200758 -1950029 -1438137 -739242 -21444 517465
15835E17465K21253j00525k99644l46940l06781k53671k06419j30148J3968K19129
$$ 517465 738718 638193 338549 -8391 -315172 -568843 -775262 -905410 -891442 -672313
15825f72313M11405M82619L85281J89989N701j43979l17664n39391p35156q06594
$$ -672313 -260908 221711 606992 796981 802682 658703 341039 -198352 -933508 -1740102
15815a740102p30461n50571l18337q5358Q4468J44051J01472J9002k4018K1965
$$ -1740102 -2470563 -3021134 -3339471 -3424829 -3340361 -3196310 -3094838 -3075836 -3099854 -3077889
15805c077889J50684L13733M61762N63761N97851N58224M62553L24032J30676
$$ -3077889 -2927205 -2613472 -2151710 -1587949 -990098 -431874 30679 354711 485387
15796D85387j22045l96645o31268p72596p89553o77790m51456j46690J60352L87002
$$ 485387 363342 -33303 -664571 -1437167 -2226720 -2904510 -3355966 -3502656 -3342304 -2955302
15786b955302N05901N53891N78412N73738M78317K48374p2366l64508n17275n04736
$$ -2955302 -2449401 -1895510 -1317098 -743360 -265043 -16669 -89035 -453543 -970818 -1475554
15776a475554l77375k06333n6328K8697N0888O4088J36087K94270N15228P50968
$$ -1475554 -1852929 -2059262 -2115590 -2086893 -2036005 -1971917 -1835830 -1541560 -1026332 -275364
15766b75364R34172R76774Q11215M55827K8814l29739n52092o52347o71712o35361
$$ -275364 658808 1635582 2446797 2902624 2931438 2601699 2049607 1397260 725548 90187
15756I0187n49070m16832k69087j70683j83399l36676o10662r13120j113182j126420
$$ 90187 -458883 -875715 -1144802 -1315485 -1498884 -1835560 -2446222 -3359342 -4472524 -5598944
15746e598944r57983o71307l43514n6173J04797R0210n2036j86719j96394p2430
$$ -5598944 -6556927 -7228234 -7571748 -7627921 -7523124 -7432914 -7484950 -7671669 -7868063 -7940493
15736g940493J09032K62774L28110K85319J76602P0278k181m6568q3951j43523
$$ -7940493 -7831461 -7568687 -7240577 -6955258 -6778656 -6708378 -6710559 -6757127 -6841078 -6984601
15726f984601k33818l11944l06474j85357N565J82491L01883L94740N15755O69431
$$ -6984601 -7218419 -7530363 -7836837 -8022194 -8016629 -7834138 -7532255 -7137515 -6621760 -5952329
15716e952329Q07118Q80041Q77531Q20019P30901O35418N83767O50254Q85587
$$ -5952329 -5145211 -4265170 -3387639 -2567620 -1836719 -1201301 -617534 32720 918307
15707I18307J250193J602044J785376J733226J476978J088902O22767J09740l82766
$$ 918307 2168500 3770544 5555920 7289146 8766124 9855026 10477793 10587533 10204767
15698A0204767p40524q85929q39244o86062n11402l73011l06036l19871l85163
$$ 10204767 9464243 8578314 7739070 7053008 6541606 6168595 5862559 5542688 5157525
15689E157525m37534m25560l50925k44587j38671p5116r4826k02669l63765n28026
$$ 5157525 4719991 4294431 3943506 3698919 3560248 3485132 3390306 3187637 2823872 2295846
15679B295846o58435p48031p97920p79836o58355m40418j62083J55892M92032
$$ 2295846 1637411 889380 91460 -688376 -1346731 -1787149 -1949232 -1793340 -1301308
15670a301308P73594Q91678P81589M74495O9610l39104p03584r83592j108004
$$ -1301308 -527714 363964 1145553 1620048 1689658 1350554 646970 -336622 -1444626
15661a444626j028767p98072n49545l95454l54273l71565l80584l46315k81683
$$ -1444626 -2473393 -3271465 -3821010 -4216464 -4570737 -4942302 -5322886 -5669201 -5950884
15652e950884k18250j66584j28751j28851k01169l38035m51504m17501k00967
$$ -5950884 -6169134 -6335718 -6464469 -6593320 -6794489 -7132524 -7584028 -8001529 -8202496
15643h202496P9877K57168K57986J24478o3239k39512l54958l76942k93278j06838
$$ -8202496 -8122619 -7865451 -7607465 -7482987 -7546226 -7785738 -8140696 -8517638 -8810916 -8917754
15633h917754J34903L06605K75920L7448k62193m47568m46467l10265j31773M6469
$$ -8917754 -8782851 -8476246 -8200326 -8162878 -8425071 -8872639 -9319106 -9629371 -9761144 -9714675
15623i714675K54066N28052Q31189J047242J075951R37054P58924O50407N85602
$$ -9714675 -9460609 -8932557 -8101368 -7054126 -5978175 -5041121 -4282197 -3631790 -3046188
15614c046188M33063J12042l02858o36855p41190n78978k37546J37044M37064
$$ -3046188 -2613125 -2501083 -2803941 -3440796 -4181986 -4760964 -4998510 -4861466 -4424402
15605d424402O42533P85714Q80141R01907Q15775N98542K66260j05838m16749
$$ -4424402 -3781869 -2996155 -2116014 -1214107 -398332 200210 466470 360632 -56117
15596e6117o17176p52248r04798j082543j188951j136250r49752p18199m90936
$$ -56117 -673293 -1425541 -2330339 -3412882 -4601833 -5738083 -6687835 -7406034 -7896970
15587g896970k70432p4503L8361J4378j38670l49636n31677o14561n61470m01008
$$ -7896970 -8167402 -8241905 -8203544 -8189166 -8327836 -8677472 -9209149 -9823710 -10385180 -10786188
15577a0786188k21617r5019N806J94236N50216J020140J442128J642529J526598
$$ -10786188 -11007805 -11102824 -11097018 -10902782 -10352566 -9332426 -7890298 -6247769 -4721171
15568d721171J140003O55282K71915J04420J27592K00948J62589p1607m81316
$$ -4721171 -3581168 -2925886 -2653971 -2549551 -2421959 -2221011 -2058422 -2130029 -2611345
15559b611345r77327j426897j672806j597202j203486o28184l9163M87505R68630
$$ -2611345 -3588672 -5015569 -6688375 -8285577 -9489063 -10117247 -10156410 -9668905 -8700275
15550h700275J410284J741983J860795J729683J411587J007317N91275K15930
$$ -8700275 -7289991 -5548008 -3687213 -1957530 -545943 461374 1052649 1268579
15542A268579m9400j28445j0638K11460M07657M95921M53334L04532J17460m6332
$$ 1268579 1219179 1090734 1080096 1291556 1699213 2195134 2648468 2953000 3070460 3024128
15532C024128j82803l28313n03906o91539q45473r13152q77250p86631p20734
$$ 3024128 2841325 2513012 2009106 1317567 472094 -441058 -1318308 -2104939 -2825673
15523b825673p16409p45910p60797p20797n97168m03937k12607q4868J841J24835
$$ -2825673 -3542082 -4287992 -5048789 -5769586 -6366754 -6770691 -6983298 -7068166 -7066325 -6941490
15513f941490L21809N63398Q10472J029257J150093J094574Q54496N06873J68788
$$ -6941490 -6619681 -6056283 -5245811 -4216554 -3066461 -1971887 -1117391 -610518 -441730
15504d41730n7875j48658j83039k69470m33018o08973p37563q20998q82604r11316
$$ -441730 -499605 -648263 -831302 -1100772 -1533790 -2142763 -2880326 -3701324 -4583928 -5495244
15494e495244q79196p86708o55918m98661l09197p9576J70221L81522N02905N53147
$$ -5495244 -6374440 -7161148 -7817066 -8315727 -8624924 -8704500 -8534279 -8152757 -7649852 -7096705
15484g096705O16262P47753Q90011R13872P49119M42353J01554j60351k47671
$$ -7096705 -6480443 -5732690 -4842679 -3928807 -3179688 -2737335 -2635781 -2796132 -3043803
15475c043803j29497J19221L57600M66735M09159K25202k7842l12902n65514o68154
$$ -3043803 -3173300 -3054079 -2696479 -2229744 -1820585 -1595383 -1623225 -1936127 -2501641 -3169795
15465c169795n45839k67698J021J42359J52803R7655M5931M0554J05280K65575
$$ -3169795 -3715634 -3983332 -3982311 -3839952 -3687149 -3589494 -3543563 -3503009 -3397729 -3132154
15455c132154N27351Q30456J073528J191409J168628J011691P46692M14792O8712
$$ -3132154 -2604803 -1774347 -700819 490590 1659218 2670909 3417601 3832393 3901105
15446C901105k22663l86865l89932k89704k10936k27085l07502l83326l95684
$$ 3901105 3678442 3291577 2901645 2611941 2401005 2173920 1866418 1483092 1087408
15437A087408k91370n3840K56608N29569O59743N86025L37086M7643j30185j54254
$$ 1087408 796038 742198 998806 1528375 2188118 2774143 3111229 3158872 3028687 2874433
15427B874433j08232j06115k03943l76717n57397o90371p37989o59062m24166
$$ 2874433 2766201 2660086 2456143 2079426 1522029 831658 93669 -565393 -989559
15418i89559n9246L49172O95071R02788R66391R45671R14742R13324R33592R27329
$$ -989559 -1048805 -699633 -4562 898226 1864617 2810288 3725030 4638354 5571946 6499275
15408F499275Q26844N96485K80326j2519j75488j66189k8721J43897K74852L22406
$$ 6499275 7326119 7922604 8202930 8190411 8014923 7848734 7820013 7963910 8238762 8561168
15398H561168K68203J25834n8537k44936m20253n58617o05888n43171m27919l27399
$$ 8561168 8829371 8955205 8896668 8651732 8231479 7672862 7066974 6523803 6095884 5768485
15388E768485k47644j72073j23907j39385k08075k80070l11417k74190j32169
$$ 5768485 5520841 5348768 5224861 5085476 4877401 4597331 4285914 4011724 3879555
15379C879555J51245N34688Q50030R05785O57403K45297j36126l93845n61744
$$ 3879555 4030800 4565488 5415518 6321303 6978706 7224003 7087877 6694032 6132288
15370F132288o94635p88378q18521p95245p36075o19840m23048j83913J2657J09015
$$ 6132288 5437653 4649275 3830754 3035509 2299434 1679594 1256546 1072633 1085290 1194305
15360A194305J24337J17186J15909J33945K24113M39516P44119J013473J133772
$$ 1194305 1318642 1435828 1551737 1685682 1909795 2349311 3093430 4106903 5240675
15351E240675J083431R18470O98857M52630K16401P0155Q1496K27257M11611N40694
$$ 5240675 6324106 7242576 7941433 8394063 8610464 8680619 8762115 8989372 9400983 9941677
15341I941677N48916L93284O8394l83022q86516j347053j667685j802746j766808
$$ 9941677 10490593 10883877 10952271 10569249 9682733 8335680 6667995 4865249 3098441
15332C098441j581104j252877q01130k76596K27887N84223O96953N78685L29612
$$ 3098441 1517337 264460 -536670 -813266 -585379 -1156 695797 1274482 1604094
15323A604094N0078k00536l84667m71027m33062k57978K6688L37456N59092O03851
$$ 1604094 1654172 1453636 1068969 597942 164880 -93098 -66410 271046 830138 1433989
15313A433989M78314K95654K01308K77694M96285P34008Q57501Q24291O94069
$$ 1433989 1912303 2207957 2409265 2686959 3183244 3917252 4774753 5599044 6293113
15304F293113N37319L72715J99700M4138m1024q600J37123L34820N17598O41096
$$ 6293113 6830432 7203147 7402847 7446985 7405961 7397361 7534484 7869304 8386902 9027998
15294I027998O61143N42225L11357O5776j01020j72540j95996k25485l11036m95210
$$ 9027998 9689141 10231366 10542723 10608499 10507479 10334939 10138943 9913458 9602422 9107212
15284I107212p62233j021454j187493j250904j230742j112970q96969o54837m74723
$$ 9107212 8344979 7323525 6136032 4885128 3654386 2541416 1644447 989610 514887
15275E14887l57063k17094J0916L11283O12889Q40317R52747R43962Q11093N56910
$$ 514887 157824 -59270 -48354 262929 875818 1716135 2668882 3612844 4423937 4980847
15265D980847K25825j05113l74141n47825o08183n49749l76884j10133J85942
$$ 4980847 5206672 5101559 4727418 4179593 3571410 3021661 2644777 2534644 2720586
15256B720586M07290M83856M43156L81622L76957M33723M95491M94166M10334
$$ 2720586 3127876 3611732 4054888 4436510 4813467 5247190 5742681 6236847 6647181
15247F647181K83689J47471q028j90933l64283m65385m72054m31039m00550l99585
$$ 6647181 6930870 7078341 7070313 6879380 6515097 6049712 5577658 5146619 4746069 4346484
15237D346484m25009m65437m91565m67300l76589k46094j44090j32188k11130
$$ 4346484 3921475 3456038 2964473 2497173 2120584 1874490 1730400 1598212 1387082
15228A387082l25199m06091m01492k79833l9978K55459M85596N64656N09206L88724
$$ 1387082 1061883 655792 254300 -25533 -65511 189948 675544 1240200 1749406 2138130
15218B138130K47087Q1295j33922l90820o21172p59047p97587p50920o15073m05782
$$ 2138130 2385217 2466512 2332590 1941770 1320598 561551 -236036 -986956 -1602029 -2007811
15208b007811j93291o2455m3627o9766m353K39261N93057Q70115R08719O85508
$$ -2007811 -2201102 -2263557 -2307184 -2376950 -2381303 -2142042 -1548985 -678870 229849 915357
15198I15357L26314K3509r1856j9008J36137K43422K64588K88857M06593N85935
$$ 915357 1241671 1265180 1173324 1154316 1290453 1533875 1798463 2087320 2493913 3079848
15188C079848P06793O68626M58713J60586r1916j93114j21309P7820L39011N80595
$$ 3079848 3786641 4455267 4913980 5074566 4982650 4789536 4668227 4746047 5085058 5665653
15178E665653P05425O71367N42375M23622L59974L16224K53110J91231J70105
$$ 5665653 6371078 7042445 7584820 8008442 8368416 8684640 8937750 9128981 9299086
15169I299086J81795J70042P6292j05992l16955m82765n61271n27222l72243j38222
$$ 9299086 9480881 9650923 9727215 9621223 9304268 8821503 8260232 7733010 7360767 7222545
15159G222545R7701K77159L62251K95677K0421m43707r67698j361010j467256
$$ 7222545 7320246 7597405 7959656 8255333 8275754 7832047 6864349 5503339 4036083
15150D036083j264387q93008n62350m03423l97371m30694l83482j78849J72530
$$ 4036083 2771696 1878688 1316338 912915 515544 84850 -298632 -477481 -304951
15141c04951N56379Q18092Q58437O95834M63633L30060L72376N10083N84976N09561
$$ -304951 251428 1069520 1927957 2623791 3087424 3417484 3789860 4299943 4884919 5394480
15131E394480L33212J75829J20038J78914L20366M84200O13300O95422P46507
$$ 5394480 5727692 5903521 6023559 6202473 6522839 7007039 7620339 8315761 9062268
15122I062268P52620O73208N01796K77997M4133j75497l68522n26659o16115n66325
$$ 9062268 9814888 10488096 10989892 11267889 11312022 11136525 10768003 10241344 9625229 9058904
15112I058904l40348q927K77537L88808K89170L4648k76354n39633o73384o57224
$$ 9058904 8718556 8709629 8987166 9375974 9665144 9699792 9423438 8883805 8210421 7553197
15102G553197n38714l91990k65392j70165j17304j33415k34665l93446n23983
$$ 7553197 7014483 6622493 6357101 6186936 6069632 5936217 5701552 5308106 4784123
15093D784123n23175l42894j3624L80375P36266R66347J011875Q54817N42862
$$ 4784123 4260948 3918054 3904430 4284805 5021071 5987418 6999293 7854110 8396972
15084H396972J84268j17728l41308n40991p66057j009305j235819j421541j535530
$$ 8396972 8581240 8463512 8122204 7581213 6815156 5805851 4570032 3148491 1612961
15075A612961j513311j296203r01092m16128P1907N08606Q54538J084148J191076
$$ 1612961 99650 -1196553 -2097645 -2513773 -2441866 -1933260 -1078722 5426 1196502
15066A196502J184751J086272R06599O20113K02737k86860p11989r65461j043417
$$ 1196502 2381253 3467525 4374124 4994237 5196974 4910114 4198125 3232664 2189247
15057B189247j014274r54011r11612q98690q99734q88031q13988o16682k93562
$$ 2189247 1174973 220962 -690650 -1589340 -2489074 -3377105 -4191093 -4807775 -5101337
15048e101337O8020L49326M86687N07374M96413N43377O91428Q98960J068784
$$ -5101337 -5033317 -4683991 -4197304 -3689930 -3193517 -2650140 -1958712 -1059752 9032
15039I032J141315J142135J119153J063639R34977P37889N32674L76139K71902
$$ 9032 1150347 2292482 3411635 4475274 5410251 6148140 6680814 7056953 7328855
15030G328855K03218K05226L24586N01102N80069M50317J25357k89953o56039
$$ 7328855 7532073 7737299 8061885 8562987 9143056 9593373 9718730 9428777 8772738
15021H772738q36148p61906n02535k30709q9026j19358l06387n94281q42596q76508
$$ 8772738 7936590 7174684 6672149 6441440 6352414 6233056 5926669 5332388 4489792 3613284
15011C613284o50690l05437j9745J42075K13765K23276J72611Q6850J1465k0841
$$ 3613284 2962594 2657157 2637412 2779487 2993252 3216528 3389139 3475989 3487454 3466613
15001C466613J7064J48367L66186O21464Q27151Q88029P60174M85840J64538j32382
$$ 3466613 3483677 3632044 3998230 4619694 5446845 6334874 7095048 7580888 7745426 7613044
14991G613044m18323p25987j017844j218611j304191j314338j290533j231170
$$ 7613044 7194721 6468734 5450890 4232279 2928088 1613750 323217 -907953
14983i07953j114607r34239o80774l11618K14476Q46706J404927J684011J617621
$$ -907953 -2022560 -2956799 -3637573 -3949191 -3734715 -2888009 -1483082 200929 1818550
14974A818550J321188R64297O08905K04833k61091o80052r05811q96531p45720
$$ 1818550 3139738 4104035 4712940 4917773 4656682 3976630 3070819 2174288 1428568
14965A428568n75453m46048l67694l35713l34759l38527l14905k44544j41509
$$ 1428568 853115 407067 39373 -296340 -631099 -969626 -1284531 -1529075 -1670584
14956a670584l6920N1034J29772K35479M24075P39325J161266J585341J880121
$$ -1670584 -1707504 -1656470 -1526698 -1291219 -867144 -127819 1033447 2618788 4498909
14947D498909J960006J813589J502802J112857O76458J70469m08184r79501j403588
$$ 4498909 6458915 8272504 9775306 10888163 11564621 11735090 11326906 10347405 8943817
14938H943817j578096j524612j383504j310340j361059j468461j506391j387526
$$ 8943817 7365721 5841109 4457605 3147265 1786206 317745 -1188646 -2576172
14930b576172j135925q52213n91562l04897P8000N39292R76924J285411J420399
$$ -2576172 -3712097 -4564310 -5155872 -5460769 -5382769 -4843477 -3866553 -2581142 -1160743
14921a160743J418837J355803J276164J178039J039802Q50946O35542M41445K99695
$$ -1160743 258094 1613897 2890061 4068100 5107902 5958848 6594390 7035835 7335530
14912G335530K25435K52034M00573O10624P53382P28791N24675J99747j39370
$$ 7335530 7560965 7812999 8213572 8824196 9577578 10306369 10831044 11030791 10891421
14903A0891421l64862l99868k72377p8565R2356J81844J50773J317j95203l31128
$$ 10891421 10526559 10126691 9854314 9775749 9868105 10049949 10200722 10202039 10006836 9675708
14893I675708l36062k18647n0351P8732R6067j5042j75657k57854k17532j52158
$$ 9675708 9339646 9120999 9070648 9149380 9245447 9230405 9054748 8796894 8579362 8427204
14883H427204k09186m50358p89662j048677j096112r40314o85235m27035k14788
$$ 8427204 8218018 7767660 6977998 5929321 4833209 3892895 3207660 2780625 2565837
14874B565837q5500q2972k16726m34729o60832q32682r06958q71767p62283o47498
$$ 2565837 2480337 2397365 2180639 1745910 1085078 252396 -654562 -1526329 -2288612 -2936110
14864b936110n98901o55814p83893q76762q38216o66077m47660k85364k23999
$$ -2936110 -3535011 -4190825 -4974718 -5851480 -6689696 -7355773 -7803433 -8088797 -8312796
14855h312796k24081j94590n9844J87424M82391P41314R12943R75227R29040Q23165
$$ -8312796 -8536877 -8731467 -8791311 -8603887 -8121496 -7380182 -6467239 -5492012 -4562972 -3739807
14845c739807P35340O97026O73835O23043N32211M15647L03659K26075J84875
$$ -3739807 -3004467 -2307441 -1633606 -1010563 -478352 -62705 240954 467029 651904
14836F51904J49138J01879P2304P7949P9117O4330J22673L41669O75163R81146
$$ 651904 801042 902921 975225 1053174 1132291 1196621 1319294 1660963 2336126 3317272
14826C317272J156011J180206J080719R05726P00665M82675K44948k1831l08363
$$ 3317272 4473283 5653489 6734208 7639934 8340599 8823274 9068222 9046391 8738028
14817H738028n79258p85675r03743r62906j012989j073072j113985j084891r69932
$$ 8738028 8158770 7373095 6469352 5506446 4493457 3420385 2306400 1221509 251577
14808B51577q01769o03786l51430k9566L00895N42642O36169N65005L37108P563
$$ 251577 -550192 -1153978 -1505408 -1534974 -1234079 -691437 -55268 509737 846845 854408
14798H54408l05389m83968m95701l78290j72616P5848K84609L64697L02187J89496
$$ 854408 549019 65051 -430650 -808940 -981556 -905708 -621099 -256402 45785 235281
14788B35281J48997K38358M40705O91025Q76743Q71372O30889K56242p6845k64901
$$ 235281 384278 622636 1063341 1754366 2631109 3502481 4133370 4389612 4312767 4047866
14778D047866l25817l15378k58358j66573p9874o0072j28030k20791k34775j14735
$$ 4047866 3722049 3406671 3148313 2981740 2901866 2841794 2713764 2492973 2258198 2143463
14768B143463R2189K64138L10524K57092K03183K16823K90157L59605L58987K81931
$$ 2143463 2235652 2499790 2810314 3067406 3270589 3487412 3777569 4137174 4496161 4778092
14758D778092J89766J35321Q8782k3147k04650l79653n09101o51971q94360j248882
$$ 4778092 4967858 5103179 5191961 5168814 4964164 4584511 4075410 3423439 2529079 1280197
14748A280197j608796j799125j704287j347391q37021k65444L15817Q55172J282235
$$ 1280197 -328599 -2127724 -3832011 -5179402 -6016423 -6281867 -5966050 -5110878 -3828643
14739c828643J538787J616341J554420J397125J150419Q07079M18865J00565m9016
$$ -3828643 -2289856 -673515 880905 2278030 3428449 4235528 4654393 4754958 4705942
14730D705942j3850J20335K23150K42546K39383K79039L30415K95181J28037j13817
$$ 4705942 4692092 4812427 5035577 5278123 5517506 5796545 6126960 6422141 6550178 6436361
14720F436361l45766n24775o28555o15420m55558j79587J48492M78872P62152
$$ 6436361 6090595 5565820 4937265 4321845 3866287 3686700 3835192 4314064 5076216
14711E076216R22698Q93154O72723L31938k5093l05553m78707n85726o82012p81089
$$ 5076216 5998914 6892068 7564791 7896729 7871636 7566083 7087376 6501650 5819638 5038549
14701E038549q50255q46263p60580o29696m97010l87945l28635l29765l37246
$$ 5038549 4188294 3342031 2581451 1951755 1454745 1066800 738165 408400 71154
14692G1154k49223o043L54833P41935J069064J265901J285892J132390Q67734
$$ 71154 -178069 -184112 170721 912656 1981720 3247621 4533513 5665903 6533637
14683F533637N90597L96554L34431L74668M35417M52522L92703K15439j18280
$$ 6533637 7124234 7520788 7855219 8229887 8665304 9117826 9510529 9725968 9607688
14674I607688n85333j060154j373285j441078j305448j046921p23555l74091q481
$$ 9607688 9022355 7962201 6588916 5147838 3842390 2795469 2071914 1697823 1689342
14665A689342L87907P89936J097029J214380J155634J026755R08790P79938N57681
$$ 1689342 2077249 2867185 3964214 5178594 6334228 7360983 8269773 9049711 9607392
14656I607392J93487k91740q22778j273107j499755j428213j095653o20756j53389
$$ 9607392 9800879 9509139 8686361 7413254 5913499 4485286 3389633 2768877 2615488
14647B615488J91990L95760N02013N37788M98236L85946K28056N7791j03332k34342
$$ 2615488 2807478 3203238 3705251 4243039 4741275 5127221 5355277 5413068 5309736 5075394
14637E075394k98316k63431j46587j6553O6154J16422K04076L60437N49587P24175
$$ 5075394 4777078 4513647 4367060 4350507 4416661 4533083 4737159 5097596 5647183 6371358
14627F371358Q59879R35851R29894Q49209P23400N60028L53025J29875l5727n8883
$$ 6371358 7231237 8167088 9096982 9946191 10669591 11229619 11582644 11712519 11676792 11617909
14617A1617909Q3224L20811N59261P46787Q58647Q53619O94889M03805N1902k81353
$$ 11617909 11701133 12021944 12581205 13327992 14186639 15040258 15735147 16138952 16190854 15909501
14607A5909501n33938o86391p67009q12902q24174p61972n90266l10260L4892
$$ 15909501 15375563 14689172 13922163 13109261 12285087 11523115 10932849 10622589 10657481
14598A0657481L71673O23393P50997P77082P66985P76748Q02177P79623O50756
$$ 10657481 11029154 11652547 12403544 13180626 13947611 14724359 15526536 16306159 16956915
14589A6956915M30217K03201O3537M7579J05916J45280J01597l0702k03953l36689
$$ 16956915 17387132 17590333 17653870 17701449 17807365 17952645 18054242 18023540 17819587 17482898
14579A7482898l52527k02852J23962N82814J071080J488045J828748K195498K691598
$$ 17482898 17130371 16927519 17051481 17634295 18705375 20193420 22022168 24217666 26909264
14570B6909264L329018M040819M734077N321718N752542O020818O112208N947805
$$ 26909264 30238282 34279101 39013178 44334896 50087438 56108256 62220464 68168269
14562F8168269N399729M370653K885012J118620o61774k210188l387199m178592
$$ 68168269 73567998 77938651 80823663 81942283 81280509 79070321 75683122 71504530
14554G1504530m649850m855175m787815m441457l891945l282844k744832k345813
$$ 71504530 66854680 61999505 57211690 52770233 48878288 45595444 42850612 40504799
14546D0504799k099346j987117j966008j979854j969637j867578j615746j231161
$$ 40504799 38405453 36418336 34452328 32472474 30502837 28635259 27019513 25788352
14538B5788352q39730n88703n10683n12867m98390m55973m36400m84111n94582
$$ 25788352 24948622 24359919 23849236 23336369 22837979 22382006 21945606 21461495 20866913
14529B0866913o99749o87810m69899l8787N43420J172051J697494J985664K025166
$$ 20866913 20167164 19479354 19009455 18970668 19514088 20686139 22383633 24369297 26394463
14520B6394463J918554J754800J535573J239067R06102O22482M47074L96938M84817
$$ 26394463 28313017 30067817 31603390 32842457 33748559 34371041 34818115 35215053 35699870
14511C5699870P16254J037160J323667J440237J305632R31137M29727l0604l37095
$$ 35699870 36416124 37453284 38776951 40217188 41522820 42453957 42883684 42853080 42515985
14502D2515985n08158o38320p77631q88182r14946q67060q09336p82028p63740
$$ 42515985 42007827 41369507 40591876 39703694 38788748 37921688 37112352 36330324 35566584
14493C5566584p25123o60136n53672l84600j72704J3922J14031J24445Q4321K1468
$$ 35566584 34841461 34181325 33627653 33243053 33070349 33084271 33198302 33322747 33407068 33428536
14483C3428536o2903j64565k60672l27233l56717l65002l87273m44247n20421
$$ 33428536 33365633 33201068 32940396 32613163 32256446 31891444 31504171 31059924 30539503
14474C0539503n90263o41301o72381o84120o77552o72888p11409q10838r21353
$$ 30539503 29949240 29307939 28635558 27951438 27273886 26600998 25889589 25078751 24157398
14465B4157398r43552q08757n40388k25040O7880L18269N13237O13779N97554
$$ 24157398 23213846 22405089 21864701 21639661 21707541 22025810 22539047 23152826 23750380
14456B3750380N24919N24392O90971J005453J345243J568998J611327J481020
$$ 23750380 24275299 24799691 25490662 26496115 27841358 29410356 31021683 32502703
14448C2502703J187085P46330K53939j39607l42422l77217l15708j89609K759
$$ 32502703 33689788 34436118 34690057 34550450 34208028 33830811 33515103 33325494 33328253
14439C3328253K24491L75775L52804J28272k25525n91693q93247j121768j281383
$$ 33328253 33552744 33928519 34281323 34409595 34184070 33592377 32699130 31577362 30295979
14430C0295979j336932j245319j017024p10191l71463q837L75618P41699J014976
$$ 30295979 28959047 27713728 26696704 25986513 25615050 25606213 25981831 26723530 27738506
14421B7738506J125811J059138R01864Q18615R21468J175077J458657J671616
$$ 27738506 28864317 29923455 30825319 31643934 32565402 33740479 35199136 36870752
14413C6870752J765699J731835J571878J277615Q55247L53553j49833n73068q44926
$$ 36870752 38636451 40368286 41940164 43217779 44073026 44426579 44276746 43703678 42858752
14404D2858752r21508q02708n26513j54812K29014N37454P24406Q18024Q95286
$$ 42858752 41937244 41134536 40608023 40453211 40682225 41219679 41944085 42762109 43657395
14395D3657395J012710J161743J288180J346627J337146J286429J197402J054781
$$ 43657395 44670105 45831848 47120028 48466655 49803801 51090230 52287632 53342413
14387E3342413Q91549Q13362R36039J301659J844713K420596K870360L081021
$$ 53342413 54233962 55047324 55983363 57285022 59129735 61550331 64420691 67501712
14379F7501712L022102K768732K482118K327510K409360K750174L268095L807265
$$ 67501712 70523814 73292546 75774664 78102174 80511534 83261708 86529803 90337068
14371I0337068M236551M508595M662155M816778N121284N655161O388707P243477
$$ 90337068 94573619 99082214 103744369 108561147 113682431 119337592 125726299 132969776
14363A32969776Q172734R186657J0317681J1590184J3051053J4829467J7127435
$$ 132969776 141142510 150329167 160646848 172237032 185288085 200117552 217244987
14356B17244987K0097929K3728571K7844597L2147661L6172929L9194601M0189301
$$ 217244987 237342916 261071487 288916084 321063745 357236674 396431275 436620576
14349D36620576L7968218L1561704K0834163P039247p286827j9357264k7382122
$$ 436620576 474588794 506150498 526984661 534023908 526737081 507379817 479997695
14342D79997695l1078727l1304800k9361471k6456460k3437463k0720483j8367788
$$ 479997695 448918968 417614168 388252697 361796237 338358774 317638291 299270503
14335B99270503j6268102j4309328j2451090j0698759r051408p486845n973616
$$ 299270503 283002401 268693073 256241983 245543224 236491816 229004971 223031355
14328B23031355m472174k947452j439614j42253O20752N33281n46220k471253
$$ 223031355 218559181 215611729 214172115 214029862 214650614 215183895 214637675 212166422
14320B12166422m805807o991181q605357r506453r789543r665178r340299q915464
$$ 212166422 207360615 200369434 191764077 182257624 172468081 162802903 153462604 144547140
14312A44547140q353584p581698o637059n676019m837306m139112l511095k880392
$$ 144547140 136193556 128611858 121974799 116298780 111461474 107322362 103811267 100930875
14304A00930875k213419j509865p86450q8105M83350Q14263Q89917Q15570P40186
$$ 100930875 98717456 97207591 96421141 96333036 96816386 97630649 98520566 99336136 100076322
14295A00076322P92187J020670J349069J623598J734322J687885J577222J488526
$$ 100076322 100868509 101889179 103238248 104861846 106596168 108284053 109861275 111349801
14287A11349801J413707J243605Q57824K27513n66823j397568k157625k800923
$$ 111349801 112763508 114007113 114864937 115092450 114525627 113128059 110970434 108169511
14279A08169511l337026l783111m136084m375368m453876m316315l975756l545847
$$ 108169511 104832485 101049374 96913290 92537922 88084046 83767731 79791975 76246128
14271G6246128l162387k904942k799668k844851l007787l204612l337010l381998
$$ 76246128 73083741 70178799 67379131 64534280 61526493 58321881 54984871 51602873
14263E1602873l382242l344245l217692k959529k569846k092883j605808j178745
$$ 51602873 48220631 44876386 41658694 38699165 36129319 34036436 32430628 31251883
14255C1251883q34663n59293l53834k61327l16140m66970n74823n17246k97202
$$ 31251883 30417220 29857927 29504093 29242766 28926626 28459656 27884833 27367587 27070385
14246B7070385k6467J85703L01226L43352L55927L62334L55991L29819K95668
$$ 27070385 27043918 27229621 27530847 27874199 28230126 28592460 28948451 29278270 29573938
14237B9573938K63338K07939Q6346r8847k85010m08234m41761m02798l67693m34359
$$ 29573938 29837276 30045215 30131561 30032714 29747704 29339470 28897709 28494911 28127218 27692859
14227B7692859o28705q78130j078708j149146j047442q01521n24664l55607l48159
$$ 27692859 27064154 26186024 25107316 23958170 22910728 22109207 21584543 21228936 20880777
14218B0880777m21993m47335l70521k26831n7664J40895L99844P26866J078861
$$ 20880777 20458784 20011449 19640928 19414097 19356433 19497328 19897172 20624038 21702899
14209B1702899J386548J581227J600339J422159J114653Q16539O38782N89869
$$ 21702899 23089447 24670674 26271013 27693172 28807825 29624364 30263146 30853015
14201C0853015O04614O15457N96654N78727O01011O23973N38912K92495m2923
$$ 30853015 31457629 32073086 32669740 33248467 33849478 34473451 35012363 35304858 35261935
14192C5261935l39228n31200o57069p95412r84572j208420j433321j621763j712665
$$ 35261935 34922707 34391507 33734438 32939026 31954454 30746034 29312713 27690950 25978285
14183B5978285j640098j394173j038064o69780l82575k33299k14932k69084l34299
$$ 25978285 24338187 22944014 21905950 21236170 20853595 20620296 20405364 20136280 19801981
14174A9801981l64243l14729j55877J12036M85432R74522J562569K173084K700179
$$ 19801981 19437738 19123009 18967132 19079168 19564600 20539122 22101691 24274775 26974954
14165B6974954L058974L210844L172616L015675K838645K740521K819171L156645
$$ 26974954 30033928 33244772 36417388 39433063 42271708 45012229 47831400 50988045
14157E0988045L774453M604035N508629O342880P011746P506012P895648Q258474
$$ 50988045 54762498 59366533 64875162 71218042 78229788 85735800 93631448 101889922
14149A01889922Q593166Q783154Q598803P727287N879035K981830o56776m394127
$$ 101889922 110483088 119266242 127865045 135592332 141471367 144453197 143796421 139402294
14141A39402294p526512r598738j0539797j0582829j0081064r344483q556369
$$ 139402294 131875782 122277044 111737247 101154418 91073354 81728871 73172502
14134G3172502p788663p085052o498406o040075n650521n255787m824867m354138
$$ 73172502 65383839 58298787 51800381 45760306 40109785 34853998 30029131 25674993
14126B5674993l828340l224074k544597j833425j156597n78236j30490K06047
$$ 25674993 21846653 18622579 16077982 14244557 13087960 12509724 12379234 12585281
14118A2585281M77072P00158Q37960Q41634P12363M95707K31562o5042l79182
$$ 12585281 13062353 13762511 14600471 15442105 16154468 16650175 16881737 16816695 16437513
14109A6437513o75548q94469r53523q05218n17372k32931m2780N2142P1903J5241
$$ 16437513 15761965 14867496 13913973 13108755 12591383 12358452 12315672 12367814 12439717 12454958
14099A2454958j05622k35830l01779k60134j28234K6050J19724Q2153j18001m37601
$$ 12454958 12349336 12113506 11811727 11551593 11423359 11449409 11569133 11651286 11533285 11095684
14089A1095684p70218j027301j208856j378633j572089j742373j792494j636879
$$ 11095684 10325466 9298165 8089309 6710676 5138587 3396214 1603720 -33159
14081c3159j244371o64963j6784N68626R75483J104569R25126N41946J63253j9759
$$ -33159 -1277530 -1942493 -1959277 -1390651 -415168 689401 1614527 2156473 2319726 2299967
14071B299967O6526L52223O60718Q01874O77697L15714j78440o85131j085205
$$ 2299967 2366493 2718716 3379434 4181308 4859005 5174719 4996279 4311148 3225943
14062C225943j239704j042237n30531J03698O43636R79803J131017J167169J135297
$$ 3225943 1986239 944002 413471 517169 1160805 2140608 3271625 4438794 5574091
14053E574091J043409Q80195O47451L74406Q7798k08993n03455p44280q71635
$$ 5574091 6617500 7497695 8145146 8519552 8607350 8398357 7894902 7150622 6278987
14044F278987q73377p82767o25837m22727k36510j55629k15066l61176m84567
$$ 6278987 5405610 4622843 3997006 3574279 3337769 3182140 2967074 2605898 2121331
14035B121331m80245k93936N7277M65012P60907Q42759P47448N65148L45858J20012
$$ 2121331 1641086 1347150 1404427 1869439 2630346 3473105 4220553 4785701 5131559 5251571
14025E251571o2420j57406j55871o6873R7611L06104M94833N92323N71710M67945
$$ 5251571 5189151 5031745 4875874 4809001 4906612 5212716 5707549 6299872 6871582 7339527
14015G339527L24845J57549j2166j37392j83619j65391j46688j97918l42999n39202
$$ 7339527 7664372 7821921 7809755 7672363 7488744 7323353 7176665 6978747 6635748 6096546
14005F096546o94346p26124o29542m61592k56470j016L05545O18628Q82835J055561
$$ 6096546 5402200 4676076 4046534 3584942 3328472 3327456 3633001 4251629 5134464 6190025
13995F190025J084453R03465M76880j43184p87588j226092j302963j039681o02666
$$ 6190025 7274478 8177943 8654823 8511639 7724051 6497959 5194996 4155315 3552649
13986C552649j64935J90936M49576O06093O72017O96753P20100P20682O52533
$$ 3552649 3387714 3578650 4028226 4634319 5306336 6003089 6723189 7443871 8096404
13977H096404N14130L50431J98216O4269m2865r3130n8719M1494J25062R7704
$$ 8096404 8610534 8960965 9159181 9223450 9180585 9087455 9028736 9070230 9195292 9292996
13967I292996o7989l08672n08602n65528m40960j58844K20369O16578R32428J067351
$$ 9292996 9225007 8916335 8407733 7842205 7401245 7242401 7462770 8079348 9011776 10079127
13957A0079127R76833P35910N21019M97524P01024J015951J275773J402485J446787
$$ 10079127 11055960 11791870 12312889 12810413 13511437 14527388 15803161 17205646 18652433
13948A8652433J493848J564313J612627J579490J424684J148646Q14626N19607
$$ 18652433 20146281 21710594 23323221 24902711 26327395 27476041 28290667 28810274
13940B8810274L12938J66552L1867j19335l03794n24298p58266r77043j172319
$$ 28810274 29123212 29289764 29321631 29202296 28898502 28374204 27615938 26638895 25466576
13931B5466576j348608j494138j584522j622856j648180j694544j752343j776749
$$ 25466576 24117968 22623830 21039308 19416452 17768272 16073728 14321385 12544636
13923A2544636j733937j624831j460324j231252r13971n10398p8005K96471N50532
$$ 12544636 10810699 9185868 7725544 6494292 5580321 5069923 4991918 5288389 5838921
13914E838921O72149O92302O59777O13787N72361N38110M96900M15509K58634
$$ 5838921 6511070 7203372 7863149 8476936 9049297 9587407 10084307 10499816 10758450
13905A0758450J2470k94350n91381p95598q43540p24925n18345l74951m06336
$$ 10758450 10770920 10476570 9885189 9089591 8246051 7521126 7002781 6627830 6221494
13896F221494n82525p77766q92256q95817p97331o20484m01891j87167j9919O3040
$$ 6221494 5638969 4861203 3968947 3073130 2275799 1655315 1253424 1066257 1046338 1109378
13886A109378L6482q6036k28739k81208j68228Q5928L69422N81606O99181P38970
$$ 1109378 1145860 1059824 831085 549877 381649 467577 836999 1418605 2117786 2856756
13876B856756O98255N54752L09761K3633j95698k65562k11982j55833j84032k63450
$$ 2856756 3555011 4109763 4419524 4443157 4247459 3981897 3769915 3614082 3430050 3166600
13866C166600k97661k26298n9869J37504K73036K50520K7940l19971o45787q53140
$$ 3166600 2868939 2642641 2582772 2720276 2993312 3243832 3271772 2951801 2306014 1452874
13856A452874r36702r16529p94115n88290l83813k89761l26450m03786m25530
$$ 1452874 516172 -400357 -1194472 -1782762 -2166575 -2456336 -2782786 -3186572 -3612102
13847c612102l55967j98205K4650K74005N10435P04061Q36395R07069R33381R20013
$$ -3612102 -3968069 -4166274 -4141624 -3867619 -3357184 -2653123 -1816728 -909659 23722 943735
13837I43735Q35710O45912L67583P5524j45323k46276k20918q8259J12868L35014
$$ 943735 1779445 2425357 2792940 2868464 2723141 2476865 2255947 2167688 2280556 2615570
13827B615570N61494Q19496J125496J436908J684049J827896J861791J781616
$$ 2615570 3177064 3996560 5122056 6558964 8243013 10070909 11932700 13714316
13819A3714316J581867J277905R22931N85668L01317N2855j92717m38315o56328
$$ 13714316 15296183 16574088 17497019 18082687 18384004 18436859 18244142 17805827 17149499
13810A7149499q12819q77724q18266o02856k41313J82591N50425P94371R28538
$$ 17149499 16336680 15458956 14640690 14037834 13796521 13979112 14529537 15323908 16252446
13801A6252446R94034R87571Q43949M98984k5818o03670j065627j308175j352503
$$ 16252446 17246480 18234051 19078000 19576984 19551166 18947496 17881869 16573694 15221191
13792A5221191j298693j244433j238592j265140j270141j222197j139997j063796
$$ 15221191 13922498 12678065 11439473 10174333 8904192 7681995 6541998 5478202
13784E478202j007927r48712q60669p48231o43471n82772n66802n44888m70333
$$ 5478202 4470275 3521563 2660894 1912663 1269192 686420 119618 -425270 -895603
13775h95603l51814k10888k6573K29204N39903Q51233J092679J209262J206527
$$ -895603 -1247417 -1458305 -1484878 -1255674 -715771 135462 1228141 2437403 3643930
13766C643930J136710J021147Q36665N98930L90236K77295K50161K56751K51765
$$ 3643930 4780640 5801787 6638452 7237382 7627618 7904913 8155074 8411825 8663590
13757H663590J93859M3350j92473m33658n86238o22912n86255n14523m07585k71368
$$ 8663590 8857449 8900799 8708326 8274668 7688430 7065518 6479263 5964740 5557155 5285787
13747E285787j28290K2721J97528L86656N63263O96520P34779O20626L44849l4383
$$ 5285787 5157497 5180218 5377746 5764402 6327665 7024185 7758964 8379590 8724439 8690056
13737H690056m43078q42110j204519j473759j577268j474476j188179q03488m22228
$$ 8690056 8246978 7404868 6200349 4726590 3149322 1674846 486667 -316821 -739049
13728g39049r7333J62473L36512L87708L02449J14749j03191k64786k98420j94458
$$ -739049 -836382 -673909 -337397 50311 352760 467509 364318 99532 -198888 -393346
13718c93346k6945J09249J93396K81625M03584M93380M38102J70949k75220p73676
$$ -393346 -420291 -311042 -117646 163979 567563 1060943 1499045 1669994 1394774 621098
13708F21098j155314j293538j178555q98734n57657k41133j8702Q0550P5561K809
$$ 621098 -534216 -1827754 -3006309 -3905043 -4462700 -4703833 -4722535 -4641985 -4566424 -4563615
13698d563615j03491k00000k35544j89677r3046J0563J07810K13240L35721M53999
$$ -4563615 -4667106 -4867106 -5102650 -5292327 -5385373 -5374810 -5267000 -5053760 -4718039 -4264040
13688d264040N23853M93915L24395M5664k04254k80717j83748m5352M0802J13444
$$ -4264040 -3740187 -3246272 -2921877 -2876213 -3080467 -3361184 -3544932 -3590284 -3549482 -3436038
13678c436038K34955L59600L82626K84624J69618J53253K40987L48534M19342
$$ -3436038 -3201083 -2841483 -2458857 -2174233 -2004615 -1851362 -1610375 -1261841 -842499
13669h42499M63660M94229M98087M83732M85154N08077N26355N13333M46253L09967
$$ -842499 -378839 115390 613477 1097209 1582363 2090440 2616795 3130128 3576381 3886348
13659C886348J11133j16018l13067m29333m63603m46114l83421k40933K1758L80792
$$ 3886348 3997481 3881463 3568396 3139063 2675460 2229346 1845925 1604992 1626750 2007542
13649B007542P21087R07707Q67994O17859K69466n932q8656N410J62643K88350
$$ 2007542 2728629 3636336 4504330 5122189 5391655 5385723 5297067 5302477 5465120 5753470
13639E753470L66204M18449M44632M10931K87857P9360j79849m46781o98660r37681
$$ 5753470 6119674 6538123 6982755 7393686 7681543 7760903 7581054 7134273 6435613 5497932
13629E497932j165773j370179j533981j638427j665992j615702j488423j258494
$$ 5497932 4332159 2961980 1427999 -210428 -1876420 -3492122 -4980545 -6239039
13621f239039q99983m44589K2712M25692P24477Q97517R48974R34601R24789R18508
$$ -6239039 -7139022 -7583611 -7560899 -7135207 -6410730 -5513213 -4564239 -3629638 -2704849 -1786341
13611a786341Q34853O20205L39317J31696Q8262J87337L34296M36673M41528L41679
$$ -1786341 -951488 -331283 8034 139730 227992 415329 749625 1186298 1627826 1969505
13601A969505J79746K6405o2458o0241L5603J86408L15480L66166L39789K84268
$$ 1969505 2149251 2175656 2113198 2052957 2088560 2274968 2590448 2956614 3296403 3580671
13591C580671K61193K91110L34949L52861L46315L37753L61234M54891O07816
$$ 3580671 3841864 4132974 4467923 4820784 5167099 5504852 5866086 6320977 6928793
13582F928793P31141P11417M90359J05478l25855o65961q13363p31144m57381
$$ 6928793 7659934 8371351 8861710 8967188 8641333 7975372 7162009 6430865 5973484
13573E973484q9371K61619N16080O37469O19651M87714L06908J55626O7032J7407
$$ 5973484 5884113 6145732 6661812 7299281 7918932 8406646 8713554 8869180 8936212 8953619
13563H953619k9736j00144k14497l72621n33356o33252o24046n04941l38247k18398
$$ 8953619 8923883 8823739 8609242 8236621 7703265 7070013 6445967 5941026 5602779 5384381
13553E384381k10127l18215n03767p07029q56332q89915p94750o10245l74275
$$ 5384381 5174254 4856039 4352272 3645243 2788911 1898996 1104246 494001 119726
13544A19726q4965K54271N85249Q20156Q91048P83922N54335L02205J27626J06086
$$ 119726 34761 289032 874281 1694437 2585485 3369407 3923742 4225947 4353573 4459659
13534D459659K61381N33446Q06410R91035J064696J043038R46985Q02120O39216
$$ 4459659 4721040 5254486 6060896 7051931 8116627 9159665 10106650 10908770 11547986
13525A1547986M64092K44648m4783l87419p34618j016413j146915j063624p86387
$$ 11547986 12012078 12256726 12211943 11824524 11089906 10073493 8926578 7862954 7076567
13516G076567m33272j59003o0548j23933k38664k54095m8398L97863R58402J412986
$$ 7076567 6643295 6484292 6423744 6299811 6061147 5807052 5758654 6156517 7114919 8527905
13506H527905J588761J465131J145209P54207L62069k9680m24463p64502r75380
$$ 8527905 10116666 11581797 12727006 13481213 13843282 13813602 13389139 12624637 11649257
13497A1649257j067904j113073j124208j061396r43016q66543q97955r87423j006481
$$ 11649257 10581353 9468280 8344072 7282676 6339660 5473117 4575162 3587739 2581258
13488B581258q53074n34438j36838K66882O27685Q80598R67653Q91468P04446
$$ 2581258 1728184 1193746 1056908 1323790 1951475 2832073 3799726 4691194 5395640
13479E395640M53497J69372j02962l06337m18631m78862n41213o08698o30094
$$ 5395640 5849137 6018509 5915547 5609210 5190579 4711717 4170504 3561806 2931712
13470B931712n58088l91960j64658Q2429K97677M21890M14596K70303L1407j99845
$$ 2931712 2373624 1981664 1817006 1899435 2197112 2619002 3033598 3303901 3335308 3135463
13460C135463l12797k73501j30256M4797J79933K06586Q8964j48067m26990o50802
$$ 3135463 2822666 2549165 2418909 2463706 2643639 2850225 2939189 2791122 2364132 1713330
13450A713330p37728o52189m14809q7547K45096N21173P40118R17990J023838
$$ 1713330 975602 323413 -91396 -178943 66153 587326 1327444 2245434 3269272
13441C269272J005214Q41374N28977P7823m39845q98152j192842j279426j169387
$$ 3269272 4274486 5115860 5644837 5722660 5282815 4384663 3191821 1912395 743008
13432G43008r23786o25770l36533q9644P8942J30943O1517p9666k14603k88022
$$ 743008 -180778 -806548 -1143081 -1232725 -1153783 -1022840 -961323 -1040989 -1255592 -1543614
13422a543614k75661j66940P310J53967J75589M9978j53549l28971m11521m06377
$$ -1543614 -1819275 -1986215 -1978905 -1824938 -1649349 -1599371 -1752920 -2081891 -2493412 -2899789
13412b899789l49611k75596k23868k25728k60115k61224j83941l0425J72598L79638
$$ -2899789 -3249400 -3524996 -3748864 -3974592 -4234707 -4495931 -4679872 -4710297 -4537699 -4158061
13402d158061N24452N53604M83072M02581L99467N04793P03787R47188J160622
$$ -4158061 -3633609 -3080005 -2596933 -2194352 -1794885 -1290092 -586305 360883 1521505
13393A521505J265306J197757R52830O12725K97181Q8648m283l0392l7084l6626
$$ 1521505 2786811 3984568 4937398 5550123 5847304 5935952 5931669 5901277 5864193 5827567
13383E827567l1330m9866j42714l34582n86880q09666r01455p92751m94155j11808
$$ 5827567 5796237 5746371 5603657 5269075 4682195 3872529 2971074 2178323 1684168 1572360
13373A572360K12175M00166M82848N36924N96981O39640O37650N99636N44354
$$ 1572360 1784535 2184701 2667549 3204473 3801454 4441094 5078744 5678380 6222734
13364F222734M53930K71726m8332m93099r78144j383436j614448j624131j399982
$$ 6222734 6676664 6948390 6900058 6406959 5428815 4045379 2430931 806800 -593182
13355e93182r80441m79009m3723K28264L35546L47967L52785L88891L95158K51610
$$ -593182 -1573623 -2052632 -2096355 -1868091 -1532545 -1184578 -831793 -442902 -47744 203866
13345B03866r4337n42876q88967r59463p30035l40932J1888K23837L12181L22197
$$ 203866 109529 -433347 -1322314 -2281777 -3011812 -3352744 -3340856 -3117019 -2804838 -2482641
13335b482641K66912J49834j3326j91772l39875m05742l29834o5189L39456O96150
$$ -2482641 -2215729 -2065895 -2079221 -2270993 -2610868 -3016610 -3346444 -3411633 -3072177 -2376027
13325b376027P87434N33500L9063m90997q59012r60399q24533n52898k12762J86804
$$ -2376027 -1588593 -1055093 -1016030 -1507027 -2366039 -3326438 -4150971 -4703869 -4916631 -4729827
13315d729827O31003J048186J346313J474932J425541J211450Q63149M30563M714
$$ -4729827 -4098824 -3050638 -1704325 -229393 1196148 2407598 3270747 3701310 3706024
13306C706024k87826l69989l06046k65177l68258n88539q06447r23134q97189
$$ 3706024 3418198 3048209 2742163 2476986 2108728 1520189 713742 -209392 -1106581
13297a106581p31454m88016k81110k08504k96820m96914o99090p74721o40719
$$ -1106581 -1838035 -2326051 -2607161 -2815665 -3112485 -3609399 -4308489 -5083210 -5723929
13288e723929l06524J10603M27375N16122L95242J72790o8121l00501n13566o79610
$$ -5723929 -6030453 -5919850 -5492475 -4976353 -4581111 -4408321 -4476442 -4776943 -5290509 -5970119
13278e970119p59715p30011n76849k83318J54340O99515J247750J641607J755641
$$ -5970119 -6729834 -7459845 -8036694 -8320012 -8165672 -7466157 -6218407 -4576800 -2821159
13269b821159J570999J168347O82407K63617K2158k0884R2691L16035N97973Q52903
$$ -2821159 -1250160 -81813 600594 864211 886369 865485 958176 1274211 1872184 2725087
13259B725087R88210R90120R48625R64291J051953J146079J177449J127813J018462
$$ 2725087 3713297 4703417 5652042 6616333 7668286 8814365 9991814 11119627 12138089
13250A2138089Q88975P93044P66072P99587Q59074Q98367Q62445P12005M54250
$$ 12138089 13027064 13820108 14586180 15385767 16244841 17143208 18005653 18717658 19171908
13241A9171908J43950j38578l20301l86314m03619m70877o40795q83975j114578
$$ 19171908 19315858 19177280 18856979 18470665 18067046 17596169 16955374 16071399 14956821
13232A4956821j254526j290402j267050j229123j186452j120751j011692q70673
$$ 14956821 13702295 12411893 11144843 9915720 8729268 7608517 6596825 5726152
13224E726152p49667p10996p87884r41787j034405q92632m59305J36762O89471
$$ 5726152 4976485 4265489 3477605 2535818 1501413 608781 149476 286238 975709
13215I75709J063416J225785J205617J060151Q46721O03839L62930J67322M7394
$$ 975709 2039125 3264910 4470527 5530678 6377399 6981238 7344168 7511490 7558884
13206G558884k4957j24238k92775m87467o24492o68565o49601n97403m96311l14702
$$ 7558884 7533927 7409689 7116914 6629447 6004955 5336390 4686789 4089386 3593075 3278373
13196C278373o9183J60775K93706L03288K12037N2189j47668l46647m93195n54065
$$ 3278373 3209190 3369965 3663671 3966959 4178996 4231185 4083517 3736870 3243675 2689610
13186B689610n34111m61238l63897k74807k21367j92910j62221j33654j25000
$$ 2689610 2155499 1694261 1330364 1055557 834190 641280 479059 345405 220405
13177B20405j26338j14295q3908k8143P6948K21217L24998K93713J03293j92444
$$ 220405 94067 -20228 -104136 -132279 -55331 165886 490884 784597 887890 695446
13167F95446n16373p92741r45434r26708p57149n27905l48341k73187k78990l15662
$$ 695446 179073 -613668 -1559102 -2485810 -3242959 -3770864 -4119205 -4392392 -4671382 -4987044
13157d987044l75652m83044o09182o47512n07009k14202J07468L61840N52518
$$ -4987044 -5362696 -5845740 -6454922 -7102434 -7609443 -7823645 -7716177 -7354337 -6801819
13148f801819P40173R67637J215022J416261J520340J515138J397889J153779
$$ -6801819 -6061646 -5094009 -3878987 -2462726 -942386 572752 1970641 3124420
13140C124420P77939L20169r7501l21520k60398L9553M24631P33056Q55596P47430
$$ 3124420 3902359 4222528 4125027 3803507 3543109 3582662 4007293 4740349 5595945 6343375
13130F343375M40216L6262l37511n85282o80053o65095o26231o55241p92176r78277
$$ 6343375 6783591 6819853 6482342 5897060 5217007 4551912 3925681 3270440 2478264 1499987
13120A499987j091851j042067q29875n35384k58793p4249r947m7106j44568k55308
$$ 1499987 408136 -633931 -1463806 -1999190 -2257983 -2332232 -2342179 -2389285 -2533853 -2789161
13110b789161l15337k59342p5506J80205M19098N45468M89507K60382m6457l17289
$$ -2789161 -3104498 -3363840 -3439346 -3259141 -2840043 -2294575 -1805068 -1544686 -1591143 -1908432
13100a908432m85527n29622m46233k45888L9653L41900N58282O29504O18425O43650
$$ -1908432 -2393959 -2923581 -3369814 -3615702 -3576049 -3234149 -2675867 -2046363 -1427938 -784288
13090g84288P42044Q59277R43655R77107R33379P79844N26772K30477n5270l11451
$$ -784288 -42244 817033 1760688 2737795 3671174 4451018 4977790 5208267 5152997 4841546
13080D841546n44463p60879r36883j011059r42722p70751n81999m21477k40124
$$ 4841546 4297083 3536204 2599321 1588262 645540 -125211 -707210 -1128687 -1368811
13071a368811N6679M88353R50960J315316J536354J641267J647945J531813J260156
$$ -1368811 -1312132 -823779 127181 1442497 2978851 4620118 6268063 7799876 9060032
13062I060032Q29524K72800l36748q77893j213225j258786j041488o91808l45715
$$ 9060032 9889556 10162356 9825608 8947715 7734490 6475704 5434216 4742408 4396693
13053D396693n0725K21296M94573P21159P86374N96768J73528l29714p20800q91770
$$ 4396693 4345968 4567264 5061837 5782996 6569370 7166138 7339666 7009952 6289152 5397382
13043E397382q45149o46958l93044j85329r1085j06382j51432j20789L2904K75935
$$ 5397382 4552233 3905275 3512231 3326902 3235817 3129435 2978003 2857214 2890118 3166053
13033C166053N44973P79761R23945R46875Q70781P51822O31570N17153L97760
$$ 3166053 3711026 4490787 5414732 6361607 7232388 7984210 8615780 9132933 9530693
13024I530693K67581J34245K2307k7550J5581J52764L76432O90248J088191J529185
$$ 9530693 9798274 9932519 9954826 9927276 9942857 10095621 10472053 11162301 12250492 13779677
13014A3779677J945611K272094K436636K310174J751204P79053l39982j255427
$$ 13779677 15725288 17997382 20434018 22744192 24495396 25274449 24934467 23679040
13006B3679040j786875j991154k032584k044827k079690k125008k149671k131365
$$ 23679040 21892165 19901011 17868427 15823600 13743910 11618902 9469231 7337866
12998G337866k048714j861826j527662j047370m84538O2947N09962Q10234R49930
$$ 7337866 5289152 3427326 1899664 852294 367756 430703 940665 1750899 2700829
12989B700829R40162Q13017O16155M18928L06264L38425N02381P01769Q11893
$$ 2700829 3640991 4454008 5070163 5489091 5795355 6133780 6636161 7337930 8149823
12980H149823P59799N52447K33553j56624n62532q94451j068976j059286q93957
$$ 8149823 8909622 9462069 9695622 9538998 8976466 8082015 7013039 5953753 5059796
12971E059796o33167l59083j60093r4426j64213l31780n38376o89890o82863n01039
$$ 5059796 4426629 4067546 3907453 3813027 3648814 3317034 2778658 2088768 1405905 904866
12961I04866k57892j13964j59081l59038n91196p30572p17003n50180k50268J27637
$$ 904866 646974 533010 373929 14891 -576305 -1306877 -2023880 -2574060 -2824328 -2696691
12951b696691M70929O63681O57354M79615K03108p4954k53867k71388j31750R6473
$$ -2696691 -2225762 -1562081 -904727 -425112 -222004 -296958 -550825 -822213 -953963 -857490
12941h57490L06545M12005M08150L76502M23420N84664P74183Q73610Q66995Q20045
$$ -857490 -550945 -138940 269210 645712 1069132 1653796 2427979 3301589 4168584 4988629
12931D988629P56074O32548M07391O1864l99120r11807j343763j565601j550137
$$ 4988629 5744703 6377251 6784642 6846506 6447386 5535579 4191816 2626215 1076078
12922A076078j382845j162423r22571o50772l32377L0999M08107P16007Q28556
$$ 1076078 -306767 -1469190 -2391761 -3042533 -3374910 -3343911 -2935804 -2219797 -1391241
12913a391241O53425K15104l45930q38806j102678j085408q69358n98203l56021
$$ -1391241 -737816 -522712 -868642 -1707448 -2810126 -3895534 -4764892 -5363095 -5719116
12904e719116j24075J40415M17839O38821P45696P07827N13188K06128q8339k40883
$$ -5719116 -5843191 -5702776 -5284937 -4646116 -3900420 -3192593 -2679405 -2473277 -2561616 -2802499
12894b802499k11729n4095J49870L44991N08729O32576P24216Q13498R26623J045215
$$ -2802499 -3014228 -3068323 -2918453 -2573462 -2064733 -1432157 -707941 105557 1032180 2077395
12884B077395J103460J051905R22206Q05855P71215Q09218Q59105Q74289Q35096
$$ 2077395 3180855 4232760 5154966 5960821 6732036 7541254 8400359 9274648 10109744
12875A0109744P18042N08323K31370p0718l88571p23070j018123j187066j201725
$$ 10109744 10827786 11336109 11567479 11496761 11108190 10385120 9366997 8179931 6978206
12866F978206j097834r29011p63153o76480p10375q45232j019971j173084j272599
$$ 6978206 5880372 4951361 4188208 3511728 2801353 1956121 936150 -236934 -1509533
12857a509533j305785j246649j051995o95758k09857K98117O82019Q54184Q47455
$$ -1509533 -2815318 -4061967 -5113962 -5809720 -6019577 -5721460 -5039441 -4185257 -3337802
12848c337802P61973O69296N75752M61322L38462K60491K74198L78622N30890
$$ -3337802 -2575829 -1906533 -1330781 -869459 -530997 -270506 3692 382314 913204
12839I13204O65559P16901O58873N19671L47345J81987N9723R70N250Q0198K44880
$$ 913204 1578763 2295664 2954537 3474208 3821553 4003540 4063263 4064233 4069483 4149681 4394561
12828D394561M93186P59723R29661R02433O47423K14592k71474o43972p55392
$$ 4394561 4887747 5647470 6577131 7479564 8126987 8341579 8070105 7426133 6670741
12819F670741n36810m4218N54597J061399J311720J200382P26980N1994n49920
$$ 6670741 6133931 6089713 6644310 7705709 9017429 10217811 10944791 10996785 10446865
12810A0446865q65982q76749p10441n20068m17483m54186o07657p91554q99530
$$ 10446865 9580883 8704134 7993693 7473625 7056142 6601956 5994299 5202745 4303215
12801D303215q66234p08335n03133l13313j40700K2071J37944J77561J75446J76355
$$ 4303215 3436981 2728646 2225513 1912200 1771500 1793571 1931515 2109076 2284522 2460877
12791B460877J50190J4983k46929n33984o98658o63954m54625j27918K76024P20638
$$ 2460877 2611067 2626050 2379121 1845137 1146479 482525 27900 -100018 176006 896644
12781H96644J161586J540260J772141J786404J597678J300605R88506P16001N21823
$$ 896644 2058230 3598490 5370631 7157035 8754713 10055318 11043824 11759825 12281648
12772A2281648M18863L58759K47091P650l57801p62319j086523j247456j230497
$$ 12281648 12700511 13059270 13306361 13314011 12956210 12193891 11107368 9859912 8629415
12763H629415j071418q32165o03782m78835m80963n53481o32460p06506p92217
$$ 8629415 7557997 6725832 6122050 5643215 5162252 4608771 3976311 3269805 2477588
12754B477588q71926q88773q18832p16245o45005n95224n07329l56619j79843
$$ 2477588 1605662 716889 -101943 -818188 -1463193 -2058417 -2565746 -2922365 -3102208
12745c102208l0143N8689P4707K2278r9778l08589n97103q80898j020446r36148
$$ -3102208 -3132351 -3073662 -2998955 -2976677 -3076455 -3385044 -3982147 -4863045 -5883491 -6819639
12735f819639o91289m36333k78854k19804j94809j42693l7450J15591K99077M90811
$$ -6819639 -7510928 -7947261 -8226115 -8445919 -8640728 -8783421 -8820871 -8705280 -8406203 -7915392
12725g915392O48853P08107O23298M27627K28120J21310J25857K01381K87935
$$ -7915392 -7266539 -6558432 -5935134 -5507507 -5279387 -5158077 -5032220 -4830839 -4542904
12716d542904L25878K85896K00583J43450J52105J96086K21585J82805N5086j24724
$$ -4542904 -4217026 -3931130 -3730547 -3587097 -3434992 -3238906 -3017321 -2834516 -2779430 -2904154
12706b904154k54361k50466j29091K5084J45369K09590K12207J66247J31968J84503
$$ -2904154 -3158515 -3408981 -3538072 -3512988 -3367619 -3158029 -2945822 -2779575 -2647607 -2463104
12696b463104L23435M46957M54458L58988K71538K90136M11698N45608O01344
$$ -2463104 -2139669 -1692712 -1238254 -879266 -607728 -317592 94106 639714 1241058
12687A241058N47287M22137L14824K87421L01079K56301J17162l3048q6874m9468
$$ 1241058 1788345 2210482 2525306 2812727 3113806 3370107 3487269 3454221 3367347 3317879
12677C317879l3459j11528k31174k88928k48496j58354o5877L2927J53615K73599
$$ 3317879 3284420 3172892 2941718 2652790 2404294 2245940 2180063 2212990 2366605 2640204
12667B640204L48660L73951L85325M01366M08123L87866L23971J96626J4687j68762
$$ 2640204 2988864 3362815 3748140 4149506 4557629 4945495 5269466 5466092 5480779 5312017
12657E312017l11602m28011n39818o15804o09946n37674m74624m78281n21938
$$ 5312017 5000415 4572404 4032586 3416782 2806836 2269162 1794538 1316257 794319
12648G94319n23531m32188k76935j41546q3364q2159q5183q0880r7102j41170
$$ 794319 270788 -161400 -438335 -579881 -663245 -745404 -830587 -911467 -1008569 -1149739
12638a149739j73797j34154J3771K39837M66475O51836Q25505J014520J161172
$$ -1149739 -1323536 -1457690 -1443919 -1204082 -737607 -85771 739734 1754254 2915426
12629B915426J152471R27021N24831M3055m15603p57959r22132r08714p76293
$$ 2915426 4067897 4994918 5519749 5562804 5147201 4389242 3467110 2558396 1782103
12620A782103o17259n46130o57430r40399j252880j423187j382563j174533q61019
$$ 1782103 1164844 618714 -38716 -979115 -2231995 -3655182 -5037745 -6212278 -7073297
12611g073297m89016j36030R3207J39022M2634p7009j11027j9998J84477M62913
$$ -7073297 -7562313 -7698343 -7605136 -7466114 -7423480 -7500489 -7611516 -7631514 -7447037 -6984124
12601f984124P38256R06407Q97429P51293O14206O27054Q15459J094737J367712
$$ -6984124 -6245868 -5339461 -4442032 -3690739 -3076533 -2449479 -1634020 -539283 828429
12592H28429J577909J669585J564484J213294O46260l6969o96747j181030j380886
$$ 828429 2406338 4075923 5640407 6853701 7499961 7462992 6766245 5585215 4204329
12583D204329j276111r24831m35471N3377M15693N80433N32354L15555M3613j61477
$$ 4204329 2928218 2003387 1567916 1621293 2036986 2617419 3149773 3465328 3508941 3347464
12573C347464k53825k65341k49513k45901k82525l72088m74220n00619l95345
$$ 3347464 3093639 2828298 2578785 2332884 2050359 1678271 1204051 703432 308087
12564C08087j85941N2329K58579M04218M78025M78219M17762L27776K45172J96093
$$ 308087 122146 174475 433054 837272 1315297 1793516 2211278 2539054 2784226 2980319
12554B980319J87592K04484K16727J90990J05052l4441k03638l89969n84418p51408
$$ 2980319 3167911 3372395 3589122 3780112 3885164 3850723 3647085 3257116 2672698 1921290
12544A921290q34665q14207p34948o45165n44078m22002l06846k39485k31938
$$ 1921290 1086625 272418 -462530 -1107695 -1651773 -2073775 -2380621 -2620106 -2852044
12535b852044k82976m11578o22209q36460r13210p65375m38934p9517J72628K75440
$$ -2852044 -3135020 -3546598 -4168807 -5005267 -5918477 -6683852 -7122786 -7202303 -7029675 -6754235
12525f754235K91807L08754L54064M04767M45994M87753N31640N39550M59170
$$ -6754235 -6462428 -6153674 -5799610 -5394843 -4948849 -4461096 -3929456 -3389906 -2930736
12516b930736K88922R5916l7222o3675J0016J21848J94714K15196K44778L23794
$$ -2930736 -2641814 -2545898 -2583120 -2646795 -2636779 -2514931 -2320217 -2105021 -1860243 -1536449
12506a536449L97368L82237K79278J66974J16222J54696K67525L92564M52006
$$ -1536449 -1139081 -756844 -477566 -310592 -194370 -39674 227851 620415 1072421
12497A072421M16146L26385K67602L15608M74025O49972P08405N67914K63509
$$ 1072421 1488567 1814952 2082554 2398162 2872187 3522159 4230564 4798478 5061987
12488E061987p0373k88395l26458k44345j87474k61763m39414o02874o51697n72254
$$ 5061987 4991614 4703219 4376761 4132416 3944942 3683179 3243765 2640891 1989194 1416940
12478A416940m38866l38290l06632l36108l79850l63827k58008j38345j40119
$$ 1416940 978074 639784 333152 -2956 -382806 -746633 -1004641 -1142986 -1283105
12469a283105l31542o42316r16807j017965q78482n05724J5655N35482Q93676
$$ -1283105 -1614647 -2256963 -3173770 -4191735 -5070217 -5575941 -5560286 -5024804 -4131128
12460d131128J006340R09190P23366N80161N43713N84577O31730O39773O04981
$$ -4131128 -3124788 -2215598 -1492232 -912071 -368358 216219 847949 1487722 2092703
12451B092703N33279M19886K58713M1539k41152n80893r46903j288748j527632
$$ 2092703 2625982 3045868 3304581 3346120 3104968 2524075 1577172 288424 -1239208
12442a239208j599237j527965j389518j203813r36362n85717k04709J51588M36315
$$ -1239208 -2838445 -4366410 -5755928 -6959741 -7896103 -8481820 -8686529 -8534941 -8098626
12433h098626N91709N99859N43791N52921O79121Q58109R90584J019760R36854
$$ -8098626 -7506917 -6907058 -6363267 -5810346 -5131225 -4273116 -3282532 -2262772 -1325918
12424a325918P73813N94688M54615L51103K30261N6822j49054l48214n04029n76749
$$ -1325918 -552105 42583 497198 848301 1078562 1135384 986330 638116 134087 -442662
12414d42662n46886m23873k04706J27367N35153R01702J090748J035113Q00814
$$ -442662 -989548 -1413421 -1618127 -1490760 -955607 -53905 1036843 2071956 2872770
12405B872770N61444M66067N32109O58702P00255N54580K36654j28668l96227
$$ 2872770 3434214 3900281 4432390 5091092 5791347 6345927 6582581 6453913 6057686
12396F057686m89843m25211k65735n6789J80773M00074N34296N59973N09818M21011
$$ 6057686 5567843 5142632 4876897 4820108 5000881 5400955 5935251 6495224 7005042 7426053
12386G426053K99704J50296J4592m7358o072J17687K72998M09879M78978M23736
$$ 7426053 7725757 7876053 7890645 7843287 7837215 7954902 8227900 8637779 9116757 9540493
12376I540493K23783n1196k85993m25344m90202n12109n07979n03472n38195o48006
$$ 9540493 9764276 9713080 9427087 9001743 8511541 7999432 7491453 6987981 6449786 5801780
12366E801780q41180j078974j285238j379678j318055j114422q06891m16779J7310
$$ 5801780 4960600 3881626 2596388 1216710 -101345 -1215767 -2022658 -2439437 -2422127
12357b422127L94486O07913O43668N80462N01039M44264M19551M09116L59170
$$ -2422127 -2027641 -1419728 -776060 -195598 305441 749705 1169256 1578372 1937542
12348A937542K06368p5568m49842q23015j077920j127365r67778o82801l78184
$$ 1937542 2143910 2068342 1618500 795485 -282435 -1409800 -2377578 -3060379 -3438563
12339c438563j14754Q9034K25583L18435M47615O83929R86340J198224J168865
$$ -3438563 -3553317 -3464283 -3238700 -2920265 -2472650 -1788721 -802381 395843 1564708
12330A564708Q79455M45129J6291l08395n04680o03720o66116p48757q43645q48282
$$ 1564708 2444163 2889292 2905583 2597188 2092508 1488788 822672 73915 -769730 -1618012
12320a618012o53524k67833J76568N38583P62173Q66453Q97137R00836Q99150
$$ -1618012 -2271536 -2539369 -2362801 -1824218 -1062045 -195592 701545 1602381 2501531
12311B501531Q70443P76727O01555L51219L8251l20429o87105r85857j124065
$$ 2501531 3371974 4148701 4750256 5101475 5139726 4819297 4132192 3146335 2022270
12302B022270j061621q49024n84295l40356j23314R7302L19138M94774N78975
$$ 2022270 960649 111625 -472670 -813026 -936340 -839038 -519900 -25126 553849
12293E53849N63632M74917L54067K45873J91010K12593L05169M37259N66048O62105
$$ 553849 1117481 1592398 1946465 2192338 2383348 2595941 2901110 3338369 3904417 4566522
12283D566522P30063P85239P99201O94050M14986J1230l73718o09910o78776o56924
$$ 4566522 5296585 6081824 6881025 7575075 7990061 8001291 7627573 7017663 6338887 5681963
12273E681963o11775n36546l91912j93882k7120M1042K2283k8430q2962j59136
$$ 5681963 5070188 4533642 4141730 3947848 3920728 3961770 3984053 3955623 3872661 3713525
12263C713525k78538m33669o01378p51247q30549p89460o42175m56380k76233
$$ 3713525 3434987 3001318 2399940 1648693 818144 28684 -613491 -1069871 -1346104
12254a346104j09984K3031Q7877O2236n5553k42794m33021n30184m71782k63229
$$ -1346104 -1456088 -1433057 -1345180 -1282944 -1338497 -1581291 -2014312 -2544496 -3016278 -3279507
12244c279507M4342L77018O49862P80818P15750M75431J64634r6357k42097k82262
$$ -3279507 -3235165 -2858147 -2208285 -1427467 -711717 -236286 -71652 -168009 -410106 -692368
12234f92368k77518k79514k91010k90979k74067k49736k25557k00081j81070k04961
$$ -692368 -969886 -1249400 -1540410 -1831389 -2105456 -2355192 -2580749 -2780830 -2961900 -3166861
12224c166861l00926m53867o25265p74754q60770q58462p76560o40103m64817
$$ -3166861 -3467787 -3921654 -4546919 -5321673 -6182443 -7040905 -7817465 -8457568 -8922385
12215h922385k52886N203L22180O82715J015832J211099J191098R88831P33437
$$ -8922385 -9175271 -9170068 -8847888 -8165173 -7149341 -5938242 -4747144 -3758313 -3024876
12206c024876N45697M61496M41745M15180L22385J56859k5849j46781j61296r7913
$$ -3024876 -2479179 -2017683 -1575938 -1160758 -838373 -681514 -707363 -854144 -1015440 -1113353
12196a113353l9763m4814j02325j75837k59353l76694n31531o79521p64875p62268
$$ -1113353 -1153116 -1197930 -1300255 -1476092 -1735445 -2112139 -2643670 -3323191 -4088066 -4850334
12186d850334o62961m59695j83480R1473L13092M78207N87071O21229N72648M67916
$$ -4850334 -5513295 -5972990 -6156470 -6064997 -5751905 -5273698 -4686627 -4065398 -3492750 -3024834
12176c024834L43425J90540l9047l63984p25446j004634j102869j012220p90970
$$ -3024834 -2681409 -2490869 -2529916 -2893900 -3619346 -4623980 -5726849 -6739069 -7530039
12167g530039m84954j07203L04854O62624Q92070R83664R55489Q12828N65112
$$ -7530039 -8014993 -8122196 -7817342 -7154718 -6262648 -5278984 -4323495 -3510667 -2945555
12158b945555K47004r7038m17655o45352p19882o40976m50714j86955R1445K75314
$$ -2945555 -2698551 -2795589 -3213244 -3858596 -4578478 -5219454 -5670168 -5857123 -5765678 -5490364
12148e490364K85106J46290o6950k95226m87575o09045o62721o78670o83788o73929
$$ -5490364 -5205258 -5058968 -5125918 -5421144 -5908719 -6517764 -7180485 -7859155 -8542943 -9216872
12138i216872o08567m63145k77831j17942j7136K5365L9108Q0630K03290M28631
$$ -9216872 -9825439 -10288584 -10566415 -10684357 -10701493 -10676128 -10637020 -10556390 -10353100 -9924469
12128i924469P41505J082386J354577J480229J464185J386225J319065J259334
$$ -9924469 -9182964 -8100578 -6746001 -5265772 -3801587 -2415362 -1096297 163037
12120A63037J125904Q20949L24614k58550p61418j064863j167220j168022j165361
$$ 163037 1288941 2109890 2434504 2175954 1414536 349673 -817547 -1985569 -3150930
12111c150930j165790j105247r21505o00083k05268J37851L32047L69693L16320
$$ -3150930 -4316720 -5421967 -6343472 -6943555 -7148823 -7010972 -6678925 -6309232 -5992912
12102e992912K71393L29193N22238P84767R86774J018542Q54278N51055K04289
$$ -5992912 -5721519 -5392326 -4870088 -4085321 -3098547 -2080005 -1225727 -674672 -470383
12093d70383j06931l58490n84012q42944j159078j462309j608254j481461j088478
$$ -470383 -577314 -935804 -1519816 -2362760 -3521838 -4984147 -6592401 -8073862 -9162340
12084i162340n55719l6536L79168O74115Q55236R33026R43887R44682R60650R65604
$$ -9162340 -9718059 -9754595 -9375427 -8701312 -7846076 -6913050 -5969163 -5024481 -4063831 -3098227
12074c098227R20383Q02333O19823M22992K73003K02084K10255K75490L70184
$$ -3098227 -2177844 -1375511 -755688 -332696 -59693 142391 352646 628136 998320
12065I98320M89775O52199Q51655J026309J079810R35017N96910J74910j83533
$$ 998320 1488095 2140294 2991949 4018258 5098068 6033085 6629995 6804905 6621372
12056F621372l89813m42835m00131l47757l42734l39178k07080J29018N73511
$$ 6621372 6231559 5788724 5388593 5040836 4698102 4358924 4151844 4280862 4854373
12047D854373R06392R43649O35341M6208o84440j364871j801676j882645j639287
$$ 4854373 5760765 6704414 7339755 7385963 6701523 5336652 3534976 1652331 13044
12038A3044j227705q26319n38589l70816k61859j31796O5624L19414N64379O96431
$$ 13044 -1214661 -2040980 -2579569 -2950385 -3212244 -3344040 -3278416 -2959002 -2394623 -1698192
12028a698192O31141L84791Q2516j36642k20958k13913j97001k38903l46698m33250
$$ -1698192 -1067051 -682260 -599744 -736386 -957344 -1171257 -1368258 -1607161 -1953859 -2387109
12018b387109l72444j24231J96442M03991M06528K74914J57703J36112J59617
$$ -2387109 -2759553 -2883784 -2687342 -2283351 -1876823 -1601909 -1444206 -1308094 -1148477
12009a148477J12449p2373l48349n80492o51588n65562m37902l88788m61632o09126
$$ -1148477 -1036028 -1108401 -1456750 -2037242 -2688830 -3254392 -3692294 -4081082 -4542714 -5151840
11999e151840p26329p04330m70210l4640M66927Q39815R78085R26036P97134O68385
$$ -5151840 -5878169 -6582499 -7052709 -7087349 -6620422 -5780607 -4802522 -3876486 -3079352 -2410967
11989b410967N55151M53800L69304K99274K30144J57970Q6707K4887O936P8908
$$ -2410967 -1855816 -1402016 -1032712 -733438 -503294 -345324 -258617 -233730 -226794 -147886
11979a47886K38651M09965M92030M46441L42677L00346L80702N53798P46731Q81528
$$ -147886 90765 500730 992760 1439201 1781878 2082224 2462926 3016724 3763455 4644983
11969D644983Q86099P15841L85616l4073m65618q53123j147670j303049j298887
$$ 4644983 5531082 6246923 6632539 6598466 6132848 5279725 4132055 2829006 1530119
11960A530119j155301r39783p50956o52400o48938p56701j021213j418065j796978
$$ 1530119 374818 -564965 -1315921 -1968321 -2617259 -3373960 -4395173 -5813238 -7610216
11951g610216j982182j924547j717167j461330j169374p95709l11060K51495Q00637
$$ -7610216 -9592398 -11516945 -13234112 -14695442 -15864816 -16660525 -16971585 -16720090 -15919453
11942a5919453J243502J538681J691540J717152J612702J368029J008336O16995
$$ -15919453 -14675951 -13137270 -11445730 -9728578 -8115876 -6747847 -5739511 -5122516
11934e122516L06375J48964J29309J61814J59638J00591L8388O0333K14874M55665
$$ -5122516 -4816141 -4667177 -4537868 -4376054 -4216416 -4115825 -4077437 -4017104 -3802230 -3346565
11924c346565O65654P39816O60416N27292M86422N86546P40496Q37995Q38389
$$ -3346565 -2680911 -1941095 -1280679 -753387 -266965 319581 1060077 1898072 2736461
11915B736461P39851N20707J70545k30874n21204n63262l34429P7147N31573Q90158
$$ 2736461 3476312 3997019 4167564 3936690 3415486 2852224 2517795 2594942 3126515 4016673
11905D016673J049900R84811P75729N56520M01796K76256Q8516k06920n45901
$$ 4016673 5066573 6051384 6827113 7383633 7785429 8061685 8150201 7943281 7397380
11896G397380p97508q69868p63761n51758l14806p5757J91493M72103O61857O31428
$$ 7397380 6599872 5730004 4966243 4414485 4099679 4023922 4215415 4687518 5349375 5980803
11886E980803L23056k00672p77089j231030j469241j502825j387695j168230q94117
$$ 5980803 6303859 6103187 5326098 4095068 2625827 1123002 -264693 -1432923 -2327040
11877b327040o51983n19608m86423m66268l99774l12866k72543l12374l87590
$$ -2327040 -2979023 -3498631 -3985054 -4451322 -4851096 -5163962 -5436505 -5748879 -6136469
11868f136469l95429k69840m4676J95849L92269N21236N82531N95178N77077N24442
$$ -6136469 -6531898 -6801738 -6846414 -6650565 -6258296 -5737060 -5154529 -4559351 -3982274 -3457832
11858c457832M25278K81827J07573q8909k98339m71900n26885m42991l12807k50991
$$ -3457832 -3032554 -2750727 -2643154 -2732063 -3030402 -3502302 -4029187 -4472178 -4784985 -5035976
11848e035976k82617l48316l84850l62226k79367j66172p5616o5239j75771l97032
$$ -5035976 -5318593 -5666909 -6051759 -6413985 -6693352 -6859524 -6935140 -7000379 -7176150 -7573182
11838g573182o51573q36779q99036q59218p68416o57138n22299l41804j17515
$$ -7573182 -8224755 -9061534 -9960570 -10819788 -11588204 -12245342 -12767641 -13109445 -13226960
11829a3226960R5675K46494L44971M21563M73384M84755M76118M95654N61499
$$ -13226960 -13131285 -12884791 -12539820 -12118257 -11644873 -11160118 -10684000 -10188346 -9626847
11820i626847O44376P00647P00484O32599M89093K62056k5404k95844m52409m56646
$$ -9626847 -8982471 -8281824 -7581340 -6948741 -6459648 -6197592 -6222996 -6518840 -6971249 -7427895
11810g427895l57287k45779k10201k81900l95214m47076l86185k23115j3187J62948
$$ -7427895 -7785182 -8030961 -8241162 -8523062 -8918276 -9365352 -9751537 -9974652 -9987839 -9824891
11800i824891K72237L78155N61918Q06256R85560R67293P35734M29617K37911
$$ -9824891 -9552654 -9174499 -8612581 -7806325 -6820765 -5853472 -5117738 -4688121 -4450210
11791d450210K52207M21460O16454P33764P68830P93837Q73771J011186J143944
$$ -4450210 -4198003 -3776543 -3160089 -2426325 -1657495 -863658 10113 1021299 2165243
11782B165243J188250J098349Q88513O16605L48433J03373j63978n04232r13851
$$ 2165243 3353493 4451842 5340355 5956960 6305393 6408766 6244788 5740556 4826705
11773D826705j338109j692060j880489j840293j579476j179649p57505l93934
$$ 4826705 3488596 1796536 -83953 -1924246 -3503722 -4683371 -5440876 -5834810
11765e834810j04560J10811K19562J65746o7124m04367p05315q52453q12730o04211
$$ -5834810 -5939370 -5828559 -5608997 -5443251 -5510375 -5914742 -6620057 -7472510 -8285240 -8889451
11755h889451k62533J29240M51254O35718P28139Q46256J060700J294581J367821
$$ -8889451 -9151984 -9022744 -8571490 -7935772 -7207633 -6361377 -5300677 -4006096 -2638275
11746b638275J161908P22826K18270j75131l62472l62563k77808k20525k44126
$$ -2638275 -1476367 -753541 -535271 -710402 -1072874 -1435437 -1713245 -1933770 -2177896
11737b177896l23048l95193m29711m53524n09466n88805o12830m95711k28965
$$ -2177896 -2500944 -2896137 -3325848 -3779372 -4288838 -4877643 -5490473 -5986184 -6215149
11728f215149R9398L51706M08264K35142q3634l83293n16991m52833k74749r1549
$$ -6215149 -6115751 -5764045 -5355781 -5120639 -5204273 -5587566 -6104557 -6557390 -6832139 -6923688
11718f923688L4787Q7093O3962l2462j77156l09457l77168l78159l36000k67354
$$ -6923688 -6888901 -6801808 -6737846 -6770308 -6947464 -7256921 -7634089 -8012248 -8348248 -8615602
11708h615602j87385j17262o4192j997J09063K68764L96353L60919Q6365l72613
$$ -8615602 -8802987 -8920249 -8984441 -8986438 -8877375 -8608611 -8212258 -7851339 -7764974 -8137587
11698h137587q64176j225922j346749j210433r07804n65866k73724p9979N445
$$ -8137587 -9001763 -10227685 -11574434 -12784867 -13692671 -14258537 -14532261 -14612240 -14606795
11689a4606795K1731L4633J04676K59475M64960O46507P43266P22745N87531M11205
$$ -14606795 -14585064 -14550431 -14445755 -14186280 -13721320 -13074813 -12331547 -11608802 -11021271 -10610066
11679a0610066L18657L79701N42721O92910P43005O70236N16657L65840L06332
$$ -10610066 -10291409 -9911708 -9368987 -8676077 -7933072 -7262836 -6746179 -6380339 -6074007
11670f074007L97576O38970R55585J236999J403828J429564J319352J088947P70650
$$ -6074007 -5676431 -5037461 -4081876 -2844877 -1441049 -11485 1307867 2396814 3167464
11661C167464M30300J50437j3541o3934n6702o6803j54903l47062o06018q12389
$$ 3167464 3597764 3748201 3734660 3670726 3614024 3547221 3392318 3045256 2439238 1626849
11651A626849q18285n58182j04863L79748P46861R29064R31214P86165N21202
$$ 1626849 808564 250382 145519 525267 1272128 2201192 3132406 3918571 4439773
$$ [...]
##END NTUPLES=NMR SPECTRUM
##END=
