##TITLE=31P ikalashn
DE-77k TFA
19.11.2024
##JCAMPDX= 6.0         $$ Bruker NMR JCAMP-DX V2.0
##DATA TYPE= NMR SPECTRUM
##DATA CLASS= NTUPLES
##ORIGIN= UXNMR, Bruker Analytische Messtechnik GmbH
##OWNER= root
$$ TOPSPIN		Version 1.3
$$ 2024-11-19 16:14:39.234 +0400  Irina@DPX200
$$ Compression mode = diff/dup
##.OBSERVE FREQUENCY= 81.01967998063
##.OBSERVE NUCLEUS= ^31P
##.ACQUISITION MODE= SIMULTANEOUS
##.ACQUISITION SCHEME= undefined
##.AVERAGES= 64
##.DIGITISER RES= 17
##SPECTROMETER/DATA SYSTEM= spect
##.PULSE SEQUENCE= zgpg
##.SOLVENT NAME= DMSO
##.SHIFT REFERENCE= INTERNAL, DMSO, 1, 298.5841
##AUDIT TRAIL= $$ (NUMBER, WHEN, WHO, WHERE, WHAT)
$$ ##TITLE= Audit trail, TOPSPIN		Version 1.3
$$ ##JCAMPDX= 5.01
$$ ##ORIGIN= Bruker BioSpin GmbH
$$ ##OWNER= Irina
$$ $$ F:/spectra/data/iren/nmr/P31dec/1/pdata/1/auditp.txt
$$ ##AUDIT TRAIL=  $$ (NUMBER, WHEN, WHO, WHERE, VERSION, WHAT)
(   1,<2024-11-19 16:14:10.031 +0400>,<Irina>,<DPX200>,<TOPSPIN 1.3>,
      <created by zg
	started at 2024-11-19 16:12:26.734 +0400,
	POWCHK disabled, PULCHK disabled
       configuration hash MD5:
       BE 6D 3F 07 2A EA 11 49 91 17 2B D3 AF B3 58 0D
       data hash MD5: 32K
       F1 05 20 4F ED 71 0A 63 FB F5 74 D0 B6 6E 1C 7F>)
(   2,<2024-11-19 16:14:10.703 +0400>,<Irina>,<DPX200>,<TOPSPIN 1.3>,
      <Start of raw data processing
       efp BC_mod = 2 LB = 10 FT_mod = 6 PKNL = 1 PHC0 = 256.2087 PHC1 = -68.95563 SI = 32K 
       data hash MD5: 32K
       24 66 E7 8E 92 7E A2 B6 9D 79 51 84 77 54 4B 5E>)
(   3,<2024-11-19 16:14:23.781 +0400>,<Irina>,<DPX200>,<TOPSPIN 1.3>,
      <apk 
       data hash MD5: 32K
       95 85 A8 23 3E D3 22 B4 02 53 9F 4D 26 F4 D7 72>)
(   4,<2024-11-19 16:14:25.875 +0400>,<Irina>,<DPX200>,<TOPSPIN 1.3>,
      <abs n ABSG = 5 
       data hash MD5: 32K
       DF 73 CB 2E 99 A5 8A AE 96 CF 2D 2A 85 F3 BE D1>)
$$ ##END=
$$ 
$$ $$ hash MD5
$$ $$ C7 AD D8 3A 34 08 53 26 35 25 B3 BD 02 52 33 F7
##$RELAX= 
##$RELAX= 
##$RELAX= 
##$RELAX= 
##$RELAX= 
##$RELAX= 
##$RELAX= 
##$RELAX= 
##$RELAX= 
##$RELAX= 
##$RELAX= 
$$ Bruker specific parameters
$$ --------------------------
##$DU= <F:/spectra>
##$EXPNO= 1
##$NAME= <P31dec>
##$PROCNO= 1
##$TYPE= <nmr>
##$USER= <iren>
##$AMP= (0..31)
100 100 100 100 100 100 100 100 100 100 100 100 100 100 100 100 100 100 
100 100 100 100 100 100 100 100 100 100 100 100 100 100 
##$ANAVPT= -1
##$AQSEQ= 0
##$AQ_mod= 1
##$AUNM= <au_zg>
##$AUTOPOS= <>
##$BF1= 81.014009
##$BF2= 200.13
##$BF3= 200.13
##$BF4= 200.13
##$BF5= 200.13
##$BF6= 200.13
##$BF7= 200.13
##$BF8= 200.13
##$BYTORDA= 1
##$CFDGTYP= 0
##$CFRGTYP= 5
##$CHEMSTR= <none>
##$CNST= (0..63)
1 1 145 1 1 1 1 1 1 1 1 1 1 1 1 1 1 1 1 1 1 1 1 1 1 1 1 1 1 1 1 1 1 1 
1 1 1 1 1 1 1 1 1 1 1 1 1 1 1 1 1 1 1 1 1 1 1 1 1 1 1 1 1 1 
##$CPDPRG= <waltz16>
##$CPDPRG1= <>
##$CPDPRG2= <waltz16>
##$CPDPRG3= <>
##$CPDPRG4= <mlev>
##$CPDPRG5= <mlev>
##$CPDPRG6= <mlev>
##$CPDPRG7= <mlev>
##$CPDPRG8= <mlev>
##$CPDPRGB= <>
##$CPDPRGT= <>
##$D= (0..63)
$$ [...]
##$SW_h= 37037.037037037
##$TD= 32768
##$TD0= 1
##$TE= 300
##$TE2= 300
##$TE3= 300
##$TEG= 300
##$TL= (0..7)
0 120 53 12 22 120 120 120 
##$TP= (0..7)
150 150 150 150 150 150 150 150 
##$TP07= 0
##$TPNAME0= <>
##$TPNAME1= <>
##$TPNAME2= <>
##$TPNAME3= <>
##$TPNAME4= <>
##$TPNAME5= <>
##$TPNAME6= <>
##$TPNAME7= <>
##$TPOAL= (0..7)
0.5 0.5 0.5 0.5 0.5 0.5 0.5 0.5 
##$TPOFFS= (0..7)
0 0 0 0 0 0 0 0 
##$TUNHIN= 0
##$TUNHOUT= 0
##$TUNXOUT= 0
##$USERA1= <user>
##$USERA2= <user>
##$USERA3= <user>
##$USERA4= <user>
##$USERA5= <user>
##$V9= 5
##$VALIST= <valist>
##$VCLIST= <CCCCCCCCCCCCCCC>
##$VD= 0
##$VDLIST= <DDDDDDDDDDDDDDD>
##$VPLIST= <PPPPPPPPPPPPPPP>
##$VTLIST= <TTTTTTTTTTTTTTT>
##$WBST= 1024
##$WBSW= 4
##$XGAIN= (0..3)
0 0 0 0 
##$XL= 0
##$YL= 0
##$YMAX_a= 9368
##$YMIN_a= -1483
##$ZGOPTNS= <>
##$ZL1= 120
##$ZL2= 120
##$ZL3= 120
##$ZL4= 120
##$ABSF1= 298.5841
##$ABSF2= -158.5842
##$ABSG= 5
##$ABSL= 5
##$ALPHA= 0
##$AQORDER= 0
##$ASSFAC= 0
##$ASSFACI= 0
##$ASSFACX= 0
##$ASSWID= 0
##$AUNMP= <proc_1d>
##$AXLEFT= 0
##$AXRIGHT= 0
##$AXTYPE= 0
##$AXUNIT= <>
##$AZFE= 0.1
##$AZFW= 0.5
##$BCFW= 0
##$BC_mod= 2
##$BYTORDP= 0
##$COROFFS= 0
##$CY= 12.5935478210449
##$DATMOD= 1
##$DC= 0
##$DFILT= <>
##$DTYPP= 0
##$F1P= 47.1127640792319
##$F2P= -24.0371245302204
##$FCOR= 0.5
##$FTSIZE= 32768
##$FT_mod= 6
##$GAMMA= 0
##$GB= 0
##$INTBC= 1
##$INTSCL= 7.269226e-011
##$ISEN= 30
##$LB= 10
##$LEV0= 0
##$LPBIN= 0
##$MAXI= 12.09355
##$MC2= 0
##$MEAN= 0
##$ME_mod= 0
##$MI= 0.7550151
##$NCOEF= 0
##$NC_proc= -11
##$NLEV= 6
##$NOISF1= 298.5841
##$NOISF2= 270.0111
##$NSP= 0
##$NTH_PI= 0
##$NZP= 0
##$OFFSET= 298.5841
##$PC= 1.4
##$PHC0= 261.9372
##$PHC1= -70.54639
##$PH_mod= 1
##$PKNL= yes
##$PPARMOD= 0
##$PPDIAG= 0
##$PPIPTYP= 0
##$PPMPNUM= 100
##$PPRESOL= 1
##$PSCAL= 0
##$PSIGN= 0
##$REVERSE= no
##$SF= 81.014009
##$SI= 32768
##$SIGF1= 270.0111
##$SIGF2= -158.5842
##$SINO= 77.54984
##$SIOLD= 32768
##$SREGLST= <31P.CDCl3>
##$SSB= 0
##$STSI= 32768
##$STSR= 0
##$SW_p= 37037.037037037
##$SYMM= 0
##$S_DEV= 0
##$TDeff= 32768
##$TDoff= 0
##$TI= <>
##$TILT= no
##$TM1= 0
##$TM2= 0
##$TOPLEV= 0
##$USERP1= <user>
##$USERP2= <user>
##$USERP3= <user>
##$USERP4= <user>
##$USERP5= <user>
##$WDW= 1
##$XDIM= 32768
##$YMAX_p= 299981217
##$YMIN_p= -9532981
$$ End of Bruker specific parameters
$$ ---------------------------------
##NTUPLES= NMR SPECTRUM
##VAR_NAME=  FREQUENCY,     SPECTRUM/REAL,   SPECTRUM/IMAG
##SYMBOL=    X,             R,               I
##VAR_TYPE=  INDEPENDENT,   DEPENDENT,       DEPENDENT
##VAR_FORM=  AFFN,          ASDF,            ASDF
##VAR_DIM=   32768,         32768,           32768
##UNITS=     HZ,            ARBITRARY UNITS, ARBITRARY UNITS
##FACTOR=    1.13031516577767, 1,            1
##FIRST=     37037.037037037, -553624,       -2439514
##LAST=      0,             1331424,         6291727
##MIN=       0,             -9532981,        0
##MAX=       37037.037037037, 299981217,     0
$$ Real data points
##PAGE= N=1
##DATA TABLE= (X++(R..R)), XYDATA
$$ [...]
17225a723336K62524K37284J90935J31435R8548J43907K25709K55670K38410K40756
$$ -1723336 -1460812 -1223528 -1032593 -901158 -802610 -658703 -432994 -177324 61086 301842
17215C01842K54586K03211Q1460j4088j4314L3450M8672R555p1992j65284k11778
$$ 301842 556428 759639 841099 827011 812697 846147 894819 904374 832382 667098 455320
17204D55320j75738p5473M6943J59147K49706L04972L03156K44990J66118J02993
$$ 455320 279582 204109 251052 410199 659905 964877 1268033 1513023 1679141 1782134
17194A782134O2377M4249N6986O3672k1255j96946l35336l49945k95544k90067
$$ 1782134 1844511 1888760 1945746 2009418 1988163 1791217 1455881 1105936 810392 520325
17184E20325m05839n94174p05251o23518l71896p4158J53343K68480K97090K79186
$$ 520325 114486 -479688 -1184939 -1808457 -2180353 -2254511 -2101168 -1832688 -1535598 -1256412
17174a256412K28903J61504J12067Q2578M2001j3831n8913p6544n9881L703J04881
$$ -1256412 -1027509 -866005 -753938 -671360 -629359 -643190 -702103 -778647 -838528 -834825 -729944
17163g29944K01481K62452K72079K00255N6533p0687r2093L093J41779K26410
$$ -729944 -528463 -266011 6068 206323 262856 192169 100076 103169 244948 471358
17153D71358K11103J21065K7637L003N6724J19668J26482Q3710L9529L1231N8415
$$ 471358 682461 803526 831163 834166 890890 1010558 1137040 1220750 1260279 1291510 1349925
17142A349925Q2763O1407j9385j37809k26524k03810p4713N9390J27541J33536
$$ 1349925 1432688 1494095 1474710 1336901 1110377 906567 831854 891244 1018785 1152321
17132A152321R1947J3273p4572j46451j86678j63088n3211J07920K49119L31335
$$ 1152321 1244268 1257541 1182969 1036518 849840 686752 633541 741461 990580 1321915
17122A321915L47480K67713N6331k54381n47454p02793o94203n82885m15803j94331
$$ 1321915 1669395 1937108 1993439 1739058 1191604 488811 -205392 -788277 -1204080 -1398411
17112a398411N0534K49808L66527L91624L22357K10491J44666J50549J74970J73358
$$ -1398411 -1347877 -1098069 -731542 -339918 -17561 192930 337596 488145 663115 836473
17102H36473J47443J08808L8592j15083l56325n81138o74096o18928m68888k77557
$$ 836473 983916 1092724 1131316 1016233 659908 78770 -595326 -1214254 -1683142 -1960699
17092a960699q9398N7968J41882J56539J20162O0986k4687j44331k49915k78542
$$ -1960699 -2050097 -1992129 -1850247 -1693708 -1573546 -1512560 -1537247 -1681578 -1931493 -2210035
17082b210035k18696j12142j2274M4149L7236k6093r7568j11183l0161J12680
$$ -2210035 -2428731 -2540873 -2553147 -2508998 -2471762 -2497855 -2595423 -2706606 -2736767 -2624087
17072b624087K19837K16397J26883L3291J437N8904J75261K58295K47271J81578
$$ -2624087 -2404250 -2187853 -2060970 -2027679 -2026242 -1967338 -1792077 -1533782 -1286511 -1104933
17062a104933J29727J14883J05422L7826j06319k41614k61567j53005K3995K00843
$$ -1104933 -975206 -860323 -754901 -717075 -823394 -1065008 -1326575 -1479580 -1455585 -1254742
17052a254742L26226L88125L87582L09365J66595L0253k8083j0986j8471j45129
$$ -1254742 -928516 -540391 -152809 156556 323151 353404 325321 314335 295864 150735
17042A50735l38562m46714l89263k03927K9662K56544M49721N78576O06495N15926
$$ 150735 -187827 -634541 -1023804 -1227731 -1198069 -941525 -491804 86772 693267 1209193
17032A209193L21460P7272j30188k39031k64299k75941l15650l36747k65604r6028
$$ 1209193 1530653 1607925 1477737 1238706 974407 698466 382816 46069 -219535 -315563
17022c15563J15798K94283L83460L68088K69612J49161O4557N484r3904k80360
$$ -315563 -199765 94518 477978 846066 1115678 1264839 1329396 1334880 1240976 960616
17012I60616n19140p05522p47385o33950m11130j29299J47528L36925L76294K62053
$$ 960616 441476 -264046 -1011431 -1645381 -2056511 -2185810 -2038282 -1701357 -1325063 -1063010
17002a063010O7075j08432k04071k23619k11033j96723j72801r7733O4516K78599
$$ -1063010 -995935 -1104367 -1308438 -1532057 -1743090 -1939813 -2112614 -2210347 -2145831 -1867232
16992a867232M45932M88659M25067L37769K83979K76917K96473K96166K44501
$$ -1867232 -1421300 -932641 -507574 -169805 114174 391091 687564 983730 1228231
16983A228231J62153P7478l5481j94239l41368l99468l30756j50279Q0236K84750
$$ 1228231 1390384 1467862 1432381 1238142 896774 497306 166550 16271 96507 381257
16973C81257M01690M05143L20609K18409J75202K20735L17578L98044M16869L50730
$$ 381257 782947 1188090 1508699 1727108 1902310 2123045 2440623 2838667 3255536 3606266
16963C606266J98712k390k12047m13484n83262o92817p26282o67827n34197l93838
$$ 3606266 3804978 3802588 3590541 3177057 2593795 1900978 1174696 506869 -27328 -421166
16953d21166k75961j22122Q8543K62696L09574K45001J69024J80188K88609M08918
$$ -421166 -697127 -819249 -730706 -468010 -158436 86565 255589 435777 724386 1133304
16943A133304M59693M47251M13922L52344K27686O2481o8407j22346j33514j75916
$$ 1133304 1592997 2040248 2454170 2806514 3034200 3096681 3028274 2905928 2772414 2596498
16933B596498k71166l47515l11536j54285L3938J58499K06488K00929J25862m7515
$$ 2596498 2325332 1977817 1666281 1511996 1545934 1704433 1910921 2111850 2237712 2190197
16923B190197l02560n65244p34480p40346n79363l11227k9709J77664K67199K54056
$$ 2190197 1887637 1322393 587913 -152433 -731796 -1043023 -1072732 -895068 -627869 -373813
16913c73813J80850Q4897q476q9125j70781k63466l37025l47957k93325k18606
$$ -373813 -192963 -108066 -116542 -205667 -376448 -639914 -976939 -1324896 -1618221 -1836827
16903a836827j55351p7752L3367J27408J58862J76575K44238L32782L50705K48743
$$ -1836827 -1992178 -2069930 -2036563 -1909155 -1750293 -1573718 -1329480 -996698 -645993 -397250
16893c97250O8742j19349k66129l19917k69326j93533j61968j49397r8183L045
$$ -397250 -328508 -447857 -713986 -1033903 -1303229 -1496762 -1658730 -1808127 -1906310 -1903265
16883a903265J24405K34387L10696L15328K09953J5342j95526l51779m05554l35542
$$ -1903265 -1778860 -1544473 -1233777 -918449 -708496 -693154 -888680 -1240459 -1646013 -1981555
16873a981555j81578m0397J8826P626m912M2363J39599K33397L07374L84268M65855
$$ -1981555 -2163133 -2203530 -2184704 -2177078 -2181990 -2139627 -2000028 -1766631 -1459257 -1074989 -609134
16862f09134N19559N34213N39338N57333N75706N74483N44008M58847K85342K4624
$$ -609134 -89575 444638 983976 1541309 2117015 2691498 3235506 3694353 3979695 4004319
16852D004319k61862m88896o15688o48492n86027l98462r0764K55654N56626P69329
$$ 4004319 3742457 3253561 2637873 1989381 1403354 1004892 914128 1169782 1726408 2495737
16842B495737Q49131P47505M62285P4603k67805m25598l52947j28721J13603K75431
$$ 2495737 3344868 4092373 4554658 4629261 4361456 3935858 3582911 3454190 3567793 3843224
16832C843224L12123K38592J19040K5832n653K90l104k9726p0016j19743j71213
$$ 3843224 4155347 4393939 4512979 4538811 4533158 4533448 4530344 4500618 4430602 4310859 4139646
16821D139646k11135k36336k48963k40873k10964j75728j56919j74295k27282
$$ 4139646 3928511 3692175 3443212 3202339 2991375 2815647 2658728 2484433 2257151
16812B257151k83238k80699j65887L3509K00002K38329J34703r5008m08233p31970
$$ 2257151 1973913 1693214 1527327 1560836 1760838 1999167 2133870 2038862 1630629 898659
16802H98659r95311j148003j175461j082209q78253o02985l09174l7510J66835
$$ 898659 -96652 -1244655 -2420116 -3502325 -4380578 -4983563 -5292737 -5330247 -5163412
16793e163412K76484L02104K68510K17305K07941K62835L40287L98770M59606
$$ -5163412 -4886928 -4584824 -4316314 -4099009 -3891068 -3628233 -3287946 -2889176 -2429570
16784b429570N60709O65311O79493N72723M27621L41087L38826L93807M55602
$$ -2429570 -1868861 -1203550 -524057 48666 476287 817374 1156200 1550007 2005609
16775B005609M64097L85425K18273k059j78211k07278q9612O5863J46219J21100
$$ 2005609 2469706 2855131 3073404 3071345 2893134 2685856 2596244 2662107 2808326 2929426
16765B929426K8146r7427k38160l55012m12448m14169l75480l11481k51607k22859
$$ 2929426 2957572 2860145 2621985 2266973 1854525 1440356 1064876 753395 501788 278929
16755B78929k03635j68793j59856k23146l43648m55805m88184m07799k25982J4450
$$ 278929 75294 -93499 -253355 -476501 -820149 -1275954 -1764138 -2171937 -2397919 -2383469
16745b383469K31167L27845K76970J71800J46680K47069M09513N38546N77278
$$ -2383469 -2152302 -1824457 -1547487 -1375687 -1229007 -981938 -572425 -33879 543399
16736E43399N21397M02603K64826J48921P7905N2417P5178J42203K05263J96756
$$ 543399 1064796 1467399 1732225 1881146 1959051 2011468 2086646 2228849 2434112 2630868
16726B630868R6909n4664k09857l48226m56430n00185m47183l06615j24865M0478
$$ 2630868 2727777 2673113 2463256 2115030 1658600 1158415 711232 404617 279752 320230
16716C20230J49504K05098K39285K72387K79435J98889J2687j83343k48193j36559
$$ 320230 469734 674832 914117 1186504 1465939 1664828 1677515 1494172 1245979 1109420
16706A109420N6598J72252J02046j31381l76436m79623m16908k70542j35178p3167
$$ 1109420 1166018 1338270 1440316 1308935 932499 452876 35968 -234574 -369752 -442919
16696d42919j09123k32588l89532m89018m63149l20900j42241j7620L6405Q7638
$$ -442919 -552042 -784630 -1174162 -1663180 -2126329 -2447229 -2589470 -2607090 -2570685 -2483047
16686b483047K01532L47634M08562L11850J01891j27969l04956l85251l50213
$$ -2483047 -2281515 -1933881 -1525319 -1213469 -1111578 -1239547 -1544503 -1929754 -2279967
16677b279967k19248n2521Q4617J46722J08904q666j36841k07310j83205o1845
$$ -2279967 -2499215 -2551736 -2467119 -2320397 -2211493 -2220159 -2357000 -2564310 -2747515 -2809360
16667b809360J10470K57116L22487L01902K33996J45660J1991j83619l84907n11269
$$ -2809360 -2698890 -2441774 -2119287 -1817385 -1583389 -1437729 -1425738 -1609357 -1994264 -2505533
16657b505533n20752m09241j97406P4724L56101N89608P19041O99481N25115K53762
$$ -2505533 -3026285 -3435526 -3632932 -3558208 -3202107 -2612499 -1893458 -1193977 -668862 -415100
16647d15100k0963k17218k86186k22013q8955L510j285o3496j17702j36241j13062
$$ -415100 -436063 -653281 -939467 -1161480 -1250435 -1246925 -1248210 -1311706 -1429408 -1565649 -1678711
16636a678711n3074J8451P6899J20157J48015J78515K67761M30220N54762M99722
$$ -1678711 -1731785 -1713334 -1636435 -1516278 -1368263 -1189748 -921987 -491767 62995 562717
16626E62717K70644R645j39104j22072N240J33317J80220J35932M3333m0871o4964
$$ 562717 833361 843006 703902 581830 587070 720387 900607 1036539 1079872 1039001 974037
16615I74037j1241P6006J39739J62388J32143M7148m8907j36587k70152m99208
$$ 974037 962796 1038802 1178541 1340929 1473072 1520220 1471313 1334726 1064574 565366
16605E65366p75687r70526r79898p97744m91478j38484K00865M70569O07419N72878
$$ 565366 -210321 -1180847 -2160745 -2958489 -3449967 -3588451 -3387586 -2917017 -2309598 -1736720
16595a736720M11006K28270J07854P0351Q2753R9826J10435J28079J39200R4058
$$ -1736720 -1325714 -1097444 -989590 -919239 -836486 -736660 -626225 -498146 -358946 -264888
16585b64888l7691k29959m13960n24356n51252n27614m65629l55585k21554j57056
$$ -264888 -302579 -532538 -946498 -1470854 -2022106 -2549720 -3015349 -3370934 -3592488 -3749544
16575c749544k40843m11273n19228m86725l21184n5090K31539M37101N14788M68767
$$ -3749544 -3990387 -4401660 -4920888 -5407613 -5728797 -5783887 -5552348 -5115247 -4600459 -4131692
16565d131692L36749J86548P1610j988m6629n1761K3535K25867N33952Q19469
$$ -4131692 -3794943 -3608395 -3536785 -3538773 -3585402 -3637163 -3613628 -3387761 -2853809 -2034340
16555b034340R34158Q17590N12321J38123j59223k93750k67851j44391m317J11088
$$ -2034340 -1100182 -282592 229729 367852 208629 -85121 -352972 -497363 -501680 -390592
16545c90592K08303K89326L19156K57247J12505p7430k83428m58032n46771n13287
$$ -390592 -182289 107037 426193 683440 795945 718515 435087 -22945 -569716 -1083003
16535a083003l40127n7942K32212M17129M61840M17356L57876L16358K93803K86587
$$ -1083003 -1423130 -1481072 -1248860 -831731 -369891 47465 405341 721699 1015502 1302089
16525A302089K66186J87953M6799r9330j83822j93732j61936j29667j25133j50233
$$ 1302089 1568275 1756228 1803027 1703697 1519875 1326143 1164207 1034540 909407 759174
16515G59174j79794j84381j50415q9773l0947K1047Q1156J21446R9419L2730k6465
$$ 759174 579380 394999 244584 154811 123864 144911 226067 347513 446932 479662 453197
16504D53197m5401k2107K1638M6248K6885j7811o3067j19770k05713k98534l42581
$$ 453197 407796 385689 407327 453575 480460 462649 399582 279812 74099 -224435 -567016
16493e67016l10011k35391j60919q3761J8738J36239K21814K50028K44760K34032
$$ -567016 -877027 -1112418 -1273337 -1357098 -1338360 -1202121 -980307 -730279 -485519 -251487
16483b51487K14166J69806J08412M5243k6986j03883j48508j40580j14119j23049
$$ -251487 -37321 132485 240897 286140 259154 155271 6763 -133817 -247936 -370985
16473c70985j82390k53005k76231k34148j77584j82018k54833l37873m36449o20466
$$ -370985 -553375 -806380 -1082611 -1316759 -1494343 -1676361 -1931194 -2269067 -2705516 -3325982
16463c325982q65172r82724p66801k26276L48622O80617P73993P61942P14731
$$ -3325982 -4191154 -5173878 -5940679 -6166955 -5818333 -5137716 -4363723 -3601781 -2887050
16454b887050O53269N92860N37943M71308L55340J58433p5143k38077k85016k54444
$$ -2887050 -2233781 -1640921 -1102978 -631670 -276330 -117897 -193040 -431117 -716133 -970577
16444i70577j88334j12050k5647Q6795J86421J78628K3825j98654l54759l59468
$$ -970577 -1158911 -1270961 -1296608 -1209813 -1023392 -844764 -820939 -1019593 -1374352 -1733820
16434a733820k24056j9648J91825L71714M81917N08282M71751L86270K51497R0996
$$ -1733820 -1957876 -1977524 -1785699 -1413985 -932068 -423786 47965 434235 685732 776728
16424G76728n0012j24784q1209Q5877K85700M00513L91341K97616J52068j8952
$$ 776728 726716 601932 520723 606600 892300 1292813 1684154 1981770 2133838 2114886
16414B114886j59028k40219k92113l51135m23729m53978l34148l2153L09067N02960
$$ 2114886 1955858 1715639 1423526 1072391 648662 194684 -139464 -171617 137450 640410
16404F40410N37207N23967M88452L74667J69344j10674m29893o85503p61698o42528
$$ 640410 1177617 1701584 2190036 2564703 2734047 2623373 2193480 1507977 746279 103751
16394A03751m43443l27033l84775o00664q42156q91792o48624k63588L3570J56780
$$ 103751 -339692 -666725 -1051500 -1652164 -2494320 -3386112 -4034736 -4298324 -4264754 -4107974
16384d107974J71387J53903J14738M9819k9042j15231j97179k48977k22556p5863
$$ -4107974 -3936587 -3782684 -3667946 -3618127 -3647169 -3762400 -3959579 -4208556 -4431112 -4506975
16374d506975J54620L63261M71755M71482L78390K21892O2167k2130m60M1390
$$ -4506975 -4352355 -3989094 -3517339 -3045857 -2667467 -2445575 -2383408 -2405538 -2405998 -2364608
16364b364608j8796j85339l27464l17697j69603r612Q1166J29194J76304K08764
$$ -2364608 -2383404 -2568743 -2896207 -3213904 -3383507 -3393119 -3311953 -3182759 -3006455 -2797691
16354b797691J98793J55409Q5871j9899j23012j38165m7144O4269J12920Q0345
$$ -2797691 -2598898 -2443489 -2357618 -2377517 -2500529 -2638694 -2685838 -2621569 -2508649 -2428304
16344b428304k2737j76059l43037m78093n38386n09177m15249k89299j61061o9421
$$ -2428304 -2451041 -2627100 -2970137 -3448230 -3986616 -4495793 -4911042 -5200341 -5361402 -5430823
16334e430823j1632N2847J10109J22900J15959J49833K56265M20724N93847P23465
$$ -5430823 -5442455 -5389608 -5279499 -5156599 -5040640 -4890807 -4634542 -4213818 -3619971 -2896506
16324b896506P88024P93817P42410O25079M52190K58554J02339M9541J22531K87881
$$ -2896506 -2108482 -1314665 -572255 52824 505014 763568 865907 915448 1037979 1325860
16314A325860M99532P32643R82987J220051J316286J060824L56255n49874j213777
$$ 1325860 1825392 2558035 3541022 4761073 6077359 7138183 7494438 6944564 5730787
16305E730787j434303j337801j117587q68732o07276l48031j31152J6217R9593
$$ 5730787 4296484 2958683 1841096 972364 365088 17057 -114095 -97878 1715
16296A715J35292J44087J46665J38396Q1007m5964j72843j89437q2313M8493R1432
$$ 1715 137007 281094 427759 566155 647162 601198 428355 238918 156605 205098 296530
16285B96530K6430o4541j02688j01930j25282j81257k25808k35249k05746j30355
$$ 296530 322960 258419 155731 53801 -71481 -252738 -478546 -713795 -919541 -1049896
16275a049896k8269O0993J21018J38972Q2263l8497j52602k05199j92916j55624
$$ -1049896 -1078165 -1017172 -896154 -757182 -674919 -713416 -866018 -1071217 -1264133 -1419757
16265a419757j45157j72072j86605j25829J6077J79578K84519K83767J88129M5140
$$ -1419757 -1564914 -1736986 -1923591 -2049420 -2033343 -1853765 -1569246 -1285479 -1097350 -1052210
16255a052210q1864j39667j08613J0323J92622L67402M47655L79013J63697j29887
$$ -1052210 -1134074 -1273741 -1382354 -1372031 -1179409 -812007 -364352 14661 178358 48471
16245D8471l91107n30542n33804m46386l36420k68024k53824k40080j61683j3240
$$ 48471 -342636 -873178 -1406982 -1853368 -2189788 -2457812 -2711636 -2951716 -3113399 -3126639
16235c126639J48202K62578L12621L07356K50265J56402P0060M5666J03110J83887
$$ -3126639 -2978437 -2715859 -2403238 -2095882 -1845617 -1689215 -1619155 -1573489 -1470379 -1286492
16225a286492J93209J00789l4298j19827j20623j04324j42984j82617j12537O3928
$$ -1286492 -1093283 -992494 -1026792 -1146619 -1267242 -1371566 -1514550 -1697167 -1809704 -1745776
16215a745776K19678K53123J97288J60225J86957K27486K14206J12656n3725k06241
$$ -1745776 -1526098 -1272975 -1075687 -915462 -728505 -501019 -286813 -174157 -227882 -434123
16205d34123k73144k49391j91504j41432p6012K9568J47489K22994K05675R5360
$$ -434123 -707267 -956658 -1148162 -1289594 -1365606 -1336038 -1188549 -965555 -759880 -664520
16195f64520m3102j37698j55191r6671K1964J64046K77675L41028L62791L34923
$$ -664520 -707622 -845320 -1000511 -1097182 -1075218 -911172 -633497 -292469 70322 405245
16185D05245K56620J65830P6696m0349j93357l30885l61149k30923J1798K74692
$$ 405245 661865 827695 904391 864042 670685 339800 -21349 -252272 -240474 34218
16175C4218N04294O65965P10253O23822M57310K71133R1967p5558k35031l99694
$$ 34218 538512 1204477 1914730 2538552 2995862 3266995 3358962 3283404 3048373 2648679
16165B648679n57005o37274n84103m33963k54196n1120J84522L85630M33279K70889
$$ 2648679 2091674 1454400 870297 436334 182138 131018 315540 701170 1134449 1405338
16155A405338l4915l44564n42571o05132n76000m78757l11472j12489N8505J77999
$$ 1405338 1370423 1025859 483288 -121844 -697844 -1176601 -1488073 -1600562 -1542057 -1364058
16145a364058K37603K32589J89851J40619P6364l0225j71116k92558l26044k32378
$$ -1364058 -1126455 -893866 -704015 -563396 -487032 -517257 -688373 -980931 -1306975 -1539353
16135a539353m3512J59009L07401L73334L53688K45033N3528j76482l65321m45788
$$ -1539353 -1582865 -1423856 -1116455 -743121 -389433 -144400 -90872 -267354 -632675 -1078463
16125a078463m12185k97885j29918M8831J58295J55376Q4289P138o7702j61736
$$ -1078463 -1490648 -1788533 -1918451 -1869620 -1711325 -1555949 -1471660 -1464522 -1532224 -1693960
16115a693960k55564k80740j95931k8260J72791L68526N28874O30440O48320N63495
$$ -1693960 -1949524 -2230264 -2426195 -2454455 -2281664 -1913138 -1384264 -753824 -105504 457991
16105D57991L77494J26822j27140l31178m62340n30086n30605m33843k36884j6068
$$ 457991 835485 962307 835167 503989 41649 -488437 -1019042 -1452885 -1689769 -1705837
16095a705837J12141J09464L2650o3428j55074k21987k67298l12791l19531j92208
$$ -1705837 -1593696 -1484232 -1451582 -1515010 -1670084 -1892071 -2159369 -2472160 -2791691 -2983899
16085b983899R2373M22939O43825O78361N52849L23175K6948k62410m02264l04450
$$ -2983899 -2891526 -2468587 -1824762 -1146401 -593552 -270377 -243429 -505839 -908103 -1212553
16075a212553n8052J42377J67908L9813j17734j86357j20835N7338K80309M43503
$$ -1212553 -1270605 -1128228 -960320 -920507 -1038241 -1224598 -1345433 -1288095 -1007786 -564283
16065e64283M62099L47179J99107J11058R7931J12152Q5117k9027k20862m26547
$$ -564283 -102184 244995 444102 555160 653091 765243 850360 821333 600471 173924
16055A73924n52652n26833l49021q6403J86163M15240N44699N35643M27751L11060
$$ 173924 -378728 -905561 -1254582 -1340985 -1154822 -739582 -194883 340760 768511 1079571
16045A079571K52247K64446L19051L71395L69124K77283J18664l5935j42557k02039
$$ 1079571 1331818 1596264 1915315 2286710 2655834 2933117 3051781 3015846 2873289 2671250
16035B671250k16612j83255j09073l2379j5381r1838k29227l51836m08205l97705
$$ 2671250 2454638 2271383 2162310 2129931 2114550 2022712 1793485 1441649 1033444 635739
16025F35739l40765k70678k34021k50335l00215l74756m72376n55802n71769m89041
$$ 635739 294974 24296 -209725 -460060 -760275 -1135031 -1607407 -2163209 -2734978 -3224019
16015c224019l16140r6480J15331K66086L15536K61351J32131k9425j55848j82725
$$ -3224019 -3540159 -3636639 -3521308 -3255222 -2939686 -2678335 -2546204 -2575629 -2731477 -2914202
16005b914202j17325k5461M3336R4399J82903L37673M92993N40954M24831J85862
$$ -2914202 -3031527 -3056988 -3013652 -2919253 -2736350 -2398677 -1905684 -1364730 -939899 -754037
15995g54037m6570j46421q8946O4582K27898L16825L05524K51741K08422J55068
$$ -754037 -800607 -947028 -1035974 -971392 -743494 -426669 -121145 130596 339018 494086
15985D94086N6700o5986j68698k16836j85106p5970O8616J69341J57930M1831
$$ 494086 550786 484800 316102 99266 -85840 -161810 -93194 76147 234077 275908
15975B75908r9754j86278j95293j35237l0261N6262Q5927J01915J61282K55742
$$ 275908 176154 -10124 -205417 -340654 -370915 -314653 -228726 -126811 34471 290213
15965B90213L21737L01990J84717K5004q9355j25852j21686j15188j12112j10028
$$ 290213 611950 913940 1098657 1123661 1034306 908454 786768 671580 559468 449440
15955D49440j03555p2311K412J23679K75176M11537M80110M73096M37130M14092
$$ 449440 345885 273574 275986 399665 674841 1086378 1566488 2039584 2476714 2890806
15945B890806L80765K73395P7109j50415l48423m80411n20828m82382m15517l69266
$$ 2890806 3271571 3544966 3622075 3471660 3123237 2642826 2121998 1639616 1224099 854833
15935H54833l69420m08493m57796m86368m64760l84791k92417k42897k16530j36052
$$ 854833 485413 76920 -380876 -867244 -1332004 -1716795 -2009212 -2252109 -2468639 -2604691
15925b604691L5903K43622L83551M06992L56065K95959K41353J65391P6284L0466
$$ -2604691 -2568788 -2325166 -1941615 -1534623 -1178558 -882599 -641246 -475855 -399571 -369105
15915c69105N1726R8579J19421R4541K7492o6871j50065j79255j77833k25587
$$ -369105 -317379 -218800 -99379 -4838 22654 -44217 -194282 -373537 -551370 -776957
15905g76957l53242n09938o15724o24006n55960m58045l41706j72173R1643L99467
$$ -776957 -1130199 -1640137 -2255861 -2879867 -3435827 -3893872 -4235578 -4407751 -4316108 -3916641
15895c916641O21928O91299O41618N52529N02300N28445N99376O35007N55920
$$ -3916641 -3294713 -2603414 -1961796 -1409267 -906967 -378522 220854 855861 1411781
15886A411781L26096k1079l82047o33393p25652p10025o63918o05853n11482l79335
$$ 1411781 1737877 1716798 1334751 701358 -24294 -734319 -1398237 -2004090 -2515572 -2894907
15876b894907k30002j01406k8621Q438O7286J63262K46336K76866K70443K51746
$$ -2894907 -3124909 -3226315 -3254936 -3246498 -3179212 -3015950 -2769614 -2492748 -2222305 -1970559
15866a970559K28551J98029J55878J20872J20522J39426J43052J33122J26499
$$ -1970559 -1742008 -1543979 -1388101 -1267229 -1146707 -1007281 -864229 -731107 -604608
15857f04608J18289R6084O7756M6497K5950j0657p3605j45869j86061j60319p8558
$$ -604608 -486319 -390235 -322479 -275982 -250032 -260689 -334294 -480163 -666224 -826543 -905101
15846i05101q86L8809O1832O4255J9814n2394j14765j49783j41731p9150m981
$$ -905101 -905987 -867178 -805346 -741091 -721277 -773671 -888436 -1038219 -1179950 -1259100 -1264081
15835a264081J1435m1066j31745k36842l15899l02096j50681J09319L82899N76838
$$ -1264081 -1252646 -1293712 -1425457 -1662299 -1978198 -2280294 -2430975 -2321656 -1938757 -1361919
15825a361919O53482O31844N49610M39910L17082J62430l0144k09499l01263k67263
$$ -1361919 -708437 -76593 473017 912927 1230009 1392439 1362295 1152796 851533 584270
15815E84270j34754K1356J28970J66775J53390J05229M3377K1382R0794K31140
$$ 584270 449516 470872 599842 766617 920007 1025236 1068613 1089995 1180789 1411929
15805A411929L53650L81524L19532K41592J86363R8636r4954l66546n62736n15431
$$ 1411929 1765579 2147103 2466635 2708227 2894590 2993226 2898272 2531726 1968990 1453559
15795A453559k11115J63279M01664M63677M43827M30549M12035K82933k0911l99767
$$ 1453559 1242444 1405723 1807387 2271064 2714891 3145440 3557475 3840408 3819497 3419730
15785C419730o66156p25677o08428l90915j75804o5827r1460j79702k16820j67294
$$ 3419730 2753574 2027897 1419469 1028554 852750 786923 695463 515761 298941 131647
15775A31647r7905o9609o9759o3335n0215m7488o0463r6722j62211k23508k28349
$$ 131647 33742 -35867 -105626 -168961 -219176 -266664 -327127 -423849 -586060 -809568 -1037917
15764a037917j52857k1236J05952J95460K75034L62995M09960L54717J81717n8777
$$ -1037917 -1190774 -1212010 -1106058 -910598 -635564 -272569 137391 492108 673825 615048
15754F15048k60822l33068k70556j45609m0556J4881N6393J24939K10321K58030
$$ 615048 354226 21158 -249398 -395007 -435563 -420682 -364289 -239350 -29029 229001
15744B29001K20717J13152N940m2994l0396N055J1287k2361n9857q4028j09871
$$ 229001 449718 562870 568810 525816 495420 500475 511762 489401 429544 345516 235645
15733B35645j29796j15079m9912O2290J66061J84411J31715R9127J41519K59673
$$ 235645 105849 -9230 -59142 3148 169209 353620 485335 584462 725981 985654
15723I85654L96678M31600K88419M8290j31112j82898j55375r8309j8215N1893
$$ 985654 1382332 1813932 2102351 2150641 2019529 1836631 1681256 1582947 1564732 1616625
15713A616625O8342M5618K1780J4058L2597Q2614J63739K63483L47971L70071
$$ 1616625 1684967 1730585 1752365 1766423 1799020 1881634 2045373 2308856 2656827 3026898
15703C026898L02987J52473o9660l14724m68076m58023l45989k34037j51838q8484
$$ 3026898 3329885 3482358 3412698 3097974 2629898 2171875 1825886 1591849 1440011 1351527
15693A351527n8319r7264k09877l37985m16107m23903l78302l24720l38069m62751
$$ 1351527 1293208 1195944 986067 648082 231975 -191928 -570230 -894950 -1233019 -1695770
15683a695770o32075p23142o89799n47805l01559J0275K90696M68878N43906N49444
$$ -1695770 -2327845 -3050987 -3740786 -4288591 -4590150 -4579875 -4289179 -3820301 -3276395 -2726951
15673b726951N24723M96499M59219M03550L48018L13147L15309L64337M18769
$$ -2726951 -2202228 -1705729 -1246510 -842960 -494942 -181795 133514 497851 916620
15664I16620L90506K39317K0917j60944k28373j91168j15706j7423J32463K98609
$$ 916620 1307126 1546443 1567360 1406416 1178043 986875 871169 853746 986209 1284818
15654A284818L72157K85771P4309j64331l34787m17890m59337m69109m25560l53108
$$ 1284818 1656975 1942746 2017055 1852724 1517937 1100047 640710 171601 -253959 -607067
15644f07067k90577k27103j27279J3146J71305L34647N06349O66471P40497O49131
$$ -607067 -897644 -1124747 -1252026 -1238880 -1067575 -732928 -226579 439892 1180389 1829520
15634A829520M18346J66427l0804j92304l70507n70708p14548o97101m90515j69401
$$ 1829520 2247866 2414293 2383489 2191185 1820678 1249970 535422 -161679 -652194 -821595
15624h21595J57835M00114M95064M43115L08747J49587j5343j68788k71203k92040
$$ -821595 -663760 -263646 231418 674533 983280 1132867 1117524 948736 677533 385493
15614C85493k32481j09276M4112J69532K27670K30206K04108J69369J35621J05971
$$ 385493 153012 43736 87848 257380 485050 715256 919364 1088733 1224354 1330325
15604A330325P6069R815j05435j89368j51163j2973J12329J36396O5545m5627
$$ 1330325 1406394 1416209 1310774 1121406 970243 957270 1069599 1205995 1271540 1225913
15594A225913j62226k44250k43861j75106j19404j38805k17031k77569k42675
$$ 1225913 1063687 819437 575576 400470 281066 142261 -74770 -352339 -595014
15585e95014j14332J6625P6159P1716M2571Q173j6800j2631J9718M7788L6609
$$ -595014 -709346 -692721 -616562 -544846 -502275 -494102 -510902 -523533 -503815 -456027 -419418
15574d19418j6316j02574k44020m40663o07921o45768n51654m12566k92064j53560
$$ -419418 -435734 -538308 -782328 -1222991 -1830912 -2476680 -3028334 -3440900 -3732964 -3886524
15564c886524Q8292M20602P10616Q75132R34344R14160Q22222O83637N38487L94753
$$ -3886524 -3798232 -3377630 -2667014 -1791882 -857538 56622 878844 1562481 2100968 2495721
15554B495721K29568O0280q0516k22554l95651n42052n78485m85663l12408j28190
$$ 2495721 2725289 2785569 2705053 2482499 2086848 1544796 966311 480648 168240 40050
15544D0050K2387J04192Q4710l7256k12431l67114m52791m43063l20891j27762
$$ 40050 62437 166629 251339 214083 1652 -365462 -818253 -1261316 -1582207 -1709969
15534a709969L2967Q6212M2756j7154j5373K6487K8817P6K2325J29801K85037
$$ -1709969 -1677002 -1590790 -1548034 -1565188 -1580561 -1554074 -1525257 -1525181 -1502856 -1373055 -1088018
15523a088018M12433M35742L40162J89148O3192m756m1289q1488j08895q2947
$$ -1088018 -675585 -239843 100319 289467 352659 347903 306614 225126 116231 33284
15513C3284j5424K4683j6357j05258j47559r6793P398J05181J51926J01889n5139
$$ 33284 17860 42543 26186 -79072 -226631 -323424 -316026 -210845 -58919 42970 -12169
15502a2169k57475m13014m51209l51977j55204O6271K34905L01425L03192L28582
$$ -12169 -269644 -682658 -1133867 -1485844 -1641048 -1574777 -1339872 -1038447 -735255 -406673
15492d06673L93464M31218L96193L17106K53061K49259L14349M10738M75831M47281
$$ -406673 -13209 418009 814202 1131308 1384369 1633628 1947977 2358715 2834546 3281827
15482C281827L05535J08105m7755j08366j09105j24643j75556k28707k73292l28017
$$ 3281827 3587362 3695467 3647712 3539346 3430241 3305598 3130042 2901335 2628043 2300026
15472B300026l81489l85862l30087k61315k35531k74710l24568k81831j11493
$$ 2300026 1918537 1532675 1202588 941273 705742 431032 106464 -175367 -286860
15463b86860R5158K07708J76348N6928p1303j76516k52521k82112k42167j57947
$$ -286860 -191702 16006 192354 249282 177979 1463 -251058 -533170 -775337 -933284
15453i33284j06248j15011j43960j56504j54195j57013j65686j68568j74877k01368
$$ -933284 -1039532 -1154543 -1298503 -1455007 -1609202 -1766215 -1931901 -2100469 -2275346 -2476714
15443b476714k26766k08379j33285k6645Q5827K05392L21579L88947L59046K02416
$$ -2476714 -2703480 -2911859 -3045144 -3071789 -2985962 -2780570 -2458991 -2070044 -1710998 -1508582
15433a508582o3061l42800n26151n85214n49959m27609k10972O3093L03243M36556
$$ -1508582 -1571643 -1914443 -2440594 -3025808 -3575767 -4003376 -4214348 -4151255 -3848012 -3411456
15423c411456M67875M45188M21190M27500M57594M85239M62980L35279J11232
$$ -3411456 -2943581 -2498393 -2077203 -1649703 -1192109 -706870 -243890 91389 202621
15414B02621j24637k87176l45478l51376l77271l98090l28858j54672P3173K95731
$$ 202621 77984 -209192 -554670 -906046 -1283317 -1681407 -2010265 -2164937 -2091764 -1796033
15404a796033M37514M28274K78608J01714R688n021j4010m2820o7221o0728j9623
$$ -1796033 -1358519 -930245 -651637 -549923 -540235 -545256 -559266 -602086 -669307 -730035 -749658
15393g49658M9322J36996K28224L01166L40155L55955L63187L42742K62036J03587
$$ -749658 -700336 -563340 -335116 -33950 306205 662160 1025347 1368089 1630125 1733712
15383A733712j12304l05401l99905m05044l93459m16338m36654l76743k20598
$$ 1733712 1621408 1316007 916102 511058 117599 -298739 -735393 -1112136 -1332734
15374a332734k2475J52502K78504L75081M73370N71540O42732O61338N64915K82385
$$ -1332734 -1355209 -1202707 -924203 -549122 -75752 495788 1138520 1799858 2364773 2647158
15364B647158j32853m94625o42669n50047k94784M883K41736L49074L10269J66797
$$ 2647158 2514305 2019680 1377011 826964 532180 537063 778799 1127873 1438142 1604939
15354A604939o469j60813l00832m31027n04846m79386l79682k62793j55898p1550
$$ 1604939 1598470 1437657 1136825 705798 200952 -278434 -658116 -920909 -1076807 -1148357
15344a148357k8863j8082O257O7505J28210J46924J52325K02679K85408L23491
$$ -1148357 -1177220 -1195302 -1189045 -1121540 -993330 -846406 -694081 -491402 -205994 117497
15334A17497K89054K51773K68779K92867K48126J32397Q919o7005r8127j25436
$$ 117497 406551 658324 927103 1219970 1468096 1600493 1609412 1542407 1444280 1318844
15324A318844j80690k57707l01784k55177j26178O947O2013J1590j24859l03765
$$ 1318844 1138154 880447 578663 323486 197308 204255 266268 277858 152999 -150766
15314a50766m53146n02230m26361k64015j01472j26N9124J35229K50046L69897
$$ -150766 -603912 -1106142 -1532503 -1796518 -1897990 -1898116 -1838992 -1703763 -1453717 -1083820
15304a083820M39147M28516L56168K52545J28301j5035j46269j88243r5646Q2714
$$ -1083820 -644673 -216157 140011 392556 520857 505822 359553 171310 75664 158378
15294A58378K49817L29249K98095J91116Q2832K4514r295o1747j12376j05745
$$ 158378 408195 737444 1035539 1226655 1309487 1334001 1324706 1262959 1150583 1044838
15284A044838j9942J11450K19838K47290J98366J31813P9174P924j17272k73607
$$ 1044838 1024896 1136346 1356184 1603474 1801840 1933653 2012827 2020751 1903479 1629872
15274A629872m05348m87939n25473n17594m69555m06049l33798k28790q5868P5405
$$ 1629872 1224524 736585 211112 -306482 -776037 -1182086 -1515884 -1744674 -1830542 -1755137
15264a755137K29240L25517L06574J75258j303j55745k44648k35449j27136K1447
$$ -1755137 -1525897 -1200380 -893806 -718548 -719851 -875596 -1120244 -1355693 -1482829 -1461382
15254a461382J22691J34164Q8238N4974O4578Q8456J00049J03887J04775Q5787
$$ -1461382 -1338691 -1204527 -1116289 -1061315 -996737 -908281 -808232 -704345 -599570 -513783
15244e13783K2797p4759j53463j73648j56034j45247j50455j47396j14620m7387
$$ -513783 -490986 -565745 -719208 -892856 -1048890 -1194137 -1344592 -1491988 -1606608 -1653995
15234a653995M9826J72029L15037M71027O08060O77908O58312N53093L86189K21402
$$ -1653995 -1604169 -1432140 -1117103 -646076 -38016 639892 1298204 1851297 2237486 2458888
15224B458888J26744J15694J53725K01801K42427K66631K72461K64516K38927
$$ 2458888 2585632 2701326 2855051 3056852 3299279 3565910 3838371 4102887 4341814
15215D341814K06111J90250J89088J86748J67706R6492l6150j76442k62802k70528
$$ 4341814 4547925 4738175 4927263 5114011 5281717 5378209 5342059 5165617 4902815 4632287
15205D632287k23929j74443j43707j17240q4107o3793j09703k53040m25168n02868
$$ 4632287 4408358 4233915 4090208 3972968 3888861 3825068 3715365 3462325 3037157 2534289
15195B534289m29628k60895j12946o6112j21060k11971k66888k81091k98136l31086
$$ 2534289 2104661 1843766 1730820 1664708 1543648 1331677 1064789 783698 485562 154476
15185A54476l27982k29213m1963J89296M21300N68266N20632K53863j34355m94772
$$ 154476 -173506 -402719 -444682 -255386 165914 734180 1254812 1508675 1374320 879548
15175H79548p09012p23097n44516k40209P7007L16628M67468N67118O37265O60722
$$ 879548 170536 -552561 -1097077 -1337286 -1260279 -943651 -476183 90935 728200 1388922
15165A388922O07388M80877L23566J62652L462j29759j97893j90335j65108k03763
$$ 1388922 1996310 2477187 2800753 2963405 2966867 2837108 2639215 2448880 2283772 2080009
15155B080009l14333m11854m07316l00733j57259l5415J9833k0762j54531l50613
$$ 2080009 1765676 1353822 946506 645773 488514 453099 472932 452170 297639 -52974
15145e2974n41210o19626n16901k93108q8398J7129L7660Q759l4912m3170J9583
$$ -52974 -594184 -1213810 -1730711 -2023819 -2112217 -2095088 -2057428 -2048669 -2083581 -2126751 -2107168
15134b107168J47193L10113M69118N75154N93737N43771M91865M96847N62055
$$ -2107168 -1959975 -1649862 -1180744 -605590 -11853 531918 1023783 1520630 2082685
15125B082685O36746O46136N30752L04424O9159p0589p9746L0401J91592K73712
$$ 2082685 2719431 3365567 3896319 4200743 4269902 4199313 4119567 4149968 4341560 4615272
15115D615272K05828L9393j49547l50841n75877p86229r03549q46809n87446k18479
$$ 4615272 4821100 4860493 4710946 4360105 3784228 2997999 2094450 1247641 660195 441716
15105D41716Q3893K09600J93295J46728J56277K31232K99632K82775J87548Q4037
$$ 441716 525609 735209 928504 1075232 1231509 1462741 1762373 2045148 2232696 2316733
15095B316733J7844j6326l8847o1872q9310j15952j46641j85384k21871k51181
$$ 2316733 2334577 2318251 2279404 2217532 2128222 2012270 1865629 1680245 1458374 1207193
15085A207193k64434k58247k34720j72630m2527J64315M12170O22574P16734O60455
$$ 1207193 942759 684512 449792 277162 234635 398950 811120 1433694 2150428 2810883
15075B810883M81676K39013K907j41617j53018q1313j3012k057m8942r2547n1546
$$ 2810883 3292559 3531572 3534479 3392862 3239844 3158531 3145519 3143462 3094520 3001973 2950427
15064B950427Q8481K51620L44357L30366K57484K10246K12252K21685K15160K11934
$$ 2950427 3038908 3290528 3634885 3965251 4222735 4432981 4645233 4866918 5082078 5294012
15054E294012K23726K45684K71060K73711K33482J63439P0150p1244k60231m37839
$$ 5294012 5517738 5763422 6034482 6308193 6541675 6705114 6775264 6704020 6443789 6005950
15044F005950n49831n91553n76948n04963l92959l12306l23696l97413m53803
$$ 6005950 5456119 4864566 4287618 3782655 3389696 3077390 2753694 2356281 1902478
15035A902478m42182l45103j71775K2342J56483K02307K02200K05938K07460J54355
$$ 1902478 1460296 1115193 943418 965760 1122243 1324550 1526750 1732688 1940148 2094503
15025B094503L8323p9697j37947j04643J8711J77545K69855K02587r32j82208
$$ 2094503 2132826 2053129 1915182 1810539 1829250 2006795 2276650 2479237 2478305 2296097
15015B296097k13857j36253p6301q2891j08759r7326m2767Q457J6990j5993n4956
$$ 2296097 2082240 1945987 1869686 1786795 1678036 1580710 1537943 1546400 1563390 1547397 1492441
15004A492441m4502K7674J05841J44862J55219J30283J4816j82163l53187m12125
$$ 1492441 1447939 1475613 1581454 1726316 1881535 2011818 2026634 1844471 1491284 1079159
14994A079159l49084j94394r364J27496J71211J54116J44183J58435J69115J53907
$$ 1079159 730075 535681 526317 653813 825024 979140 1123323 1281758 1450873 1604780
14984A604780Q8614m5085k03224k96029k93468k42292j82350j16054o1262o1003
$$ 1604780 1693394 1648309 1445085 1149056 855588 613296 430946 314892 253630 192627
14974A92627j13959j92334l15251m95012o53777o62923m67957j40632K13072N34085
$$ 192627 78668 -113666 -428917 -923929 -1577706 -2240629 -2708586 -2849218 -2636146 -2102061
14964b102061P73179Q64539P91968O25279M63780L66622L52729M35077N91939
$$ -2102061 -1328882 -464343 327625 952904 1416684 1783306 2136035 2571112 3163051
14955C163051P34817P74866O92466N22057L36970K10159J43167Q0322k2122j70213
$$ 3163051 3897868 4672734 5365200 5887257 6224227 6434386 6577553 6657875 6635753 6465540
14945F465540l52389n43413p08193q31279r12562r26595q22829n83836k75557
$$ 6465540 6113151 5569738 4861545 4030266 3117704 2191109 1368280 784444 508887
14936E08887j5681J26161J75160J75109J34141Q2229P0263R0083J01795R8782
$$ 508887 493206 619367 794527 969636 1103777 1186006 1256269 1346352 1448147 1546929
14926A546929Q5592O0631L4506J0040m5424j45077k49747l46299m54178n36798
$$ 1546929 1632521 1693152 1727658 1737698 1692274 1547197 1297450 951151 496973 -39825
14916c9825n12367l58884j42171O5502K19975K86865K67333J98910J20270N7117
$$ -39825 -552192 -911076 -1053247 -987745 -767770 -480905 -213572 -14662 105608 162725
14906A62725J0809m1639j31247k56201l55281l65436k94887k06324j30217m4138
$$ 162725 173534 131895 648 -255553 -610834 -976270 -1271157 -1477481 -1607698 -1651836
14896a651836L6760L8282p8461k55635l58183k54734Q8904N58744R25152J005925
$$ -1651836 -1615076 -1576794 -1655255 -1910890 -2269073 -2523807 -2434903 -1876159 -951007 54918
14886E4918Q04694M61783J47063k8542o1398k4148L159n254k3740k7636j7663
$$ 54918 859612 1321395 1468458 1439916 1378518 1354370 1357529 1352275 1328535 1300899 1283236
14875A283236k0734m4512m6837j0413J0815m8004j94351l76673n25240n94709
$$ 1283236 1262502 1217990 1171153 1160740 1171555 1123551 929200 552527 27287 -567422
14865e67422n76688m79251l16652j07850J00610K36565K77034K76602K94105L13240
$$ -567422 -1144110 -1623361 -1940013 -2047863 -1947253 -1710688 -1433654 -1157052 -862947 -549707
14855e49707K67234J46889K2228l3319N835J02594J87519K25567K36536K53937
$$ -549707 -282473 -135584 -113356 -146675 -140840 -38246 149273 374840 611376 865313
14845H65313K91027L37057L90754M59862N05460M72538L70099K49580J32008M089
$$ 865313 1156340 1493397 1884151 2344013 2849473 3322011 3692110 3941690 4073698 4077787
14835D077787j36654k61415l39690l71135l84727m22283m94197n36587m58263
$$ 4077787 3941133 3679718 3340028 2968893 2584166 2161883 1667686 1131099 672836
14826F72836k52578j7066J43975K10502K19793J71293K6692j78168l28869l57309
$$ 672836 420258 403192 547167 757669 977462 1148755 1175447 997279 668410 311101
14816C11101k80004j55329m9180m318k3828q0399j33155j68757k13549k51856
$$ 311101 31097 -124232 -173412 -177730 -201558 -281957 -415112 -583869 -797418 -1049274
14806a049274k07671n6630J41140L29150M67896M92190L57957J22475p6922j39209
$$ -1049274 -1256945 -1313575 -1172435 -843285 -375389 116801 474758 597233 520311 381102
14796C81102q8815l4158l9285n7972j1714R7717K04725K77278L31481L61258L28402
$$ 381102 292287 258129 218844 160872 149158 246875 451600 728878 1060359 1421617 1750019
14785A750019K42650J80480J75960J77707J50386J10846O9918L2042J6744L1508
$$ 1750019 1992669 2173149 2349109 2526816 2677202 2788048 2857966 2890008 2906752 2938260
14775B938260M5246N613r0887j47587o7582R1845J51514J0267k50880m73363n72137
$$ 2938260 2983506 2989119 2898232 2750645 2683063 2774908 2926422 2936689 2685809 2212446 1640309
14764A640309n51672m37751k64718r3934K9330J25943K28134K81193K16045Q2438
$$ 1640309 1088637 650886 386168 292234 321564 447507 675641 956834 1172879 1255317
14754A255317j2683k3982K8955J11955J84498K04275J55118O4076j3750n6264
$$ 1255317 1242634 1218652 1247607 1359562 1544060 1748335 1903453 1967529 1953779 1897515
14744A897515p2089m2341M0002J14197J17156O1372k1701j37419k64061l39168
$$ 1897515 1825426 1783085 1823087 1937284 2054440 2115812 2094111 1956692 1692631 1353463
14734A353463l17150k02968o6742Q638R697j8847n3719j02924j55394j82061j98637
$$ 1353463 1036313 833345 766603 775241 784938 766091 712372 609448 454054 271993 73356
14723G3356k66572l94935m81133m04006j63385J25191L39197M26620M26220M06495
$$ 73356 -193216 -588151 -1069284 -1473290 -1636675 -1511484 -1172287 -745667 -319447 87048
14713H7048L86938L72253M07275N03619N97833O34286N90098M67240L07961J80293
$$ 87048 473986 846239 1253514 1757133 2354966 2989252 3579350 4046590 4354551 4534844
14703D534844J19402R0432K9723r4381k47487l45848l32770k45045j77976j63343
$$ 4534844 4654246 4744678 4774401 4680020 4432533 4086685 3753915 3508870 3330894 3167551
14693C167551j37071n0850O4005J67780K60359L26286L32115K89274K37579J71510
$$ 3167551 3030480 2979630 3043635 3211415 3471774 3798060 4130175 4419449 4657028 4828538
14683D828538N8740p8731j78202j93798j12176K2825J20941J19992J3137j63477
$$ 4828538 4887278 4808547 4630345 4436547 4324371 4347196 4468137 4588129 4601266 4437789
14673D437789l15608l42502k39727q8418M0187J34282K12344K86244L74071N28980
$$ 4437789 4122181 3779679 3539952 3451534 3491721 3626003 3838347 4124591 4498662 5027642
14663E027642P80871J044615J173111J100660Q73300N68726K51460k5842k33105
$$ 5027642 5808513 6853128 8026239 9126899 10000199 10568925 10820385 10794543 10561438
14654A0561438l53533l60276k41702l0148J86930K82091J98631K0561j24122j54512
$$ 10561438 10207905 9847629 9605927 9575779 9762709 10044800 10243431 10263992 10139870 9985358
14644I985358n1569J41030L34901M37610L99172K56109J18476N9783P2155J39648
$$ 9985358 9933789 10074819 10409720 10847330 11246502 11502611 11621087 11680870 11753025 11892673
14634A1892673K52933L85590N10269O20922P20731Q18869R46554J122769J316962
$$ 11892673 12145606 12531196 13041465 13662387 14383118 15201987 16148541 17271310 18588272
14625A8588272J473821J569933J640045J752924J961080K286452K723767L182392
$$ 18588272 20062093 21632026 23272071 25024995 26986075 29272527 31996294 35178686
14617C5178686L469040L375517K773665J702701M02176p99429j639304j998089
$$ 35178686 38647726 42023243 44796908 46499609 46901785 46102356 44463052 42464963
14609D2464963j923378j605324j289217j146873j183257j269911j263212j120232
$$ 42464963 40541585 38936261 37647044 36500171 35316914 34047003 32783791 31663559
14601C1663559r23943p79862p27584p52840q30247r27104j018148j119358j219188
$$ 31663559 30739616 29959754 29232170 28479330 27649083 26721979 25703831 24584473 23365285
14592B3365285j249481j182918j085070j032332r98563r01841p42395n94468m94578
$$ 23365285 22115804 20932886 19847816 18815484 17816921 16915080 16172685 15578217 15083639
14583A5083639m01211k57175o4326J39102L43799N32258O36443O04216M54793
$$ 15083639 14682428 14425253 14360927 14500029 14843828 15376086 16012529 16616745 17071538
14574A7071538K71791J43059Q4056L5423p2248k37976l83448m45354m12555k93814
$$ 17071538 17343329 17486388 17570444 17605867 17533619 17295643 16912195 16466841 16054286 15760472
14564A5760472j30922J6521J36960K57107L96704N46669O71946P43561P72491
$$ 15760472 15629550 15646071 15783031 16040138 16436842 16983511 17655457 18399018 19171509
14555A9171509Q05814Q52858Q33200O51504L19983n4634l92950o78126q85168
$$ 19171509 19977323 20830181 21663381 22314885 22634868 22580234 22187284 21509158 20623990
14546B0623990r46412q17017n51540k63809k5184J45295K28771K07272R5386p1901
$$ 20623990 19677578 18860561 18309021 18045212 18020028 18165323 18394094 18601366 18696752 18624851
14536A8624851k51926l77706m09262l91607l84697l94092m01620l81071k96261
$$ 18624851 18372925 17995219 17585957 17194350 16809653 16415561 16013941 15632870 15336609
14527A5336609j47109J0259J13173J47143J41110J13451M2759r6114k84567m78387
$$ 15336609 15189500 15199759 15312932 15460075 15601185 15714636 15757395 15661281 15376714 14898327
14517A4898327o55282p93238q36818p18328m14318p304L42441N15875M90278L23521
$$ 14898327 14243045 13449807 12612989 11894661 11480343 11473039 11815480 12331355 12821633 13145154
14507A3145154J06282j06912l08995m94096o23325o50715n83730m88336m13212
$$ 13145154 13251436 13144524 12835529 12341433 11718108 11067393 10483663 9995327 9582115
14498I582115l29240j86686J48J51150J85071J09985M3266Q5027K15006L56393
$$ 9582115 9252875 9066189 9066337 9217487 9402558 9512543 9555809 9640836 9855842 10212235
14488A0212235M52755M67209L86964K52731J45258J07029J04785Q5232M3210L3259
$$ 10212235 10664990 11132199 11519163 11771894 11917152 12024181 12128966 12214198 12257408 12290667
14478A2290667R5936J93849K75965L40988M03472M63149N18575N78707O46599
$$ 12290667 12386603 12580452 12856417 13197405 13600877 14064026 14582601 15161308 15807907
14469A5807907P12535P62421P60343O60792M66120K41243N6502n6840p6733K1374
$$ 15807907 16520442 17282863 18043206 18703998 19170118 19411361 19467863 19411023 19334290 19355664
14459A9355664K13246M23130N99695P26633P68226P03366N94570N39385N89305
$$ 19355664 19568910 19992040 20591735 21318368 22086594 22789960 23384530 23923915 24513220
14450B4513220P39581R23579J050829J110960J167736J251850J335686J399716
$$ 24513220 25252801 26176380 27227209 28338169 29505905 30757755 32093441 33493157
14442C3493157J478775J630570J864460K148352K476980K854434L245752L600255
$$ 33493157 34971932 36602502 38466962 40615314 43092294 45946728 49192480 52792735
14434E2792735L868109L975583L848333L463545K860842K146322J513086J198988
$$ 52792735 56660844 60636427 64484760 67948305 70809147 72955469 74468555 75667543
14426G5667543J373255K020097K932599L899928M880312N977331P320214Q976221
$$ 75667543 77040798 79060895 81993494 85893422 90773734 96751065 104071279 113047500
14418A13047500J0930160J3140125J5603748J8318320K1149835K3695378K5178543
$$ 113047500 123977660 137117785 152721533 171039853 192189688 215885066 241063609
14411B41063609K4442343K0274800J2300529J899936q127594j5282461j8715832
$$ 241063609 265505952 285780752 298081281 299981217 291853623 276571162 257855330
14404B57855330j9074598j7578558j5344287j3150907j1402622j0175369r337211
$$ 257855330 238780732 221202174 205857887 192706980 181304358 171128989 161791778
14397A61791778q682468q056952p412545o761568o122516n479103m784699m048981
$$ 161791778 153109310 145052358 137639813 130878245 124755729 119276626 114491927 110442946
14389A10442946l373395k864199k557652k432762k443385k518890k574161k543748
$$ 110442946 107069551 104205352 101647700 99214938 96771553 94252663 91678502 89134754
14381H9134754k374070k016082j472450q03739p4486O65749J366636J940470K191426
$$ 89134754 86760684 84744602 83272152 82468413 82393927 83059676 84426312 86366782 88558208
14372H8558208J846361P79640p71545k293365l339956l762354l666458l264851
$$ 88558208 90404569 91184209 90412664 88119299 84779343 81016989 77350531 74085680
14364G4085680k731980k138765j502280q45126k21344K67160N29712N95895N63162
$$ 74085680 71353700 69214935 67712655 66867529 66646185 66913345 67443057 68038952 68602114
14355F8602114M49805K09173j80472o89343j218101j627014j853024j961303k043777
$$ 68602114 69051919 69261092 69080620 68391277 67173176 65546162 63693138 61731835 59688058
14346E9688058k110776k112433k033291j912970j784849j629890j428897j237486
$$ 59688058 57577282 55464849 53431558 51518588 49733739 48103849 46674952 45437466
14338D5437466j126381j075167j026866r91834j008755j080649j180073j269867
$$ 45437466 44311085 43235918 42209052 41217218 40208463 39127814 37947741 36677874
14330C6677874j321005j303843j181165r51555o91414n34564n82765q14830j096589
$$ 36677874 35356869 34053026 32871861 31920306 31228892 30694328 30111563 29296733 28200144
14321B8200144j291144j337340j249228j090330r52870r13136r43140r16099p47508
$$ 28200144 26909000 25571660 24322432 23232102 22279232 21366096 20422956 19506857 18759349
14312A8759349m95665l09586k82059l62505m26169m24935m24986m94714o19364
$$ 18759349 18263684 17954098 17672039 17309534 16883365 16458430 16033444 15538730 14919366
14303A4919366p15404o99419n60130l60823j91838j09166q3883m0600P1415K49766
$$ 14919366 14203962 13504543 12944413 12583590 12391752 12282586 12198703 12158103 12229518 12479284
14293A2479284M36875N52854N46828M24379K38935N8740p2633j57167k16407k41727
$$ 12479284 12916159 13469013 14015841 14440220 14679155 14737895 14665262 14508095 14291688 14049961
14283A4049961j92878m8016J40152K64338K66504J69849K263k13275m04942m93017
$$ 14049961 13857083 13809067 13949219 14213557 14480061 14649910 14652173 14438898 14033956 13540939
14273A3540939m56903l32212j84640q5175n9262o3089m7028j1525L1531Q3445
$$ 13540939 13084036 12751824 12567184 12482009 12422747 12359658 12312630 12301105 12332636 12416081
14263A2416081J37731J82729K22447K71352L26942L66443L52334K56956J23752
$$ 12416081 12553812 12736541 12958988 13230340 13557282 13923725 14276059 14533015 14656767
14254A4656767N5659J32102L46330N88847P39392P78963P48114O62153N30402
$$ 14656767 14712426 14844528 15190858 15779705 16519097 17298060 18046174 18708327 19238729
14245A9238729L66169J61525p5083k82913m07570m73061n49872o28977o06947
$$ 19238729 19604898 19766423 19691340 19408427 19000857 18527796 17977924 17348947 16742000
14236A6742000m45147k23023m354K18553M58486P18809R99879J272161J496123
$$ 16742000 16296853 16073830 16069476 16288029 16746515 17465324 18465203 19737364 21233487
14227B1233487J668687J835766K058405K348078K653283K934853L231960L663062
$$ 21233487 22902174 24737940 26796345 29144423 31797706 34732559 37964519 41627581
14219D1627581M365969N350857O427782P294277P571936O764651M448481P62308
$$ 41627581 45993550 51344407 57772189 65066466 72638402 79403053 83851534 84613842
14211H4613842l308361o468280q024117q101418p220111n916926m592303l453094
$$ 84613842 81305481 74837201 66813084 58711666 51491555 45574629 40982326 37529232
14203C7529232k539793j841721j379342j182743j245435j495916j786758j965100
$$ 37529232 34989439 33147718 31768376 30585633 29340198 27844282 26057524 24092424
14195B4092424j968608j827360j600124j331587j073669q73603p16174n60610
$$ 24092424 22123816 20296456 18696332 17364745 16291076 15417473 14701299 14140689
14187A4140689m32768m10791n36101p54190r31515r47403p72233m71894j50253
$$ 14140689 13707921 13297130 12761029 12006839 11075324 10127921 9355688 8883794 8733541
14178H733541J08516K50201K42679R8709j12935l10768m54649n54231o22639o47004
$$ 8733541 8842057 9092258 9334937 9433646 9320711 9009943 8555294 8001063 7378424 6731420
14168F731420o13606n41925m79391m36025l66894k47519j00762L6279J28246J43632
$$ 6731420 6117814 5575889 5096498 4660473 4293579 4046060 3945298 3981577 4109823 4253455
14158D253455P3251l6888j04706q4137n417N4923L8387o4001k18461l68717m61484
$$ 4253455 4326706 4289818 4185112 4100975 4095558 4150481 4188868 4124867 3906406 3537689 3076205
14147C076205m72132l94515k24722L493K11895L34732L53845K65680P4798j48380
$$ 3076205 2604073 2209558 1984836 1988329 2200224 2534956 2888801 3154481 3229279 3080899
14137C080899k99732l37052k98972k54120k41783k45803k14455j26561q083J17163
$$ 3080899 2781167 2444115 2145143 1891023 1649240 1403437 1188982 1062421 1054338 1171501
14127A171501K25047K63191J84245J0965j63178k56053k52992j86198j03186o5403
$$ 1171501 1396548 1659739 1843984 1854949 1691771 1435718 1182726 996528 893342 827939
14117H27939j34993l13128n08714n96829n08528k76601j2643J67193K14519J41349
$$ 827939 692946 379818 -128896 -725725 -1234253 -1510854 -1523497 -1356304 -1141785 -1000436
14107a000436n734j28551j29354j5727J28963K39563K86722K80045K59471K61747
$$ -1000436 -1006170 -1134721 -1264075 -1279802 -1150839 -911276 -624554 -344509 -85038 176709
14097A76709L04019L68344M00370L43068J79649m0611k46616m10664n27477n57459
$$ 176709 480728 849072 1249442 1592510 1772159 1731548 1484932 1074268 546791 -10668
14087a0668m45272j97943Q8876L03922L97636L88079L26906K71179K51611K51846
$$ -10668 -455940 -653883 -565007 -261085 136551 524630 851536 1122715 1374326 1626172
14077A626172K32425J78429J22377R2146N7702k8417j50958k39155k56277k35394
$$ 1626172 1858597 2037026 2159403 2251549 2309251 2280834 2129876 1890721 1634444 1399050
14067A399050k14604k01357k23846l15379m42047n44181n94851n88147n23093
$$ 1399050 1184446 983089 759243 443864 1817 -542364 -1137215 -1725362 -2248455
14058b248455l82575j74020L6292J88198K71202L00712K91229K45711J78178J38974
$$ -2248455 -2631030 -2805050 -2768758 -2580560 -2309358 -2008646 -1717417 -1471706 -1293528 -1154554
14048a154554J87701L39906N20167N94495M89020K60013K9996j17309j68532j48894
$$ -1154554 -966853 -626947 -106780 487715 976735 1236748 1266744 1149435 980903 832009
14038H32009p5312K6420Q5557M7250o5926j89501k59017k30322j25377k8858j821
$$ 832009 756697 783117 868674 915924 849998 660497 401480 171158 45781 16923 15102
14027A5102l9286j25058k46387l49270l57513k36902j21L15109O36102Q54160
$$ 15102 -24184 -149242 -395629 -744899 -1102412 -1339314 -1339435 -1024326 -388224 465936
14017D65936Q87854P51891N46089L57577K05726R2321L3517L4269P4373J38341
$$ 465936 1353790 2105681 2651770 3009347 3215073 3307394 3340911 3375180 3449553 3587894
14007C587894K19080K72138K33027J06795k3118j02371j83585l46031n60084p17288
$$ 3587894 3806974 4079112 4312139 4418934 4395816 4293445 4109860 3763829 3203745 2486457
13997B486457p61970p18747o29981n21139m12136l15331k31216j58138q0856K6581
$$ 2486457 1724487 1005740 375759 -145380 -557516 -872847 -1104063 -1262201 -1343057 -1316476
13987a316476J67132L11750M07788M21248L72976K81894J27760q6518k95067m16856
$$ -1316476 -1149344 -837594 -429806 -8558 364418 646312 774072 687554 392487 -24369
13977b4369m18260l20963j87952q6588l6913l911O2331J79485L13744M11488M35339
$$ -24369 -442629 -763592 -951544 -1038132 -1075045 -1078956 -1016625 -837140 -523396 -111908 323431
13966C23431L82790L05336K70890K91451L14989K94939K60026K86345M07691N73312
$$ 323431 706221 1011557 1282447 1573898 1888887 2183826 2443852 2730197 3137888 3711200
13956C711200O83976O61578M91789K19495o4487k68233l68219l87050l40567k48665
$$ 3711200 4395176 5056754 5548543 5768038 5703551 5435318 5067099 4680049 4339482 4090817
13946D090817j42176n5575k0178k9690k9057L1969J30747K06295K34185K05620
$$ 4090817 3948641 3893066 3872888 3843198 3814141 3846110 3976857 4183152 4417337 4622957
13936D622957J13559k211o5277m5251M506J8616j1896p0053j31652j54921j26231
$$ 4622957 4736516 4734305 4669028 4623777 4628283 4646899 4635003 4564950 4433298 4278377 4152146
13925D152146q7606q6487j28922j96156k71911l29658l27544k57242j66153j12294
$$ 4152146 4064540 3978053 3849131 3652975 3381064 3051406 2723862 2466620 2300467 2188173
13915B188173j04333r7045n4138P271L5583n38r0126k22023l84645n09829n00752
$$ 2188173 2083840 1986795 1932657 1939928 1975511 1974973 1884847 1662824 1278179 768350 267598
13904B67598l19572P914M06537P37299Q77667Q21462O52109M63218L01624J57623
$$ 267598 -51974 -44060 362477 1099776 1977443 2798905 3451014 3914232 4215856 4373479
13894D373479K0015r4927j75484k27159k57187k74504k80304k49281j52324N977
$$ 4373479 4393494 4298567 4123083 3895924 3638737 3364233 3083929 2834648 2682324 2688301
13884B688301J89637L39330L74718K55919M3436j47032k53651l09773l65797m14607
$$ 2688301 2877938 3217268 3591986 3847905 3891341 3744309 3490658 3180885 2815088 2400481
13874B400481m11445l38707k25648j04379P337R1400J39620J56678J50318J41164
$$ 2400481 1989036 1650329 1424681 1320302 1327639 1419039 1558659 1715337 1865655 2006819
13864B006819J70537K71754M25005N56608O02844N65230M64117K86580M1155k09311
$$ 2006819 2177356 2449110 2874115 3430723 4033567 4598797 5062914 5349494 5390649 5181338
13854E181338l99399m92153m79880l90864k70443j48477n4635k8041p3359j29896
$$ 5181338 4781939 4289786 3809906 3419042 3148599 3000122 2945487 2917446 2844087 2714191
13844B714191j22014m2255M8137R1532Q6243P6689Q2579Q1065O5118N1300M0160
$$ 2714191 2592177 2549922 2598059 2689591 2775834 2852523 2935102 3016167 3081285 3132585 3172745
13833C172745J3036k6356m6399l9973m8317j16156k52407m30270n99572o82096
$$ 3172745 3185781 3159425 3113026 3073053 3024736 2908580 2656173 2225903 1626331 944235
13823I44235n99001l60138r0466Q4805J35290Q3688m5815k24884m13434n47520
$$ 944235 345234 -14904 -105370 -20565 114725 198413 152598 -72286 -485720 -1033240
13813a033240n69775m83085l24634j11933J45086M08694O11037O70057N41366
$$ -1033240 -1603015 -2086100 -2410734 -2522667 -2377581 -1968887 -1357850 -687793 -146427
13804a46427K82652K7813j26552j98795k46083k60125k03348p2725Q7196J95755
$$ -146427 136225 164038 37486 -161309 -407392 -667517 -870865 -943590 -856394 -660639
13794f60639J90957N6587j79980m28525n73739n63539m36119k63195q7816Q3560
$$ -660639 -469682 -413095 -593075 -1021600 -1595339 -2158878 -2594997 -2858192 -2946008 -2862448
13784b862448K49538L92163M78113M75667L80855K15167Q900k03059l93145n44276
$$ -2862448 -2612910 -2220747 -1742634 -1266967 -886112 -670945 -662045 -865104 -1258249 -1802525
13774a802525o37753o47857n61868m02539k23281p2413K2834M9174K1564l2759
$$ -1802525 -2440278 -3088135 -3650003 -4052542 -4275823 -4348236 -4325402 -4276228 -4254664 -4287423
13764d287423j16596k33090l10156k41054k1611K36518M27837N18566N16210M51381
$$ -4287423 -4404019 -4637109 -4947265 -5188319 -5209930 -4973412 -4545575 -4027009 -3510799 -3059418
13754c059418L83141L52574L29584K71364K22960K78992M41580N87910N96553
$$ -3059418 -2676277 -2323703 -1994119 -1722755 -1499795 -1220803 -779223 -191313 405240
13745D05240M58704K59208Q7835l490n324L9600N0483l7750k21408m23668n36852
$$ 405240 863944 1123152 1210987 1207497 1202173 1241773 1292256 1254506 1033098 609430 72578
13734G2578m89656l02878p6595R3030J79215K19295K56971K82211K56280J70823
$$ 72578 -417078 -719956 -796551 -703521 -524306 -305011 -48040 234171 490451 661274
13724F61274N1315n5305j03074n2830J15544L39643M86617M75865L47096K07202
$$ 661274 712589 657284 554210 501380 616924 956567 1443184 1919049 2266145 2473347
13714B473347J30707J04072O7199j2079j06766j77108k20072k43020k40512k19035
$$ 2473347 2604054 2708126 2775325 2763246 2656480 2479372 2259300 2016280 1775768 1556733
13704A556733k00986k02102k33088k83662k94246k01392k9282J01937J04285J4881
$$ 1556733 1355747 1153645 920557 636895 342649 141257 111975 213912 318197 333078
13694C33078p9412j45591k09800k86406l50924l62545k86204j34270L0598J68308
$$ 333078 253666 108075 -101725 -388131 -739055 -1101600 -1387804 -1522074 -1491476 -1323168
13684a323168K88174L92240M54959M51689L83985K78656J60932N2132k3164n5630
$$ -1323168 -1034994 -642754 -187795 263894 647879 926535 1087467 1139599 1116435 1060805
13674A060805m2329K6212J31931K22223K46520J80137J1106k63858o03156q99296
$$ 1060805 1018476 1044688 1176619 1398842 1645362 1825499 1836605 1572747 969591 70295
13664G0295j038775r93590q28105o36431m76981l48961k19480p3585N1239R2107
$$ 70295 -968480 -1962070 -2790175 -3426606 -3903587 -4252548 -4472028 -4545613 -4494374 -4402267
13654d402267L1202p6428j56459j73240j22846j8464J14556K51931L80345N04623
$$ -4402267 -4371065 -4447493 -4603952 -4777192 -4900038 -4918502 -4803946 -4552015 -4171670 -3667047
13644c667047O31350P43571P99450P57333O01682L55693P4404j89075m09486n63671
$$ -3667047 -3035697 -2292126 -1492676 -735343 -133661 222032 296436 107361 -302125 -865796
13634h65796o33141o38322n95896n01515l79747k89450k69231k94105k93181k04372
$$ -865796 -1498937 -2137259 -2733155 -3234670 -3614417 -3903867 -4173098 -4467203 -4760384 -4964756
13624d964756j8042K21576M36923N63545O18511O87173Q21397R62634R89364Q16503
$$ -4964756 -4982798 -4761222 -4324299 -3760754 -3142243 -2455070 -1633673 -671039 318325 1134828
13614A134828M47400k959l52676m74407l80977j74487M2515J94399K58300K55799
$$ 1134828 1582228 1579269 1226593 752186 371209 196722 239237 433636 691936 947735
13604I47735K20332J96403K06769K27775K37293K32864K07255J57420R3778L8840
$$ 947735 1168067 1364470 1571239 1799014 2036307 2269171 2476426 2633846 2727624 2766464
13594B766464K166k8646n4017o2192o9354j03678j54597j84489j68764r9476J3087
$$ 2766464 2768630 2739984 2685967 2623775 2554421 2450743 2296146 2111657 1942893 1843417 1856504
13583A856504J17528J38399L7762j30796k59912l01997l17033l89167n11823n82614
$$ 1856504 1974032 2112431 2150193 2019397 1759485 1457488 1140455 751288 239465 -343149
13573c43149n07074k99384p0935Q4309J54170J47788O3006l6389m9269Q011J9304
$$ -343149 -850223 -1149607 -1220542 -1136233 -982063 -834275 -771269 -807658 -856927 -848916 -829612
13562h29612n8781j61178k15960k00271j31580k9240R4173J93386K02567R6744
$$ -829612 -888393 -1049571 -1265531 -1465802 -1597382 -1626622 -1532449 -1339063 -1136496 -1039752
13552a039752p9093k15513k06291m4883J74567L48353M47794N13972N78554O16577
$$ -1039752 -1118845 -1334358 -1540649 -1585532 -1410965 -1062612 -614818 -100846 477708 1094285
13542A094285N73654M40705K96943K29524K20834J75956N0236j13877k63212m00384
$$ 1094285 1667939 2108644 2405587 2635111 2855945 3031901 3082137 2968260 2705048 2304664
13532B304664n38288o31775o17147n00357l42481j80057k9807Q7977J65899J96523
$$ 2304664 1766376 1134601 517454 17097 -325384 -505441 -535248 -447271 -281372 -84849
13522h4849J54529L6128j18143k64557l75250m08762l31543j87594p7270n4201
$$ -84849 69680 105808 -12335 -276892 -652142 -1060904 -1392447 -1580041 -1657311 -1711512
13512a711512o6143j9250J00531K32026L35446L96139L93329L37482K86037K89815
$$ -1711512 -1777655 -1796905 -1696374 -1464348 -1128902 -732763 -339434 -1952 284085 573900
13502E73900L41105L81244L46253K12386J1066j72989k41839j69746k7952R0818
$$ 573900 915005 1296249 1642502 1854888 1865954 1692965 1451126 1281380 1253428 1344246
13492A344246J56123J96068K36808K64490K34153J25886n779r2429j31583j46637
$$ 1344246 1500369 1696437 1933245 2197735 2431888 2557774 2551995 2459566 2327983 2181346
13482B181346j33203j07467j19243j65279j86742j53732r5385n1352l4035l5575
$$ 2181346 2048143 1940676 1821433 1656154 1469412 1315680 1220295 1168943 1134908 1099333
13472A099333l3885J240O3444Q1030j3638j99697l89964n12141n39715m78721
$$ 1099333 1065448 1066688 1130132 1211162 1197524 997827 607863 95722 -443993 -922714
13462i22714l43954j60862K7192J87766L12563L80048L71364L33456L09691K52464
$$ -922714 -1266668 -1427530 -1400338 -1212572 -900009 -519961 -148597 184859 494550 747014
13452G47014J03847r5260k44592l21070l97720n22594o52138p04017o24873m05861
$$ 747014 850861 755601 511009 189939 -207781 -730375 -1382513 -2086530 -2711403 -3117264
13442c117264r5266J98152L81739M48563M35236L52133J79669p3221l27857m66795
$$ -3117264 -3212530 -3014378 -2632639 -2184076 -1748840 -1396707 -1217038 -1290259 -1618116 -2084911
13432b084911m17669k20133J2812J87966K65561K55044K08729J89921K08631K30065
$$ -2084911 -2502580 -2722713 -2709901 -2521935 -2256374 -2001330 -1792601 -1602680 -1394049 -1163984
13422a163984K48403K82253L20405L35614L02756J77114n8668l27774n20576o16325
$$ -1163984 -915581 -633328 -312923 22691 325447 502561 443893 116119 -404457 -1020782
13412a020782o59733o43737n12012k60494L8604K99179M55953M89199M26216K88264
$$ -1020782 -1680515 -2324252 -2836264 -3096758 -3058154 -2758975 -2303022 -1813823 -1387607 -1099343
13402a099343P8925j62234l48522m22090l91494k81134r7619J53967M51864P37966
$$ -1099343 -1020418 -1182652 -1531174 -1953264 -2344758 -2625892 -2723511 -2569544 -2117680 -1379714
13392a379714R11891Q86378O56776L25120M8010q7859j31093j82145k76944l78030
$$ -1379714 -467823 418555 1075331 1400451 1448461 1360602 1229509 1047364 770420 392390
13382C92390m36838m18286l03165j27611J3252N1539K7711N1084J73306L35027
$$ 392390 -44448 -462734 -765899 -893510 -880258 -828719 -801008 -749924 -576618 -241591
13372b41591M38139M19647K82976Q8171q9963j89446j78643n6023J31334K82412
$$ -241591 196548 616195 899171 987342 897379 707933 529290 473267 604601 887013
13362H87013L37104L31658L15867K71742J33099j01500l11643l73049k86873j44130
$$ 887013 1224117 1555775 1871642 2143384 2276483 2174983 1863340 1490291 1203418 1059288
13352A059288p698J16154K22816K65338J99797O7220m7476j08884j32970j36639
$$ 1059288 1051590 1167744 1390560 1655898 1855695 1922915 1875439 1766555 1633585 1496946
13342A496946j15866o8445j9602q240m1087p7399p5531l4017L7868J37804K35351
$$ 1496946 1381080 1312635 1293033 1284793 1243706 1166307 1090776 1056759 1094627 1232431 1467782
13331A467782K70608K26325J58076J14037R5489J20998K18537L32888L44546J81590
$$ 1467782 1738390 1964715 2122791 2236828 2332317 2453315 2671852 3004740 3349286 3530876
13321C530876j24577m54124o53471o50499n23229l74122k11461l0587J20943J93761
$$ 3530876 3406299 2952175 2298704 1648205 1124976 750854 539393 508806 629749 823510
13311H23510J62917L7516j26351k51744k93121k47519j48620p4648r1384j73170
$$ 823510 986427 1023943 897592 645848 352727 105208 -43412 -118060 -209444 -382614
13301c82614k29190k06737j21141l696J27510K47825L18532L30915L17097L03788
$$ -382614 -611804 -818541 -939682 -943378 -815868 -568043 -249511 81404 398501 702289
13291G02289K95997K99020L18932L49989L89602M46876M89317M37608K51102l5794
$$ 702289 998286 1297306 1616238 1966227 2355829 2802705 3292022 3729630 3980732 3944938
13281C944938l21734m86366m89771l76952j90386L1176K31122L69793M29118M17293
$$ 3944938 3623204 3136838 2647067 2270115 2079729 2110905 2342027 2711820 3140938 3558231
13271C558231L58842K53132Q7293j54511m75967p85508r14977p96926n48168l37672
$$ 3558231 3917073 4170205 4257498 4102987 3627020 2841512 1926535 1129609 581441 243769
13261B43769k29845j83856j58610j59674j84559j81033j10930m8274j25646l55599
$$ 243769 13924 -169932 -328542 -488216 -672775 -853808 -964738 -1013012 -1138658 -1494257
13251a494257o01494p14614o31718l72734k3035K66565L66155K90884J66076Q7874
$$ -1494257 -2095751 -2810365 -3442083 -3814817 -3837852 -3571287 -3205132 -2914248 -2748172 -2660298
13241b660298P7643J21158K11419L44601M80212N54363N38468M53330L28309J92739
$$ -2660298 -2582655 -2461497 -2250078 -1905477 -1425265 -870902 -332434 120896 449205 641944
13231F41944Q1727O4p5443j53913k16557k14675j13428M1724J56629J70929R5191
$$ 641944 723671 723735 648292 494379 277822 63147 -50281 -8557 148072 319001 414192
13220D14192k9601j94758l89257n49627o16505n97491n17508l70393j70841J3801
$$ 414192 384591 189833 -199424 -749051 -1365556 -1963047 -2480555 -2850948 -3021789 -3007988
13210c007988J36321K34176L82780N84663P55062Q25959P92286O66489M61380
$$ -3007988 -2871667 -2637491 -2254711 -1670048 -914986 -89027 703259 1369748 1831128
13201A831128K11923k2283j84385k61128k74576k42068j82904j33812j14511j13139
$$ 1831128 2043051 2020768 1836383 1575255 1300679 1058611 875707 741895 627384 514245
13191E14245j14723r6282k4500R2320J93041K26785K03530J60553J09866O3078
$$ 514245 399522 303240 278740 371060 564101 790886 994416 1154969 1264835 1327913
13181A327913O5408J42242K39296K72806K07394N4490j55844l66567m92689m88519
$$ 1327913 1393321 1535563 1774859 2047665 2255059 2309549 2153705 1787138 1294449 805930
13171H05930l91929k83939k22754k19107k52515k88930k87130k22699j30258q4033
$$ 805930 414001 130062 -92692 -311799 -564314 -853244 -1140374 -1363073 -1493331 -1577364
13161a577364j15583j68487j51848l8199J20558K60134L47393L67519L04188J82054
$$ -1577364 -1692947 -1861434 -2013282 -2051481 -1930923 -1670789 -1323396 -955877 -651689 -469635
13151d69635Q8759R5253K07346M01020O30376P90403P70566N74410L20710J29535
$$ -469635 -380876 -285623 -78277 322743 953119 1743522 2514088 3088498 3409208 3538743
13141C538743L8330k843p7084k19149l81216m72336m48762l40297j77322K6866
$$ 3538743 3577073 3574230 3497146 3277997 2896781 2424445 1975683 1635386 1458064 1484930
13131A484930K25094L52117M10063M52291M67437L79854J61323j23914l80533
$$ 1484930 1710024 2062141 2472204 2924495 3391932 3771786 3933109 3809195 3428662
13122C428662n52864o31741o23505n41862m15171k77283j55356n1551O4865J92295
$$ 3428662 2875798 2244057 1620552 1078690 663519 386236 230880 179329 244194 436489
13112D36489K56258J89706Q222j94615l10126l04361k31242j38347k7415Q3501
$$ 436489 692747 882453 890675 696060 385934 81573 -149669 -288016 -315431 -231930
13102b31930J45143J37118Q2478K141j11881k79063m72990o09095o24285n14914
$$ -231930 -86787 50331 132809 134950 23069 -255994 -728984 -1338079 -1962364 -2477278
13092b477278k98851q148K84926M66786M64541L53152K92156L31860L74177L18783
$$ -2477278 -2776129 -2784277 -2499351 -2032565 -1568024 -1214872 -922716 -590856 -216679 102104
13082A02104J62418l0060j90639k83674l14872l17043k93985k07741o2040P7493
$$ 102104 264522 234462 43823 -239851 -554723 -871766 -1165751 -1373492 -1435532 -1358039
13072a358039J72789K41721K97099L32251L61995M06201M44960M48371M25197
$$ -1358039 -1185250 -943529 -646430 -314179 47816 454017 898977 1347348 1772545
13063A772545L97949L74688L62319L91844N02447O83613Q80965J054637J203966
$$ 1772545 2170494 2545182 2907501 3299345 3801792 4485405 5366370 6421007 7624973
13054G624973J336941J456896J584934J739868J882536J915537J737476J270286
$$ 7624973 8961914 10418810 12003744 13743612 15626148 17541685 19279161 20549447
13046B0549447M90479m67848j308235j780092j834311j601454j301318j108106
$$ 20549447 21039926 20572078 19263843 17483751 15649440 14047986 12746668 11638562
13038A1638562j056532j085060j138514j186741j174377j055425q58806o28168
$$ 11638562 10582030 9496970 8358456 7171715 5997338 4941913 4083107 3454939
13030C454939l72534j32303L551j8335j51402k86223l52880l43218k55318r3920
$$ 3454939 3082405 2950102 2953653 2935318 2783916 2497693 2144813 1801595 1546277 1452357
13020A452357R9349K70150L95016M72349N02619M90738M42228L55628K35098J24506
$$ 1452357 1551706 1821856 2216872 2689221 3191840 3682578 4124806 4480434 4715532 4840038
13010D840038P7491Q2890J02598J32363J72018K01297K01650J61212O3486r1571
$$ 4840038 4917529 5000419 5103017 5235380 5407398 5608695 5810345 5971557 6035043 5943472
13000E943472k46300l13162k71219j78724j08772r8018j34915j91325k48285k93687
$$ 5943472 5697172 5384010 5112791 4934067 4825295 4727277 4592362 4401037 4152752 3859065
12990C859065l07083k68166j82866q4811o572L7534M2258o308j26082l06327m81223
$$ 3859065 3551982 3283816 3100950 3016139 3009567 3047101 3089359 3083051 2956969 2650642 2169419
12979B169419n54113m91645l58630k28586j15332M529J36435K52170L09500K77992
$$ 2169419 1615306 1123661 765031 536445 421113 425642 562077 814247 1123747 1401739
12969A401739J60491l1881k82529n25998o74062o91716o12243m87056l44715k16708
$$ 1401739 1562230 1530349 1247820 721822 47760 -643956 -1256199 -1743255 -2087970 -2304678
12959b304678j41132j06357p5086m4194l3109n4105j23397k44434l39280l03517
$$ -2304678 -2445810 -2552167 -2627253 -2671447 -2704556 -2758661 -2882058 -3126492 -3465772 -3769289
12949c769289j36404N0164J36342J01824K9199k680O555L662n1778j19485j05131
$$ -3769289 -3905693 -3855529 -3719187 -3617363 -3588164 -3590844 -3584289 -3580627 -3632405 -3751890 -3857021
12938c857021L5353K56290M44953M77955L28223J14631j3232j954J06401K37586
$$ -3857021 -3821668 -3565378 -3120425 -2642470 -2314247 -2199616 -2212848 -2214802 -2108401 -1870815
12928a870815L36818L87621M18865M64400N01680M87265M16872L23801K64817
$$ -1870815 -1533997 -1146376 -727511 -263111 238569 725834 1142706 1466507 1731324
12919A731324K65621K78366K33261R5089j06245k85283l92492m74908n87553o90166
$$ 1731324 1996945 2275311 2508572 2603661 2497416 2212133 1819641 1344733 757180 67014
12909F7014o98960n89871m31377l02841k01458q7110L7057J25195J35130N7508
$$ 67014 -631946 -1221817 -1653194 -1956035 -2157493 -2244603 -2207546 -2082351 -1947221 -1889713
12899a889713r9481l17311n36535o58816o04373l75538o2608K30289M39366N48627
$$ -1889713 -1989194 -2306505 -2843040 -3501856 -4106229 -4481767 -4544375 -4314086 -3874720 -3326093
12889c326093N97554O35264O63085O48678N65423M23226K60144Q4499j18759l20131
$$ -3326093 -2728539 -2093275 -1430190 -781512 -216089 207137 467281 551780 433021 112890
12879A12890m53593m92122m77371m58210m11801k76979m6660K08980L97970M79995
$$ 112890 -340703 -832825 -1310196 -1768406 -2180207 -2457186 -2503846 -2294866 -1896896 -1416901
12869a416901M72608M07293L20228K54129K26276K21607K06399J36957R209j01590
$$ -1416901 -944293 -537000 -216772 37357 263633 485240 691639 828596 837805 736215
12859G36215r8720K0752J43375J65033J00269N6720J15661K29415K86024K42630
$$ 736215 637495 658247 801622 966655 1066924 1123644 1239305 1468720 1754744 1997374
12849A997374J18103o6046k61725l99794m72007n15085n09896l97459j78997O4661
$$ 1997374 2115477 2049431 1787706 1387912 915905 400820 -109076 -506535 -685532 -620871
12839f20871K22251K31548J48165J01441J68876L14151M22818L76083J25938k59725
$$ -620871 -398620 -167072 -18907 82534 251410 565561 988379 1364462 1490400 1230675
12829A230675o21255q10348p85014o20157m40319l18049k23175r9805K6031P3850
$$ 1230675 609420 -200928 -985942 -1606099 -2046418 -2364467 -2587642 -2687447 -2661416 -2587566
12819b587566K1773l4251M4750K77942N20488O26134O05771N73266N94948O29791
$$ -2587566 -2565793 -2600044 -2555294 -2277352 -1756864 -1130730 -524959 48307 643255 1273046
12809A273046N69544L51902N1169j92831l09186l08435k03892k7736J38958K55405
$$ 1273046 1842590 2194492 2245661 2052830 1743644 1435209 1231317 1203581 1342539 1597944
12799A597944L28319L44498K89829J82124N9755l0591m5547J783K9733k9321j60515
$$ 1597944 1926263 2270761 2560590 2742714 2802469 2771878 2726331 2728114 2757847 2728526 2568011
12788B568011l08915m35194m93105m47171l18425j73333q9673j13346k14954l03910
$$ 2568011 2259096 1823902 1330797 883626 565201 391868 302195 188849 -26105 -330015
12778c30015l11520k20167l7109J79831L17975L12199K13359J27211J15755J66984
$$ -330015 -641535 -861702 -898811 -718980 -401005 -88806 124553 251764 367519 534503
12768E34503K40302L11823L89034M78958N51390N53809M60549K89476O6031j80200
$$ 534503 774805 1086628 1475662 1954620 2506010 3059819 3520368 3809844 3875875 3695675
12758C695675l82225m62485l95178k31727o2873L5562K8061n4340j30952j61936
$$ 3695675 3313450 2850965 2455787 2224060 2161187 2196749 2224810 2170470 2039518 1877582
12748A877582j85225k31861k85251l30499l67477l88236l80926l47029k94756
$$ 1877582 1692357 1460496 1175245 844746 477269 89033 -291893 -638922 -933678
12739i33678k34400j95963k02859k18815j83927j00749l7351m5480j21695k20655
$$ -933678 -1168078 -1364041 -1566900 -1785715 -1969642 -2070391 -2107742 -2153222 -2274917 -2495572
12729b495572k68992k03085j8733K24310M50384O20951P29005P66821P27315O24314
$$ -2495572 -2764564 -2967649 -2986382 -2762072 -2311688 -1690737 -961732 -194911 532404 1156718
12719A156718M93095L56313K00942Q372k00486l88604n40319o27562n94810m30661
$$ 1156718 1649813 2006126 2207068 2215440 2014954 1626350 1086031 458469 -136341 -567002
12709e67002k30318j24342j29174j42908j01612k7684N2950J20706J56321J72331
$$ -567002 -797320 -921662 -1050836 -1193744 -1295356 -1323040 -1270090 -1149384 -993063 -820732
12699h20732J74129J19603j4154j66282k32905j66422k1902J18170K25258K99586
$$ -820732 -646603 -527000 -541154 -707436 -940341 -1106763 -1128665 -1010495 -785237 -485651
12689d85651L44000L68574L79083L67700K97095J20610j35339l57228m55276m32767
$$ -485651 -141651 226923 606006 973706 1270801 1391411 1256072 898844 443568 10801
12679A0801l36179k01441n8719M7197O8914Q29j08993k15717l30126m76329o19748
$$ 10801 -325378 -526819 -585538 -538341 -469427 -468598 -577591 -793308 -1123434 -1599763 -2219511
12668b219511o86318o39119n05728l34003j66803m6265N026Q064K6203R7616J95499
$$ -2219511 -2905829 -3544948 -4050676 -4384679 -4551482 -4597747 -4592721 -4584657 -4558454 -4460838 -4265339
12657d265339K64664K64538K06775J47850J39121J77059J96111J52240Q0179M0562
$$ -4265339 -4000675 -3736137 -3529362 -3381512 -3242391 -3065332 -2869221 -2716981 -2636802 -2596240
12647b596240N7796J28097K41970L65234M46939M61320L97510K39448K48k57385
$$ -2596240 -2538444 -2410347 -2168377 -1803143 -1356204 -894884 -497374 -257926 -257678 -515063
12637e15063m44764m84202l58347j35052Q8125K57732L66609M25563M47196M28202
$$ -515063 -959827 -1444029 -1802376 -1937428 -1849303 -1591571 -1224962 -799399 -352203 75999
12627G5999L62513K65176J38718k2975j87349k94532k82170j16698J33501L08307
$$ 75999 438512 703688 842406 819431 632082 337550 55380 -61318 72183 380490
12617C80490K98178J30269q9116k69342l64567l59135k82614j91616j07151l8438
$$ 380490 678668 808937 719821 450479 85912 -273223 -555837 -747453 -854604 -893042
12607h93042j8059m6808o0668j2726P2954J64948K50239K87856K46340J53049
$$ -893042 -911101 -957909 -1018577 -1031303 -958349 -793401 -543162 -255306 -8966 144083
12597A44083M3920o1265j27141j17919m8297L4343J05204J47613J33132P2689
$$ 144083 188003 126738 -403 -118322 -166619 -132276 -27072 120541 253673 326362
12587C26362n095j10400k49667l81810m38262l79811k44148j13738m2602m1435
$$ 326362 321267 210867 -38800 -420610 -858872 -1238683 -1482831 -1596569 -1639171 -1680606
12577a680606r4163j62686j95586j61540j00100j09980k36483m02946m81991m20094
$$ -1680606 -1774769 -1937455 -2133041 -2294581 -2394681 -2504661 -2741144 -3144090 -3626081 -4046175
12567d046175k66229r7311L2242P9155K0066j12471k35845k72985j87598J0657
$$ -4046175 -4312404 -4409715 -4377473 -4298318 -4278252 -4390723 -4626568 -4899553 -5087151 -5076494
12557e076494K43887M01633M25001L37469K20697J51076J39183J43373J18873
$$ -5076494 -4832607 -4430974 -4005973 -3668504 -3447807 -3296731 -3157548 -3014175 -2895302
12548b895302O5166K7633L9518J01208K07968L45998M57320M70012L60540J70071
$$ -2895302 -2830136 -2802503 -2762985 -2661777 -2453809 -2107811 -1650491 -1180479 -819939 -649868
12538f49868O625j6721J10867K97683M32568M34257K80039L3962j89573l07428
$$ -649868 -643243 -659964 -549097 -251414 181154 615411 895450 929412 739839 432411
12528D32411k93770j68306K211J50670K67576L81819M96971N70313N61122M63593
$$ 432411 138641 -29665 -27454 123216 390792 772611 1269582 1839895 2401017 2864610
12518B864610K93414P1802j62007l36804m04714l88881l47379l23454l35480l79696
$$ 2864610 3158024 3229826 3067819 2731015 2326301 1937420 1590041 1266587 931107 551411
12508E51411m25776m40014m21083l82071l31935k90783k68064k45193k09758j59102
$$ 551411 125635 -314379 -735462 -1117533 -1449468 -1740251 -2008315 -2253508 -2463266 -2622368
12498b622368o8155R4342L07309M97048N84803N27502L60999J76624K4430r1545
$$ -2622368 -2690523 -2596181 -2288872 -1791824 -1207021 -679519 -318520 -141896 -117466 -209011
12488b09011j56861j69389j48711j02932l6778L3610P2932M3021k6080m4758K2456
$$ -209011 -365872 -535261 -683972 -786904 -823682 -790072 -717140 -674119 -700199 -744957 -722501
12477g22501J13198J37452O4963n8427j70397k45110k73447k33152r2379J35375
$$ -722501 -609303 -471851 -406888 -465315 -635712 -880822 -1154269 -1387421 -1479800 -1344425
12467a344425L44803M29630L98143L36486L12864L48143M18747M87891N45466
$$ -1344425 -999622 -569992 -171849 164637 477501 825644 1244391 1732282 2277748
12458B277748N86322N64718M14132J04758l03509o45271p73386p05389n59914
$$ 2277748 2864070 3428788 3842920 3947678 3644169 2998898 2225512 1520123 960209
12449I60209m08429k52619q8754O9727J93803K31080J41326m5772k30856l34657
$$ 960209 551780 299161 210407 280134 473937 705017 846343 800571 569715 235058
12439B35058l66082l64016l15872j77448N1403K99644M66015N21596N19942M85886
$$ 235058 -131024 -495040 -810912 -988360 -936957 -637313 -171298 350298 870240 1356126
12429A356126L91267K18420k3122l00036n45589o83912o71251n28362l52053k45151
$$ 1356126 1747393 1965813 1942691 1642655 1097066 413154 -258097 -786459 -1138512 -1383663
12419a383663k25156k20106j39242K8452J90488K61460K63442K67972L00071L63181
$$ -1383663 -1608819 -1828925 -1968167 -1939715 -1749227 -1487767 -1224325 -956353 -656282 -293101
12409b93101M70768N95518O73125O71659O19260N58188M77416L41922J79725O9974
$$ -293101 177667 773185 1446310 2117969 2737229 3295417 3772833 4114755 4294480 4364454
12399D364454M9024Q6927J24336J07410K0093j03206k02082k31887j86263q9723
$$ 4364454 4413478 4500405 4624741 4732151 4752244 4649038 4446956 4215069 4028806 3939083
12389C939083K6138J27539J73689J32590L411j87162l84926n13958n54469n77427
$$ 3939083 3965221 4092760 4266449 4399039 4402450 4215288 3830362 3316404 2761935 2184508
12379B184508o44230p37286q12137q45888q07190o63424m53264k55281q2388R0470
$$ 2184508 1540278 802992 -9145 -855033 -1662223 -2325647 -2778911 -3034192 -3116580 -3026110
12369c026110K21967K25295J01748l2496n7572N2519K27072L66356M08165L81690
$$ -3026110 -2804143 -2578848 -2477100 -2509596 -2567168 -2514649 -2287577 -1921221 -1513056 -1131366
12359a131366L90993M97379O54207P85315Q57245Q48127P11128M21186N7634k34798
$$ -1131366 -740373 -242994 411213 1196528 2053773 2901900 3613028 4034214 4091848 3857050
12349C857050l82601m20446m14402l88695l34785k57525j85742j51488j69164
$$ 3857050 3474449 3054003 2639601 2250906 1916121 1658596 1472854 1321366 1152202
12340A152202k08205k09695j68013j35216j42735j67937j78906j83423j94096
$$ 1152202 943997 734302 566289 431073 288338 120401 -58505 -241928 -436024
12331d36024j87305j56592j16372n2786O0428K21423L84733M80038M45545K80878
$$ -436024 -623329 -779921 -896293 -949079 -888651 -667228 -282495 197543 643088 923966
12321I23966P6252m7449n2686j2181J927J4928Q1065J73447K21290K04116J59171
$$ 923966 1000218 952769 900083 887902 889829 904757 985822 1159269 1380559 1584675 1743846
12310A743846J41439J87673K73907L16233K56757J25691k5255j85051l40474m48798
$$ 1743846 1885285 2072958 2346865 2663098 2919855 3045546 3020291 2835240 2494766 2045968
12300B045968m78569m16305k52199k6506J60623K23876J38539o3349l09785n17427
$$ 2045968 1567399 1151094 898895 872389 1033012 1256888 1395427 1332078 1022293 504866
12290E04866o27318o37333n90222n12094l94823k58358j39877k2504J17998K44170
$$ 504866 -122452 -759785 -1350007 -1862101 -2256924 -2515282 -2655159 -2677663 -2559665 -2315495
12280b315495L11723L40796L89894M97802O58921Q04232Q37905P51513O24320
$$ -2315495 -2003772 -1662976 -1273082 -775280 -116359 687873 1525778 2277291 2901611
12271B901611M90106L14277R1165j20354k56908l23084l78764m54162n13822n22958
$$ 2901611 3391717 3705994 3797159 3676805 3419897 3096813 2718049 2263887 1750065 1227107
12261A227107n07989m95160m55223l75976l11680l02828k96867k13486n7475J07242
$$ 1227107 719118 223958 -231265 -607241 -918921 -1221749 -1518616 -1732102 -1789577 -1682335
12251a682335K50193L71821M72771N66765O69266P53477P61266O83689N80441
$$ -1682335 -1432142 -1060321 -587550 -20785 648481 1401958 2163224 2846913 3427354
12242C427354M87025L64334J65264j08298m05525o35633p19947o56808n00622
$$ 3427354 3914379 4278713 4443977 4335679 3930154 3294521 2574574 1917766 1417144
12233A417144l07857j29428j071Q4217J40020J32437N1114k0507R016J33759K57391
$$ 1417144 1109287 979859 978788 1063005 1203025 1335462 1386576 1366069 1375085 1508844 1766235
12222A766235K87736K04389M7467j14900k50598l60253l95672l06681j40425J5493
$$ 1766235 2053971 2258360 2305827 2190927 1940329 1580076 1184404 877723 737298 752791
12212G52791J25658J88370K11870K15992K07076J79094J55145J76001K24144K33083
$$ 752791 878449 1066819 1278689 1494681 1701757 1880851 2035996 2211997 2436141 2669224
12202B669224J88599J39814R8644K8886o6243j41675j77962j83657j65888j52660
$$ 2669224 2857823 2997637 3096281 3125167 3058924 2917249 2739287 2555630 2389742 2237082
12192B237082j88249k77428l61139l53046k13278J1942K29737L83395M77657N24564
$$ 2237082 2048833 1771405 1410266 1057220 843942 855884 1085621 1469016 1946673 2471237
12182B471237N14252M43874L19965J49183l4707j77099k43843k46148k36201k60044
$$ 2471237 2985489 3429363 3749328 3898511 3863804 3686705 3442862 3196714 2960513 2700469
12172B700469l14575l64243l75910l20545j92853m6857M6621O6327L5159k7553
$$ 2700469 2385894 2021651 1645741 1325196 1132343 1085486 1132107 1198434 1233593 1206040
12162A206040j11292j87009k25960k20012j62316n6349N4506J10550Q7041J9337
$$ 1206040 1094748 907739 681779 461767 299451 243102 297608 408158 495199 514536
12152E14536m881P1764J95868K67593K51742J82196R9408J3846r0308k31649l90331
$$ 514536 509655 581419 777287 1044880 1296622 1478818 1578226 1592072 1501764 1270115 879784
12141H79784n13713n55012m88076l39264j78542m8272P6003K29572L70906M06478
$$ 879784 366071 -188941 -677017 -1016281 -1194823 -1243095 -1167092 -937520 -566614 -160136
12131a60136L08883J44966j3877j34141j88237j50775l2744R8705J69222J69420
$$ -160136 148747 293713 279836 145695 -42542 -193317 -226061 -127356 41866 211286
12121B11286J48040J17239L4616j02783k36384k90151k24940o9432J29995L59897
$$ 211286 359326 476565 511181 408398 172014 -118137 -343077 -412509 -282514 77383
12111G7383O06726Q01149Q48713P34121N37424L40776J80187P9826P0533J51702
$$ 77383 684109 1485258 2333971 3068092 3605516 3946292 4126479 4206305 4276838 4428540
12101D428540K70794L69177M09025L51658J87180l9231k60176m30458n54821o61674
$$ 4428540 4699334 5068511 5477536 5829194 6016374 5977143 5716967 5286509 4731688 4070014
12091D070014p65551q64263r54015j015963r86718q09401n29508k65924r7957
$$ 4070014 3304463 2440200 1486185 470222 -516496 -1325897 -1855405 -2121329 -2219286
12082b219286l3210l4460n2175n6856l3706K1375Q3201J31054J72091K06521K12007
$$ -2219286 -2252496 -2286956 -2339131 -2395987 -2429693 -2408318 -2325117 -2194063 -2021972 -1815451 -1603444
12071a603444J69073J03183N8104L6715M395o9259j64912k04159j18297P7097
$$ -1603444 -1434371 -1331188 -1273084 -1236369 -1231974 -1301233 -1466145 -1670304 -1788601 -1711504
12061a711504L07905N32244P42263Q94056R13557P76561N39331K78745L2924j91245
$$ -1711504 -1403599 -871355 -129092 764964 1678521 2455082 2994413 3273158 3306082 3114837
12051C114837l85086n27282n83644n32132m12058l04943k51279k27471j92349
$$ 3114837 2729751 2202469 1618825 1086693 674635 369692 118413 -109058 -301407
12042c01407j17655M242J43687K50179K76308K06513P3575q5011k31186l06592
$$ -301407 -419062 -414820 -271133 -20954 255354 461867 535442 450431 219245 -87347
12032h7347k79991j77648o2773j0239m2575j00757j24940j19422j08552q5932
$$ -87347 -367338 -544986 -607759 -617998 -660573 -761330 -886270 -1005692 -1114244 -1200176
12022a200176m4179l715Q362q759j3353N7871K12551L61817M13665L77650L24268
$$ -1200176 -1244355 -1248070 -1239708 -1248467 -1261820 -1203949 -991398 -629581 -215916 161734 486002
12011D86002K65296J40879o1842k59552l65534l52127k32306o6360L7594k619
$$ 486002 751298 892177 830335 570783 205249 -146878 -379184 -445544 -407950 -410569
12001d10569j70489l66439m97103n36531n06189m25450l01546j64090o7367l5387
$$ -410569 -581058 -947497 -1444600 -1981131 -2487320 -2912770 -3214316 -3378406 -3445773 -3481160
11991c481160l8997m2484m6652q8453j92735k98526k96722j43679J00637L17706
$$ -3481160 -3520157 -3562641 -3609293 -3697746 -3890481 -4189007 -4485729 -4629408 -4528771 -4211065
11981d211065M19865M10443L49781K68047J53171L1092l9384n9983q4172j06763
$$ -4211065 -3791200 -3380757 -3030976 -2762929 -2609758 -2578666 -2618050 -2678033 -2762205 -2868968
11971b868968p1426L7699J92835L31672L66154K50953L4694j74760k78642k50311
$$ -2868968 -2940394 -2902695 -2709860 -2378188 -2012034 -1761081 -1726387 -1901147 -2179789 -2430100
11961b430100j56078r4445j12441j86734k43424j94260k4934J78444L17798L69580
$$ -2430100 -2586178 -2680623 -2793064 -2979798 -3223222 -3417482 -3442416 -3263972 -2946174 -2576594
11951b576594L91255M43131M93917M54498K93570P5070j00473j85793k06786j90214
$$ -2576594 -2185339 -1742208 -1248291 -793793 -500223 -425153 -525626 -711419 -918205 -1108419
11941a108419j26842k743J70171L47415M78882N35196M96741L53747J42894l1879
$$ -1108419 -1235261 -1238004 -1067833 -720418 -241536 293660 790401 1144148 1287042 1255163
11931A255163q4470o6699j12314k72655m82467o51465p23150o57556m49637j76346
$$ 1255163 1170693 1103994 991680 719025 236558 -414907 -1138057 -1795613 -2245250 -2421596
11921b421596N9516K16687L25947M20133M77776M57199L53417K11059R3222M0970
$$ -2421596 -2362080 -2145393 -1819446 -1399313 -921537 -464338 -110921 100138 193360 234330
11911B34330N0192N7404j5034j83731l90061n31388n42806m54788l35763k12339
$$ 234330 284522 341926 326892 143161 -246900 -778288 -1321094 -1775882 -2111645 -2323984
11901b323984o7686R8070K51613L80735N15454O63471P82821Q28556P74487O02311
$$ -2323984 -2391670 -2293600 -2041987 -1661252 -1145798 -482327 300494 1129050 1903537 2505848
11891B505848L18195p826k72340m08498m01307l02655k04791j44850r3781m0693
$$ 2505848 2824043 2816217 2543877 2135379 1734072 1431417 1226626 1081776 987995 947302
11881I47302k8371j05707k83810n21515p04616o92920m64738j59318N5915J13691
$$ 947302 918931 813224 529414 7899 -696717 -1389637 -1854375 -2013693 -1957778 -1844087
11871a844087N7296j5750l1224K560L1624L5833L2788K3501j0404o3497j13645
$$ -1844087 -1786791 -1802541 -1833765 -1831205 -1799581 -1763748 -1730960 -1707459 -1717863 -1781360 -1895005
11860a895005j41254j10150J919J59705L02083L63314K80256P0689j47888k79723
$$ -1895005 -2036259 -2146409 -2144490 -1984785 -1682702 -1319388 -1039132 -968443 -1116331 -1396054
11850a396054l26634l32742k99083j91013j4984J95507M15455N76270N80625M06697
$$ -1396054 -1722688 -2055430 -2354513 -2545526 -2560510 -2365003 -1949548 -1373278 -792653 -385956
11840c85956J37004j09415k57817l03661k69515j88880j21789j12333j43149j52386
$$ -385956 -248952 -358367 -616184 -919845 -1189360 -1378240 -1500029 -1612362 -1755511 -1907897
11830a907897r6059J9581J39947K02228K16752K37289K68050K58525J81562N7097
$$ -1907897 -2003956 -1984375 -1844428 -1642200 -1425448 -1188159 -920109 -661584 -480022 -422925
11820d22925j06039k95779m48001m96814m42035l35044k22118j07734J5879J15089
$$ -422925 -528964 -824743 -1272744 -1769558 -2211593 -2546637 -2768755 -2876489 -2860610 -2745521
11810b745521J23502K0078j31514k32521k39976j89845j38722j15056r4572m3484
$$ -2745521 -2622019 -2601941 -2733455 -2965976 -3205952 -3395797 -3534519 -3649575 -3744147 -3787631
11800c787631J2147J5815m4588j20054j46863r8909K3963K12251M19399N78928
$$ -3787631 -3775484 -3759669 -3804257 -3924311 -4071174 -4170083 -4146120 -3933869 -3514470 -2935542
11790b935542O28505N29648L34972J64959R7643J08840J17229R9178R0265J11231
$$ -2935542 -2307037 -1777389 -1442417 -1277458 -1179815 -1070975 -953746 -854568 -764303 -653072
11780f53072J61879K35014L28140M50760N86947O63685O05924M20270J91659J0798
$$ -653072 -491193 -256179 71961 522721 1109668 1773353 2379277 2799547 2991206 3002004
11770C002004r5780j78367k92134m32980n38745n58050n22293n01999n13731n20258
$$ 3002004 2906224 2727857 2435723 2002743 1463998 905948 383655 -118344 -632075 -1152333
11760a152333m76094l30358n1107K99621N69872O41589N36321L64089K06191P8971
$$ -1152333 -1628427 -1958785 -2009892 -1710271 -1140399 -498810 37511 401600 607791 686762
11750F86762m9281k15514l98447n33199n79440n28485l97415k46017j40453j06633
$$ 686762 637481 421967 23520 -509679 -1089119 -1617604 -2015019 -2261036 -2401489 -2508122
11740b508122j28144j54090j27053l1957R4231J95463K46618K59665K35910J92355
$$ -2508122 -2636266 -2790356 -2917409 -2949366 -2855135 -2659672 -2413054 -2153389 -1917479 -1725124
11730a725124J73614J73274J40411P1556K4967N4226J52007K57979L39906M43946
$$ -1725124 -1551510 -1378236 -1237825 -1166269 -1141302 -1087076 -935069 -677090 -337184 106762
11720A06762O07735P67299Q18383P36380N92424M70528L87487K92108J27234j03007
$$ 106762 714497 1481796 2300179 3036559 3628983 4099511 4486998 4779106 4906340 4803333
11710D803333l40166n41618o87037p36966o64826n17603l65365k29683j13147
$$ 4803333 4463167 3921549 3234512 2497546 1832720 1315117 949752 720069 606922
11701F06922k7372L1308O8320P1778M2006k900o3160j36585j85101j81824j47742
$$ 606922 579550 610858 679178 750956 792962 790062 726902 590317 405216 223392 75650
11690G5650j33712j72309k34249k64175k45553k18916k42327l21447l95684m29672
$$ 75650 -58062 -230371 -464620 -728795 -974348 -1193264 -1435591 -1757038 -2152722 -2582394
11680b582394m56786m89226m65951l31484j37290q221o340q7589j82183k31621
$$ -2582394 -3039180 -3528406 -3994357 -4325841 -4463131 -4471352 -4477692 -4565281 -4747464 -4979085
11670d979085j82560k9449J60750L06960L85214M18736M36012M71268N52412O69979
$$ -4979085 -5161645 -5191094 -5030344 -4723384 -4338170 -3919434 -3483422 -3012154 -2459742 -1789763
11660a789763P73438P88373O49794L52798j6844l22094m69326m77996m36078l85341
$$ -1789763 -1016325 -227952 421842 774640 757796 435702 -33624 -511620 -947698 -1333039
11650a333039k98755j53846K6739J84539K58645K47391K03802J57836J01613K9670
$$ -1333039 -1631794 -1785640 -1758901 -1574362 -1315717 -1068326 -864524 -706688 -605075 -575405
11640e75405l9004o3371o432J26168K78431L73269L48356J96576j0283j56667
$$ -575405 -614409 -677780 -684212 -558044 -279613 93656 442012 638588 628305 471638
11630D71638j69858o7597P4173J96192K71262K64325J72662P2193L3167L1202
$$ 471638 301780 234183 308356 504548 775810 1040135 1212797 1284990 1318157 1349359
11620A349359J5711q058j0830P256R835l6468j22840k10703k59335k45282j72661
$$ 1349359 1365070 1357012 1346182 1353438 1363273 1326805 1203965 993262 733927 488645 315984
11609C15984n6162Q6233K27320L35095L88618L73925K78239J23989k1746r4240
$$ 315984 259822 346055 573375 908470 1297088 1671013 1949252 2073241 2051495 1957255
11599A957255o8959Q479L2793n3929j97412l13053l84030m30747m40378l86316
$$ 1957255 1888296 1896775 1929568 1875639 1678227 1365174 981144 550397 110019 -276297
11589b76297k70383j23793L004M4389l0918j69920k77217k87112j87448j1487
$$ -276297 -546680 -670473 -667469 -623080 -653998 -823918 -1101135 -1388247 -1575695 -1587182
11579a587182J61984K50804K45267J96015J42387Q9045L9967K6762P3107J53768
$$ -1587182 -1425198 -1174394 -929127 -733112 -590725 -501680 -461713 -434951 -361844 -208076
$$ [...]
##END NTUPLES=NMR SPECTRUM
##END=
