##TITLE=31P ikalashn
DE-77_org Ph_T
21.11.2024
##JCAMPDX= 6.0         $$ Bruker NMR JCAMP-DX V2.0
##DATA TYPE= NMR SPECTRUM
##DATA CLASS= NTUPLES
##ORIGIN= UXNMR, Bruker Analytische Messtechnik GmbH
##OWNER= root
$$ TOPSPIN		Version 1.3
$$ 2024-11-21 14:06:17.406 +0400  Irina@DPX200
$$ Compression mode = diff/dup
##.OBSERVE FREQUENCY= 81.01967998063
##.OBSERVE NUCLEUS= ^31P
##.ACQUISITION MODE= SIMULTANEOUS
##.ACQUISITION SCHEME= undefined
##.AVERAGES= 128
##.DIGITISER RES= 17
##SPECTROMETER/DATA SYSTEM= spect
##.PULSE SEQUENCE= zgpg
##.SOLVENT NAME= CDCl3
##.SHIFT REFERENCE= INTERNAL, CDCl3, 1, 298.5841
##AUDIT TRAIL= $$ (NUMBER, WHEN, WHO, WHERE, WHAT)
$$ ##TITLE= Audit trail, TOPSPIN		Version 1.3
$$ ##JCAMPDX= 5.01
$$ ##ORIGIN= Bruker BioSpin GmbH
$$ ##OWNER= Irina
$$ $$ F:/spectra/data/iren/nmr/P31dec/1/pdata/1/auditp.txt
$$ ##AUDIT TRAIL=  $$ (NUMBER, WHEN, WHO, WHERE, VERSION, WHAT)
(   1,<2024-11-21 14:05:46.359 +0400>,<Irina>,<DPX200>,<TOPSPIN 1.3>,
      <created by zg
	started at 2024-11-21 14:02:28.203 +0400,
	POWCHK disabled, PULCHK disabled
       configuration hash MD5:
       BE 6D 3F 07 2A EA 11 49 91 17 2B D3 AF B3 58 0D
       data hash MD5: 32K
       78 59 62 F2 22 1A 87 08 64 F0 84 7A 0D 45 78 6E>)
(   2,<2024-11-21 14:05:59.937 +0400>,<Irina>,<DPX200>,<TOPSPIN 1.3>,
      <Start of raw data processing
       efp BC_mod = 2 LB = 16 FT_mod = 6 PKNL = 1 PHC0 = 146.9548 PHC1 = 148.1423 SI = 32K 
       data hash MD5: 32K
       F3 7A 4B 09 47 00 F0 D5 91 F2 6B 61 F7 C9 78 9A>)
(   3,<2024-11-21 14:06:02.156 +0400>,<Irina>,<DPX200>,<TOPSPIN 1.3>,
      <apk 
       data hash MD5: 32K
       13 43 65 ED 27 20 47 92 4C 44 55 F7 A0 21 FC 16>)
(   4,<2024-11-21 14:06:04.281 +0400>,<Irina>,<DPX200>,<TOPSPIN 1.3>,
      <abs n ABSG = 5 
       data hash MD5: 32K
       AB E9 DD 9B 65 3A BF A7 EC 11 9E F1 27 BD BA CE>)
$$ ##END=
$$ 
$$ $$ hash MD5
$$ $$ 49 B9 6F 58 65 7B 79 F0 F3 48 8B 86 27 F4 FF 64
##$RELAX= 
##$RELAX= 
##$RELAX= 
##$RELAX= 
##$RELAX= 
##$RELAX= 
##$RELAX= 
##$RELAX= 
##$RELAX= 
##$RELAX= 
##$RELAX= 
$$ Bruker specific parameters
$$ --------------------------
##$DU= <F:/spectra>
##$EXPNO= 1
##$NAME= <P31dec>
##$PROCNO= 1
##$TYPE= <nmr>
##$USER= <iren>
##$AMP= (0..31)
100 100 100 100 100 100 100 100 100 100 100 100 100 100 100 100 100 100 
100 100 100 100 100 100 100 100 100 100 100 100 100 100 
##$ANAVPT= -1
##$AQSEQ= 0
##$AQ_mod= 1
##$AUNM= <au_zg>
##$AUTOPOS= <>
##$BF1= 81.014009
##$BF2= 200.13
##$BF3= 200.13
##$BF4= 200.13
##$BF5= 200.13
##$BF6= 200.13
##$BF7= 200.13
##$BF8= 200.13
##$BYTORDA= 1
##$CFDGTYP= 0
##$CFRGTYP= 5
##$CHEMSTR= <none>
##$CNST= (0..63)
1 1 145 1 1 1 1 1 1 1 1 1 1 1 1 1 1 1 1 1 1 1 1 1 1 1 1 1 1 1 1 1 1 1 
1 1 1 1 1 1 1 1 1 1 1 1 1 1 1 1 1 1 1 1 1 1 1 1 1 1 1 1 1 1 
##$CPDPRG= <waltz16>
##$CPDPRG1= <>
##$CPDPRG2= <waltz16>
##$CPDPRG3= <>
##$CPDPRG4= <mlev>
##$CPDPRG5= <mlev>
##$CPDPRG6= <mlev>
##$CPDPRG7= <mlev>
##$CPDPRG8= <mlev>
##$CPDPRGB= <>
##$CPDPRGT= <>
##$D= (0..63)
$$ [...]
##$SW_h= 37037.037037037
##$TD= 32768
##$TD0= 1
##$TE= 300
##$TE2= 300
##$TE3= 300
##$TEG= 300
##$TL= (0..7)
0 120 53 12 22 120 120 120 
##$TP= (0..7)
150 150 150 150 150 150 150 150 
##$TP07= 0
##$TPNAME0= <>
##$TPNAME1= <>
##$TPNAME2= <>
##$TPNAME3= <>
##$TPNAME4= <>
##$TPNAME5= <>
##$TPNAME6= <>
##$TPNAME7= <>
##$TPOAL= (0..7)
0.5 0.5 0.5 0.5 0.5 0.5 0.5 0.5 
##$TPOFFS= (0..7)
0 0 0 0 0 0 0 0 
##$TUNHIN= 0
##$TUNHOUT= 0
##$TUNXOUT= 0
##$USERA1= <user>
##$USERA2= <user>
##$USERA3= <user>
##$USERA4= <user>
##$USERA5= <user>
##$V9= 5
##$VALIST= <valist>
##$VCLIST= <CCCCCCCCCCCCCCC>
##$VD= 0
##$VDLIST= <DDDDDDDDDDDDDDD>
##$VPLIST= <PPPPPPPPPPPPPPP>
##$VTLIST= <TTTTTTTTTTTTTTT>
##$WBST= 1024
##$WBSW= 4
##$XGAIN= (0..3)
0 0 0 0 
##$XL= 0
##$YL= 0
##$YMAX_a= 11183
##$YMIN_a= -937
##$ZGOPTNS= <>
##$ZL1= 120
##$ZL2= 120
##$ZL3= 120
##$ZL4= 120
##$ABSF1= 298.5841
##$ABSF2= -158.5842
##$ABSG= 5
##$ABSL= 5
##$ALPHA= 0
##$AQORDER= 0
##$ASSFAC= 0
##$ASSFACI= 0
##$ASSFACX= 0
##$ASSWID= 0
##$AUNMP= <proc_1d>
##$AXLEFT= 0
##$AXRIGHT= 0
##$AXTYPE= 0
##$AXUNIT= <>
##$AZFE= 0.1
##$AZFW= 0.5
##$BCFW= 0
##$BC_mod= 2
##$BYTORDP= 0
##$COROFFS= 0
##$CY= 12.5935478210449
##$DATMOD= 1
##$DC= 0
##$DFILT= <>
##$DTYPP= 0
##$F1P= 47.1127640792319
##$F2P= -24.0371245302204
##$FCOR= 0.5
##$FTSIZE= 32768
##$FT_mod= 6
##$GAMMA= 0
##$GB= 0
##$INTBC= 1
##$INTSCL= 7.269226e-011
##$ISEN= 30
##$LB= 16
##$LEV0= 0
##$LPBIN= 0
##$MAXI= 12.09355
##$MC2= 0
##$MEAN= 0
##$ME_mod= 0
##$MI= 0.7550151
##$NCOEF= 0
##$NC_proc= -14
##$NLEV= 6
##$NOISF1= 298.5841
##$NOISF2= 270.0111
##$NSP= 0
##$NTH_PI= 0
##$NZP= 0
##$OFFSET= 298.5841
##$PC= 1.4
##$PHC0= 180.3041
##$PHC1= 106.9568
##$PH_mod= 1
##$PKNL= yes
##$PPARMOD= 0
##$PPDIAG= 0
##$PPIPTYP= 0
##$PPMPNUM= 100
##$PPRESOL= 1
##$PSCAL= 0
##$PSIGN= 0
##$REVERSE= no
##$SF= 81.014009
##$SI= 32768
##$SIGF1= 270.0111
##$SIGF2= -158.5842
##$SINO= 77.54984
##$SIOLD= 32768
##$SREGLST= <31P.CDCl3>
##$SSB= 0
##$STSI= 32768
##$STSR= 0
##$SW_p= 37037.037037037
##$SYMM= 0
##$S_DEV= 0
##$TDeff= 32768
##$TDoff= 0
##$TI= <>
##$TILT= no
##$TM1= 0
##$TM2= 0
##$TOPLEV= 0
##$USERP1= <user>
##$USERP2= <user>
##$USERP3= <user>
##$USERP4= <user>
##$USERP5= <user>
##$WDW= 1
##$XDIM= 32768
##$YMAX_p= 235365768
##$YMIN_p= -64473730
$$ End of Bruker specific parameters
$$ ---------------------------------
##NTUPLES= NMR SPECTRUM
##VAR_NAME=  FREQUENCY,     SPECTRUM/REAL,   SPECTRUM/IMAG
##SYMBOL=    X,             R,               I
##VAR_TYPE=  INDEPENDENT,   DEPENDENT,       DEPENDENT
##VAR_FORM=  AFFN,          ASDF,            ASDF
##VAR_DIM=   32768,         32768,           32768
##UNITS=     HZ,            ARBITRARY UNITS, ARBITRARY UNITS
##FACTOR=    1.13031516577767, 1,            1
##FIRST=     37037.037037037, 27428767,      -35326701
##LAST=      0,             -4472834,        -71207269
##MIN=       0,             -64473730,       0
##MAX=       37037.037037037, 235365768,     0
$$ Real data points
##PAGE= N=1
##DATA TABLE= (X++(R..R)), XYDATA
$$ [...]
$$ plain form
17498 -16706594 -16885652 -16802736 -16587226 -16429000 -16531523 -17046697 -18033019 -19460862 -21251315
17489 -21251315 -23317192 -25579955 -27953846 -30316739 -32503321 -34330481 -35625500 -36232672
17481 -36232672 -36018880 -34916882 -32998754 -30512723 -27823465 -25269179 -23019365 -21026043
17473 -21026043 -19095304 -17015698 -14651034 -11959895 -8970955 -5758048 -2433312 850526
17465 850526 3906772 6536218 8551839 9798979 10182762 9708289 8504799 6797206 4830921
17456 4830921 2798682 809449 -1103211 -2961842 -4834620 -6825788 -9042549 -11533049
17448 -11533049 -14228275 -16932948 -19380140 -21316189 -22561223 -23020955 -22675321 -21579985
17440 -21579985 -19877473 -17785268 -15546922 -13367537 -11371350 -9608104 -8101558 -6906071
$$ packed form
17498a6706594j79058Q2916K15510J58226j02523n15174r86322j427843j790453
17489b1251315k065877k262763k373891k362893k186582j827160j295019o07172
17481c6232672K13792J101998J918128K486031K689258K554286K249814J993322
17473b1026043J930739K079606K364664K691139K988940L212907L324736L283838
17465H50526L056246K629446K015621J247140L83783m74473j203490j707593j966285
17456D830921k032239j989233j912660j858631j872778j991168k216761k490500
17448a1533049k695226k704673k447192j936049j245034m59732L45634J095336
17440b1579985J702512K092205K238346K179385J996187J763246J506546J195487
$$ plain form
17432 -6906071 -6135349 -5941359 -6445831 -7663848 -9476455 -11672128 -14018638 -16315030 -18407296
17423 -18407296 -20176169 -21511923 -22296623 -22412330 -21777591 -20394855 -18378720 -15937872
17415 -15937872 -13310612 -10693045 -8208527 -5928189 -3909492 -2220274 -942756 -159848
17407 -159848 79106 -199260 -874862 -1762169 -2671483 -3475950 -4159810 -4827901 -5664963 -6851917
17397 -6851917 -8468494 -10428191 -12487300 -14327750 -15661796 -16303714 -16201559 -15447860 -14257326
17388 -14257326 -12884072 -11501011 -10113437 -8560416 -6600783 -4037674 -820316 2919480
17380 2919480 6892959 10708686 13933938 16168106 17133013 16755797 15197541 12801940
17372 12801940 9989731 7154218 4598336 2519432 1022207 135912 -170496 34159
$$ packed form
17432f906071P70722J93990n04472j218017j812607k195673k346510k296392k092266
17423a8407296j768873j335754p84700j15707O34739J382736K016135K440848
17415a5937872K627260K617567K484518K280338K018697J689218J277518P82908
17407a59848K38954k78366o75602q87307r09314q04467o83860o68091q37062j186954
17397f851917j616577j959697k059109j840450j334046o41918J02155P53699J190534
17388a4257326J373254J383061J387574J553021J959633K563109L217358L739796
17380B919480L973479L815727L225252K234168R64907l77216j558256k395601
17372A2801940k812209k835513k555882k078904j497225q86295l06408K04655
$$ plain form
17364 34159 672492 1675744 2976937 4496231 6145323 7848763 9549738 11181657 12629091
17355 12629091 13722812 14290366 14234195 13580000 12460098 11045843 9473718 7810587 6078832
17346 6078832 4311787 2575766 933746 -600519 -2059408 -3474642 -4841637 -6128114
17338 -6128114 -7303691 -8350029 -9246303 -9956392 -10436666 -10657034 -10613226 -10318671 -9786945
17329 -9786945 -9023275 -8032981 -6839100 -5493909 -4077587 -2686805 -1409903 -286440
17321 -286440 724370 1730448 2851052 4167302 5717452 7513615 9526163 11631195
17313 11631195 13582214 15064412 15822495 15789112 15138294 14242886 13559678 13473287 14148384
17304 14148384 15466454 17085448 18573286 19535079 19700784 18983040 17508391 15601771
$$ packed form
17364C4159O38333J003252J301193J519294J649092J703440J700975J631919J447434
17355A2629091J093721N67554n6171o54195j119902j414255j572125j663131j731755
17346F078832j767045j736021j642020j534265j458889j415234j366995j286477
17338f128114j175577j046338q96274p10089m80274k20368M3808K94555N31726
17329i786945P63670R90294J193881J345191J416322J390782J276902J123463
17321b86440J010810J006078J120604J316250J550150J796163K012548K105032
17313A1631195J951019J482198P58083l3383o50818q95408o83208q6391O75097
17304A4148384J318070J618994J487838R61793J65705p17744j474649j906620
$$ plain form
17296 15601771 13703864 12230804 11427281 11287850 11594555 12046122 12395314 12517562 12396600
17287 12396600 12073095 11606432 11061324 10506644 10021065 9705436 9687833 10100504 11032248
17278 11032248 12495174 14443343 16828601 19630766 22819393 26280832 29793974 33093296
17270 33093296 35965820 38307862 40128449 41522186 42613145 43471093 44042954 44149298
17262 44149298 43542789 41986070 39322326 35533990 30775203 25354131 19660784 14065426
17254 14065426 8832150 4090683 -125480 -3816750 -6989020 -9672383 -11939594 -13878377
17246 -13878377 -15534902 -16886083 -17870517 -18453588 -18676151 -18654411 -18540227 -18470789 -18519336
17237 -18519336 -18652611 -18729360 -18578050 -18129201 -17504509 -16974995 -16804338 -17090985 -17720020
$$ packed form
17296A5601771j897907j473060q03523j39431L06705M51567L49192J22248j20962
17287A2396600l23505m66663n45108n54680m85579l15629j7603M12671R31744
17278A1032248J462926J948169K385258K802165L188627L461439L513142L299322
17270C3093296K872524K342042J820587J393737J090959Q57948N71861J06344
17262D4149298o06509j556719k663744l788336m758787n421072n693347n595358
17254A4065426n233276m741467m216163l691270l172270k683363k267211j938783
17246a3878377j656525j351181r84434n83071k22563K1740J14184O9438m8547
17237a8519336j33275p6749J51310M48849O24692N29514J70657k86647o29035
$$ plain form
17228 -17720020 -18445387 -19033164 -19374099 -19508101 -19557669 -19620841 -19696305 -19685299 -19461894 -18961921
17218 -18961921 -18231628 -17403621 -16617220 -15943162 -15366378 -14823525 -14249587 -13605525 -12894330
17209 -12894330 -12175535 -11571286 -11247925 -11363116 -11996082 -13108189 -14565016 -16195864 -17841371
17200 -17841371 -19365696 -20642724 -21539160 -21914418 -21644030 -20657443 -18969838 -16688603 -13986330
17191 -13986330 -11047064 -8008535 -4924482 -1755536 1608023 5284604 9315614 13604718
17183 13604718 17926875 22003035 25588153 28516655 30690977 32042497 32506894 32039164
17175 32039164 30658596 28484094 25721714 22600383 19289619 15844415 12206905 8264605
17167 8264605 3930849 -793734 -5792516 -10837376 -15634182 -19903273 -23456249 -26220515
$$ packed form
17228a7720020p25367n87777l40935j34002m9568o3172p5464J1006K23405M99973
17218a8961921P30293Q28007P86401O74058N76784N42853N73938O44062P11195
17209a2894330P18795O04249L23361j15191o32966j112107j456827j630848j645507
17200a7841371j524325j277028q96436l75258K70388R86587J687605K281235K702273
17191a3986330K939266L038529L084053L168946L363559L676581M031010M289104
17183A3604718M322157M076160L585118K928502K174322J351520M64397m67730
17175C2039164j380568k174502k762380l121331l310764l445204l637510l942300
17167H264605m333756m724583m998782n044860m796806m269091l552976k764266
$$ plain form
17159 -26220515 -28197627 -29398104 -29814040 -29442756 -28315351 -26486665 -24002679 -20900723
17151 -20900723 -17266103 -13300617 -9332712 -5743878 -2850222 -806921 413592 965649
17143 965649 1038311 781941 285573 -397174 -1202527 -2026023 -2725945 -3157018 -3215242 -2872797
17133 -2872797 -2186802 -1271596 -246960 799926 1817375 2775998 3664930 4496687 5307952
17124 5307952 6153708 7100753 8224081 9596838 11258450 13168205 15182209 17084635
17116 17084635 18659141 19752073 20292853 20280167 19763607 18829859 17579454 16090780 14394586
17107 14394586 12488936 10398338 8238620 6234198 4666314 3775349 3662412 4231848
17099 4231848 5198814 6165217 6740993 6655023 5796770 4181889 1891875 -960252 -4226529
$$ packed form
17159b6220515j977112j200477m15936L71284J127405J828686K483986L101956
17151b0900723L634620L965486L967905L588834K893656K043301J220513N52057
17143I65649P2662k56370m96368o82747q05353q23496o99922m31073n8224L42445
17133b872797O85995R15206J024636J046886J017449R58623Q88932Q31757Q11265
17124E307952Q45756R47045J123328J372757J661612J909755K014004J902426
17116A7084635J574506J092932N40780j2686n16560r33748j250405j488674j696194
17107A4394586j905650k090598k159718k004422j567884q90965j12937N69436
17099D231848R66966R66403N75776q5970q58253j614881k290014k852127l266277
$$ plain form
17090 -4226529 -7705216 -11134904 -14218535 -16681644 -18351597 -19222196 -19461975 -19350182 -19168538
17081 -19168538 -19109178 -19246726 -19569638 -20027012 -20555355 -21082989 -21533857 -21845619 -21987490
17072 -21987490 -21954007 -21737491 -21306822 -20615651 -19637301 -18395563 -16959465 -15405215 -13778747
17063 -13778747 -12090678 -10355945 -8657057 -7173667 -6130111 -5685348 -5854459 -6521565
17055 -6521565 -7509818 -8634167 -9713849 -10575514 -11070173 -11095686 -10606719 -9600566 -8086921
17046 -8086921 -6071445 -3570474 -639208 2613286 6031467 9436921 12656737 15546030
17038 15546030 17999068 19949728 21367484 22259561 22686889 22786122 22776313 22931947 23521282
17029 23521282 24729594 26600568 29026528 31793439 34652805 37379491 39791452 41739345
$$ packed form
17090d226529l478687l429688l083631k463109j669953q70599k39779J11793J81644
17081a9168538N9360j37548l22912m57374n28343n27634m50868l11762j41871
17072b1987490L3483K16516M30669O91171R78350J241738J436098J554250J626468
17063a3778747J688069J734733J698888J483390J043556M44763j69111o67106
17055f521565r88253j124349j079682q61665m94659k5513M88967J006153J513645
17046h086921K015476K500971K931266L252494L418181L405454L219816K889293
17038A5546030K453038J950660J417756Q92077M27328R9233r809J55634N89335
17029B3521282J208312J870974K425960K766911K859366K726686K411961J947893
$$ plain form
17021 41739345 43094456 43753077 43652635 42790365 41242307 39174001 36824003 34452968
17013 34452968 32280046 30445192 29017309 28025459 27471979 27316304 27459180 27759093 28077635
17004 28077635 28320467 28443642 28425557 28232881 27806057 27063868 25917246 24300728 22225984
16995 22225984 19819623 17298930 14899109 12814258 11182694 10085167 9520638 9375638
16987 9375638 9430228 9414700 9089867 8307350 7017801 5232186 2976863 275931 -2841455
16978 -2841455 -6321823 -10059754 -13875418 -17522518 -20732678 -23271134 -24969976 -25729908
16970 -25729908 -25515955 -24369864 -22423601 -19880258 -16955360 -13810966 -10526472 -7122140
16962 -7122140 -3612166 -54540 3416397 6584018 9188230 11006977 11938117 12031874 11456114
$$ packed form
17021D1739345J355111O58621j00442q62270j548058k068306k349998k371035
17013C4452968k172922j834854j427883r91850n53480j55675J42876K99913L18542
17004B8077635K42832J23175j8085j92676m26824p42189j146622j616518k074744
16995B2225984k406361k520693k399821k084851j631564j097527n64529j45000
16987I375638N4590j5528l24833p82517j289549j785615k255323k700932l117386
16978b841455l480368l737931l815664l647100l210160k538456j698842p59932
16970b5729908K13953J146091J946263K543343K924898L144394L284494L404332
16962g122140L509974L557626L470937L167621K604212J818747R31140R3757n75760
$$ plain form
16953 11456114 10415663 9074380 7530705 5855462 4142948 2519973 1111083 7321
16945 7321 -727110 -1033949 -870744 -252229 720437 1879342 3056259 4155438 5183194
16936 5183194 6222376 7384431 8771538 10453250 12455858 14772010 17382551 20261310
16928 20261310 23350682 26533327 29638727 32498272 35014814 37185413 39048815 40601188
16920 40601188 41755428 42375627 42356191 41690952 40490341 38940362 37235008 35518437 33846919
16911 33846919 32173197 30373209 28320767 25966786 23368270 20658780 17993693 15501135
16903 15501135 13250596 11244985 9441340 7793370 6289984 4962609 3857717 2994856
16895 2994856 2337262 1794759 1262152 674536 45936 -535231 -951498 -1113087 -991790
$$ packed form
16953A1456114j040451j341283j543675j675243j712514j622975j408890j103762
16945G321p34431l06839J63205O18515R72666J158905J176917J099179J027756
16936E183194J039182J162055J387107J681712K002608K316152K610541K878759
16928B0261310L089372L182645L105400K859545K516542K170599J863402J552373
16920D0601188J154240O20199j9436o65239j200611j549979j705354j716571j671518
16911C3846919j673722j799988k052442k353981k598516k709490k665087k492558
16903A5501135k250539k005611j803645j647970j503386j327375j104892q62861
16895B994856o57594n42503n32607n87616o28600n81167m16267j61589J21297
$$ plain form
16886 -991790 -611820 -361 871179 2106019 3829964 6091514 8781661 11629391 14271288
16877 14271288 16351922 17612723 17942179 17375917 16055335 14169897 11913029 9466959
16869 9466959 7004331 4683165 2626070 892054 -542795 -1776970 -2937044 -4106014
16861 -4106014 -5263848 -6280969 -6980425 -7242171 -7086976 -6681565 -6258683 -6004214 -5982192
16852 -5982192 -6134755 -6336763 -6458038 -6404934 -6135484 -5646202 -4935117 -3966327 -2670345
16843 -2670345 -985865 1092897 3503109 6141495 8911951 11761052 14675191 17634707
16835 17634707 20551433 23233930 25407880 26779279 27108229 26273476 24317228 21451657
16827 21451657 18011987 14367133 10823202 7562261 4643948 2057325 -224034 -2215205
$$ packed form
16886i91790L79970O11459Q71540J234840J723945K261550K690147K847730K641897
16877A4271288K080634J260801L29456n66262j320582j885438k256868k446070
16869I466959k462628k321166k057095j734016j434849j234175j160074j168970
16861d106014j157834j017121o99456k61746J55195M05411M22882K54469K2022
16852e982192j52563k02008j21275N3104K69450M89282P11085R68790J295982
16843b670345J684480K078762K410212K638386K770456K849101K914139K959516
16835A7634707K916726K682497K173950J371399L28950q34753j956248k865571
16827B1451657l439670l644854l543931l260941k918313k586623k281359j991171
$$ plain form
16819 -2215205 -3908588 -5258485 -6176211 -6564481 -6387358 -5731788 -4812106 -3906219 -3260158
16810 -3260158 -3015656 -3191883 -3709911 -4423243 -5136940 -5635874 -5741882 -5384134 -4647245
16801 -4647245 -3770526 -3087862 -2920046 -3465942 -4751674 -6657847 -8993797 -11575336 -14278748
16792 -14278748 -17061700 -19949024 -22981465 -26143892 -29321444 -32323660 -34958292 -37093799
16784 -37093799 -38670528 -39673353 -40102840 -39965432 -39279902 -38093347 -36505258 -34689510
16776 -34689510 -32888802 -31365061 -30324367 -29859895 -29945706 -30478304 -31328365 -32361377 -33423627
16767 -33423627 -34326613 -34860924 -34846400 -34196740 -32954403 -31266049 -29314639 -27247859 -25126765
16758 -25126765 -22905448 -20456112 -17636971 -14366323 -10664886 -6657659 -2542557 1463976
$$ packed form
16819b215205j693383j349897r17726l88270J77123O55570R19682R05887O46061
16810c260158K44502j76227n18028p13332p13697m98934j06008L57748P36889
16801d647245Q76719O82664J67816n45896j285732j906173k335950k581539k703412
16792a4278748k782952k887324l032441l162427l177552l002216k634632k135507
16784c7093799j576729j002825m29487J37408O85530J186555J588089J815748
16776c4689510J800708J523741J040694M64472q5811n32598q50061j033012j062250
16767c3423627r02986n34311J4524O49660J242337J688354J951410K066780K121094
16758b5126765K221317K449336K819141L270648L701437M007227M115102M006533
$$ plain form
16750 1463976 5182599 8497226 11338031 13648727 15388826 16582546 17362576 17956389
16742 17956389 18624063 19598172 21061608 23156828 25991659 29614988 33967368 38839118
16734 38839118 43872153 48615371 52609407 55467010 56930205 56902265 55454611 52797776
16726 52797776 49214949 44994248 40401655 35686724 31080259 26767501 22853425 19346615
16718 19346615 16182293 13278822 10587711 8101040 5824608 3754484 1882836 230694
16710 230694 -1118603 -2018498 -2304670 -1870120 -734779 924049 2795913 4510975 5745758
16701 5745758 6327716 6289621 5843316 5295978 4957957 5063930 5707932 6812700 8165633
16692 8165633 9516930 10683541 11596218 12274503 12762961 13075281 13178838 13019913 12558758
$$ packed form
16750A463976L718623L314627K840805K310696J740099J193720P80030N93813
16742A7956389O67674R74109J463436K095220K834831L623329M352380M871750
16734C8839118N033035M743218L994036K857603J463195k7940j447654k656835
16726E2797776l582827m220701m592593m714931m606465m312758l914076l506810
16718A9346615l164322k903471k691111k486671k276432k070124j871648j652142
16710B30694j349297q99895k86172M34550J135341J658828J871864J715062J234783
16701E745758N81958l8095m46305n47338l38021J05973O44002J104768J352933
16692H165633J351297J166611R12677O78285M88458L12320J03557j58925m61155
$$ plain form
16683 12558758 11789456 10748303 9520869 8238136 7040970 6020124 5182956 4484668
16675 4484668 3888407 3386109 2966067 2575843 2127337 1541819 798708 -41189 -848533
16666 -848533 -1477861 -1849461 -2020792 -2193892 -2638624 -3568363 -5036205 -6907485 -8915137
16657 -8915137 -10749723 -12126928 -12820014 -12684913 -11693439 -9951330 -7673471 -5126439 -2576977
16648 -2576977 -268121 1591785 2847103 3414787 3291241 2550347 1343857 -109156 -1564937
16639 -1564937 -2816514 -3738382 -4305191 -4601475 -4823655 -5253392 -6186922 -7831711 -10216610
16630 -10216610 -13172057 -16397043 -19575303 -22479846 -25015216 -27183033 -29006874 -30479853
16622 -30479853 -31568078 -32237317 -32446028 -32104730 -31065405 -29184891 -26430786 -22955575
$$ packed form
16683A2558758p69302j041153j227434j282733j197166j020846q37168o98288
16675D484668n96261n02298m20042l90224m48506n85518p43111q39897q07344
16666h48533o29328l71600j71331j73100m44732r29739j467842j871280k007652
16657h915137j834586j377205o93086J35101R91474J742109K277859K547032K549462
16648b576977K308856J859906J255318N67684j23546p40894j206490j453013j455781
16639a564937j251577r21868n66809k96284k22180m29737r33530j644789k384899
16630a0216610k955447l224986l178260k904543k535370k167817j823841j472979
16622c0479853j088225o69239k08711L41298J039325J880514K754105L475211
$$ plain form
16614 -22955575 -19085154 -15223643 -11725002 -8797901 -6490145 -4748737 -3500701 -2693436
16606 -2693436 -2275396 -2151608 -2172059 -2176639 -2060196 -1809695 -1496156 -1218987 -1017362 -806021
16596 -806021 -397833 396010 1666892 3374951 5378859 7493968 9553223 11453406 13169839
16587 13169839 14736873 16208494 17613903 18922581 20038897 20832038 21180709 21011578
16579 21011578 20325415 19201832 17769851 16155361 14440831 12660858 10825555 8951390
16571 8951390 7087226 5327170 3800000 2638553 1953727 1832001 2344425 3538263 5397829
16562 5397829 7797005 10495235 13205925 15691726 17809137 19488443 20703925 21475824
16554 21475824 21887798 22080038 22205513 22375258 22630756 22961501 23352286 23824740 24445274
$$ packed form
16614b2955575L870421L861511L498641K927101K307756J741408J248036Q07265
16606b693436M18040J23788k0451m580J16443K50501L13539K77169K01625K11341
16596h06021M08188P93843J270882J708059K003908K115109K059255J900183J716433
16587A3169839J567034J471621J405409J308678J116316P93141L48671j69131
16579B1011578o86163j123583j431981j614490j714530j779973j835303j874165
16571H951390j864164j760056j527170j161447o84826j21726N12424J193838J859566
16562E397829K399176K698230K710690K485801K117411J679306J215482P71899
16554B1475824M11974J92240J25475J69745K55498L30745L90785M72454O20534
$$ plain form
16545 24445274 25292221 26394806 27678617 28960016 30002600 30601059 30638807 30097467 29041497
16536 29041497 27606118 25986839 24408817 23066447 22056563 21345832 20792505 20206349
16528 20206349 19410225 18276736 16743912 14826909 12623909 10301445 8064306 6137433
16520 6137433 4772090 4247878 4827515 6656820 9663170 13533865 17806573 22019970
16512 22019970 25843789 29137138 31919798 34274829 36238528 37749784 38690937 38974961
16504 38974961 38595862 37600280 36013565 33794969 30869570 27208791 22882403 18041514
16496 18041514 12866017 7528122 2185996 -3008599 -7904173 -12348552 -16194647 -19320423
16488 -19320423 -21662816 -23244169 -24165486 -24565468 -24572348 -24277894 -23739100 -22990623 -22048468
$$ packed form
16545B4445274Q46947J102585J283811J281399J042584N98459L7748n41340j055970
16536B9041497j435379j619279j578022j342370j009884p10731n53327n86156
16528B0206349p96124j133489j532824j917003k203000k322464k237139j926873
16520F137433j365343n24212N79637J829305L006350L870695M272708M213397
16512B2019970L823819L293349K782660K355031J963699J511256R41153K84024
16504C8974961l79099r95582j586715k218596k925399l660779m326388m840889
16496A8041514n175497n337895n342126n194595m895574m444379l846095l125776
16488a9320423k342393j581353r21317l99982o880K94454N38794P48477R42155
$$ plain form
16479 -22048468 -20902102 -19512434 -17829361 -15815700 -13454909 -10743044 -7686280 -4315048
16471 -4315048 -701493 3038268 6761864 10338441 13710460 16960162 20325323 24121821
16463 24121821 28588281 33714235 39133203 44160121 48006460 50102287 50351452 49162485
16455 49162485 47250712 45352826 44012956 43507374 43870160 44947321 46446108 47991099
16447 47991099 49197664 49753359 49493355 48449267 46837540 44974347 43158463 41589230
16439 41589230 40353218 39460688 38892211 38629469 38661135 38965133 39484317 40125532 40795186
16430 40795186 41441897 42056826 42619690 43038537 43147029 42775921 41853356 40463906 38820695
16421 38820695 37157593 35603993 34128683 32598355 30907783 29077776 27243487 25549371
$$ packed form
16479b2048468J146366J389668J683073K013661K360791K711865L056764L371232
16471d315048L613555L739761L723596L576577L372019L249702L365161L796498
16463B4121821M466460N125954N418968N026918L846339K095827K49165j188967
16455D9162485j911773j897886j339870n05582L62786J077161J498787J544991
16447D7991099J206565N55695k60004j044088j611727j863193j815884j569233
16439D1589230j236012q92530n68477k62742L1666L03998N19184O41215O69654
16430D0795186O46711O14929N62864M18847J08492l71108r22565j389450j643211
16421C8820695j663102j553600j475310j530328j690572j830007j834289j694116
$$ plain form
16413 25549371 24043348 22654066 21259200 19785911 18274412 16866438 15724118 14928495
16405 14928495 14425156 14050549 13610998 12956352 12011274 10767719 9264698 7570921 5759030
16396 5759030 3858311 1806580 -554527 -3422658 -6950088 -11181879 -16034522 -21302837
16388 -21302837 -26681440 -31784723 -36150714 -39253009 -40586167 -39849888 -37140879 -32999166
16380 -32999166 -28243000 -23682459 -19875529 -17038833 -15116249 -13924219 -13272658 -13004932
16372 -13004932 -12976526 -13040562 -13085397 -13101620 -13212005 -13616475 -14468964 -15760834 -17283258 -18682585
16362 -18682585 -19568197 -19623588 -18683009 -16746840 -13940176 -10459306 -6548442 -2502295 1345457
16353 1345457 4672937 7240056 8935990 9782883 9904774 9485121 8734232 7873783 7129052
$$ packed form
16413B5549371j506023j389282j394866j473289j511499j407974j142320p95623
16405A4928495n03339l74607m39551o54646r45078j243555j503021j693777j811891
16396E759030j900719k051731k361107k868131l527430m231791m852643n268315
16388b1302837n378603n103283m365991l102295j333158P36279K709009M141713
16380c2999166M756166M560541L806930K836696J922584J192030O51561K67726
16372a3004932K8406o4036m4835j6223j10385m04470q52489j291870j522424j399327
16362a8682585q85612n5391R40579J936169K806664L480870L910864M046147L847752
16353A345457L327480K567119J695934Q46893J21891m19653p50889q60449p44731
$$ plain form
16344 7129052 6711298 6780591 7403648 8538352 10061591 11827495 13729146 15732440 17853458
16335 17853458 20085607 22332756 24403745 26072528 27170047 27658466 27636848 27267691 26679261
16326 26679261 25913801 24935891 23658806 21954789 19666772 16658555 12897382 8510241
16318 8510241 3760606 -1050640 -5709462 -10177912 -14606278 -19263406 -24414760 -30185293
16310 -30185293 -36443956 -42767632 -48543577 -53185022 -56328128 -57891696 -58003531 -56887471
16302 -56887471 -54793976 -51987595 -48749940 -45359009 -42044672 -38950974 -36137621 -33626357
16294 -33626357 -31459871 -29725248 -28522613 -27905411 -27835128 -28178071 -28745913 -29357717 -29893463
16285 -29893463 -30319378 -30677738 -31042854 -31462623 -31920557 -32336798 -32593775 -32566520 -32153040
$$ packed form
16344G129052m17754O9293O23057J134704J523239J765904J901651K003294K121018
16335A7853458K232149K247149K070989J668783J097519M88419k1618l69157n88430
16326B6679261p65460r77910j277085j704017k288017l008217l761173m387141
16318H510241m749635m811246m658822m468450m428366m657128n151354n770533
16310c0185293o258663o323676n775945m641445l143106j563568j11835J116060
16302e6887471K093495K806381L237655L390931L314337L093698K813353K511264
16294c3626357K166486J734623J202635O17202P0283l42943n67842o11804n35746
16285b9893463m25915l58360l65116m19769m57934m16241k56977K7255M13480
$$ plain form
16276 -32153040 -31303754 -30039579 -28444568 -26633572 -24716271 -22774795 -20851142 -18945470
16268 -18945470 -17045096 -15184101 -13487147 -12147117 -11335397 -11092635 -11263422 -11519875 -11471088
16259 -11471088 -10802255 -9369052 -7204767 -4455554 -1301339 2082474 5510975 8763721
16251 8763721 11601933 13839455 15412329 16379127 16844897 16873355 16462841 15599609 14329284
16242 14329284 12780701 11129412 9530774 8059727 6691569 5343385 3951189 2520874
16234 2520874 1111800 -228181 -1511525 -2788282 -4063909 -5227072 -6041932 -6205021
16226 -6205021 -5438117 -3591824 -734034 2824187 6613116 10182127 13273305 15887295
16218 15887295 18213501 20484350 22846675 25308768 27760917 30031999 31943521 33342459
$$ packed form
16276c2153040Q49286J264175J595011J810996J917301J941476J923653J905672
16268a8945470J900374J860995J696954J340030Q11720K42762j70787k56453M8787
16259a1471088O68833J433203K164285K749213L154215L383813L428501L252746
16251H763721K838212K237522J572874R66798M65770K8458m10514q63232j270325
16242A4329284j548583j651289j598638j471047j368158j348184j392196j430315
16234B520874j409074j339981j283344j276757j275627j163163q14860j63089
16226f205021P66904J846293K857790L558221L788929L569011L091178K613990
16218A5887295K326206K270849K362325K462093K452149K271082J911522J398938
$$ plain form
16210 33342459 34120977 34235230 33715789 32658712 31203107 29504073 27697732 25864344
16202 25864344 24021450 22166047 20332739 18613574 17121991 15932715 15045259 14394205
16194 14394205 13888240 13442394 12990891 12491449 11927539 11308724 10673342 10092486 9662266
16185 9662266 9478063 9605265 10061595 10805246 11724085 12648214 13404743 13889030 14104991
16176 14104991 14157816 14213872 14443523 14960417 15777713 16803234 17881532 18863043 19657334
16167 19657334 20235452 20590457 20704597 20557072 20153613 19538515 18784196 17984207 17254218
16158 17254218 16715130 16451113 16465952 16656759 16812497 16649041 15887955 14356585 12056399
16149 12056399 9157119 5924725 2630463 -512927 -3369039 -5861639 -7951391 -9626254
$$ packed form
16210C3342459P78518J14253n19441j057077j455605j699034j806341j833388
16202B5864344j842894j855403j833308j719165j491583j189276q87456o51054
16194A4394205n05965m45846m51503m99442n63910o18815o35382n80856m30220
16185I662266j84203J27202M56330P43651R18839R24129P56529M84287K15961
16176A4104991N2825N6056K29651N16894Q17296J025521J078298R81511P94291
16167A9657334N78118L55005J14140j47525m03459o15098p54319p99989p29989
16158A7254218n39088k64017J4839J90807J55738j63456p61086j531370k300186
16149A2056399k899280l232394l294262l143390k856112k492600k089752j674863
$$ plain form
16141 -9626254 -10905526 -11839327 -12492667 -12926047 -13186156 -13301996 -13279629 -13106404 -12778774
16132 -12778774 -12341216 -11896417 -11559594 -11377225 -11265568 -11013113 -10348272 -9042799 -7013721
16123 -7013721 -4382533 -1460319 1335692 3594154 5008847 5442685 4943061 3699779
16115 3699779 1962289 -37127 -2113426 -4109422 -5855717 -7146088 -7753941 -7487098
16107 -7487098 -6245748 -4050656 -1041483 2545723 6428265 10345371 14099472 17537061
16099 17537061 20505887 22853897 24478850 25376607 25639553 25402569 24775489 23807950 22501520
16090 22501520 20848002 18864839 16612615 14198058 11772218 9517951 7608139 6138380
16082 6138380 5078277 4291179 3624460 3017762 2564302 2489607 3059780 4472422 6786774
$$ packed form
16141i626254j279272r33801o53340m33380k60109j15840K2367J73225L27630
16132a2778774M37558M44799L36823J82369J11657K52455O64841J305473K029078
16123g013721K631188K922214K796011K258462J414693M33838m99624j243282
16115C699779j737490j999416k076299j995996j746295j290371o07853K66843
16107g487098J241350K195092L009173L587206L882542L917106L754101L437589
16099A7537061K968826K348010J624953Q97757K62946k36984o27080r67539j306430
16090B2501520j653518j983163k252224k414557k425840k254267j909812j469759
16082F138380j060103p87098o66719o06698m53460p4695N70173J412642K314352
$$ plain form
16073 6786774 9915140 13663346 17795070 22093828 26398847 30603513 34628461 38394364
16065 38394364 41808083 44762069 47150204 48899678 49994802 50465944 50349643 49653236
16057 49653236 48354387 46443812 43987739 41161385 38219529 35422200 32965711 30950265
16049 30950265 29380497 28181774 27222903 26347198 25412058 24327402 23083025 21757890
16041 21757890 20498628 19460443 18737792 18335736 18199215 18260800 18461947 18748727 19075206
16032 19075206 19430224 19861849 20461399 21307504 22412650 23704737 25040468 26239500 27135547
16023 27135547 27627861 27699477 27385893 26721820 25711761 24341084 22606657 20538830 18204007
16014 18204007 15693833 13109815 10547631 8083095 5760104 3584002 1534305 -398160
$$ packed form
16073F786774L128366L748206M131724M298758M305019M204666M024948L765903
16065C8394364L413719K953986K388135J749474J095124M71142j16301o96407
16057D9653236j298849j910575k456073k826354k941856k797329k456489k015446
16049C0950265j569768j198723r58871q75705r35140j084656j244377j325135
16041B1757890j259262j038185p22651m02056j36521O1585K01147K86780L26479
16032A9075206L55018M31625N99550Q46105J105146J292087J335731J199032Q96047
16023B7135547M92314P1616l13584o64073j010059j370677j734427k067827k334823
16014A8204007k510174k584018k562184k464536k322991k176102k049697j932465
$$ plain form
16006 -398160 -2174679 -3700010 -4837344 -5430982 -5340353 -4490232 -2912239 -743689 1814488
15997 1814488 4547287 7259842 9794755 12028589 13843133 15092807 15611035 15272685
15989 15272685 14071431 12146331 9736288 7106748 4505488 2156267 255195 -1058947
15981 -1058947 -1752875 -1930264 -1814868 -1687410 -1809790 -2368437 -3442698 -4991294 -6861401
15972 -6861401 -8828095 -10648170 -12099669 -13006321 -13273219 -12937834 -12195178 -11354620 -10741948
15963 -10741948 -10606810 -11077019 -12153093 -13717967 -15552127 -17365855 -18858059 -19785682
15955 -19785682 -20016064 -19544432 -18469881 -16939799 -15094537 -13044111 -10879879 -8694675
15947 -8694675 -6584967 -4638007 -2926978 -1519896 -481698 147735 391315 364990 279395
$$ packed form
16006c98160j776519j525331j137334n93638R0629Q50121J577993K168550K558177
15997A814488K732799K712555K534913K233834J814544J249674N18228l38350
15989A5272685j201254j925100k410043k629540k601260k349221j901072j314142
15981a058947o93928j77389J15396J27458j22380n58647j074261j548596j870107
15972f861401j966694j820075j451499r06652k66898L35385P42656Q40558O12672
15963a0741948J35138m70209j076074j564874j834160j813728j492204r27623
15955a9785682k30382M71632J074551J530082J845262K050426K164232K185204
15947h694675K109708J946960J711029J407082J038198O29433K43580k6325q5595
$$ plain form
15938 279395 398557 959390 2087502 3757990 5825227 8098244 10407283 12628192 14675276
15929 14675276 16481962 17977130 19072926 19683642 19769105 19371350 18617627 17683656 16734848
15920 16734848 15881069 15170402 14612458 14204429 13947462 13855644 13956112 14272921 14799767
15911 14799767 15483983 16231233 16910965 17350651 17340956 16677058 15227029 12989327 10110953
15902 10110953 6867856 3619928 743502 -1456732 -2834083 -3445844 -3538142 -3484716 -3705155
15893 -3705155 -4571758 -6310971 -8923794 -12159543 -15564156 -18593683 -20752911 -21707182
15885 -21707182 -21336072 -19738932 -17214291 -14203837 -11182729 -8528062 -6437590 -4931820
15877 -4931820 -3902881 -3164734 -2499641 -1710765 -670031 658739 2225397 3919426 5609965
$$ packed form
15938B79395J19162N60833J128112J670488K067237K273017K309039K220909K047084
15929A4675276J806686J495168J095796O10716Q5463l97755p53723r33971r48808
15920A6734848q53779p10667n57944m08029k56967r1818J00468L16809N26846
15911A4799767O84216P47250O79732M39686r695o63898j450029k237702k878374
15902A0110953l243097l247928k876426k200234j377351o11761r2298N3426k20439
15893c705155q66603j739213k612823l235749l404613l029527k159228r54271
15885b1707182L71110J597140K524641L010454L021108K654667K090472J505770
15877d931820J028939P38147O65093P88876J040734J328770J566658J694029J690539
$$ plain form
15868 5609965 7190080 8605723 9853838 10951240 11891388 12616067 13027123 13039356 12638781
15859 12638781 11895924 10921058 9806526 8612648 7403555 6286852 5411728 4924758 4918677
15850 4918677 5407298 6334724 7601493 9080451 10612815 12002629 13029086 13476279 13175653
15841 13175653 12060838 10216583 7879147 5362736 2947997 801008 -1046382 -2669507
15833 -2669507 -4194100 -5720429 -7253850 -8676803 -9781163 -10349490 -10239652 -9417857 -7930095
15824 -7930095 -5857854 -3303501 -403584 2664616 5703200 8523609 10962087 12883016
15816 12883016 14188817 14841805 14881292 14409370 13536517 12314983 10704707 8597342 5890951
15807 5890951 2579494 -1193351 -5154407 -8987955 -12428665 -15293538 -17447864 -18766565
$$ packed form
15868E609965J580115J415643J248115J097402R40148P24679M11056J2233m00575
15859A2638781p42857r74866j114532j193878j209093j116703q75124m86970o081
15850D918677M88621R27426J266769J478958J532364J389814J026457M47193l00626
15841A3175653j114815j844255k337436k516411k414739k146989j847390j623125
15833b669507j524593j526329j533421j422953j104360n68327J09838Q21795J487762
15824g930095K072241K554353K899917L068200L038584K820409K438478J920929
15816A2883016J305801O52988L9487m71922q72853j221534j610276k107365k706391
15807E890951l311457l772845l961056l833548l440710k864873k154326j318701
$$ plain form
15799 -18766565 -19144381 -18539409 -16996957 -14634625 -11613537 -8119401 -4351604 -508532
15791 -508532 3230290 6712632 9806221 12385070 14324966 15517861 15902974 15500212 14427505
15782 14427505 12889244 11135641 9413545 7945473 6953144 6686764 7398527 9251494
15774 9251494 12224482 16077134 20384096 24613968 28244354 30902231 32467554 33059766
15766 33059766 32907984 32207126 31061510 29523198 27659052 25586867 23463794 21439141
15758 21439141 19596597 17917681 16287624 14533924 12467962 9913504 6723976 2793275
15750 2793275 -1928105 -7394365 -13410949 -19610414 -25495793 -30540781 -34298862 -36476948
15742 -36476948 -36957366 -35784453 -33146944 -29366108 -24868513 -20127392 -15586386 -11591613
$$ packed form
15799a8766565l77816O04972J542452K362332L021088L494136L767797L843072
15791e08532L738822L482342L093589K578849J939896J192895L85113m02762j072707
15782A4427505j538261j753603j722096j468072r92329k66380P11763J852967
15774I251494K972988L852652M306962M229872L630386K657877J565323N92212
15766C3059766j51782p00858j145616j538312j864146k072185k123073k024653
15758B1439141j842544j678916j630057j753700k065962k554458l189528l930701
15750B793275m721380n466260o016584o199465n885379n044988l758081k178086
15742c6476948m80418J172913K637509L780836M497595M741121M541006L994773
$$ plain form
15734 -11591613 -8349389 -5914033 -4200062 -3017401 -2139341 -1395812 -743823 -260216 -55526
15725 -55526 -170750 -528531 -968136 -1340205 -1595874 -1800107 -2054973 -2394838 -2733314 -2887446
15715 -2887446 -2645272 -1835077 -379479 1674235 4161857 6844037 9448785 11693179
15707 11693179 13306113 14080185 13938341 12970494 11416460 9613385 7931740 6697628
15699 6697628 6102359 6139592 6619468 7261690 7815885 8145021 8237296 8159542 7996334 7811694
15689 7811694 7640944 7502132 7418179 7442986 7675398 8241190 9240060 10680216 12439840
15680 12439840 14290855 15988593 17381991 18468566 19348604 20115734 20776215 21257413 21486690
15671 21486690 21473555 21338333 21275599 21480508 22073658 23048138 24255729 25444744 26346413
$$ packed form
15734a1591613L242224K435356J713971J182661Q78060P43529O51989M83607K04690
15725e5526j15224l57781m39605l72069k55669k04233k54866l39865l38476j54132
15715b887446K42174Q10195J455598K053714K487622K682180K604748K244394
15707A1693179J612934P74072j41844r67847j554034j803075j681645j234112
15699F697628n95269L7233M79876O42222N54195L29136R2275p7754j63208j84640
15689G811694j70750j38812q3953K4807K32412N65792R98870J440156J759624
15680A2439840J851015J697738J393398J086575Q80038P67130O60481M81198K29277
15671B1486690j3135j35222o2734K04909N93150R74480J207591J189015R01669
$$ plain form
15662 26346413 26778750 26711732 26249429 25542540 24695909 23724642 22565659 21125942 19341102
15653 19341102 17212312 14805201 12222260 9568057 6917512 4293525 1664496 -1027665
15645 -1027665 -3815813 -6663133 -9457038 -12042041 -14258068 -15945271 -16918371 -16966107 -15916445
15636 -15916445 -13730400 -10549958 -6675549 -2509954 1496435 4902793 7349553 8629763
15628 8629763 8729746 7825752 6243608 4387319 2642731 1279526 387191 -126208 -465415
15619 -465415 -835924 -1343608 -1958805 -2557841 -3004755 -3215004 -3166243 -2870305 -2352710 -1669192
15609 -1669192 -939640 -348912 -84392 -236924 -731219 -1338738 -1776619 -1844693 -1525609 -989717
15599 -989717 -504838 -309276 -518169 -1100354 -1918192 -2796118 -3586742 -4220325 -4725283 -5203131
$$ packed form
15662B6346413M32337o7018m62303p06889q46631r71267j158983j439717j784840
15653A9341102k128790k407111k582941k654203k650545k623987k629029k692161
15645a027665k788148k847320k793905k585003k216027j687203r73100m7736J049662
15636a5916445K186045L180442L874409M165595M006389L406358K446760J280210
15628H629763R9983r03994j582144j856289j744588j363205q92335n13399l39207
15619d65415l70509n07684o15197n99036m46914k10249M8761K95938N17595O83518
15609a669192P29552N90728K64520j52532m94295o07519m37881o8074L19084N35892
15599i89717M84879J95562k08893n82185q17838q77926p90624o33583n04958m77848
$$ plain form
15589 -5203131 -5767330 -6490451 -7388276 -8424592 -9517980 -10561138 -11463882 -12202013 -12839467
15580 -12839467 -13508004 -14357334 -15502173 -16980812 -18723896 -20544363 -22178639 -23383980
15572 -23383980 -24039905 -24185032 -23973031 -23589682 -23174366 -22766369 -22295205 -21628047 -20651145
15563 -20651145 -19331567 -17722174 -15921440 -14026874 -12109865 -10214222 -8359861 -6535279
15555 -6535279 -4685742 -2717696 -532783 1916898 4582761 7310991 9876190 12046252
15547 12046252 13657163 14666829 15161155 15306357 15272396 15175728 15072046 14981371 14908804 14850409
15537 14850409 14792313 14701720 14511356 14117005 13402410 12282385 10741964 8850848 6748352
15528 6748352 4614296 2638754 983773 -262961 -1109934 -1626775 -1870259 -1834554 -1476365
$$ packed form
15589e203131n64199p23121q97825j036316j093388j043158r02744p38131o37454
15580a2839467o68537q49330j144839j478639j743084j820467j634276j205341
15572b3383980o55925j45127K12001L83349M15316M07997M71164O67158R76902
15563b0651145J319578J609393J800734J894566J917009J895643J854361J824582
15555f535279J849537J968046K184913K449681K665863K728230K565199K170062
15547A2046252J610911J009666M94326J45202l3961r6668j03682r0675p2567n8395
15537A4850409n8096r0593j90364l94351p14595j120025j540421j891116k102496
15528F748352k134056j975542j654981j246734q46973n16841k43484L5705L58189
$$ plain form
15519 -1476365 -804496 31859 727541 897377 194180 -1595118 -4494546 -8311577 -12642344
15510 -12642344 -16942171 -20668514 -23437108 -25100614 -25708990 -25404191 -24344184 -22694121
15502 -22694121 -20641295 -18391227 -16154740 -14139519 -12526602 -11423249 -10826598 -10636055
15494 -10636055 -10707282 -10903509 -11116175 -11270188 -11336152 -11339309 -11338628 -11378313 -11451386 -11509027 -11501549
15483 -11501549 -11402983 -11195032 -10839456 -10278274 -9458560 -8354858 -6985219 -5429963 -3839539
15474 -3839539 -2408662 -1324216 -721352 -670670 -1185169 -2214819 -3617577 -5140590 -6451260
15465 -6451260 -7213456 -7169525 -6196500 -4328309 -1747479 1251724 4328151 7173746 9578920
15456 9578920 11454453 12805729 13683998 14144638 14222705 13924445 13240627 12183997 10831693
$$ packed form
15519a476365O71869Q36355O95682J69836p03197j789298k899428l817031m330767
15510a2642344m299827l726343k768594j663506o08376L04799J060007J650063
15502b2694121K052826K250068K236487K015221J612917J103353N96651J90543
15494a0636055p1227j96227k12666j54013o5964l157O81l9685p3073n7641P478
15483a1501549R8566K07951L55576N61182Q19714J103702J369639J555256J590424
15474c839539J430877J084446O02864N0682n14499j029650j402758j523013j310670
15465f451260p62196M3931R73025J868191K580830K999203L076427K845595K405174
15456I578920J875533J351276Q78269M60640P8067k98260o83818j056630j352304
$$ plain form
15447 10831693 9338407 7902089 6704571 5869547 5458431 5492755 5981831 6943316 8409052
15438 8409052 10403849 12897689 15765667 18795512 21744392 24415655 26722308 28702807
15430 28702807 30466712 32096844 33581952 34834950 35774172 36387562 36722784 36826226 36702800
15421 36702800 36331645 35705368 34846220 33790896 32575135 31250492 29921984 28761973
15413 28761973 27983924 27801089 28386711 29826631 32067186 34890444 37941183 40792487
15405 40792487 43021648 44280488 44349917 43167090 40823526 37542483 33642556 29493233
15397 29493233 25467728 21888913 18962052 16716077 15004039 13588442 12269914 10979173
15389 10979173 9783606 8826170 8250827 8155149 8576471 9496651 10851172 12539234 14438992
$$ packed form
15447A0831693j493286j436318j197518q35024m11116L4324M89076R61485J465736
15438H409052J994797K493840K867978L029845K948880K671263K306653J980499
15430B8702807J763905J630132J485108J252998R39222O13390L35222J03442j23426
15421C6702800l71155o26277q59148j055324j215761j324643j328508j160011
15413B8761973p78049j82835N85622J439920K240555K823258L050739K851304
15405D0792487K229161J258840O9429j182827k343564l281043l899927m149323
15397B9493233m025505l578815k926861k245975j712038j415597j318528j290741
15389A0979173j195567r57436n75343r5678M21322R20180J354521J688062J899758
$$ plain form
15380 14438992 16427131 18391470 20232282 21865628 23235805 24324010 25143118 25725429
15372 25725429 26109650 26320357 26336084 26067700 25382296 24167720 22377540 20013624 17082689
15363 17082689 13596325 9628950 5375593 1144502 -2716332 -5897561 -8160624 -9334114
15355 -9334114 -9314170 -8080374 -5704926 -2336382 1830021 6566258 11599844 16598575
15347 16598575 21184402 24989118 27729266 29262260 29599273 28874080 27292876 25098609
15339 25098609 22558885 19958162 17577491 15666797 14422979 13977225 14384482 15608141
15331 15608141 17503154 19815916 22227626 24447306 26309954 27810318 29050757 30153038
15323 30153038 31196461 32195742 33094314 33767693 34061866 33870717 33206400 32203794 31049483
$$ packed form
15380A4438992J988139J964339J840812J633346J370177J088205Q19108N82311
15372B5725429L84221K10707J5727k68384o85404j214576j790180k363916k930935
15363A7082689l486364l967375m253357m231091l860834l181229k263063j173490
15355i334114J9944J233796K375448L368544M166403M736237N033586M998731
15347A6598575M585827L804716K740148J532994L37013p25193j581204k194267
15339B5098609k539724k600723k380671j910694j243818m45754M07257J223659
15331A5608141J895013K312762K411710K219680J862648J500364J240439J102281
15323C0153038J043423R99281Q98572O73379K94173j91149o64317j002606j154311
$$ plain form
15314 31049483 29890736 28789621 27736380 26687374 25589170 24381134 22998287 21392903
15306 21392903 19566995 17596393 15635069 13894728 12599395 11927352 11962137 12669242 13905973
15297 13905973 15465387 17138714 18761267 20216546 21412344 22266230 22717823 22750472 22397809
15288 22397809 21733451 20865728 19950602 19198089 18835863 19035037 19842796 21158653 22762389
15279 22762389 24385821 25807568 26933126 27822671 28652680 29629426 30897191 32484508
15271 32484508 34303826 36187185 37929872 39328436 40218340 40512881 40224890 39453241 38342534
15262 38342534 37042245 35679556 34336886 33026740 31681328 30178811 28397522 26266305
15254 26266305 23793298 21077731 18309774 15756597 13728564 12513535 12280337 12995477
$$ packed form
15314C1049483j158747j101115j053241j049006j098204j208036j382847j605384
15306B1392903j825908j970602j961324j740341j295333o72043L4785P07105J236731
15297A3905973J559414J673327J622553J455279J195798Q53886M51593L2649l52663
15288B2397809o64358q67723r15126p52513l62226J99174Q07759J315857J603736
15279B2762389J623432J421747J125558Q89545Q30009R76746J267765J587317
15271C2484508J819318J883359J742687J398564Q89904K94541k87991p71649j110707
15262C8342534j300289j362689j342670j310146j345412j502517j781289k131217
15254B6266305k473007k715567k767957k553177k028033j215029k33198P15140
$$ plain form
15246 12995477 14420834 16212940 18062645 19790148 21364797 22873266 24457417 26228739
15238 26228739 28194757 30255436 32271914 34135363 35780646 37166659 38271643 39116319
15230 39116319 39793984 40478560 41386971 42692209 44427203 46451329 48515657 50385131
15222 50385131 51938614 53198421 54296886 55419117 56754702 58466070 60661803 63363806
15214 63363806 66477188 69792709 73046750 76020890 78618600 80868804 82866735 84704960
15206 84704960 86441166 88110795 89756856 91443955 93242880 95193481 97261870 99305458
15198 99305458 101065812 102220112 102499532 101823583 100365869 98509894 96731131 95470896
15190 95470896 95038423 95546557 96885770 98752714 100738719 102447872 103595689 104056954
$$ packed form
15246A2995477J425357J792106J849705J727503J574649J508469J584151J771322
15238B6228739J966018K060679K016478J863449J645283J386013J104984Q44676
15230C9116319O77665O84576R08411J305238J734994K024126K064328J869474
15222E0385131J553483J259807J098465J122231J335585J711368K195733K702003
15214F3363806L113382L315521L254041K974140K597710K250204J997931J838225
15206H4704960J736206J669629J646061J687099J798925J950601K068389K043588
15198I9305458J760354J154300K79420o75949j457714j855975j778763j260235
15190I5470896m32473N08134J339213J866944J986005J709153J147817M61265
$$ plain form
15182 104056954 103855484 103107619 101954329 100520662 98911096 97218231 95518578 93850088
15174 93850088 92193044 90480772 88641383 86644741 84527775 82392267 80388858 78701048
15166 78701048 77524909 77031350 77317607 78374807 80089552 82275034 84716439 87214173
15158 87214173 89610691 91797979 93712313 95322061 96616678 97611171 98372636 99050907
15150 99050907 99874687 101088048 102849295 105148985 107794333 110469999 112848006 114698024
15142 114698024 115953980 116718053 117209850 117687542 118371401 119388625 120750996 122373144
15134 122373144 124122518 125877335 127568944 129185296 130727812 132159358 133401714 134396497
15126 134396497 135182351 135925448 136875584 138270308 140240786 142771379 145729608 148934574
$$ packed form
15182A04056954k01470p47865j153290j433667j609566j692865j699653j668490
15174I3850088j657044j712272j839389j996642k116966k135508k003409j687810
15166G8701048j176139m93559K86257J057200J714745K185482K441405K497734
15158H7214173K396518K187288J914334J609748J294617R94493P61465O78271
15150I9050907Q23780J213361J761247K299690K645348K675666K378007J850018
15142A14698024J255956P64073M91797M77692O83859J017224J362371J622148
15134A22373144J749374J754817J691609J616352J542516J431546J242356R94783
15126A34396497P85854P43097R50136J394724J970478K530593K958229L204966
$$ plain form
15118 148934574 152217219 155458262 158613222 161716007 164840343 168031961 171262301 174435166
15110 174435166 177422665 180088516 182289521 183877682 184721188 184741545 183954759 182505474
15102 182505474 180681913 178894277 177594851 177139458 177645409 178933259 180599039 182183257
15094 182183257 183348388 183980230 184178253 184158147 184126090 184189839 184346456 184539271 184730804
15085 184730804 184927447 185137284 185310517 185332038 185085163 184538755 183794505 183067707 182613964
15076 182613964 182636036 183215655 184303099 185760200 187422707 189148863 190838733 192425621
15068 192425621 193854394 195071179 196043702 196801722 197458286 198185281 199155380 200481424 202180498
15059 202180498 204178816 206351818 208572999 210749408 212836537 214822125 216675119 218301786
$$ packed form
15118A48934574L282645L241043L154960L102785L124336L191618L230340L172865
15110A74435166K987499K665851K201005J588161Q43506K0357p86786j449285
15102A82505474j823561j787636j299426m55393N05951J287850J665780J584218
15094A82183257J165131O31842J98023k0106l2057O3749J56617J92815J91533
15085A84730804J96643K09837J73233K1521k46875n46408p44250p26798m53743
15076A82613964K2072N79619J087444J457101J662507J726156J689870J586888
15068A92425621J428773J216785R72523P58020O56564P26995R70099J326044J699074
15059B02180498J998318K173002K221181K176409K087129J985588J852994J626667
$$ plain form
15051 218301786 219571720 220408536 220862086 221101323 221348103 221803497 222590772 223717309 225067784
15042 225067784 226447537 227667082 228623406 229334674 229918473 230532982 231306818 232279835 233374779
15033 233374779 234410299 235149314 235365768 234906849 233724908 231870305 229467262 226700291
15025 226700291 223809796 221071648 218748971 217033232 215997172 215574095 215577321 215759588 215880366
15016 215880366 215743667 215204577 214173040 212635957 210685224 208513741 206357618 204410363
15008 204410363 202760830 201383703 200167602 198948433 197536494 195753644 193497359 190814892
15000 190814892 187932283 185191935 182922293 181325139 180442440 180184934 180373091 180779938
14992 180779938 181192741 181480487 181618923 181650589 181619789 181536232 181377403 181106788 180689358 180102346
$$ packed form
15051B18301786J269934Q36816M53550K39237K46780M55394P87275J126537J350475
15042B25067784J379753J219545R56324P11268N83799O14509P73836R73017J094944
15033B33374779J035520P39015K16454m58919j181941j854603k403043k766971
15025B26700291k890495k738148k322677j715739j036060m23077L226J82267J20778
15016B15880366j36699n39090j031537j537083j950733k171483k156123j947255
15008B04410363j649533j377127j216101j219169j411939j782850k256285k682467
15000A90814892k882609k740348k269642j597154q82699k57506J88157M06847
14992A80779938M12803K87746J38436L1666l0800q3557j58829k70615m17430n87012
$$ plain form
14982 180102346 179344574 178442120 177448441 176441544 175517170 174771226 174271264 174030533 173997628
14973 173997628 174062062 174066981 173815586 173070507 171577021 169137814 165711249 161465146 156741072
14964 156741072 151945627 147430209 143414816 139969029 137027912 134422272 131927259 129333017
14956 129333017 126506901 123407409 120053913 116496441 112814463 109127862 105585376 102324009
14948 102324009 99430892 96945326 94904217 93390498 92536332 92466741 93215852 94672811
14940 94672811 96593000 98668445 100629867 102339457 103819376 105185342 106522742 107790204
14932 107790204 108814623 109377288 109332388 108677353 107529129 106037698 104318101 102449859
14924 102449859 100513842 98606896 96823099 95238052 93910805 92870973 92069729 91334740
$$ packed form
14982A80102346p57772r02454r93679j006897r24374p45944m99962k40731l2905
14973A73997628O4434M919k51395p45079j493486k439207l426565m246103m724074
14964A56741072m795445m515418m015393l445787k941117k605640k495013k594242
14956A29333017k826116l099492l353496l557472l681978l686601l542486l261367
14948A02324009k893117k485566k041109j513719q54166o9591P49111J456959
14940I4672811J920189K075445J961422J709590J479919J365966J337400J267462
14932A07790204J024419N62665m4900o55035j148224j491431j719597j868242
14924A02449859j936017j906946j783797j585047j327247j039832q01244p34989
$$ plain form
14916 91334740 90397870 89016260 87119811 84877249 82630553 80750014 79507716 79024275
14908 79024275 79277811 80144440 81452428 83031788 84735948 86429096 87959862 89153004
14900 89153004 89837011 89897118 89316356 88161268 86508093 84374184 81734629 78622378 75216422
14891 75216422 71825964 68774205 66271841 64367933 62990711 62026843 61383382 61003226
14883 61003226 60831233 60756436 60577661 60030226 58870384 56971723 54375289 51263889 47884763
14874 47884763 44477711 41244536 38349230 35913991 33985500 32482839 31179946 29772117
14866 29772117 28010270 25824589 23366771 20955176 18953828 17637486 17095102 17206956
14858 17206956 17703774 18283140 18729924 18982792 19119283 19281698 19591660 20088743 20708294
$$ packed form
14916I1334740r36870j381610j896449k242562k246696j880539j242298m83441
14908G9024275K53536Q66629J307988J579360J704160J693148J530766J193142
14900H9153004O84007O0107n80762j155088j653175k133909k639555l112251l405956
14891G5216422l390458l051759k502364j903908j377222r63868o43461l80156
14883F1003226j71993p4797j78775n47435j159842j898661k596434l111400l379126
14874D7884763l407052l233175k895306k435239j928491j502661j302893j407829
14866B9772117j761847k185681k457818k411595k001348j316342n42384J11854
14858A7206956M96818N79366M46784K52868J36491J62415L09962M97083O19551
$$ plain form
14849 20708294 21302959 21701256 21778809 21503044 20925104 20135970 19230772 18300172 17429160
14840 17429160 16686032 16111680 15724266 15537818 15580902 15901389 16553216 17574300 18968683
14831 18968683 20699769 22693664 24845096 27018839 29053907 30788966 32111763 33005152
14823 33005152 33558261 33939894 34351484 34967282 35863364 36964904 38070369 38973654 39608544
14814 39608544 40100056 40688745 41597085 42918036 44560681 46272855 47753316 48805744
14806 48805744 49430666 49794311 50114406 50548928 51139778 51809540 52390815 52681033 52514918
14797 52514918 51822297 50641024 49093593 47354434 45611512 44011589 42604701 41329021
14789 41329021 40058753 38691587 37220956 35750226 34449138 33484051 32958483 32891506 33234155
$$ packed form
14849B0708294N94665L98297P7553k75765n77940p89134r05198r30600q71012
14840A7429160p43128n74352l87414j86448M3084L20487O51827J021084J394383
14831A8968683J731086J993895K151432K173743K035068J735059J322797Q93389
14823C3005152N53109L81633M11590O15798Q96082J101540J105465R03285O34890
14814C9608544M91512N88689R08340J320951J642645J712174J480461J052428
14806D8805744O24922L63645L20095M34522N90850O69762N81275K90218j66115
14797E2514918o92621j181273j547431j739159j742922j599923j406888j275680
14789D1329021j270268j367166j470631j470730j301088r65087n25568o6977L42649
$$ plain form
14780 33234155 33891903 34726456 35546356 36117186 36213235 35700183 34596922 33061685 31303033
14771 31303033 29473170 27608819 25651590 23533721 21275725 19029965 17036722 15522304
14763 15522304 14604693 14251766 14298679 14508833 14646440 14520908 13991995 12971995 11459828
14754 11459828 9581487 7573194 5684360 4056267 2667772 1389451 95386 -1260621
14746 -1260621 -2649693 -4017703 -5316631 -6498424 -7504862 -8284320 -8823682 -9160499 -9358847
14737 -9358847 -9465560 -9477987 -9338534 -8946624 -8177662 -6915190 -5100112 -2775034 -90691
14728 -90691 2732327 5457594 7867932 9777583 11047224 11616952 11536090 10956955 10084220
14719 10084220 9101731 8115334 7144999 6167127 5172177 4198635 3330882 2676041 2339609
$$ packed form
14780C3234155O57748Q34553Q19900N70830R6049n13052j103261j535237j758652
14771C1303033j829863j864351j957229k117869k257996k245760j993243j514418
14763A5522304r17611l52927M6913K10154J37607j25532n28913j020000j512167
14754A1459828j878341k008293j888834j628093j388495j278321j294065j356007
14746a260621j389072j368010j298928j181793j006438p79458n39362l36817j98348
14737i358847j06713j2427J39453L91910P68962J262472J815078K325078K684343
14728i0691K823018K725267K410338J909651J269641N69728q0862n79135q72735
14719A0084220r82489r86397r70335r77872r94950r73542q67753o54841l36432
$$ plain form
14710 2339609 2404351 2907252 3821236 5062588 6530995 8154491 9898563 11725568 13532886
14701 13532886 15121650 16233095 16641806 16246453 15098718 13368823 11294581 9146416
14693 9146416 7197163 5677000 4725920 4376816 4579384 5240896 6256708 7523437 8940186
14684 8940186 10405773 11824451 13131228 14324905 15470845 16651043 17891993 19124940
14676 19124940 20195865 20897816 21005343 20324907 18770209 16431624 13596559 10706959
14668 10706959 8273466 6780087 6606792 7974580 10904384 15198202 20464362 26182237
14660 26182237 31778522 36704400 40512394 42916420 43818722 43300053 41573761 38918583
14652 38918583 35625991 31984114 28275345 24752890 21598592 18894218 16631208 14757204
$$ packed form
14710B339609O4742N02901R13984J241352J468407J623496J744072J827005J807318
14701A3532886J588764J111445M08711l95353j147735j729895k074242k148165
14693I146416j949253j520163r51080l49104K02568O61512J015812J266729J416749
14684H940186J465587J418678J306777J193677J145940J180198J240950J232947
14676A9124940J070925P01951J07527o80436j554698k338585k835065k889600
14668A0706959k433493j493379j73295J367788K929804M293818N266160N717875
14660B6182237N596285M925878L807994K404026R02302n18669j726292k655178
14652C8918583l292592l641877l708769l522455l154298k704374k263010j874004
$$ plain form
14644 14757204 13228808 12039593 11226271 10870064 11085746 11979568 13582891 15798397 18396827
14635 18396827 21068809 23499089 25427807 26685789 27205150 27009810 26196127 24912718
14627 24912718 23335372 21629529 19912413 18242691 16646514 15155366 13825153 12728419
14619 12728419 11934851 11498651 11454794 11813094 12548783 13603535 14901911 16363933 17897668
14610 17897668 19387415 20702591 21726257 22385513 22670483 22627845 22319988 21772509 20961392
14601 20961392 19869498 18574172 17283431 16271714 15746284 15728813 16024101 16289022 16161182
14592 16161182 15390917 13932874 11968423 9843260 7934449 6506416 5633948 5228769
14584 5228769 5140839 5271073 5636220 6357556 7588296 9422867 11831840 14652246 17637643
$$ packed form
14644A4757204j528396j189215q13322l56207K15682Q93822J603323K215506K598430
14635A8396827K671982K430280J928718J257982N19361j95340q13683j283409
14627B4912718j577346j705843j717116j669722j596177j491148j330213j096734
14619A2728419p93568m36200m3857L58300P35689J054752J298376J462022J533735
14610A7897668J489747J315176J023666O59256K84970m2638l07857n47479q11117
14601B0961392j091894j295326j290741j011717n25430j7471K95288K64921j27840
14592A6161182p70265j458043j964451k125163j908811j428033q72468m05179
14584E228769q7930J30234L65147P21336J230740J834571K408973K820406K985397
$$ plain form
14575 17637643 20540997 23188825 25513801 27533452 29292482 30813771 32091913 33115782
14567 33115782 33885997 34420114 34757973 34964686 35118506 35286228 35500079 35746689 35974747
14558 35974747 36118147 36113850 35895041 35373004 34447258 33058394 31246888 29170699 27069852
14549 27069852 25199823 23766568 22889448 22595558 22826321 23439788 24217665 24903916 25280749
14540 25280749 25241918 24809083 24083944 23186819 22225082 21281101 20397708 19574222 18791553
14531 18791553 18044878 17341981 16664865 15940792 15062404 13948990 12604718 11131000 9686407
14522 9686407 8426595 7460011 6825827 6481159 6297357 6084434 5653972 4899100 3849173
14513 3849173 2665646 1577537 785346 373234 265451 249849 64183 -496434 -1506972
$$ packed form
14575A7637643K903354K647828K324976K019651J759030J521289J278142J023869
14567C3115782P70215N34117L37859K06713J53820J67722K13851K46610K28058
14558C5974747J43400m297k18809n22037r25746j388864j811506k076189k100847
14549B7069852j870029j433255q77120k93890K30763O13467P77877O86251L76833
14540B5280749l8831m32835p25139q97125r61737r43981q83393q23486p82669
14531A8791553p46675p02897o77116p24073q78388j113414j344272j473718j444593
14522I686407j259812r66584o34184l44668j83802k12923m30462p54872j049927
14513C849173j183527j088109p92191m12112j07783j5602j85666n60617j010538
$$ plain form
14504 -1506972 -2897673 -4480152 -6000496 -7214521 -7956628 -8166567 -7875265 -7174035 -6179670
14495 -6179670 -5002883 -3733286 -2443320 -1195561 -39342 997557 1909382 2707933
14487 2707933 3427524 4141620 4972920 6076533 7597382 9623010 12152560 15092273 18276891
14478 18276891 21506277 24584273 27348848 29679860 31477660 32634217 33035709 32608104
14470 32608104 31370233 29449282 27052471 24420148 21775419 19273039 16963611 14796881
14462 14796881 12667556 10475109 8156666 5679920 3022540 166425 -2889816 -6109334
14454 -6109334 -9401121 -12627323 -15637712 -18312850 -20588020 -22443855 -23873871 -24851904
14446 -24851904 -25318652 -25197470 -24443026 -23109283 -21392773 -19609362 -18114960 -17216910 -17105679
$$ packed form
14504a506972j390701j582479j520344j214025p42107k09939K91302P01230R94365
14495f179670J176787J269597J289966J247759J156219J036899R11825P98551
14487B707933P19591P14096Q31300J103613J520849K025628K529550K939713L184618
14478A8276891L229386L077996K764575K331012J797800J156557M01492m27605
14470C2608104j237871j920951k396811k632323k644729k502380k309428k166730
14462A4796881k129325k192447k318443k476746k657380k856115l056241l219518
14454f109334l291787l226202l010389k675138k275170j855835j430016r78033
14446b4851904m66748J21182P54444J333743J716510J783411J494402Q98050J11231
$$ plain form
14437 -17105679 -17811159 -19188975 -20945876 -22700123 -24063755 -24737695 -24602443 -23763886 -22515019
14428 -22515019 -21220704 -20182011 -19541485 -19259050 -19154351 -18986020 -18525697 -17601189 -16116464
14419 -16116464 -14067083 -11552592 -8772658 -6003089 -3565655 -1796808 -991986 -1314692
14411 -1314692 -2719856 -4962332 -7692971 -10567769 -13308330 -15721724 -17714216 -19301861
14403 -19301861 -20593060 -21729648 -22808229 -23827031 -24692863 -25282045 -25514640 -25402791 -25057916
14394 -25057916 -24657793 -24382108 -24337830 -24511300 -24779078 -24977097 -24993275 -24833761 -24620082 -24511470
14384 -24511470 -24597647 -24826797 -25009223 -24891248 -24253058 -22978630 -21071602 -18617639 -15717858
14375 -15717858 -12435990 -8790865 -4791378 -486106 4004485 8492424 12754536 16567023
$$ packed form
14437a7105679p05480j377816j756901j754247j363632o73940J35252Q38557J248867
14428b2515019J294315J038693O40526K82435J04699J68331M60323R24508J484725
14419a6116464K049381K514491K779934K769569K437434J768847Q04822l22706
14411a314692j405164k242476k730639k874798k740561k413394j992492j587645
14403a9301861j291199j136588j078581j018802q65832n89182k32595J11849L44875
14394b5057916M00123K75685M4278j73470k67778j98019j6178J59514K13679J08612
14384b4511470q6177k29150j82426J17975O38190J274428J907028K453963K899781
14375a5717858L281868L645125L999487M305272M490591M487939M262112L812487
$$ plain form
14367 16567023 19733539 22118815 23689808 24542820 24892448 25021179 25213414 25698936 26613955
14358 26613955 27980937 29715812 31664989 33651930 35509413 37093881 38291234 39020635
14350 39020635 39238230 38942062 38177641 37036591 35639113 34103938 32524959 30969540
14342 30969540 29492860 28149919 26991069 26042296 25289434 24685708 24177288 23726516 23328542
14333 23328542 23026858 22911047 23072518 23533868 24205029 24900934 25401969 25514751 25115197
14324 25115197 24179837 22804828 21197431 19625933 18336766 17475712 17047657 16921719 16879355
14315 16879355 16701763 16263377 15568539 14693101 13665371 12377219 10601046 8108134 4807310
14306 4807310 816083 -3566795 -7960747 -12026227 -15559038 -18510266 -20922860 -22835170
$$ packed form
14367A6567023L166516K385276J570993Q53012L49628J28731J92235M85522R15019
14358B6613955J366982J734875J949177J986941J857483J584468J197353P29401
14350C9020635K17595k96168p64421j141050j397478j535175j578979j555419
14342C0969540j476680j342941j158850r48773p52862o03726n08420m50772l97974
14333B3328542l01684j15811J61471M61350O71161O95905N01035J12782l99554
14324B5115197r35360j375009j607397j571498j289167q61054m28055j25938m2364
14315A6879355j77592m38386o94838q75438j027730j288152j776173k492912l300824
14306D807310l991227m382878m393952m065480l532811k951228k412594j912310
$$ plain form
14298 -22835170 -24229773 -25063834 -25338369 -25131548 -24568226 -23758166 -22743373 -21474409 -19829479
14289 -19829479 -17676217 -14937561 -11613512 -7760423 -3468729 1143295 5934824 10753553
14281 10753553 15439358 19813648 23671143 26797853 29016370 30232646 30457249 29796217
14273 29796217 28423821 26546590 24361492 22017800 19599413 17135159 14625221 12065469
14265 12065469 9462404 6844964 4282683 1904821 -104916 -1555134 -2313169 -2346768
14257 -2346768 -1720846 -569891 925306 2553551 4100070 5395714 6368087 7048719 7516549
14248 7516549 7821156 7949762 7853273 7490990 6849503 5932196 4747415 3311780 1660459
14239 1660459 -141430 -1981108 -3679660 -4995557 -5668973 -5500391 -4426766 -2547775
$$ packed form
14298b2835170j394603q34061k74535K06821N63322Q10060J014793J268964J644930
14289a9829479K153262K738656L324049L853089M291694M612024M791529M818729
14281A0753553M685805M374290L857495L126710K218517J216276K24603o61032
14273B9796217j372396j877231k185098k343692k418387k464254k509938k559752
14265A2065469k603065k617440k562281k377862k009737j450218p58035l3599
14257b346768O25922J150955J495197J628245J546519J295644R72373O80632M67830
14248G516549L04607J28606r6489l62283o41487r17307j184781j435635j651321
14239A660459j801889j839678j698552j315897o73416J68582J073625J878991
$$ plain form
14231 -2547775 -81343 2722145 5650178 8551699 11328584 13925210 16325689 18540733
14223 18540733 20567504 22343403 23740201 24608366 24824390 24302244 22986395 20856856
14215 20856856 17942823 14329459 10160511 5640490 1023557 -3419617 -7442776 -10852038
14207 -10852038 -13516883 -15375545 -16444413 -16827170 -16707161 -16307832 -15827225 -15382867 -15009564
14198 -15009564 -14716101 -14553760 -14631442 -15056584 -15850689 -16908447 -18023660 -18955607 -19499795
14189 -19499795 -19540764 -19079627 -18233844 -17201752 -16195812 -15376105 -14819369 -14530517 -14475673
14180 -14475673 -14612309 -14908175 -15353629 -15967239 -16784230 -17822932 -19046936 -20351384 -21580713
14171 -21580713 -22562536 -23143417 -23214164 -22709421 -21584169 -19795685 -17318193 -14189218 -10557660
$$ packed form
14231b547775K466432K803488K928033K901521K776885K596626K400479K215044
14223A8540733K026771J775899J396798Q68165K16024n22146j315849k129539
14215B0856856k914033l613364m168948m520021m616933m443174m023159l409262
14207a0852038k664845j858662j068868l82757J20009L99329M80607M44358L73303
14198a5009564K93463J62341p7682m25142p94105j057758j115213r31947n44188
14189a9499795m0969M61137Q45783J032092J005940Q19707N56736K88852N4844
14180a4475673j36636k95866m45454o13610q16991j038702j224004j304448j229329
14171b1580713r81823n80881p0747N04743J125252J788484K477492L128975L631558
$$ plain form
14162 -10557660 -6698924 -2979923 227801 2665186 4271191 5178323 5629187 5877455
14154 5877455 6116790 6437083 6799159 7044394 6959824 6375561 5236861 3618131 1689415
14145 1689415 -339193 -2272151 -3965401 -5341229 -6387378 -7146613 -7694251 -8103241 -8415120
14136 -8415120 -8638984 -8778217 -8868326 -9005918 -9339629 -9999667 -10997323 -12181052 -13301679
14127 -13301679 -14136818 -14578367 -14638670 -14400807 -13956980 -13359506 -12593711 -11575969 -10174117
14118 -10174117 -8247485 -5703625 -2556730 1041571 4822617 8468486 11700372 14352714
14110 14352714 16397294 17902848 18961335 19628921 19896189 19678612 18835433 17230890 14821106
14101 14821106 11722658 8224046 4728108 1644422 -724464 -2254870 -3005974 -3164266
$$ packed form
14162a0557660L858736L719001L207724K437385J606005R07132M50864K48268
14154E877455K39335L20293L62076K45235q4570n84263j138700j618730j928716
14145A689415k028608j932958j693250j375828j046149p59235n47638m08990l11879
14136h415120k23864j39233r0109j37592l33711o60038r97656j183729j120627
14127a3301679q35139m41549o0303K37863M43827N97474P65795J017742J401852
14118a0174117J926632K543860L146895L598301L781046L645869L231886K652342
14110A4352714K044580J505554J058487O67586K67268k17577q43179j604543k409784
14101A4821106l098448l498612l495938l083686k368886j530406p51104j58292
$$ plain form
14093 -3164266 -2965000 -2635476 -2380232 -2386562 -2815589 -3766951 -5230762 -7059318 -8994264
14084 -8994264 -10746572 -12077248 -12830602 -12921086 -12307571 -10981923 -8974491 -6362741 -3274195
14075 -3274195 110872 3558388 6799485 9575160 11685858 13028102 13613598 13560543 13050136
14066 13050136 12270137 11382211 10525333 9833393 9439484 9458225 9953592 10909818 12228337
14057 12228337 13759207 15350593 16888666 18302005 19517645 20390739 20672375 20075814
14049 20075814 18423601 15773276 12422070 8789376 5271470 2160230 -365073 -2225257
14041 -2225257 -3444318 -4150974 -4546524 -4840080 -5180006 -5614310 -6102737 -6569699 -6951810
14032 -6951810 -7205952 -7290987 -7157636 -6759107 -6069609 -5099966 -3912865 -2635336 -1448536
$$ packed form
14093c164266J99266L29524K55244o330m29027r51362j463811j828556j934946
14084h994264j752308j330676p53354r0484O13515J325648K007432K611750L088546
14075c274195L385067L447516L241097K775675K110698J342244N85496n3055n10407
14066A3050136p79999q87926q56878o91940l93909J8741M95367R56226J318519
14057A2228337J530870J591386J538073J413339J215640Q73094K81636n96561
14049B0075814j652213k650325l351206l632694l517906l111240k525303j860184
14041b225257j219061p06656l95550k93556l39926m34304m88427m66962l82111
14032f951810k54142q5035J33351L98529O89498R69643J187101J277529J186800
$$ plain form
14023 -1448536 -535224 4864 228440 366598 774310 1834422 3856440 7006169 11284145
14014 11284145 16545879 22536694 28917539 35285349 41212107 46313638 50326004 53150591
14006 53150591 54847034 55583629 55569745 54996004 54001540 52673245 51068545 49244771 47277919
13997 47277919 45269141 43349236 41676056 40401784 39608432 39257184 39206684 39298492 39438827
13988 39438827 39604550 39774411 39853379 39655254 38955512 37578197 35465844 32694049 29425670
13979 29425670 25842123 22106223 18379638 14861197 11789037 9389891 7814382 7105067
13971 7105067 7207832 8005796 9351257 11083695 13035362 15036517 16936482 18641636
13963 18641636 20139999 21478581 22705012 23823392 24797078 25585154 26172610 26569367 26795403
$$ packed form
14023a448536R13312N40088K23576J38158M07712J060112K022018L149729M277976
14014A1284145N261734N990815O380845O367810N926758N101531M012366K824587
14006E3150591J696443P36595j3884n73741r94464j328295j604700j823774j966852
13997D7277919k008778j919905j673180j274272p93352l51248n0500R1808J40335
13988C9438827J65723J69861P8968j98125o99742j377315k112353k771795l268379
13979B9425670l583547l735900l726585l518441l072160k399146j575509p09315
13971G105067J02765P97964J345461J732438J951667K001155J899965J705154
13963A8641636J498363J338582J226431J118380R73686P88076N87456L96757K26036
$$ plain form
13954 26795403 26886024 26914383 26987039 27186871 27497478 27771459 27775088 27290963 26224822 24657639
13944 24657639 22815281 20978449 19386894 18179263 17375958 16896974 16608942 16386153 16157424
13935 16157424 15922138 15742453 15722603 15974656 16570072 17496273 18654158 19910765 21166217
13926 21166217 22372085 23492005 24461833 25196666 25627832 25728816 25520802 25071876 24491826
13917 24491826 23909696 23432778 23109970 22923096 22802520 22651581 22379412 21937306 21328701
13908 21328701 20572582 19650505 18495079 17041944 15300669 13374715 11409420 9512568
13900 9512568 7701179 5896082 3965148 1804293 -579851 -3035236 -5301652 -7098752
13892 -7098752 -8215663 -8559390 -8149593 -7077233 -5464537 -3461669 -1272797 843059
$$ packed form
13954B6795403R0621K8359P2656J99832L10607K73981L629m84125j066141j567183
13944B4657639j842358j836832j591555j207631q03305m78984k88032k22789k28729
13935A6157424k35286j79685j9850K52053N95416R26201J157885J256607J255452
13926B1166217J205868J119920R69828P34833M31166J00984k08014m48926n80050
13917B4491826n82130m76918l22808j86874j20576j50939k72169m42106o08605
13908B1328701p56119r22077j155426j453135j741275j925954j965295j896852
13900I512568j811389j805097j930934k160855k384144k455385k266416j797100
13892g098752j116911l43727M09797J072360J612696K002868K188872K115856
$$ plain form
13884 843059 2635683 3958284 4813281 5310054 5579321 5721350 5818167 5973710 6324030
13875 6324030 6991854 8011788 9281877 10580150 11634054 12193670 12075842 11189805 9559208
13866 9559208 7325537 4715850 1984277 -652074 -3067047 -5251705 -7295877 -9327345
13858 -9327345 -11438692 -13640868 -15861818 -17979854 -19871294 -21458083 -22743083 -23813456
13850 -23813456 -24800193 -25814436 -26901537 -28037992 -29168955 -30265081 -31361958 -32549203
13842 -32549203 -33913564 -35477770 -37173340 -38853975 -40333169 -41420584 -41938433 -41728206
13834 -41728206 -40672770 -38733299 -35978575 -32591013 -28846420 -25069602 -21571138 -18582654
13826 -18582654 -16221934 -14509326 -13418631 -12917029 -12966337 -13500004 -14402560 -15504027 -16601282
$$ packed form
13884H43059J792624J322601Q54997M96773K69267J42029R6817J55543L50320
13875F324030O67824J019934J270089J298273J053904N59616j17828q86037j630597
13866I559208k233671k609687k731573k636351k414973k184658k044172k031468
13858i327345k111347k202176k220950k118036j891440j586789j285000j070373
13850b3813456r86737j014243j087101j136455j130963j096126j096877j187245
13842c2549203j364361j564206j695570j680635j479194j087415n17849K10227
13834d1728206J055436J939471K754724L387562L744593L776818L498464K988484
13826a8582654K360720J712608J090695N01602m9308n33667r02556j101467j097255
$$ plain form
13817 -16601282 -17514756 -18159149 -18585457 -18965281 -19522603 -20448303 -21833314 -23631463 -25650935
13808 -25650935 -27582287 -29065909 -29779400 -29515022 -28225022 -26027065 -23173937 -19995608
13800 -19995608 -16827164 -13944924 -11526833 -9634334 -8206601 -7073410 -6001364 -4764159
13792 -4764159 -3203365 -1257997 1034455 3555484 6133748 8576896 10702069 12362665
13784 12362665 13465502 13971606 13888185 13267680 12211406 10862785 9393434 7998213 6895340
13775 6895340 6307978 6417633 7308704 8932735 11110354 13573732 16033310 18238190 20009033
13766 20009033 21246976 21931431 22110327 21883417 21388088 20789656 20254784 19893370 19696560
13757 19696560 19521551 19143038 18340979 16983123 15085917 12845542 10617703 8832250
$$ packed form
13817a6601282r13474o44393m26308l79824n57322r25700j385011j798149k019472
13808b5650935j931352j483622p13491K64378J290000K197957K853128L178329
13800a9995608L168444K882240K418091J892499J427733J133191J072046J237205
13792d764159J560794J945368K292452K521029K578264K443148K125173J660596
13784A2362665J102837N06104q3421o20505j056274j348621j469351j395221j102873
13775F895340n87362J09655Q91071J624031K177619K463378K459578K204880J770843
13766B0009033J237943O84455J78896k26910m95329n98432n34872l61414j96810
13757A9696560j75009l78513q02059j357856j897206k240375k227839j785453
$$ plain form
13749 8832250 7860491 7883898 8830228 10421535 12303427 14165864 15793318 17052507 17863749
13740 17863749 18195605 18084707 17642999 17020950 16344853 15678483 15038706 14443883 13944820
13731 13944820 13612981 13508633 13658858 14043124 14573138 15080250 15342037 15156168 14424601
13722 14424601 13196905 11651531 10028420 8543620 7321148 6364914 5572756 4782907
13714 4782907 3837882 2644344 1205386 -387780 -1993860 -3463590 -4673603 -5556161
13706 -5556161 -6116578 -6415236 -6517725 -6457613 -6246969 -5915951 -5534488 -5198253 -5000261 -5003959
13696 -5003959 -5210086 -5524327 -5761510 -5706909 -5209254 -4252511 -2964738 -1561987 -261218
13687 -261218 795965 1576068 2127201 2511412 2747808 2809581 2666418 2327589 1852070 1320518
$$ packed form
13749H832250r71759K3407R46330J591307J881892J862437J627454J259189Q11242
13740A7863749L31856j10898m41708o22049o76097o66370o39777n94823m99063
13731A3944820l31839j04348J50225L84266N30014N07112K61787j85869p31567
13722A4424601j227696j545374j623111j484800j222472r56234p92158p89849
13714D782907r45025j193538j438958j593166j606080j469730j210013q82558
13706e556161n60417k98658j02489O0112K10644L31018L81463L36235J97992l698
13696e003959k06127l14241k37183N4601M97655R56743J287773J402751J300769
13687b61218J057183P80103N51133L84211K36396O1773j43163l38829m75519n31552
$$ plain form
13677 1320518 786738 238967 -407279 -1283119 -2515141 -4166826 -6206282 -8522482 -10964524
13668 -10964524 -13357537 -15490945 -17118813 -18001273 -17974909 -17011644 -15227854 -12837761 -10081930
13659 -10081930 -7171815 -4273692 -1526962 930210 2956209 4430638 5295882 5595505
13651 5595505 5491682 5246593 5160164 5483359 6354405 7789497 9710622 11977784 14418504
13642 14418504 16860974 19165617 21238697 23013668 24407214 25289550 25511496 24980290
13634 24980290 23722906 21887110 19690561 17360767 15089725 13002218 11139586 9468787
13626 9468787 7915231 6403216 4888254 3372356 1898781 528460 -693969 -1768210
13618 -1768210 -2738460 -3660592 -4559419 -5397716 -6061728 -6373690 -6143423 -5239310 -3636569
$$ packed form
13677A320518n33780n47771o46246q75840j232022j651685k039456k316200k442042
13668a0964524k393013k133408j627868q82460K6364R63265J783790K390093K755831
13659a0081930K910115K898123K746730K457172K025999J474429Q65244K99623
13651E595505j03823k45089q6429L23195Q71046J435092J921125K267162K440720
13642A4418504K442470K304643K073080J774971J393546Q82336K21946n31206
13634B4980290j257384j835796k196549k329794k271042k087507j862632j670799
13626I468787j553556j512015j514962j515898j473575j370321j222429j074241
13618a768210r70250r22132q98827q38297o64012l11962K30267R04113J602741
$$ plain form
13609 -3636569 -1420662 1242948 4146396 7067139 9789757 12136187 14005766 15401974
13601 15401974 16416685 17172251 17761040 18227275 18598995 18928565 19289526 19728406 20222815
13592 20222815 20686292 21010065 21105555 20926093 20469940 19773998 18902800 17930309 16910675
13583 16910675 15846766 14680601 13319409 11678588 9711509 7413561 4803988 1896346
13575 1896346 -1327597 -4922594 -8942043 -13357155 -17982444 -22476841 -26437630 -29527278
13567 -29527278 -31554519 -32485758 -32419000 -31552401 -30150701 -28505382 -26894728 -25549147 -24623514
13558 -24623514 -24184647 -24218912 -24649251 -25348197 -26152474 -26897411 -27468350 -27831330 -28005050
13549 -28005050 -27986176 -27693924 -26993638 -25789103 -24110261 -22130625 -20107048 -18281284 -16800624
$$ packed form
13609c636569K215907K663610K903448K920743K722618K346430J869579J396208
13601A5401974J014711P55566N88789M66235L71720L29570L60961M38880M94409
13592B0222815M63477L23773R5490j79462m56153o95942q71198r72491j019634
13583A6910675j063909j166165j361192j640821j967079k297948k609573k907642
13575A896346l223943l594997m019449m415112m625289m494397l960789l089648
13567b9527278k027241r31239O6758Q66599J401700J645319J610654J345581R25633
13558b4623514M38867l4265m30339o98946q04277p44937n70939l62980j73720
13549b8005050J8874K92252P00286J204535J678842J979636K023577J825764J480660
$$ plain form
13540 -16800624 -15705835 -14982121 -14610456 -14568279 -14790971 -15133535 -15358229 -15165224 -14276929
13531 -14276929 -12552967 -10072232 -7121222 -4082586 -1286346 1083505 2975657 4384812
13523 4384812 5275711 5574423 5215621 4192660 2569887 458612 -2016450 -4739886 -7613744
13514 -7613744 -10553743 -13476130 -16279009 -18824998 -20935391 -22404706 -23036564 -22692944
13506 -22692944 -21344352 -19107660 -16255419 -13175151 -10268328 -7824628 -5947755 -4578543
13498 -4578543 -3579629 -2805888 -2119104 -1365641 -367785 1041145 2958780 5379462 8208842
13489 8208842 11313405 14568363 17873368 21131661 24215160 26951105 29155150 30699217
13481 30699217 31568242 31866655 31778177 31511683 31253692 31122162 31118734 31105107 30837246 30054990
$$ packed form
13540a6800624J094789P23714L71665M2177k22692l42564k24694J93005Q88295
13531a4276929J723962K480735K951010L038636K796240K369851J892152J409155
13523D384812Q90899K98712l58802j022961j622773k111275k475062k723436k873858
13514g613744k939999k922387k802879k545989k110393j469315o31858L43620
13506b2692944J348592K236692K852241L080268K906823K443700J876873J369212
13498d578543R98914P73741O86784P53463R97856J408930J917635K420682K829380
13489H208842L104563L254958L305005L258293L083499K735945K204045J544067
13481C0699217Q69025K98413q8478k66494k57991j31530l428j3627k67861p82256
$$ plain form
13471 30054990 28580951 26376094 23529933 20202187 16558387 12742102 8893769 5182325
13463 5182325 1803813 -1063520 -3311299 -4916241 -5912639 -6354556 -6298480 -5807267 -4956009
13454 -4956009 -3826231 -2496291 -1047046 414899 1739877 2752296 3308171 3365538 3023552
13445 3023552 2502369 2070153 1948497 2235091 2877864 3713492 4548427 5238486 5730647
13436 5730647 6057637 6298715 6526266 6756295 6926345 6924496 6664433 6160537 5547665 5026078
13426 5026078 4763593 4815249 5110724 5516841 5929841 6338394 6836218 7599167 8837601
13417 8837601 10722588 13304562 16469166 19960385 23459045 26675861 29414399 31580729
13409 31580729 33148233 34103488 34404530 33978574 32759217 30733005 27969046 24628951
$$ packed form
13471C0054990j474039k204857k846161l327746l643800l816285l848333l711444
13463E182325l378512k867333k247779j604942r96398m41917N6076M91213Q51258
13454d956009J129778J329940J449245J461945J324978J012419N55875N7367l41986
13445C023552n21183m32216j21656K86594O42773Q35628Q34935O90059M92161
13436E730647L26990K41078K27551K30029J70050j849k60063n03896o12872n21587
13426E026078k62485N1656K95475M06117M13000M08553M97824P62949J238434
13417H837601J884987K581974L164604L491219L498660L216816K738538K166330
13409C1580729J567504R55255L01042m25956j219357k026212k763959l340095
$$ plain form
13401 24628951 20955881 17231301 13709659 10575968 7956798 5960576 4700283 4279342
13393 4279342 4751337 6071801 8067506 10453616 12901964 15121753 16910892 18173424
13385 18173424 18923168 19277435 19421176 19537647 19740248 20039597 20337915 20430863 20030228
13376 20030228 18830142 16603467 13288328 9034342 4193351 -754884 -5329647 -9177886
13368 -9177886 -12144226 -14259986 -15674729 -16572999 -17117033 -17438724 -17662659 -17908390 -18244794
13359 -18244794 -18634378 -18932313 -18957562 -18584983 -17790345 -16626557 -15169758 -13491938 -11677851
13350 -11677851 -9851089 -8164406 -6750857 -5672665 -4901095 -4332348 -3826687 -3256987 -2556859
13341 -2556859 -1750598 -937509 -227187 331291 776875 1211159 1739109 2400529 3127578
$$ packed form
13401B4628951l673070l724580l521642l133691k619170j996222j260293m20941
13393D279342M71995J320464J995705K386110K448348K219789J789139J262532
13385A8173424P49744L54267J43741J16471K02601K99349K98318R2948m00635
13376B0030228j200086k226675l315139m253986m840991m948235m574763l848239
13368i177886k966340k115760j414743q98270n44034l21691k23935k45731l36404
13359a8244794l89584k97935k5249L72579P94638J163788J456799J677820J814087
13350a1677851J826762J686683J413549J078192P71570N68747N05661N69700P00128
13341b556859Q06261Q13089P10322N58478M45584M34284N27950O61420P27049
$$ plain form
13332 3127578 3763025 4136710 4154306 3846228 3352906 2858899 2513896 2380376 2426725 2561097
13322 2561097 2679785 2692124 2506180 2000792 1026181 -548640 -2772214 -5587479 -8868761
13313 -8868761 -12479993 -16304506 -20231323 -24119566 -27778175 -30986169 -33543061 -35312825
13305 -35312825 -36239121 -36340465 -35701071 -34461798 -32804693 -30921713 -28971681 -27048953
13297 -27048953 -25185945 -23385214 -21653328 -20012102 -18482326 -17052738 -15660728 -14209647
13289 -14209647 -12616103 -10849897 -8942623 -6975664 -5066047 -3353547 -1982393 -1075048
13281 -1075048 -708667 -910439 -1671455 -2955153 -4679222 -6686350 -8751421 -10648396 -12233254
13272 -12233254 -13477617 -14440846 -15220685 -15918809 -16625800 -17413118 -18326267 -19383294 -20578273
$$ packed form
13332C127578O35447L73685J7596l08078m93322m94007l45003j33520M6349J34372
13322B561097J18688J2339j85944n05388r74611j574821k223574k815265l281282
13313h868761l611232l824513l926817l888243l658609l207994k556892j769764
13305c5312825r26296j01344O39394J239273J657105J882980J950032J922728
13297b7048953J863008J800731J731886J641226J529776J429588J392010J451081
13289a4209647J593544J766206J907274J966959J909617J712500J371154R07345
13281a075048L66381k01772p61016j283698j724069k007128k065071j896975j584858
13272a2233254j244363r63229p79839o98124p06991p87318r13149j057027j194979
$$ plain form
13263 -20578273 -21876929 -23194884 -24377224 -25211487 -25471970 -24955218 -23483031 -20902166
13255 -20902166 -17127713 -12227534 -6483052 -365198 5570838 10819148 15033494 18080763
13247 18080763 20019546 21022033 21293640 21029859 20400220 19534046 18510767 17369439 16129255
13238 16129255 14803334 13407760 11975264 10564358 9249299 8100961 7183265 6563003
13230 6563003 6301317 6415067 6843843 7464621 8146442 8792412 9330826 9672437 9683230 9205078
13220 9205078 8112328 6356807 3963452 992544 -2481312 -6350240 -10439571 -14497391
13212 -14497391 -18219924 -21304391 -23519169 -24775583 -25167232 -24939396 -24386597 -23728330 -23034409
13203 -23034409 -22240914 -21233893 -19928601 -18289648 -16303828 -13949902 -11187107 -7960930
$$ packed form
13263b0578273j298656j317955j182340q34263k60483N16752J472187K580865
13255b0902166L774453M900179N744482O117854N936036N248310M214346L047269
13247A8080763J938783J002487K71607k63781o29639q66174j023279j141328j240184
13238A6129255j325921j395574j432496j410906j315059j148338r17696o20262
13230F563003k61686J13750M28776O20778O81821O45970N38414L41611J0793m78152
13220I205078j092750j755521k393355k970908l473856l868928m089331m057820
13212a4497391l722533l084467k214778j256414l91649K27836N52799O58267O93921
13203b3034409P93495J007021J305292J638953J985820K353926K762795L226177
$$ plain form
13195 -7960930 -4223185 39270 4777200 9856394 15040864 19999350 24360363 27810403
13187 27810403 30186078 31509767 31962547 31815403 31330511 30652486 29749586 28462195 26631316
13178 26631316 24201180 21225218 17815375 14116001 10314905 6642794 3331758 545308
13170 545308 -1685969 -3479103 -5042113 -6579502 -8216160 -9963509 -11721027 -13306775
13162 -13306775 -14512592 -15168247 -15192621 -14617530 -13580500 -12294425 -11011921 -9992333 -9458742
13153 -9458742 -9543869 -10256879 -11500134 -13125409 -14992420 -17000812 -19090235 -21215910 -23312416
13144 -23312416 -25272539 -26971046 -28327438 -29355367 -30150899 -30830374 -31469579 -32078412 -32608928
13135 -32608928 -32980202 -33108632 -32938546 -32461850 -31712552 -30738666 -29568882 -28193322 -26576779
$$ packed form
13195g960930L737745M262455M737930N079194N184470M958486M361013L450040
13187B7810403K375675J323689M52780j47144m84892o78025r02900j287391j830879
13178B6631316k430136k975962l409843l699374l801096l672111l311036k786450
13170E45308k231277j793134j563010j537389j636658j747349j757518j585748
13162a3306775j205817o55655k4374N75091J037030J286075J282504J019588N33591
13153i458742q5127p13010j243255j625275j867011k008392k089423k125675k096506
13144b3312416j960123j698507j356392j027929p95532o79475o39205o08833n30516
13135c2608928l71274j28430J70086M76696P49298R73886J169784J375560J616543
$$ plain form
13126 -26576779 -24706555 -22646815 -20559290 -18670816 -17204625 -16314524 -16049732 -16351136
13118 -16351136 -17073941 -18041719 -19123258 -20291313 -21621965 -23233475 -25200709 -27489630
13110 -27489630 -29941748 -32312829 -34345850 -35846039 -36731213 -37042558 -36909930 -36481577 -35854326
13101 -35854326 -35050569 -34059402 -32906732 -31695637 -30592203 -29776603 -29386860 -29472211 -29969849
13092 -29969849 -30716341 -31494380 -32097152 -32379447 -32273310 -31768331 -30869419 -29550737 -27737367
13083 -27737367 -25343627 -22354286 -18890535 -15213245 -11669513 -8621707 -6385165 -5178040
13075 -5178040 -5086585 -6054582 -7895914 -10320191 -12971684 -15490890 -17588070 -19092188 -19952469
13066 -19952469 -20209633 -19960271 -19315672 -18363167 -17159358 -15761802 -14260344 -12769270 -11386505
$$ packed form
13126b6576779J870224K059740K087525J888474J466191Q90101K64792l01404
13118a6351136p22805r67778j081539j168055j330652j611510j967234k288921
13110b7489630k452118k371081k033021j500189q85174l11345J32628M28353O27251
13101c5854326Q03757R91167J152670J211095J103434Q15600L89743q5351m97638
13092b9969849p46492p78039o02772k82295J06137N04979Q98912J318682J813370
13083b7737367K393740K989341L463751L677290L543732L047806K236542J207125
13075e178040R1455r67997j841332k424277k651493k519206k097180j504118q60281
13066a9952469k57164K49362O44599R52505J203809J397556J501458J491074J382765
$$ plain form
13057 -11386505 -10154595 -9049261 -8009492 -7009961 -6134276 -5576553 -5547177 -6148698 -7316579
13048 -7316579 -8862437 -10575955 -12304076 -13959583 -15478737 -16783205 -17779561 -18385696
13040 -18385696 -18555843 -18289507 -17627831 -16651309 -15485234 -14294126 -13243686 -12447462 -11940264
13031 -11940264 -11690052 -11614924 -11577170 -11377690 -10794350 -9658978 -7921347 -5670056 -3120223
13022 -3120223 -574572 1650668 3323151 4372001 4908477 5187989 5537044 6272850 7634323
13013 7634323 9731135 12516013 15790804 19250814 22556025 25406170 27595320 29029346
13005 29029346 29705826 29678710 29042094 27943444 26592686 25230489 24066998 23233201 22765954
12996 22765954 22618715 22688807 22858641 23039003 23190132 23304523 23366634 23333180 23164886 22888393
$$ packed form
13057a1386505J231910J105334J039769R99531Q75685N57723K9376o01521j167881
13048g316579j545858j713518j728121j655507j519154j304468r96356o06135
13040a8385696j70147K66336O61676R76522J166075J191108J050440P96224N07198
13031a1940264K50212P5128L7754J99480N83340J135372J737631K251291K549833
13022c120223K545651K225240J672483J048850N36476K79512L49055P35806J361473
13013G634323K096812K784878L274791L460010L305211K850145K189150J434026
13005B9029346O76480k7116o36616j098650j350758j362197j163491q33797m67247
12996B2765954j47239P0092J69834J80362J51129J14391O2111l3454j68294k76493
$$ plain form
12986 22888393 22629478 22579712 22916660 23727093 24963602 26443075 27894978 29058428 29794838
12977 29794838 30156135 30361062 30688166 31351443 32429252 33866582 35516992 37186720 38675490
12968 38675490 39816006 40495112 40642526 40201371 39109007 37303124 34747381 31459117
12960 31459117 27526167 23114935 18470123 13885881 9636960 5907617 2775789 259264
12952 259264 -1628167 -2860339 -3423054 -3343654 -2700144 -1617997 -270359 1128055 2355550
12943 2355550 3246856 3754650 3966232 4053652 4180153 4417812 4724650 4988299 5101736 5027290
12933 5027290 4820469 4605855 4522934 4678165 5127731 5882418 6909393 8119125 9352492
12924 9352492 10396961 11040900 11137037 10634511 9566464 8012505 6063633 3809118 1351705
$$ packed form
12986B2888393k58915m9766L36948Q10433J236509J479473J451903J163450P36410
12977B9794838L61297K04927L27104O63277J077809J437330J650410J669728J488770
12968C8675490J140516O79106J47414m41155j092364j805883k555743l288264
12960C1459117l932950m411232m644812m584242m248921l729343l131828k516525
12952B59264j887431j232172n62715P9400O43510J082147J347638J398414J227495
12943B355550Q91306N07794K11582Q7420J26501K37659L06838K63649J13437p4446
12933E027290k06821k14614q2921J55231M49566P54687J026975J209732J233367
12924I352492J044469O43939R6137n02526j068047j553959j948872k254515k457413
$$ plain form
12915 1351705 -1164897 -3548085 -5584446 -7086268 -7922752 -8023019 -7370435 -6007337 -4042732
12906 -4042732 -1646061 973397 3585437 5944987 7798592 8920946 9185521 8621332
12898 8621332 7397982 5739412 3829432 1774026 -365287 -2506131 -4504756 -6175182
12890 -6175182 -7361920 -8021074 -8250850 -8248596 -8231260 -8371527 -8763465 -9406268 -10214023 -11068007
12880 -11068007 -11890480 -12692057 -13566729 -14637040 -15969105 -17501957 -19039695 -20309575
12872 -20309575 -21039989 -21015937 -20109112 -18295854 -15658939 -12365327 -8633867 -4714470 -877317
12863 -877317 2609138 5523715 7745506 9277601 10217311 10685856 10761312 10464322 9810781
12854 9810781 8879715 7816047 6744905 5663948 4408435 2725817 417089 -2536740
$$ packed form
12915A351705k516602k383188k036361j501822q36484j00267O52584J363098J964605
12906d042732K396671K619458K612040K359550J853605J122354K64575n64189
12898H621332j223350j658570j909980k055406k139313k140844j998625j670426
12890f175182j186738o59154k29776K254J7336j40267l91938o42803q07755q53984
12880a1068007q22473q01577q74672j070311j332065j532852j537738j269880
12872b0309575p30414K4052R06825J813258K636915L293612L731460L919397L837153
12863h77317L486455K914577K221791J532095R39710M68545P5456k96990o53541
12854I810781r31066j063668j071142j080957j255513j682618k308728k953829
$$ plain form
12846 -2536740 -5935731 -9434540 -12683539 -15449047 -17646367 -19289202 -20413689 -21032913
12838 -21032913 -21145934 -20796980 -20144579 -19473979 -19118670 -19332630 -20195335 -21600034 -23314912
12829 -23314912 -25071275 -26633716 -27829571 -28546520 -28727312 -28377724 -27571257 -26423412 -25039653
12820 -25039653 -23475658 -21736833 -19805375 -17671471 -15362626 -12974646 -10689978 -8750173
12812 -8750173 -7375275 -6677569 -6628080 -7086178 -7856238 -8736397 -9550053 -10163688 -10499709
12803 -10499709 -10553046 -10402914 -10199178 -10119661 -10315029 -10862600 -11748988 -12887749 -14152693
12794 -14152693 -15404409 -16513409 -17393921 -18036410 -18507235 -18908889 -19328953 -19800821 -20274026
12785 -20274026 -20593533 -20509241 -19738260 -18071719 -15482283 -12180905 -8595284 -5273964 -2742732
$$ packed form
12846b536740l398991l498809l248999k765508k197320j642835j124487o19224
12838b1032913j13021L48954O52401O70600L55309k13960q62705j404699j714878
12829b3314912j756363j562441j195855p16949j80792L49588Q06467J147845J383759
12820b5039653J563995J738825J931458K133904K308845K387980K284668J939805
12812h750173J374898O97706M9489m58098p70060q80159q13656o13635l36021
12803a0499709n3337J50132K03736P9517j95368n47571q86388j138761j264944
12794a4152693j251716j109000q80512o42489m70825m01654m20064m71868m73205
12785b0274026l19507Q4292P70981J666541K589436L301378L585621L321320K531232
$$ plain form
12776 -2742732 -1358669 -1218773 -2163454 -3869220 -5980559 -8216311 -10408366 -12481226
12768 -12481226 -14416788 -16230679 -17950131 -19581908 -21079145 -22326336 -23159500 -23422868
12760 -23422868 -23037742 -22038637 -20540148 -18649976 -16399282 -13750127 -10668872 -7207371
12752 -7207371 -3541534 53250 3275707 5877609 7710527 8740855 9045257 8777672
12744 8777672 8106320 7156283 5996804 4671119 3235557 1783840 452784 -593323
12736 -593323 -1204986 -1303560 -916749 -169363 762269 1702487 2505381 3053872 3254519 3057660
12726 3057660 2494940 1695737 862776 223061 -23734 252482 1087986 2425426 4137363
12717 4137363 6064178 8049497 9953355 11638199 12950140 13728672 13854900 13313069 12226277
$$ packed form
12776b742732J384063J39896r44681j705766k111339k235752k192055k072860
12768a2481226j935562j813891j719452j631777j497237j247191q33164k63368
12760b3422868L85126R99105J498489J890172K250694K649155L081255L461501
12752g207371L665837L594784L222457K601902J832918J030328L04402k67585
12744H777672o71352r50037j159479j325685j435562j451717j331056j046107
12736e93323o11663r8574L86811P47386R31632R40218Q02894N48491K00647j96859
12726C057660n62720p99203q32961o39715k46795K76216Q35504J337440J711937
12717D137363J926815J985319J903858J684844J311941P78532J26228n41831j086792
$$ plain form
12708 12226277 10838839 9439491 8251998 7354640 6682938 6104326 5497044 4783745 3925274
12699 3925274 2904109 1719511 399729 -984874 -2332436 -3546942 -4577759 -5438168
12691 -5438168 -6198768 -6959022 -7799766 -8728139 -9640802 -10336531 -10587227 -10230706 -9225847
12682 -9225847 -7644795 -5625987 -3324966 -889374 1531044 3757144 5577109 6790122
12674 6790122 7272503 7016301 6112019 4696616 2911171 886402 -1257011 -3404398 -5433959
12665 -5433959 -7195450 -8506925 -9191933 -9139976 -8351985 -6949614 -5148789 -3208143 -1368454
12656 -1368454 200694 1433585 2366839 3098327 3724901 4294156 4793378 5169732 5360657
12647 5360657 5321947 5051564 4606670 4108070 3726304 3647493 4023715 4925485 6325181 8122662
$$ packed form
12708A2226277j387438j399348j187493q97358o71702n78612o07282p13299q58471
12699C925274j021165j184598j319782j384603j347562j214506j030817q60409
12691e438168p60600p60254q40744r28373r12663o95729k50696L56521J004859
12682i225847J581052K018808K301021K435592K420418K226100J819965J213013
12674F790122M82381k56202r04282j415403j785445k024769k143413k147387k029561
12665e433959j761491j311475o85008N1957P87991J402371J800825J940646J839689
12656a368454J569148J232891R33254P31488O26574N69255M99222L76354J90925
12647E360657l8710k70383m44894m98600l81766p8811L76222R01770J399696J797481
$$ plain form
12637 8122662 10182846 12344747 14405111 16122324 17267518 17693796 17374273 16387249 14859859
12628 14859859 12904841 10591800 7965058 5078937 2020475 -1081323 -4056170 -6714616
12620 -6714616 -8896647 -10525831 -11630896 -12310075 -12657632 -12701141 -12382131 -11589060 -10236896
12611 -10236896 -8350943 -6086926 -3669683 -1313391 811249 2571687 3878979 4715700
12603 4715700 5156814 5360312 5527926 5848435 6439783 7309963 8356088 9406056 10282316
12594 10282316 10853360 11052244 10873924 10377366 9697008 9043702 8678102 8855444 9754228
12585 9754228 11415617 13728545 16474949 19406053 22302801 25004458 27420273 29528498
12577 29528498 31348983 32888666 34084491 34773719 34711368 33641177 31399682 28001616
$$ packed form
12637H122662K060184K161901K060364J717213J145194M26278l19523r87024j527390
12628A4859859j955018k313041k626742k886121l058462l101798k974847k658446
12620f714616k182031j629184j105065o79179l47557m3509L19010P93071J352164
12611a0236896J885953K264017K417243K356292K124640J760438J307292Q36721
12603D715700M41114K03498J67614L20509N91348Q70180J046125J049968Q76260
12594A0282316N71044J98884j78320m96558o80358o53306l65600J77342Q98784
12585I754228J661389K312928K746404K931104K896748K701657K415815K108225
12577B9528498J820485J539683J195825O89228o2351j070191k241495l398066
$$ plain form
12569 28001616 23661365 18747329 13695847 8919262 4736817 1332970 -1266631 -3192585
12561 -3192585 -4677234 -5947594 -7111886 -8105197 -8731472 -8781757 -8159279 -6938286 -5333596
12552 -5333596 -3619718 -2054999 -832083 -45736 322511 389520 328459 324229 543919 1119637
12542 1119637 2134349 3605421 5470000 7585169 9748939 11732826 13319380 14346587
12534 14346587 14743497 14526165 13754607 12495062 10823651 8856230 6759715 4723780
$$ packed form
12569B8001616m340251m914036n051482m776585m182445l403847k599601j925954
12561c192585j484649j270360j164292r93311o26275n0285O22478J220993J604690
12552e333596J713878J564719J222916P86347L68247O7009o1061m230K19690N75718
12542A119637J014712J471072J864579K115169K163770J983887J586554J027207
12534A4346587L96910k17332p71558j259545j671411j967421k096515k035935
$$ [...]
##END NTUPLES=NMR SPECTRUM
##END=
