##TITLE=31P ikalashn
DE-77_oil
15.11.2024
##JCAMPDX= 6.0         $$ Bruker NMR JCAMP-DX V2.0
##DATA TYPE= NMR SPECTRUM
##DATA CLASS= NTUPLES
##ORIGIN= UXNMR, Bruker Analytische Messtechnik GmbH
##OWNER= root
$$ TOPSPIN		Version 1.3
$$ 2024-11-15 14:18:26.531 +0400  Irina@DPX200
$$ Compression mode = diff/dup
##.OBSERVE FREQUENCY= 81.01967998063
##.OBSERVE NUCLEUS= ^31P
##.ACQUISITION MODE= SIMULTANEOUS
##.ACQUISITION SCHEME= undefined
##.AVERAGES= 64
##.DIGITISER RES= 17
##SPECTROMETER/DATA SYSTEM= spect
##.PULSE SEQUENCE= zgpg
##.SOLVENT NAME= D2O
##.SHIFT REFERENCE= INTERNAL, D2O, 1, 298.5841
##AUDIT TRAIL= $$ (NUMBER, WHEN, WHO, WHERE, WHAT)
$$ ##TITLE= Audit trail, TOPSPIN		Version 1.3
$$ ##JCAMPDX= 5.01
$$ ##ORIGIN= Bruker BioSpin GmbH
$$ ##OWNER= Irina
$$ $$ F:/spectra/data/iren/nmr/P31dec/1/pdata/1/auditp.txt
$$ ##AUDIT TRAIL=  $$ (NUMBER, WHEN, WHO, WHERE, VERSION, WHAT)
(   1,<2024-11-15 14:16:20.609 +0400>,<Irina>,<DPX200>,<TOPSPIN 1.3>,
      <acquisition in progress>)
(   2,<2024-11-15 14:18:03.109 +0400>,<Irina>,<DPX200>,<TOPSPIN 1.3>,
      <Start of raw data processing
       efp BC_mod = 2 LB = 10 FT_mod = 6 PKNL = 1 PHC0 = 180.5912 PHC1 = 119.9369 SI = 32K 
       data hash MD5: 32K
       33 54 4E 8B E9 DE CF 31 4F 0A 89 15 61 33 CB 5B>)
(   3,<2024-11-15 14:18:05.531 +0400>,<Irina>,<DPX200>,<TOPSPIN 1.3>,
      <apk 
       data hash MD5: 32K
       23 3B CF 93 C2 A9 4A E9 31 1F D5 CE 62 39 15 2C>)
(   4,<2024-11-15 14:18:13.812 +0400>,<Irina>,<DPX200>,<TOPSPIN 1.3>,
      <pk fgphup PHC0 = -5.4 PHC1 = 0 
       data hash MD5: 32K
       32 1A 72 4C 46 33 46 4A 14 40 8D 69 88 BA B9 6E>)
$$ ##END=
$$ 
$$ $$ hash MD5
$$ $$ 5F 58 40 16 FF E4 91 3C 76 0F 8B 84 C1 85 FE 81
##$RELAX= 
##$RELAX= 
##$RELAX= 
##$RELAX= 
##$RELAX= 
##$RELAX= 
##$RELAX= 
##$RELAX= 
##$RELAX= 
##$RELAX= 
##$RELAX= 
$$ Bruker specific parameters
$$ --------------------------
##$DU= <F:/spectra>
##$EXPNO= 1
##$NAME= <P31dec>
##$PROCNO= 1
##$TYPE= <nmr>
##$USER= <iren>
##$AMP= (0..31)
100 100 100 100 100 100 100 100 100 100 100 100 100 100 100 100 100 100 
100 100 100 100 100 100 100 100 100 100 100 100 100 100 
##$ANAVPT= -1
##$AQSEQ= 0
##$AQ_mod= 1
##$AUNM= <au_zg>
##$AUTOPOS= <>
##$BF1= 81.014009
##$BF2= 200.13
##$BF3= 200.13
##$BF4= 200.13
##$BF5= 200.13
##$BF6= 200.13
##$BF7= 200.13
##$BF8= 200.13
##$BYTORDA= 1
##$CFDGTYP= 0
##$CFRGTYP= 5
##$CHEMSTR= <none>
##$CNST= (0..63)
1 1 145 1 1 1 1 1 1 1 1 1 1 1 1 1 1 1 1 1 1 1 1 1 1 1 1 1 1 1 1 1 1 1 
1 1 1 1 1 1 1 1 1 1 1 1 1 1 1 1 1 1 1 1 1 1 1 1 1 1 1 1 1 1 
##$CPDPRG= <waltz16>
##$CPDPRG1= <>
##$CPDPRG2= <waltz16>
##$CPDPRG3= <>
##$CPDPRG4= <mlev>
##$CPDPRG5= <mlev>
##$CPDPRG6= <mlev>
##$CPDPRG7= <mlev>
##$CPDPRG8= <mlev>
##$CPDPRGB= <>
##$CPDPRGT= <>
##$D= (0..63)
0 1 0 0 0 0 0 0 0 0.06 0 0.03 2e-005 3e-006 0 0 0.0002 0 0 0 0 0 0 0 0 
0 0 0 0 0 0 0 0 0 0 0 0 0 0 0 0 0 0 0 0 0 0 0 0 0 0 0 0 0 0 0 0 0 0 0 
0 0 0 0 
##$DATE= 1731665879
##$DBL= (0..7)
120 120 120 11 120 120 24 19 
##$DBP= (0..7)
$$ [...]
##$SW_h= 37037.037037037
##$TD= 32768
##$TD0= 1
##$TE= 300
##$TE2= 300
##$TE3= 300
##$TEG= 300
##$TL= (0..7)
0 120 53 12 22 120 120 120 
##$TP= (0..7)
150 150 150 150 150 150 150 150 
##$TP07= 0
##$TPNAME0= <>
##$TPNAME1= <>
##$TPNAME2= <>
##$TPNAME3= <>
##$TPNAME4= <>
##$TPNAME5= <>
##$TPNAME6= <>
##$TPNAME7= <>
##$TPOAL= (0..7)
0.5 0.5 0.5 0.5 0.5 0.5 0.5 0.5 
##$TPOFFS= (0..7)
0 0 0 0 0 0 0 0 
##$TUNHIN= 0
##$TUNHOUT= 0
##$TUNXOUT= 0
##$USERA1= <user>
##$USERA2= <user>
##$USERA3= <user>
##$USERA4= <user>
##$USERA5= <user>
##$V9= 5
##$VALIST= <valist>
##$VCLIST= <CCCCCCCCCCCCCCC>
##$VD= 0
##$VDLIST= <DDDDDDDDDDDDDDD>
##$VPLIST= <PPPPPPPPPPPPPPP>
##$VTLIST= <TTTTTTTTTTTTTTT>
##$WBST= 1024
##$WBSW= 4
##$XGAIN= (0..3)
0 0 0 0 
##$XL= 0
##$YL= 0
##$YMAX_a= 11358
##$YMIN_a= -3252
##$ZGOPTNS= <>
##$ZL1= 120
##$ZL2= 120
##$ZL3= 120
##$ZL4= 120
##$ABSF1= 0
##$ABSF2= 0
##$ABSG= 0
##$ABSL= 0
##$ALPHA= 0
##$AQORDER= 0
##$ASSFAC= 0
##$ASSFACI= 0
##$ASSFACX= 0
##$ASSWID= 0
##$AUNMP= <proc_1d>
##$AXLEFT= 0
##$AXRIGHT= 0
##$AXTYPE= 0
##$AXUNIT= <>
##$AZFE= 0.1
##$AZFW= 0.5
##$BCFW= 0
##$BC_mod= 2
##$BYTORDP= 0
##$COROFFS= 0
##$CY= 12.5935478210449
##$DATMOD= 1
##$DC= 0
##$DFILT= <>
##$DTYPP= 0
##$F1P= 47.1127640792319
##$F2P= -24.0371245302204
##$FCOR= 0.5
##$FTSIZE= 32768
##$FT_mod= 6
##$GAMMA= 0
##$GB= 0
##$INTBC= 1
##$INTSCL= 7.269226e-011
##$ISEN= 30
##$LB= 10
##$LEV0= 0
##$LPBIN= 0
##$MAXI= 12.09355
##$MC2= 0
##$MEAN= 0
##$ME_mod= 0
##$MI= 0.7550151
##$NCOEF= 0
##$NC_proc= -12
##$NLEV= 6
##$NOISF1= 298.5841
##$NOISF2= 270.0111
##$NSP= 0
##$NTH_PI= 0
##$NZP= 0
##$OFFSET= 298.5841
##$PC= 1.4
##$PHC0= 137.4958
##$PHC1= 133.5118
##$PH_mod= 1
##$PKNL= yes
##$PPARMOD= 0
##$PPDIAG= 0
##$PPIPTYP= 0
##$PPMPNUM= 100
##$PPRESOL= 1
##$PSCAL= 0
##$PSIGN= 0
##$REVERSE= no
##$SF= 81.014009
##$SI= 32768
##$SIGF1= 270.0111
##$SIGF2= -158.5842
##$SINO= 77.54984
##$SIOLD= 32768
##$SREGLST= <31P.CDCl3>
##$SSB= 0
##$STSI= 32768
##$STSR= 0
##$SW_p= 37037.037037037
##$SYMM= 0
##$S_DEV= 0
##$TDeff= 32768
##$TDoff= 0
##$TI= <>
##$TILT= no
##$TM1= 0
##$TM2= 0
##$TOPLEV= 0
##$USERP1= <user>
##$USERP2= <user>
##$USERP3= <user>
##$USERP4= <user>
##$USERP5= <user>
##$WDW= 1
##$XDIM= 32768
##$YMAX_p= 410333672
##$YMIN_p= -42757397
$$ End of Bruker specific parameters
$$ ---------------------------------
##NTUPLES= NMR SPECTRUM
##VAR_NAME=  FREQUENCY,     SPECTRUM/REAL,   SPECTRUM/IMAG
##SYMBOL=    X,             R,               I
##VAR_TYPE=  INDEPENDENT,   DEPENDENT,       DEPENDENT
##VAR_FORM=  AFFN,          ASDF,            ASDF
##VAR_DIM=   32768,         32768,           32768
##UNITS=     HZ,            ARBITRARY UNITS, ARBITRARY UNITS
##FACTOR=    1.13031516577767, 1,            1
##FIRST=     37037.037037037, -17646800,     -9911858
##LAST=      0,             -17921493,       -8956018
##MIN=       0,             -42757397,       0
##MAX=       37037.037037037, 410333672,     0
$$ Real data points
##PAGE= N=1
##DATA TABLE= (X++(R..R)), XYDATA
$$ [...]
18446 -27021054 -26215677 -25080068 -23878734 -23003225 -22727747 -23004025 -23478297 -23719690 -23467851
18437 -23467851 -22743388 -21791438 -20926803 -20420469 -20404172 -20812984 -21473306 -22188670 -22782806
18428 -22782806 -23194999 -23509888 -23856836 -24339702 -25047121 -26020034 -27186079 -28357051 -29327900
18419 -29327900 -30000105 -30383780 -30495876 -30296191 -29724553 -28794930 -27650186 -26516493 -25627746
18410 -25627746 -25175595 -25213127 -25601335 -26111956 -26554560 -26841249 -27006211 -27101953 -27100202 -26964199
18400 -26964199 -26694531 -26276024 -25689958 -24966377 -24144638 -23206026 -22152422 -21153438 -20494613
18391 -20494613 -20367962 -20760041 -21527168 -22564119 -23833394 -25186143 -26289219 -26816772 -26649264
18382 -26649264 -25872937 -24690965 -23353899 -22086636 -21070334 -20458114 -20325401 -20621402 -21167677
18373 -21167677 -21682812 -21877655 -21617475 -21022943 -20382346 -19954139 -19863696 -20163006 -20894296
18364 -20894296 -22014127 -23322596 -24550240 -25495460 -26080717 -26321144 -26232912 -25785393 -24972811
18355 -24972811 -23882266 -22704009 -21711133 -21188625 -21265216 -21753671 -22273103 -22552134 -22598356
18346 -22598356 -22624089 -22784776 -23005099 -23075096 -22892433 -22589752 -22374182 -22277223 -22179459 -22059785
18336 -22059785 -22098268 -22487346 -23207429 -24008418 -24596212 -24876539 -24986042 -25091601 -25249826
18327 -25249826 -25441888 -25616374 -25690706 -25661698 -25699699 -25982587 -26472469 -26941385 -27171852 -27076097
18317 -27076097 -26681642 -26120827 -25620003 -25369201 -25386422 -25557929 -25741132 -25823575 -25747813 -25445729
18307 -25445729 -24796302 -23730698 -22294907 -20576231 -18665918 -16727965 -14994036 -13608671
18299 -13608671 -12574448 -11911314 -11772233 -12301462 -13421810 -14833980 -16202644 -17320307
18291 -17320307 -18107677 -18553771 -18739513 -18867049 -19145845 -19639855 -20276005 -20946407 -21542623
18282 -21542623 -21943261 -22050930 -21870372 -21531956 -21233920 -21131750 -21205881 -21237166 -20966769 -20297424
18272 -20297424 -19341950 -18281143 -17226536 -16250906 -15463777 -14987641 -14853571 -14926011 -14991781
18263 -14991781 -14947352 -14835771 -14739173 -14698865 -14722830 -14857035 -15247389 -16038163 -17186302 -18454367
18253 -18454367 -19571489 -20370286 -20809004 -20932784 -20810592 -20485615 -19991880 -19392885 -18764137
18244 -18764137 -18173284 -17704967 -17442479 -17392769 -17452805 -17486871 -17484888 -17629164 -18101845 -18833875
18234 -18833875 -19512708 -19821893 -19658233 -19121787 -18357547 -17452874 -16519188 -15857844 -15886300
18225 -15886300 -16823708 -18495962 -20442468 -22208197 -23541492 -24350408 -24593870 -24261346 -23418268
18216 -23418268 -22217888 -20843612 -19434566 -18047454 -16683807 -15356203 -14115199 -13050879
18208 -13050879 -12291827 -11910506 -11843635 -11965629 -12176493 -12449094 -12829395 -13340532 -13941075
18199 -13941075 -14620192 -15434624 -16422219 -17519525 -18545291 -19305659 -19749981 -19982068 -20155168
18190 -20155168 -20425639 -20931762 -21734843 -22795562 -23991788 -25124291 -25982681 -26479027 -26686299
18181 -26686299 -26746996 -26771484 -26820456 -26916838 -27004184 -26945426 -26628446 -26046545 -25268573 -24369593
18171 -24369593 -23396694 -22373024 -21300038 -20190871 -19110043 -18147099 -17353251 -16679278 -15997873
18162 -15997873 -15232725 -14481332 -14005374 -14036458 -14587515 -15471769 -16428656 -17248712 -17869604
18153 -17869604 -18380784 -18935685 -19643049 -20473157 -21201856 -21497638 -21178591 -20422723 -19688632
18144 -19688632 -19358159 -19441896 -19668082 -19810552 -19880622 -20036839 -20403324 -20963662 -21543001 -21918795
18134 -21918795 -21997315 -21885166 -21789733 -21839720 -21971545 -22007715 -21852257 -21586561 -21418326 -21541701
18124 -21541701 -21990697 -22665503 -23461614 -24284847 -25034097 -25603480 -25873812 -25757594 -25276888
18115 -25276888 -24545135 -23611893 -22407655 -20903219 -19247023 -17731793 -16633732 -16058225
18107 -16058225 -15881072 -15806946 -15586677 -15224658 -14926333 -14898139 -15259188 -16069333 -17311796
18098 -17311796 -18820945 -20330287 -21622678 -22602240 -23226097 -23452621 -23301739 -22888553 -22361141
18089 -22361141 -21834899 -21425555 -21289171 -21523197 -22046926 -22660438 -23253029 -23913222 -24786966
18080 -24786966 -25858121 -26932418 -27835509 -28543403 -29126409 -29623208 -29940065 -29892170 -29364670
18071 -29364670 -28327428 -26799332 -24996562 -23362698 -22306557 -21984763 -22322739 -23105847
18063 -23105847 -24034065 -24832040 -25373764 -25646601 -25622470 -25275160 -24704755 -24157077 -23879665
18054 -23879665 -23880585 -23874326 -23585984 -23012810 -22324458 -21693997 -21264611 -21097500 -21132642 -21276761
18044 -21276761 -21468447 -21625534 -21582719 -21185119 -20501229 -19815494 -19361575 -19158223 -19090188 -19088856
18034 -19088856 -19204735 -19464036 -19738932 -19818747 -19518458 -18745986 -17570682 -16209067 -14885273
18025 -14885273 -13707927 -12718854 -12025071 -11762809 -11949811 -12462095 -13116676 -13757948 -14306357
18016 -14306357 -14762955 -15154905 -15446945 -15532757 -15308524 -14748518 -13960444 -13154400 -12509883
18007 -12509883 -12105830 -11975748 -12160711 -12675015 -13439323 -14321906 -15231432 -16110337 -16880768
17998 -16880768 -17469200 -17862112 -18074187 -18113854 -18012359 -17834127 -17650173 -17468652 -17221896
17989 -17221896 -16924236 -16780918 -17015575 -17624932 -18412733 -19214924 -19989927 -20740932 -21472901
17980 -21472901 -22228189 -23078560 -24045073 -25023212 -25809968 -26257575 -26404233 -26401177 -26329519 -26150129
17970 -26150129 -25803369 -25278808 -24582262 -23670049 -22459331 -20929486 -19207429 -17559389 -16282835
17961 -16282835 -15577812 -15495006 -15936631 -16694199 -17528786 -18223751 -18625900 -18698272 -18489819 -18056376
17951 -18056376 -17476596 -16886660 -16453505 -16343224 -16645208 -17291481 -18107467 -18911944 -19571901
17942 -19571901 -20038606 -20337212 -20542209 -20737904 -20947952 -21144056 -21335551 -21622292 -22178465
17933 -22178465 -23118116 -24331070 -25557364 -26620432 -27472689 -28046188 -28213727 -27913877 -27259098
17924 -27259098 -26542820 -26132454 -26277959 -26949403 -27883653 -28815751 -29605599 -30181942 -30487485
17915 -30487485 -30511494 -30346991 -30155107 -30020920 -29861711 -29556480 -29158848 -28880571 -28852923 -28986393
17905 -28986393 -29090990 -29050507 -28864320 -28601346 -28351532 -28223239 -28345376 -28775677 -29400550
17896 -29400550 -29976874 -30245110 -30031405 -29334450 -28339071 -27308915 -26408787 -25603034 -24706654
17887 -24706654 -23536904 -22036297 -20281959 -18430941 -16674845 -15182236 -14086760 -13554991
17879 -13554991 -13752425 -14696335 -16168186 -17764877 -19121612 -20163293 -21078169 -22056803 -23104272
17870 -23104272 -24065489 -24784034 -25191611 -25295509 -25127277 -24707114 -24112433 -23538845 -23184710
17861 -23184710 -23120522 -23322302 -23734412 -24279664 -24877598 -25474402 -26043141 -26536810 -26871935
17852 -26871935 -27014345 -27053549 -27108540 -27157973 -27010622 -26451107 -25414712 -24008682 -22386115
17843 -22386115 -20689046 -19147153 -18104242 -17808178 -18205688 -18990360 -19818195 -20479606 -20943048
17834 -20943048 -21274940 -21514816 -21646557 -21694270 -21775462 -22009314 -22402784 -22850938 -23260248 -23608348
17824 -23608348 -23887276 -24073781 -24178608 -24264465 -24376262 -24513014 -24661794 -24804964 -24908671
17815 -24908671 -24953395 -24943019 -24830864 -24510242 -23911850 -23092842 -22258933 -21651870 -21363943 -21328348
17805 -21328348 -21472262 -21748854 -22073096 -22361951 -22620728 -22913375 -23235760 -23454313 -23390194
17796 -23390194 -22972842 -22275446 -21391935 -20375798 -19302751 -18269725 -17331585 -16483195 -15705520
17787 -15705520 -15046148 -14612284 -14467554 -14601375 -14971108 -15495984 -16051349 -16524982 -16868144
17778 -16868144 -17133130 -17445573 -17888363 -18404901 -18838757 -19076067 -19113725 -19031851 -18949453 -18989136
17768 -18989136 -19252602 -19778407 -20501611 -21268128 -21878875 -22188403 -22184015 -21952567 -21646335 -21442927
17758 -21442927 -21467268 -21783678 -22411417 -23278001 -24231371 -25134838 -25901449 -26451893 -26689457
17749 -26689457 -26543554 -26048382 -25348424 -24604665 -23920113 -23346176 -22909480 -22588280 -22303106
17740 -22303106 -21996306 -21661669 -21283386 -20841747 -20381425 -20002071 -19760388 -19635237 -19591980
17731 -19591980 -19622031 -19739283 -19960000 -20295056 -20745528 -21278910 -21890314 -22679840 -23761667
17722 -23761667 -25102466 -26513562 -27790454 -28786729 -29389873 -29558372 -29367547 -28964941 -28527452
17713 -28527452 -28229743 -28136161 -28145751 -28085823 -27805773 -27184800 -26173231 -24871153 -23495284
17704 -23495284 -22307763 -21580085 -21494907 -22014832 -22906609 -23935174 -24982966 -26001120 -26945018
17695 -26945018 -27760151 -28376230 -28694507 -28615960 -28160247 -27586897 -27285194 -27461661 -28014678
17686 -28014678 -28727171 -29494540 -30295723 -31012697 -31467193 -31638101 -31715434 -31889475 -32124474
17677 -32124474 -32173741 -31774591 -30812177 -29361041 -27651397 -26002494 -24743114 -24135247 -24255819
17668 -24255819 -24891793 -25659032 -26270304 -26662339 -26935665 -27224264 -27569019 -27904138 -28158079
17659 -28158079 -28284594 -28222283 -27918424 -27401382 -26813338 -26336856 -26078108 -26040819 -26164179 -26367848
17649 -26367848 -26586871 -26825124 -27202099 -27835374 -28701749 -29728024 -30888874 -32092396 -33112544
17640 -33112544 -33728069 -33866820 -33613190 -33129764 -32593289 -32126700 -31739592 -31378689 -30998505
17631 -30998505 -30597187 -30260177 -30083881 -30025497 -29936937 -29701495 -29282748 -28702199 -28008754 -27263728
17621 -27263728 -26535037 -25889329 -25376146 -24995377 -24696240 -24410167 -24056312 -23567976 -22975301
17612 -22975301 -22433182 -22127095 -22125496 -22340642 -22639557 -22955765 -23308791 -23715813 -24087351 -24258128
17602 -24258128 -24127873 -23766558 -23430680 -23467837 -24124579 -25375129 -26915040 -28352759 -29445556
17593 -29445556 -30156946 -30536068 -30594967 -30239066 -29344361 -27957838 -26344020 -24816257 -23581796
17584 -23581796 -22740748 -22324456 -22267825 -22410542 -22602603 -22768682 -22867011 -22845590 -22603489 -21981580
17574 -21981580 -20908070 -19556924 -18236047 -17145999 -16354669 -15910101 -15869074 -16257075 -17007063
17565 -17007063 -17926091 -18775478 -19382863 -19645650 -19493068 -18950631 -18202962 -17489376 -16948303
17556 -16948303 -16591882 -16442062 -16578225 -16996361 -17560282 -18108574 -18570298 -19002361 -19547583
17547 -19547583 -20325137 -21290087 -22230862 -22937502 -23333833 -23476210 -23511562 -23644547 -24030548
17538 -24030548 -24636143 -25246674 -25629038 -25682383 -25429924 -24921222 -24228269 -23497698 -22882806
17529 -22882806 -22415126 -22050582 -21810881 -21775265 -21962646 -22266501 -22527879 -22671462 -22745921 -22834501
17519 -22834501 -22962684 -23102072 -23241683 -23427896 -23712159 -24103338 -24557767 -24976996 -25261894
17510 -25261894 -25349732 -25177511 -24648311 -23657297 -22189218 -20415388 -18654295 -17235223 -16375122
17501 -16375122 -16119747 -16430075 -17249577 -18383687 -19494812 -20333947 -20863513 -21143042 -21236130
17492 -21236130 -21226290 -21168800 -21013186 -20683710 -20243328 -19895962 -19796037 -19915809 -20152175 -20499487
17482 -20499487 -21011662 -21644846 -22275893 -22832296 -23291617 -23602305 -23669319 -23435902 -22979214
17473 -22979214 -22493740 -22151894 -22025783 -22098603 -22266437 -22425157 -22564481 -22701341 -22804008
17464 -22804008 -22863613 -22965417 -23218871 -23623709 -24020405 -24159426 -23823727 -22959236 -21713240
17455 -21713240 -20344996 -19143419 -18310034 -17818547 -17489683 -17198518 -16938638 -16780629 -16848950
17446 -16848950 -17262672 -18023325 -18965752 -19845707 -20469127 -20753548 -20725594 -20503547 -20284499
17437 -20284499 -20248905 -20415408 -20652264 -20828327 -20906250 -20923135 -20898482 -20780628 -20509759 -20108141
17427 -20108141 -19691205 -19389454 -19242875 -19160974 -18987622 -18611231 -18040445 -17417319 -16971428
17418 -16971428 -16908457 -17263779 -17882883 -18561108 -19136260 -19471929 -19477642 -19174742 -18711317 -18329430
17408 -18329430 -18284621 -18716108 -19584316 -20717840 -21912866 -23025883 -24017455 -24916676 -25725177
17399 -25725177 -26350599 -26652258 -26575111 -26211116 -25697843 -25093636 -24382339 -23558321 -22660741
17390 -22660741 -21719958 -20732928 -19704090 -18715089 -17964497 -17673563 -17928896 -18605959 -19445171
17381 -19445171 -20230319 -20853258 -21247913 -21403121 -21420249 -21433237 -21451102 -21344156 -20946317 -20151766
17371 -20151766 -19021189 -17769429 -16590826 -15554015 -14659430 -13933553 -13456247 -13328423 -13593729
17362 -13593729 -14171583 -14905452 -15666820 -16348521 -16813529 -16968465 -16871244 -16699282 -16606142 -16640456
17352 -16640456 -16787490 -17007634 -17194207 -17231488 -17195125 -17337148 -17833318 -18656249 -19617947 -20415122
17342 -20415122 -20748364 -20544542 -20031795 -19577953 -19497517 -19900966 -20579904 -21131936 -21285927
17333 -21285927 -21057491 -20644232 -20277740 -20134193 -20279008 -20682991 -21275878 -21925054 -22403943
17324 -22403943 -22447163 -21884250 -20761164 -19325706 -17889840 -16698070 -15887449 -15486130 -15412223
17315 -15412223 -15533615 -15752653 -16032501 -16339726 -16568191 -16588603 -16363822 -15948187 -15438331
17306 -15438331 -14982390 -14762560 -14905161 -15399917 -16102124 -16832959 -17490377 -18075629 -18644465
17297 -18644465 -19247491 -19920614 -20683797 -21513488 -22338660 -23067709 -23606345 -23888688 -23939473
17288 -23939473 -23872721 -23802355 -23748546 -23626227 -23366196 -23030171 -22763242 -22673113 -22775838 -23055984
17278 -23055984 -23526227 -24158651 -24822750 -25354866 -25648992 -25674293 -25459139 -25109671 -24812390
17269 -24812390 -24747574 -24957615 -25326860 -25693022 -25900270 -25801615 -25295007 -24329295 -22938227
17260 -22938227 -21296545 -19665969 -18304407 -17414781 -17091101 -17294147 -17905211 -18789131 -19784507
17251 -19784507 -20727911 -21514146 -22087863 -22427100 -22553476 -22537419 -22464529 -22406580 -22476466 -22837619
17241 -22837619 -23550963 -24427710 -25120600 -25403575 -25284167 -24901843 -24440561 -24019431 -23616152
17232 -23616152 -23212416 -22935770 -22936984 -23212310 -23627717 -24042859 -24346899 -24470572 -24445639 -24383265
17222 -24383265 -24359080 -24332161 -24198306 -23951437 -23727488 -23690581 -23944031 -24523782 -25390124 -26407391
17212 -26407391 -27394851 -28213327 -28795737 -29112719 -29158844 -28996410 -28732341 -28419808 -28075379
17203 -28075379 -27771608 -27587108 -27481002 -27312015 -26974576 -26431354 -25649745 -24632993 -23472299
17194 -23472299 -22295099 -21178568 -20139101 -19186510 -18358625 -17735254 -17403519 -17350857 -17404700
17185 -17404700 -17375724 -17270908 -17263469 -17490434 -17943779 -18495743 -19004070 -19402623 -19707622 -19917399
17175 -19917399 -19926057 -19645606 -19151583 -18584125 -18014934 -17493943 -17112209 -16943736 -16980465 -17153337
17165 -17153337 -17373004 -17579626 -17814101 -18193217 -18764554 -19442480 -20069031 -20481208 -20569240
17156 -20569240 -20305151 -19749926 -19073092 -18484387 -18097280 -17904475 -17892286 -18132578 -18706917
17147 -18706917 -19543887 -20419603 -21127938 -21576994 -21767478 -21744683 -21546255 -21183708 -20668800
17138 -20668800 -20024032 -19264651 -18378382 -17370216 -16378061 -15656362 -15389726 -15573712 -16055358
17129 -16055358 -16650276 -17255497 -17953194 -18986454 -20509746 -22390095 -24315803 -26034733
17121 -26034733 -27479774 -28744361 -29920528 -30913014 -31469558 -31446702 -31007098 -30495259 -30124837
17112 -30124837 -29891393 -29746042 -29688772 -29704905 -29711435 -29613808 -29421647 -29254492 -29196293 -29181379
17102 -29181379 -29076034 -28834440 -28507796 -28167754 -27823202 -27307679 -26335611 -24789887 -22872547
17093 -22872547 -20946418 -19345865 -18301416 -17890238 -18063120 -18750350 -19826418 -21031052
17085 -21031052 -22091237 -22869192 -23356207 -23594533 -23623684 -23471217 -23159275 -22735431 -22305487
17076 -22305487 -21991951 -21828244 -21724465 -21607038 -21521250 -21546720 -21664306 -21702261 -21442116 -20814008
17066 -20814008 -19959617 -19105318 -18425357 -18023225 -17954872 -18243125 -18903153 -19935732 -21269825
17057 -21269825 -22716993 -24034504 -25067412 -25774774 -26115598 -26019333 -25521148 -24822024 -24127667
17048 -24127667 -23516132 -23003397 -22654520 -22548291 -22615320 -22638971 -22494932 -22288496 -22218572 -22385800
17038 -22385800 -22779624 -23345411 -24009459 -24743612 -25561421 -26396804 -27094763 -27527102 -27663258
17029 -27663258 -27562339 -27339081 -27110416 -26885963 -26545219 -25986178 -25245680 -24433569 -23592495
17020 -23592495 -22690479 -21711743 -20703884 -19761023 -18962614 -18300757 -17638451 -16789942 -15723754
17011 -15723754 -14681183 -14048412 -14105902 -14911642 -16313927 -17967997 -19427139 -20383671 -20841718
17002 -20841718 -20991917 -20958009 -20729842 -20281204 -19664423 -18976936 -18283589 -17577579 -16797828
16993 -16797828 -15941963 -15124948 -14449120 -13935468 -13622420 -13575174 -13806138 -14254682 -14795541
16984 -14795541 -15274781 -15571459 -15624954 -15435974 -15094498 -14771553 -14646182 -14871205 -15567526
16975 -15567526 -16743673 -18198761 -19612924 -20809511 -21885926 -23044097 -24320472 -25535437
16967 -25535437 -26481485 -27119142 -27609122 -28124585 -28650284 -29016444 -29089625 -28893706 -28626281
16958 -28626281 -28553956 -28763374 -29029262 -29022578 -28621682 -27931057 -27055800 -26017169 -24872617
16949 -24872617 -23715993 -22573360 -21446062 -20410038 -19608574 -19143299 -18972813 -18929897 -18849142
16940 -18849142 -18668035 -18379472 -17943481 -17296536 -16440345 -15524982 -14810437 -14523811 -14747198
16931 -14747198 -15376576 -16163976 -16900419 -17573656 -18283503 -19084254 -19967091 -20919888 -21934625
16922 -21934625 -22963805 -23890405 -24521319 -24663208 -24290532 -23595718 -22813210 -22055011 -21344443
16913 -21344443 -20722838 -20228037 -19834273 -19476883 -19088579 -18644930 -18214459 -17896388 -17691586
16904 -17691586 -17499043 -17236383 -16943753 -16758908 -16801354 -17117648 -17707460 -18546598 -19569506
16895 -19569506 -20649125 -21618442 -22355246 -22832630 -23050542 -22992003 -22706953 -22352980 -22085852
16886 -22085852 -21962672 -21964492 -22055542 -22224935 -22500403 -22893244 -23323560 -23652414 -23830779 -23938935
16876 -23938935 -24060209 -24210989 -24375838 -24514760 -24569834 -24560074 -24623615 -24879167 -25291059 -25719580
16866 -25719580 -26033701 -26135353 -25931812 -25328867 -24294809 -22948389 -21527823 -20280866 -19378864
16857 -19378864 -18819990 -18457210 -18167850 -17884827 -17556626 -17174877 -16773280 -16395355 -16062551
16848 -16062551 -15801753 -15694561 -15842388 -16293845 -16985937 -17746504 -18384288 -18752724 -18798116
16839 -18798116 -18661271 -18606618 -18811878 -19343225 -20205296 -21284524 -22323648 -23045404 -23315374
16830 -23315374 -23238480 -23084264 -23043307 -23122837 -23248065 -23342204 -23293784 -22932728 -22159081 -21090743
16820 -21090743 -20005755 -19157410 -18661776 -18495114 -18536805 -18614937 -18576590 -18380320 -18138268 -18057110
16810 -18057110 -18257303 -18652727 -19041701 -19256941 -19272264 -19220456 -19250453 -19368018 -19452573 -19382321
16800 -19382321 -19120881 -18743592 -18414444 -18309083 -18541265 -19123993 -19925627 -20690531 -21209681
16791 -21209681 -21473012 -21615746 -21744450 -21837678 -21779138 -21484607 -20987535 -20389828 -19766447 -19143878
16781 -19143878 -18567877 -18117957 -17830045 -17714491 -17862939 -18418990 -19387699 -20524384 -21447883
16772 -21447883 -21856291 -21678795 -21062671 -20229192 -19341048 -18493227 -17784060 -17344167 -17245204
16763 -17245204 -17376870 -17467086 -17249699 -16675579 -15945201 -15326916 -15022503 -15135849 -15660837
16754 -15660837 -16490395 -17437944 -18271896 -18790857 -18922348 -18743628 -18376962 -17874407 -17249140
16745 -17249140 -16611330 -16186182 -16178033 -16647760 -17516525 -18663569 -19987266 -21368968 -22656378
16736 -22656378 -23735806 -24579953 -25217738 -25699287 -26102353 -26526072 -27010178 -27498660 -27941204
16727 -27941204 -28358660 -28764059 -29081737 -29184835 -29005717 -28601722 -28135017 -27782656 -27631510
16718 -27631510 -27680980 -27923559 -28365899 -28989395 -29700803 -30315690 -30620216 -30490200 -29981356
16709 -29981356 -29292896 -28625959 -28071607 -27613108 -27234214 -27013541 -27061588 -27341127 -27605029
16700 -27605029 -27571549 -27141572 -26435008 -25661532 -24990975 -24527602 -24317170 -24326799 -24474345 -24716067
16690 -24716067 -25089008 -25657727 -26427226 -27307182 -28138284 -28757387 -29028657 -28876904 -28368148
16681 -28368148 -27694531 -27046166 -26524455 -26133565 -25807133 -25467201 -25108972 -24820675 -24643803
16672 -24643803 -24453233 -24047939 -23329108 -22390628 -21472852 -20775895 -20302778 -19905987 -19477722
16663 -19477722 -19061754 -18764191 -18621289 -18588732 -18615191 -18709689 -18941793 -19350133 -19848798 -20252376
16653 -20252376 -20430846 -20408041 -20262104 -19989820 -19543881 -18944657 -18313099 -17804723 -17514228
16644 -17514228 -17462577 -17665498 -18180999 -19057793 -20248133 -21570195 -22746142 -23554494 -23982797
16635 -23982797 -24194252 -24344931 -24497086 -24652401 -24743238 -24642500 -24258497 -23623267 -22896664
16626 -22896664 -22303151 -22000965 -21963187 -22022312 -22013863 -21868131 -21628640 -21391334 -21168082 -20837400
16616 -20837400 -20284935 -19551958 -18819097 -18302544 -18173389 -18518948 -19370973 -20731548 -22493927
16607 -22493927 -24360417 -25964210 -27109672 -27838880 -28301415 -28614769 -28816119 -28865030 -28649971
16598 -28649971 -28019292 -26878498 -25313973 -23577107 -21921673 -20533327 -19594685 -19246014
16590 -19246014 -19462849 -20064791 -20802087 -21463171 -22019137 -22633381 -23484216 -24588594 -25772427
16581 -25772427 -26810161 -27597821 -28184458 -28672857 -29114599 -29468809 -29623469 -29453883 -28865507
16572 -28865507 -27811573 -26340611 -24630604 -22953471 -21561669 -20563282 -19933332 -19592628
16564 -19592628 -19428754 -19344260 -19334873 -19482984 -19856472 -20442847 -21113438 -21612500 -21720763 -21455120
16554 -21455120 -21053572 -20804319 -20860962 -21164651 -21558458 -21943449 -22293222 -22574315 -22733769
16545 -22733769 -22779238 -22837266 -23062986 -23458692 -23855257 -24059468 -23975989 -23652814 -23258086 -23008081
16535 -23008081 -23049355 -23336629 -23665357 -23843215 -23761362 -23371021 -22720118 -21953890 -21201387 -20530482
16525 -20530482 -19980317 -19515754 -19041735 -18550946 -18149367 -17909084 -17808025 -17821274 -17991179
16516 -17991179 -18364244 -18855046 -19261872 -19435381 -19366747 -19135888 -18834565 -18532077 -18252194
16507 -18252194 -17972067 -17684462 -17437059 -17276699 -17158797 -16962482 -16647193 -16347662 -16259894
16498 -16259894 -16469711 -16950385 -17664236 -18617480 -19846536 -21355883 -23053887 -24756673 -26253726
16489 -26253726 -27374114 -28074728 -28472140 -28725954 -28868030 -28752331 -28217005 -27283865 -26143687
16480 -26143687 -25012255 -24064437 -23396407 -23016287 -22950976 -23288875 -24031467 -24991595 -25884965
16471 -25884965 -26519667 -26913557 -27241450 -27662613 -28185140 -28727299 -29276770 -29921630 -30754861
16462 -30754861 -31743063 -32592346 -32785965 -31929797 -30150362 -28014142 -26048588 -24438865 -23099589
16453 -23099589 -21945180 -21024053 -20411824 -20065332 -19790898 -19398849 -18881278 -18353889 -17872494
16444 -17872494 -17419007 -17025105 -16804356 -16869378 -17224455 -17774706 -18423831 -19119292 -19834605
16435 -19834605 -20539939 -21206128 -21803396 -22291548 -22651788 -22911601 -23092194 -23191242 -23253454 -23406424
16425 -23406424 -23776219 -24339861 -24914146 -25337107 -25600989 -25798949 -25996607 -26168016 -26238161
16416 -26238161 -26133672 -25799278 -25284413 -24828435 -24729008 -25097947 -25812375 -26663010 -27448168
16407 -27448168 -27957783 -27999196 -27502834 -26556811 -25338298 -24015260 -22680253 -21394161 -20271883
16398 -20271883 -19415449 -18786083 -18287509 -17937459 -17839634 -18012700 -18343609 -18775095 -19474390
16389 -19474390 -20659686 -22265278 -23886565 -25092643 -25806408 -26340807 -27040090 -27935905 -28756106
16380 -28756106 -29210462 -29232519 -28983753 -28708151 -28562968 -28515479 -28398077 -28088376 -27647755 -27269276
16370 -27269276 -27116168 -27232167 -27536865 -27852814 -27971543 -27731926 -27079436 -26088310 -24924452
16361 -24924452 -23815299 -23022620 -22716015 -22869910 -23307577 -23769681 -24001474 -23908949 -23602753
16352 -23602753 -23231452 -22849535 -22452711 -22034304 -21591333 -21133524 -20720974 -20493220 -20618858
16343 -20618858 -21151018 -21908762 -22538374 -22712763 -22282085 -21349989 -20266650 -19446350 -19152971
16334 -19152971 -19425714 -20107362 -20950847 -21758693 -22442720 -23001690 -23497044 -24032847 -24710153
16325 -24710153 -25584495 -26649307 -27830361 -29030350 -30180500 -31259512 -32295424 -33348859
16317 -33348859 -34519928 -35894783 -37434840 -39001662 -40489168 -41820191 -42757397 -42728201
16309 -42728201 -41005758 -37433503 -32885813 -28532118 -24945107 -22127112 -19903100 -18152107
16301 -18152107 -16864116 -16062062 -15643224 -15343845 -14953331 -14557113 -14456265 -14860178 -15753992
16292 -15753992 -17016436 -18544267 -20254903 -22015786 -23626563 -24899397 -25689853 -25859067
16284 -25859067 -25344336 -24264027 -22865139 -21372153 -19930134 -18643715 -17599075 -16882379
16276 -16882379 -16555531 -16588835 -16874608 -17298429 -17762876 -18201013 -18594007 -18970719 -19364692
16267 -19364692 -19761878 -20120688 -20424925 -20710341 -21017817 -21311603 -21516107 -21637129 -21752252
16258 -21752252 -21899679 -22058674 -22195336 -22281816 -22314907 -22360873 -22542167 -22915289 -23386369 -23761478
16248 -23761478 -23881404 -23707023 -23272867 -22624442 -21847403 -21072009 -20448262 -20156055 -20351803
16239 -20351803 -21059205 -22096906 -23110754 -23757742 -23891541 -23563338 -22949740 -22300476 -21821955
16230 -21821955 -21540491 -21324155 -21065496 -20779514 -20542184 -20419099 -20435857 -20536189 -20568679 -20399327
16220 -20399327 -20089071 -19906739 -20086257 -20597942 -21226829 -21792829 -22205986 -22415706 -22405765 -22216840
16210 -22216840 -21922412 -21555775 -21106010 -20608969 -20186517 -19961450 -19929663 -19934876 -19792355 -19410671
16200 -19410671 -18815140 -18141623 -17599549 -17350710 -17395159 -17621749 -17939800 -18316011 -18741813
16191 -18741813 -19193094 -19608423 -19905639 -20020367 -19913245 -19555756 -18994052 -18415075 -18047870
16182 -18047870 -18004545 -18245664 -18649680 -19091159 -19487019 -19838777 -20258660 -20886333 -21787217
16173 -21787217 -22988241 -24545478 -26458539 -28521699 -30365871 -31679594 -32387693 -32624578
16165 -32624578 -32535491 -32106251 -31219062 -29896727 -28393029 -26975818 -25693951 -24424523 -23131927
16156 -23131927 -21934600 -20871953 -19778989 -18478639 -17026331 -15724040 -14885480 -14572001
16148 -14572001 -14558546 -14557851 -14461609 -14356786 -14351218 -14439281 -14530317 -14544690 -14496639 -14524723 -14825706
16137 -14825706 -15514632 -16516546 -17614104 -18570408 -19190732 -19394670 -19224363 -18721531 -17942083
16128 -17942083 -17100589 -16535998 -16504249 -16988156 -17709893 -18391469 -18963284 -19505179 -20085212
16119 -20085212 -20688950 -21263958 -21812580 -22399266 -23091280 -23946114 -24982092 -26111790 -27130992
16110 -27130992 -27826814 -28098391 -27943678 -27386265 -26442963 -25131965 -23503076 -21653986 -19733318
16101 -19733318 -17929892 -16415674 -15308252 -14740302 -14901928 -15901753 -17575146 -19504092
16093 -19504092 -21263092 -22626297 -23573201 -24157138 -24410033 -24357203 -24037152 -23483299 -22768279
16084 -22768279 -22068274 -21602977 -21481470 -21634524 -21910207 -22219673 -22576376 -23017920 -23524371
16075 -23524371 -24011787 -24414098 -24757212 -25117253 -25519283 -25869231 -25980878 -25735968 -25240189
16066 -25240189 -24767555 -24530438 -24555022 -24765395 -25052858 -25265243 -25277329 -25098164 -24821579 -24481927
16056 -24481927 -24005243 -23289373 -22327083 -21215136 -20083457 -19077079 -18349317 -18002486 -18050413
16047 -18050413 -18454407 -19108821 -19802770 -20296378 -20453314 -20308104 -20019897 -19745426 -19539347
16038 -19539347 -19350984 -19091219 -18713982 -18287971 -17987457 -17969489 -18244887 -18658284 -18997332
16029 -18997332 -19118188 -18963435 -18522201 -17816822 -16903636 -15899293 -15002758 -14451224 -14442799
16020 -14442799 -15010587 -15926491 -16859185 -17630301 -18223583 -18659736 -18925246 -18920601 -18525164 -17803469
16010 -17803469 -17057183 -16597211 -16548370 -16872644 -17439150 -18055735 -18531920 -18761937 -18780259 -18763759
16000 -18763759 -18953523 -19483222 -20265462 -21086472 -21748371 -22101919 -22070607 -21723547 -21231918
15991 -21231918 -20716353 -20212212 -19739772 -19298843 -18859799 -18437566 -18055042 -17649392 -17154307
15982 -17154307 -16595147 -16030213 -15492899 -14999009 -14562314 -14238045 -14141279 -14408475 -15169318
15973 -15169318 -16445598 -18037535 -19646484 -21113068 -22482590 -23860301 -25176210 -26142366
15965 -26142366 -26472591 -26106579 -25235039 -24119803 -22902405 -21617804 -20379112 -19442571 -19042184
15956 -19042184 -19203546 -19740674 -20417244 -21090098 -21700953 -22166749 -22354273 -22217316 -21873231
15947 -21873231 -21502168 -21275087 -21317936 -21643458 -22153107 -22684499 -23050141 -23086741 -22717618 -22010031
15937 -22010031 -21157928 -20353385 -19683264 -19185653 -18939756 -19052770 -19587662 -20487255 -21542659
15928 -21542659 -22490268 -23177942 -23620542 -23927285 -24190627 -24398006 -24457198 -24298739 -23893775
15919 -23893775 -23207525 -22223788 -21001392 -19661377 -18313341 -16974629 -15596042 -14199862
15911 -14199862 -12933697 -11953279 -11296794 -10901694 -10723634 -10772495 -11062710 -11593198 -12341920
15902 -12341920 -13276907 -14362415 -15497443 -16502550 -17235602 -17691719 -17989233 -18276335 -18661826
15893 -18661826 -19222126 -19989193 -20893688 -21774936 -22440846 -22734849 -22596227 -22068374 -21271359
15884 -21271359 -20374514 -19549276 -18924293 -18524758 -18231360 -17898233 -17494903 -17077093 -16733556
15875 -16733556 -16607056 -16848056 -17495634 -18444094 -19510144 -20491616 -21213627 -21619029 -21846579
15866 -21846579 -22124114 -22558307 -23085512 -23578179 -23934787 -24065269 -23839648 -23114362 -21852370
15857 -21852370 -20212602 -18523836 -17163563 -16398435 -16277987 -16665247 -17368073 -18202269 -18973979
15848 -18973979 -19541470 -19897207 -20104989 -20210813 -20250851 -20255427 -20185354 -19889615 -19191086 -18048940
15838 -18048940 -16623890 -15177833 -13931477 -13047992 -12682173 -12914514 -13632441 -14559836 -15406569
15829 -15406569 -15976038 -16184733 -16011014 -15448912 -14569985 -13588362 -12779772 -12352916 -12412584
15820 -12412584 -12950046 -13775205 -14544325 -14979022 -15035816 -14855746 -14609350 -14391094 -14213609
15811 -14213609 -14042470 -13848599 -13648390 -13507333 -13578024 -14070084 -15099193 -16570560 -18180624
15802 -18180624 -19529651 -20303989 -20413030 -19974983 -19222606 -18414611 -17718006 -17155583 -16685970
15793 -16685970 -16250838 -15750195 -15090858 -14298408 -13535782 -12961334 -12595561 -12361033 -12210285
15784 -12210285 -12189652 -12365771 -12720804 -13178755 -13702644 -14322137 -15083927 -15974699 -16896730
15775 -16896730 -17718625 -18312036 -18581279 -18520342 -18219967 -17801622 -17337423 -16812925 -16212879
15766 -16212879 -15677687 -15472912 -15730095 -16321534 -17037118 -17744883 -18378664 -18900910 -19306982
15757 -19306982 -19626624 -19926050 -20315648 -20888667 -21602627 -22252541 -22623738 -22645256 -22377712
15748 -22377712 -21967255 -21596719 -21338548 -21100361 -20783479 -20439122 -20205091 -20068943 -19800330
15739 -19800330 -19201580 -18341391 -17490042 -16885983 -16599639 -16591206 -16827291 -17302368 -18005593 -18921478
15729 -18921478 -20023323 -21228476 -22346306 -23091301 -23231326 -22782117 -22031232 -21321958 -20793085
15720 -20793085 -20357124 -19923413 -19544384 -19365299 -19506498 -19945733 -20519592 -21061845 -21484486
15711 -21484486 -21778848 -22010171 -22269040 -22591386 -22948275 -23264003 -23439381 -23404136 -23144325
15702 -23144325 -22718191 -22284476 -22029662 -22023339 -22243676 -22725307 -23570860 -24805688 -26290209
15693 -26290209 -27779022 -29034835 -29946350 -30570594 -31024945 -31371088 -31593152 -31625002 -31383971
15684 -31383971 -30790004 -29769079 -28317072 -26596177 -24889098 -23430591 -22274944 -21308608
15676 -21308608 -20404928 -19578319 -18984463 -18771013 -18929643 -19277606 -19579486 -19737362 -19851350
15667 -19851350 -20062701 -20419405 -20915763 -21543494 -22226344 -22754240 -22887653 -22559785 -21929625
15658 -21929625 -21231880 -20626576 -20165705 -19814858 -19476837 -19037217 -18472329 -17926343 -17643159
15649 -17643159 -17821007 -18553688 -19830382 -21476155 -23138829 -24464360 -25335900 -25889503 -26298920
15640 -26298920 -26605975 -26771643 -26816091 -26798647 -26664680 -26214657 -25317663 -24142666 -23094714
15631 -23094714 -22521445 -22534780 -23034707 -23809814 -24691943 -25628380 -26533407 -27187805 -27382850
15622 -27382850 -27094362 -26493555 -25815046 -25215994 -24738585 -24354870 -24017620 -23693256 -23422638
15613 -23422638 -23339315 -23556341 -24049040 -24671836 -25266538 -25731515 -26036152 -26201882 -26244764 -26148040
15603 -26148040 -25880468 -25409000 -24762752 -24122264 -23741999 -23738694 -23981655 -24158218 -23965933 -23335492
15593 -23335492 -22476642 -21652510 -20966496 -20403221 -19932700 -19509164 -19052608 -18481122 -17778271
15584 -17778271 -17035330 -16414819 -16069303 -16062870 -16336524 -16760236 -17194019 -17548801 -17835278 -18096668
15574 -18096668 -18344305 -18592370 -18850086 -19066326 -19188491 -19252149 -19328030 -19413506 -19450492 -19424495
15564 -19424495 -19379844 -19339861 -19269648 -19128765 -18890442 -18504424 -17950498 -17330246 -16833744 -16614228
15554 -16614228 -16656835 -16802444 -16955831 -17140002 -17321113 -17364625 -17190362 -16866021 -16536231 -16293523
15544 -16293523 -16141970 -16077596 -16142748 -16410697 -16960503 -17819679 -18870018 -19825867 -20400294
15535 -20400294 -20502646 -20198783 -19559564 -18655724 -17623042 -16631647 -15817039 -15237033 -14878170
15526 -14878170 -14743331 -14861667 -15171962 -15508572 -15720019 -15776361 -15798277 -15944740 -16252204 -16609268
15516 -16609268 -16841761 -16818291 -16513789 -16002714 -15433718 -14978983 -14725712 -14600761 -14459422
15507 -14459422 -14261391 -14116283 -14178299 -14520849 -15057600 -15579369 -15892533 -15928264 -15750047 -15492118
15497 -15492118 -15302256 -15310596 -15579061 -16054425 -16592536 -17042610 -17329650 -17439538 -17369821 -17152173
15487 -17152173 -16874969 -16621226 -16392061 -16129803 -15831070 -15581851 -15426131 -15267246 -14957261
15478 -14957261 -14444442 -13805899 -13177719 -12672531 -12308005 -12062975 -12046206 -12490614 -13544589
15469 -13544589 -15152544 -17117714 -19195116 -21164052 -22878530 -24257272 -25253659 -25868870
15461 -25868870 -26182938 -26311889 -26311263 -26191229 -26005442 -25833631 -25689892 -25512308 -25220034 -24747769
15451 -24747769 -24074658 -23236110 -22308670 -21401038 -20624254 -20057267 -19761387 -19794389 -20158750
15442 -20158750 -20762496 -21450065 -22017585 -22249990 -22056313 -21524796 -20821899 -20123505 -19587939
15433 -19587939 -19323761 -19409630 -19904569 -20777179 -21846979 -22865368 -23672501 -24221726 -24451563
15424 -24451563 -24205827 -23329194 -21870532 -20141775 -18557935 -17417833 -16802614 -16687196 -17065043
15415 -17065043 -17889454 -18996441 -20170795 -21248243 -22133053 -22739056 -22995806 -22963408 -22811869
15406 -22811869 -22660440 -22502983 -22254826 -21860681 -21363536 -20834319 -20261369 -19580454 -18751273
15397 -18751273 -17792563 -16829209 -16065933 -15657250 -15605064 -15761213 -15949121 -16102112 -16230166
15388 -16230166 -16300382 -16206689 -15885311 -15475993 -15278180 -15476341 -15945749 -16422152 -16823356 -17271115
15378 -17271115 -17863201 -18563347 -19266520 -19881186 -20354259 -20664678 -20842703 -20985204 -21188989
15369 -21188989 -21489432 -21861272 -22213484 -22415718 -22381798 -22138700 -21850644 -21779257 -22110955 -22761252
15359 -22761252 -23431316 -23878503 -24079231 -24169724 -24261355 -24299160 -24124746 -23677880 -23087103 -22520196
15349 -22520196 -21990120 -21371292 -20547176 -19509210 -18384909 -17353296 -16469220 -15607538 -14635936
15340 -14635936 -13607505 -12752322 -12326715 -12464567 -13098247 -14028733 -15082442 -16143881 -17061064
15331 -17061064 -17626964 -17698455 -17294788 -16579407 -15806431 -15232227 -14990627 -15072633 -15428952 -15978828
15321 -15978828 -16534050 -16868925 -16870189 -16550580 -15996179 -15400099 -15058964 -15157370 -15549000 -15884580
15311 -15884580 -15919931 -15654028 -15313758 -15207063 -15457434 -15907228 -16298900 -16497377 -16538831 -16530454
15301 -16530454 -16580158 -16796015 -17242855 -17883458 -18632995 -19464680 -20367431 -21193816 -21680623
15292 -21680623 -21633770 -21042904 -20101909 -19170277 -18635620 -18746779 -19522034 -20736649 -22062030
15283 -22062030 -23277153 -24313094 -25166999 -25817985 -26178556 -26115348 -25543632 -24489341 -23059898
15274 -23059898 -21392847 -19687898 -18251338 -17406154 -17327066 -17956592 -19038615 -20218857 -21208432
15265 -21208432 -21917414 -22407459 -22772225 -23111161 -23501575 -23932413 -24285554 -24381334 -24098782
15256 -24098782 -23479783 -22665032 -21756725 -20796066 -19831389 -18955269 -18253391 -17761643 -17496853
15247 -17496853 -17452222 -17558344 -17696662 -17766144 -17763936 -17785836 -17925604 -18189410 -18465025 -18585668
15237 -18585668 -18461608 -18129774 -17753272 -17598437 -17890890 -18647833 -19654629 -20637379 -21448313
15228 -21448313 -21999838 -22149720 -21816080 -21082593 -20080966 -18868845 -17494990 -16108750 -14923087
15219 -14923087 -14059362 -13493248 -13194129 -13216717 -13594832 -14259274 -15094144 -15962999 -16695363
15210 -16695363 -17152257 -17320445 -17332599 -17393799 -17651173 -18108433 -18635835 -19058432 -19305602 -19464509
15200 -19464509 -19628353 -19760376 -19759445 -19570623 -19218273 -18779227 -18314028 -17818687 -17272289 -16736319
15190 -16736319 -16313826 -15996430 -15683557 -15356220 -15116634 -15064867 -15200285 -15437642 -15680014
15181 -15680014 -15876110 -16038950 -16228720 -16518748 -16982528 -17669776 -18521513 -19303395 -19690715
15172 -19690715 -19495089 -18840483 -18103504 -17674719 -17776545 -18412651 -19369593 -20282344 -20824914
15163 -20824914 -20927093 -20794374 -20704150 -20781299 -20921226 -20911455 -20633944 -20113312 -19418898 -18649314
15153 -18649314 -17954175 -17447416 -17134011 -16939369 -16737464 -16397971 -15904345 -15384045 -14969639
15144 -14969639 -14677894 -14468024 -14357934 -14406243 -14625271 -14964429 -15351580 -15716448 -15967993
15135 -15967993 -16054520 -16082450 -16272910 -16775419 -17572584 -18535288 -19494519 -20297882 -20858436 -21139489
15125 -21139489 -21097952 -20705843 -20059691 -19395466 -18934417 -18741096 -18724955 -18729503 -18635588 -18446222
15115 -18446222 -18264543 -18154886 -18061916 -17882441 -17576772 -17199539 -16875305 -16779968 -17113000 -17991652
15105 -17991652 -19300344 -20715615 -21938953 -22895605 -23716556 -24515977 -25219274 -25652178 -25730403
15096 -25730403 -25544673 -25281074 -25037196 -24772274 -24418528 -24013211 -23768044 -23931749 -24522363
15087 -24522363 -25235635 -25685399 -25732031 -25509531 -25213865 -24968014 -24808622 -24695008 -24553874
15078 -24553874 -24357871 -24155512 -23997012 -23818352 -23459502 -22857169 -22157604 -21587633 -21305365
15069 -21305365 -21376809 -21778803 -22392833 -23055168 -23614027 -23943725 -23987198 -23773067 -23360189 -22796066
15059 -22796066 -22113001 -21321609 -20403137 -19368750 -18369018 -17642184 -17305223 -17263968 -17311630
15050 -17311630 -17269191 -17066643 -16746545 -16372368 -15928629 -15353011 -14640750 -13894214 -13296135
15041 -13296135 -12999845 -13022843 -13250164 -13538775 -13811731 -14036086 -14150661 -14079033 -13849886 -13620800
15031 -13620800 -13549465 -13703888 -14056502 -14511590 -14967096 -15389088 -15826516 -16338427 -16906665
15022 -16906665 -17440717 -17871428 -18203940 -18464169 -18598212 -18484436 -18092316 -17542334 -16998731
15013 -16998731 -16592824 -16404639 -16426668 -16583586 -16800187 -17025203 -17247005 -17481913 -17719004
15004 -17719004 -17926108 -18099462 -18251574 -18363005 -18381058 -18273781 -18093870 -17971411 -17994436 -18099911
14994 -18099911 -18100123 -17868425 -17525488 -17356519 -17520220 -17931589 -18432433 -18945813 -19404522 -19666110
14984 -19666110 -19613812 -19278136 -18788122 -18254215 -17757777 -17352853 -17007833 -16630556 -16165407
14975 -16165407 -15631172 -15106524 -14707977 -14543578 -14659254 -15018966 -15537138 -16116996 -16675485
14966 -16675485 -17197885 -17745693 -18367704 -19033612 -19631897 -20031545 -20201460 -20245411 -20318177 -20508028
14956 -20508028 -20796776 -21121072 -21400491 -21526043 -21389108 -20919638 -20138311 -19181967 -18216192
14947 -18216192 -17330932 -16516309 -15700661 -14844430 -14031648 -13454332 -13312902 -13754548 -14827087
14938 -14827087 -16395423 -18125435 -19611176 -20561331 -20889645 -20647891 -19916835 -18812417 -17549164
14929 -17549164 -16391125 -15484261 -14778508 -14180228 -13696902 -13347692 -13067539 -12789781 -12548263
14920 -12548263 -12474900 -12664998 -13036679 -13355981 -13399536 -13116317 -12661102 -12278167 -12139001 -12289798
14910 -12289798 -12754380 -13583505 -14777415 -16206310 -17558936 -18448761 -18662061 -18243415 -17378973
14901 -17378973 -16281539 -15138465 -14078531 -13172489 -12465495 -12000010 -11850468 -12114936 -12787973
14892 -12787973 -13718260 -14784769 -15955926 -17123800 -18063094 -18579794 -18609184 -18194577 -17448732
14883 -17448732 -16552611 -15724235 -15132222 -14884200 -15062689 -15683290 -16668709 -17901566 -19214067
14874 -19214067 -20339618 -20982813 -20992897 -20431909 -19491884 -18443800 -17576871 -17094574 -17077497
14865 -17077497 -17474850 -18125028 -18873162 -19671443 -20530372 -21418747 -22256996 -22968219 -23501420
14856 -23501420 -23824079 -23911766 -23727038 -23213872 -22361895 -21270238 -20110829 -19048540 -18220593
14847 -18220593 -17778771 -17836275 -18320905 -18975818 -19500417 -19663082 -19384967 -18763321 -17996453
14838 -17996453 -17285596 -16733494 -16282970 -15813368 -15323847 -14942365 -14769636 -14784584 -14861033 -14877826
14828 -14877826 -14833736 -14834783 -14977883 -15261171 -15559652 -15665737 -15441526 -14968065 -14470815 -14124020
14818 -14124020 -14031510 -14296909 -14968827 -15944319 -16954474 -17636623 -17698311 -17083830 -15981181
14809 -15981181 -14695943 -13511777 -12593150 -11993294 -11727865 -11775775 -12038661 -12396951 -12794463
14800 -12794463 -13202672 -13562003 -13823207 -14001193 -14169345 -14427233 -14848665 -15403808 -15927148
14791 -15927148 -16228788 -16266776 -16191487 -16179697 -16225688 -16148420 -15807586 -15258161 -14690633 -14303559
14781 -14303559 -14231535 -14522716 -15128048 -15886479 -16547353 -16874325 -16759768 -16233670 -15367261
14772 -15367261 -14204666 -12817687 -11373843 -10079158 -9055109 -8302732 -7772170 -7438933
14764 -7438933 -7311754 -7405292 -7733322 -8269184 -8882086 -9344123 -9462543 -9195695 -8606960 -7797428
14754 -7797428 -6927253 -6190920 -5674364 -5258446 -4736740 -4048610 -3366044 -2951899 -2972463 -3423361
14744 -3423361 -4151531 -4917320 -5474942 -5677154 -5554987 -5293275 -5087121 -5035360 -5204773 -5670203
14734 -5670203 -6407075 -7174733 -7572485 -7310488 -6388614 -4955129 -3124171 -1016051 1145663
14725 1145663 3064112 4498038 5399061 5922385 6293687 6692826 7247540 8028375 9026413
14716 9026413 10205368 11519297 12854745 14061880 15050333 15784395 16226847 16349917 16180285
14707 16180285 15824695 15440006 15135513 14918015 14739797 14559221 14373214 14264266 14384190
14698 14384190 14855115 15723514 16979086 18524670 20127106 21515184 22577472 23395312
14690 23395312 24063016 24537360 24689706 24465418 23955218 23336738 22781798 22387863 22194160
14681 22194160 22256449 22607436 23150770 23693278 24092142 24355180 24627060 25082717 25825894
14672 25825894 26901516 28318093 29996939 31777462 33521703 35199682 36851667 38510091
14664 38510091 40208144 42044685 44169573 46688592 49670564 53201034 57313555 61937429
14656 61937429 66957696 72242378 77622933 82912722 87919748 92486134 96552767 100102533
14648 100102533 102997951 104914522 105502128 104585440 102213105 98612917 94147244 89246777
14640 89246777 84320905 79725239 75771235 72682799 70442740 68704875 66961289 64794579
14632 64794579 62017531 58714389 55184467 51749117 48574560 45669909 43010638 40652724
14624 40652724 38717240 37268771 36246501 35513285 34907484 34262507 33443004 32353617 30934452
14615 30934452 29219479 27356294 25491257 23670284 21919637 20362047 19139819 18265970
14607 18265970 17585252 16862737 15940501 14825829 13645907 12541564 11592021 10801629 10099078
14598 10099078 9342442 8369914 7108759 5684937 4359077 3331652 2655922 2291550 2196903
14589 2196903 2342837 2650426 2999768 3299560 3464630 3366936 2915822 2180294 1360696 642970
14579 642970 133198 -112469 -55623 317160 944878 1676767 2370825 3035042 3803229 4740688
14569 4740688 5747835 6649964 7299378 7622576 7637207 7421850 7097779 6853326 6898001 7307899
14559 7307899 7911509 8348074 8269146 7531672 6283408 4924229 3935200 3627114 3998905
14550 3998905 4812090 5756989 6565021 7054909 7173892 7032280 6817278 6682186 6733090 7037462
14540 7037462 7620117 8436581 9403582 10481218 11669709 12941557 14239973 15522487 16751249
14531 16751249 17888150 18910846 19792097 20526993 21174033 21786026 22378739 22980667 23617294
14522 23617294 24280730 24939516 25549355 26064750 26447942 26656914 26621928 26262195 25531946
14513 25531946 24434083 23052260 21605133 20406017 19703176 19559991 19822342 20150380 20223934
14504 20223934 19965844 19523200 19114405 18952462 19233787 20064240 21368714 22930285 24525286
14495 24525286 26048535 27566629 29268691 31296518 33564204 35818820 37884827 39787582
14487 39787582 41690204 43762870 46092756 48642505 51243194 53676431 55819160 57709606
14479 57709606 59464685 61148505 62684941 63900751 64688104 65097592 65327235 65691864 66469293
14470 66469293 67643736 68896802 69920300 70633726 71111998 71473407 71852448 72405454 73282909
14461 73282909 74538407 76044870 77554841 78921196 80242634 81725529 83438790 85278067
14453 85278067 87106064 88860619 90576207 92349363 94289934 96492234 99025848 101934334
14445 101934334 105271652 109103682 113403556 118023982 122839194 127844732 133105890 138688453
14437 138688453 144637475 150957888 157630822 164699082 172332580 180807904 190422988 201419422
14429 201419422 213964969 228162463 244009017 261347150 279931563 299524477 319821474
14422 319821474 340264674 359983802 377918231 392970378 404045994 410086798 410333672
14415 410333672 404683993 393728706 378472716 360028247 339393286 317401192 294787743
14408 294787743 272226870 250375813 229865609 211159750 194467974 179747967 166719280
14401 166719280 155002662 144344125 134704010 126175001 118856577 112783285 107893416 104009454
14393 104009454 100854988 98118311 95520901 92824855 89821420 86412552 82687815 78843954
14385 78843954 75027572 71277269 67590910 63976864 60428764 56922357 53451183 50044767
14377 50044767 46777230 43748606 41049609 38733533 36833510 35355110 34150919 32889627
14369 32889627 31259324 29211012 26997031 24930322 23103430 21390089 19645980 17852876
14361 17852876 16138459 14679345 13571482 12795223 12272360 11943480 11804249 11838209 11902593
14352 11902593 11770671 11311806 10609694 9931112 9550856 9532843 9698286 9847700 9923706 9941924
14342 9941924 9893055 9790376 9713880 9699008 9635087 9349408 8751159 7900980 6985574 6215932
14332 6215932 5730088 5561442 5652080 5870008 6065985 6162098 6184941 6230033 6427253 6874501
14322 6874501 7544788 8310967 9032050 9574484 9860146 9971256 10114958 10451808 11013371
14313 11013371 11752690 12660476 13824380 15338157 17182678 19199932 21174042 23005987
14305 23005987 24808725 26794971 29147500 32027212 35595205 39926403 44937260 50481706
14297 50481706 56516942 63107923 70267393 77933283 86114198 94926257 104477776 114763877
14289 114763877 125653962 136883649 147941491 157996867 166089122 171442495 173562070
14282 173562070 172142144 167102519 158748590 147802901 135255257 122148033 109352222
14275 109352222 97435340 86681032 77132663 68622010 60878130 53718601 47150343 41304040
14267 41304040 36300760 32156655 28756680 25860790 23191680 20608205 18168157 16011679
14259 16011679 14248942 12944375 12082073 11512326 10986386 10267415 9212576 7810311 6181308
14250 6181308 4516646 3031446 1933160 1338886 1201446 1304224 1344993 1106645 579939
14241 579939 -94467 -776636 -1389758 -1892173 -2252933 -2422582 -2316954 -1868381 -1101076 -172934
14231 -172934 646603 1115723 1201490 1091775 986516 906158 725344 316996 -354826 -1225180
14221 -1225180 -2181264 -3093927 -3846220 -4405261 -4856881 -5337112 -5900566 -6478826 -6968813
14212 -6968813 -7343383 -7656064 -7923677 -8095714 -8213526 -8504178 -9213453 -10387247 -11860683
14203 -11860683 -13389016 -14763963 -15846771 -16527792 -16730332 -16501447 -16031619 -15585783 -15417187
14194 -15417187 -15625870 -16084592 -16538389 -16760727 -16661487 -16315328 -15868924 -15399765 -14918040
14185 -14918040 -14423613 -13884263 -13222579 -12338950 -11178672 -9820020 -8427431 -7109350 -5902401
14176 -5902401 -4846988 -4001763 -3391330 -2968236 -2636131 -2282487 -1786755 -1057752 -102146
14167 -102146 969722 1990129 2781708 3235694 3387351 3381504 3326761 3206628 2955667 2591790
14157 2591790 2210727 1870748 1566943 1313397 1190860 1300248 1720063 2488080 3570001
14148 3570001 4845387 6097788 7076801 7689866 8086865 8486392 8979775 9480227 9812091
14139 9812091 9898897 9868098 9911742 10089627 10329491 10524885 10524214 10089894 9040868 7462307
14129 7462307 5649616 3890713 2333225 947781 -383731 -1775317 -3297393 -4890145
14121 -4890145 -6360835 -7547559 -8460040 -9241226 -10028020 -10844548 -11591311 -12142719 -12452198
14112 -12452198 -12543325 -12422306 -12064745 -11517366 -10940280 -10529503 -10427747 -10672416 -11225824
14103 -11225824 -12055272 -13114679 -14218385 -15034126 -15300261 -15015512 -14416759 -13837445 -13516013
14094 -13516013 -13481563 -13615434 -13753851 -13759938 -13555739 -13117573 -12480623 -11712001 -10847801 -9866938
14084 -9866938 -8755740 -7604809 -6602943 -5920226 -5594213 -5517139 -5532649 -5557339 -5622912 -5793053
14074 -5793053 -6025187 -6179587 -6166053 -5986643 -5655177 -5155504 -4529300 -3932843 -3527809 -3384075
14064 -3384075 -3458561 -3605428 -3676422 -3631469 -3535339 -3483040 -3537378 -3698810 -3920357 -4183355
14054 -4183355 -4566926 -5187376 -6051841 -7028744 -7920876 -8495372 -8556809 -8103001 -7373234 -6714520
14044 -6714520 -6385343 -6440560 -6742793 -7052344 -7133897 -6838891 -6169157 -5272613 -4328141 -3407321
14034 -3407321 -2434542 -1271737 162773 1854549 3731088 5718123 7763068 9829808
14026 9829808 11876304 13828165 15587283 17062428 18209720 19012798 19435235 19430055 18947331
14017 18947331 17965305 16566225 14963046 13421043 12119969 11069935 10164457 9284511
14009 9284511 8341475 7289879 6109517 4787047 3375501 2018905 852659 -121405
14001 -121405 -1041235 -2032253 -3085814 -4098609 -4975067 -5672771 -6200575 -6601702 -6890393
13992 -6890393 -7069769 -7197076 -7304719 -7350126 -7337253 -7347300 -7413888 -7543579 -7822512 -8338544
13982 -8338544 -9039153 -9740552 -10238336 -10372748 -10027977 -9155061 -7824517 -6243945 -4723477
13973 -4723477 -3576719 -2970980 -2834266 -2898812 -2874838 -2643216 -2279308 -1928823 -1730393 -1756835
13963 -1756835 -1960055 -2241861 -2555953 -2903454 -3300448 -3786778 -4407137 -5175482 -6027376
13954 -6027376 -6783784 -7308653 -7687279 -8079043 -8461063 -8668617 -8628196 -8445265 -8315210 -8399428
13944 -8399428 -8776746 -9475333 -10459254 -11561868 -12532879 -13215745 -13662968 -14047487 -14449566
13935 -14449566 -14773371 -14880587 -14765518 -14599905 -14617786 -14979456 -15685631 -16513167 -17119603
13926 -17119603 -17333528 -17262018 -17097422 -16955820 -16886650 -16940977 -17218832 -17802550 -18595545 -19330595
13916 -19330595 -19848025 -20218184 -20510141 -20648623 -20539792 -20192918 -19741171 -19374719 -19198385
13907 -19198385 -19191744 -19328110 -19672209 -20325336 -21258709 -22258680 -23068320 -23544311 -23692466 -23575154
13897 -23575154 -23216545 -22632346 -21912672 -21225959 -20738622 -20550391 -20712530 -21225315 -21973792
13888 -21973792 -22747899 -23365572 -23751755 -23924208 -23918666 -23713952 -23259802 -22555817 -21634779 -20530786
13878 -20530786 -19363988 -18387830 -17847981 -17868451 -18494797 -19710558 -21373819 -23199871 -24833491
13869 -24833491 -25956735 -26406793 -26212657 -25502885 -24421919 -23125679 -21781022 -20524707
13861 -20524707 -19423909 -18507680 -17786890 -17215750 -16690729 -16070508 -15233470 -14231177 -13345289
13852 -13345289 -12884592 -12956125 -13459697 -14240817 -15199818 -16257776 -17245161 -17913269 -18118060
13843 -18118060 -17972348 -17780770 -17828583 -18237667 -18937081 -19702181 -20272581 -20469070 -20265345
13834 -20265345 -19813101 -19339051 -18970802 -18676844 -18415411 -18272455 -18362772 -18641334 -18884923
13825 -18884923 -18879849 -18597334 -18166921 -17694481 -17164218 -16512893 -15732277 -14943804 -14396844 -14351989
13815 -14351989 -14924921 -15976290 -17151698 -18124274 -18791592 -19212193 -19455922 -19573251 -19652357
13806 -19652357 -19790314 -19984340 -20126513 -20108369 -19904384 -19576726 -19184538 -18681004 -17993230
13797 -17993230 -17224949 -16689008 -16731832 -17520344 -18948336 -20705305 -22393795 -23655139 -24285803
13788 -24285803 -24265713 -23704827 -22773320 -21628385 -20372710 -19103396 -17921363 -16825895 -15678402
13779 -15678402 -14361130 -12991635 -11908803 -11386712 -11402468 -11702187 -12055603 -12403295 -12803731
13770 -12803731 -13359501 -14167715 -15240518 -16477209 -17709906 -18770590 -19569478 -20131102 -20528086
13761 -20528086 -20772800 -20798173 -20551960 -20080053 -19520834 -19065197 -18899820 -19091203 -19519100
13752 -19519100 -19976944 -20351945 -20683014 -21057892 -21506092 -21959039 -22277365 -22340731 -22137132
13743 -22137132 -21762694 -21322120 -20814011 -20162058 -19353464 -18450669 -17514201 -16592182 -15701424
13734 -15701424 -14810520 -13913540 -13099411 -12538410 -12408495 -12776772 -13537728 -14459378 -15285868
13725 -15285868 -15869728 -16236339 -16488826 -16670159 -16740769 -16643546 -16339412 -15778136 -14934999 -13899456
13715 -13899456 -12850482 -11976903 -11480800 -11513407 -11987809 -12591300 -13039775 -13285418 -13509131
13706 -13509131 -13878242 -14339968 -14706370 -14843440 -14745955 -14494113 -14120957 -13564708 -12815578
13697 -12815578 -12005719 -11314803 -10874296 -10745675 -10931055 -11399001 -12069886 -12803675 -13458178
13688 -13458178 -13950442 -14255100 -14380222 -14381772 -14369592 -14488662 -14889288 -15662091 -16745383 -17888189
13678 -17888189 -18807907 -19389467 -19704679 -19911703 -20162143 -20551657 -21063862 -21551770 -21846918
13669 -21846918 -21861224 -21586237 -21098203 -20551971 -20110347 -19840799 -19678447 -19514329 -19261598
13660 -19261598 -18866687 -18380574 -17952709 -17708921 -17697266 -17875104 -18147177 -18481324 -18934814
13651 -18934814 -19555131 -20297378 -21040019 -21647755 -22017669 -22108511 -21981776 -21801146 -21738881 -21869640
13641 -21869640 -22112914 -22268273 -22172696 -21805489 -21225684 -20502816 -19762583 -19206222 -18965290
13632 -18965290 -18961403 -19017270 -19071771 -19147794 -19197759 -19134082 -18945504 -18691900 -18397985 -18021782
13622 -18021782 -17565333 -17139578 -16852351 -16705538 -16622002 -16511415 -16309962 -16012937 -15728644
13613 -15728644 -15650095 -15891975 -16414212 -17076365 -17669030 -17975573 -17911177 -17577461 -17152616 -16756559
13603 -16756559 -16440437 -16235411 -16138631 -16101535 -16094390 -16165851 -16383207 -16747081 -17232084 -17859519
13593 -17859519 -18674523 -19682732 -20794575 -21796298 -22441896 -22617049 -22413665 -22085650 -21887696
13584 -21887696 -21874347 -21888095 -21763903 -21516606 -21365089 -21582433 -22281043 -23322507 -24430929
13575 -24430929 -25406809 -26213178 -26874574 -27377907 -27653045 -27573965 -27008105 -25925587 -24485882
13566 -24485882 -23033551 -21942132 -21398748 -21312765 -21402195 -21399303 -21204823 -20861853 -20446974 -20014527
13556 -20014527 -19573130 -19091886 -18581917 -18157786 -17985734 -18171869 -18685852 -19353652 -19936767
13547 -19936767 -20268058 -20331118 -20216392 -20011686 -19772533 -19543805 -19349686 -19205532 -19130497 -19112240
13537 -19112240 -19097910 -19045054 -18939839 -18770083 -18486344 -17989706 -17230841 -16297416 -15364279 -14593235
13527 -14593235 -14050908 -13702533 -13508933 -13477801 -13620670 -13936370 -14417125 -15026563 -15710389
13518 -15710389 -16471986 -17409718 -18599428 -19917618 -21073775 -21866233 -22312855 -22545744 -22725096
13509 -22725096 -23015455 -23544032 -24378847 -25494264 -26725239 -27801893 -28500214 -28788138 -28790426
13500 -28790426 -28633841 -28377302 -28069357 -27796802 -27646306 -27607893 -27504186 -27068846 -26153298
13491 -26153298 -24830150 -23345405 -22035671 -21186489 -20907349 -21129172 -21662853 -22296967 -22918652
13482 -22918652 -23530781 -24146472 -24739034 -25275248 -25745773 -26186090 -26632660 -27019082 -27137445
13473 -27137445 -26776243 -25956199 -24956551 -24081520 -23471001 -23097072 -22868892 -22754011 -22794329
13464 -22794329 -23023708 -23436543 -24015902 -24718179 -25452355 -26132785 -26707804 -27100539 -27215930
13455 -27215930 -27009812 -26472477 -25590507 -24403695 -23062731 -21778391 -20725366 -19999246 -19676739
13446 -19676739 -19864589 -20522935 -21343937 -22018027 -22489878 -22871631 -23263374 -23735183 -24376900
13437 -24376900 -25221267 -26132263 -26855680 -27169064 -26957602 -26234097 -25149326 -23960685 -22938124
13428 -22938124 -22227527 -21811798 -21601579 -21536555 -21610055 -21818724 -22123976 -22459943 -22760735 -22978416
13418 -22978416 -23097892 -23121499 -23008645 -22671350 -22067605 -21275266 -20495622 -19987081 -19890656 -20060359
13408 -20060359 -20119433 -19748838 -18903036 -17779933 -16676074 -15821081 -15263889 -14922292 -14664810
13399 -14664810 -14354091 -13987566 -13777213 -13954844 -14567601 -15514705 -16624160 -17684876 -18535504
13390 -18535504 -19160887 -19672969 -20154282 -20575056 -20858996 -20926131 -20700457 -20148635 -19331791
13381 -19331791 -18443502 -17760932 -17521277 -17825570 -18614134 -19749107 -21119066 -22568827 -23806832
13372 -23806832 -24570776 -24825945 -24741890 -24579621 -24577582 -24818245 -25156082 -25320326 -25161278 -24765005
13362 -24765005 -24322538 -23975462 -23755684 -23621060 -23546333 -23557158 -23675979 -23866441 -23991614 -23839230
13352 -23839230 -23288568 -22456846 -21630156 -21043758 -20719295 -20505278 -20289720 -20139071 -20197952
13343 -20197952 -20472891 -20764969 -20840758 -20628057 -20217610 -19768030 -19459897 -19450917 -19812152 -20498979
13333 -20498979 -21407472 -22443102 -23466352 -24229280 -24490547 -24230447 -23720226 -23335736 -23288672
13324 -23288672 -23542704 -23927414 -24266745 -24409547 -24186526 -23443547 -22197199 -20728566 -19450576
13315 -19450576 -18630895 -18237501 -18066094 -17971903 -17927086 -17953577 -18128683 -18610248 -19546165 -20902181
13305 -20902181 -22386677 -23576105 -24151675 -24056528 -23479431 -22741289 -22151983 -21881687 -21923968
13296 -21923968 -22166148 -22501792 -22855342 -23132450 -23250090 -23218391 -23131888 -23084390 -23101343 -23132831
13286 -23132831 -23130437 -23112419 -23105949 -23070263 -22913908 -22569630 -22046082 -21417241 -20766115 -20109561
13276 -20109561 -19416168 -18745834 -18274594 -18129088 -18261002 -18513831 -18771743 -19009652 -19254079
13267 -19254079 -19577501 -20104421 -20928007 -22019495 -23220547 -24294126 -25002716 -25179859 -24778583
13258 -24778583 -23885839 -22702694 -21500010 -20550828 -20010205 -19831646 -19891676 -20205029 -20897614
13249 -20897614 -21973585 -23228452 -24380022 -25229128 -25716985 -25900342 -25908835 -25885976 -25931148
13240 -25931148 -26065172 -26243435 -26404845 -26488540 -26433987 -26189228 -25746531 -25187855 -24669698 -24337339
13230 -24337339 -24211980 -24124886 -23817407 -23182614 -22392896 -21752452 -21422182 -21345635 -21415933 -21609117
13220 -21609117 -21923805 -22302484 -22714388 -23196380 -23737159 -24218648 -24497282 -24493364 -24202077 -23681862
13210 -23681862 -23031779 -22332983 -21606424 -20870890 -20253087 -19968163 -20139569 -20673440 -21355250
13201 -21355250 -22013894 -22539470 -22872151 -23067258 -23282187 -23661645 -24239030 -24922858 -25520411
13192 -25520411 -25807319 -25672683 -25162320 -24372412 -23415057 -22470536 -21757547 -21388893 -21262777
13183 -21262777 -21187763 -21101931 -21091854 -21251496 -21600032 -22094395 -22634356 -23047680 -23180466 -23038464
13173 -23038464 -22786042 -22625618 -22666969 -22886532 -23179573 -23412149 -23462144 -23237280 -22693572 -21871063
13163 -21871063 -20873409 -19799150 -18728514 -17764850 -17012392 -16517998 -16272930 -16197095 -16108468
13154 -16108468 -15801650 -15207363 -14469800 -13808080 -13309402 -12952619 -12773955 -12857178 -13189103
13145 -13189103 -13647010 -14140762 -14703239 -15408035 -16243900 -17122976 -17981134 -18831050 -19739134
13136 -19739134 -20740146 -21767898 -22691324 -23402496 -23865001 -24102145 -24139158 -23939637 -23442675
13127 -23442675 -22686914 -21874518 -21308973 -21194986 -21453266 -21754177 -21721667 -21159375 -20134110
13118 -20134110 -18873266 -17666646 -16787356 -16325938 -16121781 -15897499 -15416224 -14611983 -13645072
13109 -13645072 -12748628 -12042867 -11542113 -11235276 -11096444 -11054808 -11031855 -11038702 -11179748 -11558279
13099 -11558279 -12190449 -12963950 -13691012 -14272421 -14785661 -15348174 -15944583 -16438671 -16718121
13090 -16718121 -16790634 -16770471 -16865831 -17298800 -18106177 -19069568 -19898799 -20397281 -20452779 -20044747
13080 -20044747 -19316347 -18552574 -18070313 -18052706 -18415814 -18883932 -19209372 -19311499 -19275966 -19246331
13070 -19246331 -19283735 -19339843 -19326929 -19213095 -19080407 -19053902 -19187850 -19458039 -19816210 -20218479
13060 -20218479 -20649006 -21148345 -21768767 -22488596 -23213224 -23866581 -24434247 -24923960 -25377779
13051 -25377779 -25882966 -26464889 -27002251 -27312693 -27299330 -26983034 -26411788 -25585244 -24504622
13042 -24504622 -23250061 -21983200 -20931531 -20332450 -20310692 -20839598 -21817948 -23113774 -24549613
13033 -24549613 -25877825 -26806669 -27120958 -26796682 -25984665 -24879987 -23635042 -22402401 -21339430
13024 -21339430 -20500370 -19757641 -18924873 -18005907 -17246710 -16959011 -17341910 -18377123 -19846202
13015 -19846202 -21472112 -23024144 -24337012 -25305514 -25889758 -26120399 -26051717 -25727468 -25206146
13006 -25206146 -24571782 -23926945 -23353286 -22854268 -22377198 -21913685 -21585814 -21619775 -22230378
12997 -22230378 -23531272 -25510778 -28029391 -30779406 -33285503 -35064189 -35811965 -35458536
12989 -35458536 -34148991 -32217915 -30098791 -28182957 -26688268 -25610419 -24840406 -24357281
12981 -24357281 -24250164 -24551657 -25148840 -25891026 -26696367 -27529198 -28338598 -29045513 -29581703
12972 -29581703 -29902354 -29954834 -29683175 -29094158 -28320106 -27587461 -27105602 -27002521 -27321717
12963 -27321717 -27985899 -28786508 -29473591 -29830935 -29755121 -29352580 -28889188 -28578328 -28462780
12954 -28462780 -28483754 -28572454 -28686010 -28769476 -28688203 -28304116 -27637672 -26878030 -26232328 -25804843
12944 -25804843 -25584370 -25488631 -25426614 -25360827 -25295643 -25179187 -24886780 -24381215 -23816722 -23420569
12934 -23420569 -23353414 -23677546 -24376358 -25397552 -26704047 -28265746 -29966701 -31583631 -32878799
12925 -32878799 -33674311 -33868768 -33444188 -32498671 -31270440 -30088006 -29195173 -28538905 -27806900
12916 -27806900 -26740608 -25358420 -23906360 -22645470 -21704151 -21113273 -20863515 -20883296 -21047996
12907 -21047996 -21257849 -21483644 -21699530 -21789271 -21587013 -21010352 -20138757 -19195032 -18422695
12898 -18422695 -17976387 -17944246 -18371978 -19221962 -20368640 -21635514 -22836631 -23831739 -24542090
12889 -24542090 -24956996 -25166443 -25320984 -25531617 -25815025 -26113677 -26344727 -26448779 -26466085
12880 -26466085 -26577662 -26973309 -27641642 -28308791 -28613952 -28370766 -27638276 -26604966 -25510954
12871 -25510954 -24620918 -24127577 -24049607 -24220668 -24366884 -24297334 -24088056 -24036126 -24395265 -25129642
12861 -25129642 -25919772 -26400575 -26391962 -25962677 -25322705 -24663699 -24073675 -23543904 -23012589 -22393108
12851 -22393108 -21615725 -20717004 -19865527 -19226613 -18807985 -18486729 -18167414 -17863076 -17651227
12842 -17651227 -17599219 -17765117 -18238741 -19099560 -20334423 -21788450 -23184541 -24259286 -24892712
12833 -24892712 -25102517 -24991875 -24721235 -24421077 -24095652 -23665666 -23099045 -22482116 -21939431
12824 -21939431 -21484046 -20980078 -20269215 -19330789 -18309772 -17464423 -17084369 -17284362 -17856219
12815 -17856219 -18436472 -18802980 -18962492 -19058076 -19246952 -19553311 -19828004 -19897999 -19717397 -19380023
12805 -19380023 -19047314 -18869685 -18932931 -19255469 -19831740 -20608482 -21382059 -21831499 -21758729 -21289430
12795 -21289430 -20757620 -20379200 -20073479 -19586784 -18760526 -17691420 -16686366 -16051999 -15871415
12786 -15871415 -16010649 -16329549 -16776149 -17301701 -17832233 -18335918 -18811526 -19213735 -19475171
12777 -19475171 -19571581 -19520653 -19381549 -19270825 -19297640 -19477797 -19761684 -20131531 -20594871 -21083268
12767 -21083268 -21413779 -21379836 -20890343 -19992850 -18826914 -17636523 -16724583 -16276654 -16311183
12758 -16311183 -16824539 -17843236 -19318230 -21048775 -22725667 -24098302 -25102988 -25786200
12750 -25786200 -26189098 -26312802 -26090479 -25461298 -24530150 -23561093 -22772121 -22188535 -21710486
12741 -21710486 -21281457 -20973250 -20900722 -21055508 -21203757 -20990598 -20270328 -19278144 -18418656
12732 -18418656 -18022053 -18273125 -19163157 -20458595 -21802258 -22884125 -23585827 -24006316 -24311798
12723 -24311798 -24582443 -24800070 -24919365 -24944089 -24986493 -25230735 -25747175 -26330266 -26608115 -26356918
12713 -26356918 -25677572 -24869168 -24206579 -23843809 -23811363 -24001845 -24187910 -24183845 -24008020 -23843436
12703 -23843436 -23881723 -24180553 -24611225 -24982398 -25216878 -25391108 -25644569 -26054510 -26543077
12694 -26543077 -26895899 -26916564 -26613924 -26263737 -26218297 -26603908 -27256996 -27934538 -28469263 -28715842
12684 -28715842 -28509005 -27765188 -26615552 -25426705 -24608320 -24336460 -24479612 -24759536 -24962943
12675 -24962943 -25023201 -24957230 -24815997 -24678214 -24592117 -24509532 -24321595 -23989264 -23613509 -23330008
12665 -23330008 -23202479 -23292716 -23705640 -24439426 -25297300 -26049848 -26652100 -27212175 -27766980
12656 -27766980 -28222600 -28477162 -28506609 -28377143 -28200001 -28037492 -27847451 -27526408 -27019105
12647 -27019105 -26382400 -25738104 -25196422 -24791742 -24421373 -23898377 -23114287 -22076481 -20794304
12638 -20794304 -19270663 -17616455 -16049567 -14776979 -13945527 -13644174 -13879032 -14556916 -15504660
12629 -15504660 -16514022 -17420983 -18181917 -18883181 -19631208 -20393987 -20999821 -21298308 -21268655
12620 -21268655 -20983283 -20560569 -20178288 -20032260 -20226722 -20722950 -21390847 -22111400 -22809516
12611 -22809516 -23395707 -23734531 -23676227 -23125736 -22124588 -20896164 -19762434 -18972951 -18623168
12602 -18623168 -18714674 -19197078 -19902472 -20543616 -20840803 -20654806 -20076123 -19375935 -18824973
12593 -18824973 -18591637 -18722495 -19140154 -19677694 -20152169 -20427316 -20427386 -20172645 -19784954 -19365317
12583 -19365317 -18948871 -18614185 -18459395 -18487979 -18659267 -18980784 -19446643 -19990564 -20555373
12574 -20555373 -21107742 -21610860 -22071288 -22596468 -23326655 -24252117 -25164053 -25833081 -26185999
12565 -26185999 -26320109 -26393218 -26498384 -26611056 -26649199 -26592231 -26534322 -26606794 -26819114 -26997885
12555 -26997885 -26972069 -26752384 -26446570 -26093163 -25635439 -24998338 -24120733 -22985289 -21707364
12546 -21707364 -20535749 -19728341 -19446434 -19705543 -20357725 -21163543 -21939381 -22637262 -23286974
12537 -23286974 -23886344 -24364141 -24648101 -24724316 -24624634 -24387084 -24044629 -23639482 -23249039 -23010077
12527 -23010077 -23071330 -23514790 -24345214 -25495196 -26829338 -28162056 -29276090 -30000602 -30318847
12518 -30318847 -30377021 -30392038 -30540149 -30852349 -31167250 -31212532 -30770516 -29797140 -28428242 -26895079
12508 -26895079 -25422097 -24170523 -23244579 -22747351 -22806825 -23484071 -24642525 -25923342 -26907754
12499 -26907754 -27344225 -27183241 -26471603 -25339084 -24013295 -22726820 -21609157 -20677790 -19898219
12490 -19898219 -19219472 -18614357 -18134975 -17861784 -17833637 -18122056 -18901842 -20275327 -22011591
12481 -22011591 -23642357 -24854429 -25647193 -26160216 -26508464 -26714674 -26642652 -26108699 -25128092
12472 -25128092 -23909926 -22651088 -21462832 -20436039 -19680833 -19343682 -19545265 -20233421 -21152804
12463 -21152804 -21959175 -22375840 -22341168 -22029144 -21668270 -21331140 -20974454 -20649827 -20532825
12454 -20532825 -20740384 -21222128 -21833877 -22436238 -22931970 -23284272 -23542288 -23867258 -24431211
12445 -24431211 -25238717 -26114043 -26843184 -27291453 -27425938 -27298507 -27029761 -26758919 -26595606
12436 -26595606 -26587993 -26674269 -26721358 -26681291 -26658785 -26768313 -26957158 -27015585 -26761739 -26204882
12426 -26204882 -25539566 -24988058 -24684189 -24677690 -24922552 -25251512 -25473153 -25555468 -25678422 -26034752
12416 -26034752 -26608131 -27220695 -27752815 -28220461 -28640353 -28948776 -29088151 -29104457 -29124542 -29260563
12406 -29260563 -29553396 -29945304 -30260996 -30272043 -29838584 -29001610 -27963583 -26980022 -26214270
12397 -26214270 -25661392 -25223236 -24865044 -24653215 -24663683 -24933132 -25431306 -25995302 -26372512
12388 -26372512 -26422947 -26250035 -26107267 -26245220 -26792328 -27625699 -28412370 -28876715 -28995098
12379 -28995098 -28937574 -28880583 -28872057 -28834101 -28678332 -28363837 -27812073 -26873023 -25478431 -23813472
12369 -23813472 -22283250 -21280293 -20962151 -21225587 -21831777 -22531415 -23130872 -23480444 -23457948
12360 -23457948 -23023233 -22244230 -21230096 -20059715 -18834423 -17757729 -17051537 -16811264 -17002493
12351 -17002493 -17539735 -18334460 -19291763 -20277692 -21128783 -21695418 -21922619 -21944859 -22033281 -22396501
12341 -22396501 -23084362 -24052778 -25185278 -26247207 -26989728 -27354664 -27500729 -27640527 -27882713
12332 -27882713 -28185123 -28407154 -28395550 -28046341 -27354165 -26437252 -25488436 -24693630 -24168318
12323 -24168318 -23914937 -23846916 -23878738 -23978745 -24125764 -24234901 -24134997 -23664295 -22853395 -21956376
12313 -21956376 -21243850 -20848167 -20829918 -21266538 -22179388 -23406578 -24627631 -25566643 -26151388
12304 -26151388 -26450151 -26513697 -26324619 -25833645 -24996500 -23862110 -22625872 -21509921 -20618713
12295 -20618713 -19955938 -19544235 -19479914 -19887896 -20800801 -22010915 -23100437 -23703286 -23720973
12286 -23720973 -23331456 -22833324 -22456304 -22304278 -22391803 -22667653 -23036056 -23388182 -23627991
12277 -23627991 -23707143 -23652483 -23562843 -23548255 -23622838 -23671903 -23509606 -22931038 -21829087 -20348392
12267 -20348392 -18816989 -17528699 -16675732 -16395709 -16760292 -17716075 -19079012 -20606543 -22030667
12258 -22030667 -23045102 -23391399 -23027508 -22225127 -21477290 -21269503 -21827157 -22976304 -24309483
12249 -24309483 -25510773 -26477691 -27185167 -27562123 -27533786 -27124189 -26500893 -25901156 -25484106
12240 -25484106 -25240164 -25058674 -24863502 -24668414 -24590435 -24796291 -25400228 -26426618 -27784982
12231 -27784982 -29249826 -30527439 -31355335 -31599513 -31341976 -30821549 -30228816 -29586494 -28822850
12222 -28822850 -27908688 -26923355 -26050390 -25507324 -25384559 -25534658 -25678107 -25594278 -25213945
12213 -25213945 -24617917 -23958744 -23375479 -22982122 -22866971 -23042927 -23431359 -23926761 -24456970
12204 -24456970 -24996358 -25545603 -26097960 -26607716 -26972201 -27099654 -27001909 -26755740 -26430903
12195 -26430903 -26134296 -26037399 -26245113 -26658819 -27028810 -27156248 -27046230 -26855696 -26739166
12186 -26739166 -26779308 -27009130 -27442188 -28071506 -28868446 -29764900 -30631529 -31312096 -31716497
12177 -31716497 -31853611 -31747728 -31395477 -30809223 -30011651 -29013065 -27856882 -26631045 -25393159
12168 -25393159 -24127417 -22827198 -21643806 -20873189 -20731868 -21181786 -21959835 -22737201 -23266237
12159 -23266237 -23482908 -23534754 -23656775 -23985184 -24494439 -25065540 -25558626 -25855928 -25903539 -25738197
12149 -25738197 -25453776 -25150559 -24910089 -24759687 -24651577 -24505260 -24286765 -24048367 -23878919
12140 -23878919 -23825984 -23865088 -23911730 -23893156 -23830380 -23808203 -23857267 -23863942 -23639729 -23151450 -22610461
12129 -22610461 -22291558 -22335913 -22716627 -23331299 -24087710 -24901351 -25682010 -26394400 -27089754
12120 -27089754 -27795852 -28424568 -28856206 -29087437 -29228460 -29371895 -29531170 -29671091 -29688189
12111 -29688189 -29362841 -28484618 -27105615 -25549145 -24112375 -22897256 -21937022 -21315006 -21109807
12102 -21109807 -21270493 -21572427 -21724102 -21553838 -21102450 -20564643 -20187435 -20177368 -20601750
12093 -20601750 -21361029 -22276034 -23182578 -23941867 -24415309 -24553626 -24506320 -24510660 -24675462 -24925434
12083 -24925434 -25121665 -25180830 -25084068 -24811858 -24319701 -23582986 -22643636 -21640495 -20779976
12074 -20779976 -20211708 -19919693 -19805946 -19852430 -20102430 -20546398 -21114007 -21748403 -22448506
12065 -22448506 -23228734 -24011187 -24589636 -24770186 -24569523 -24243390 -24098248 -24266758 -24651383
12056 -24651383 -25074730 -25445079 -25734994 -25874518 -25790042 -25489322 -25005089 -24316326 -23392479
12047 -23392479 -22282499 -21136956 -20152748 -19492667 -19186906 -19096915 -19059246 -19083543 -19321546
12038 -19321546 -19824686 -20440972 -20953960 -21250703 -21370171 -21431020 -21474843 -21404837 -21121657 -20655821
12028 -20655821 -20173237 -19909810 -20048227 -20609597 -21456676 -22367845 -23140406 -23645035 -23785566
12019 -23785566 -23499586 -22844834 -22007683 -21143031 -20252675 -19259104 -18149571 -17065443 -16247361
12010 -16247361 -15869644 -15940800 -16326697 -16839620 -17361975 -17955863 -18799577 -19947020 -21238143
12001 -21238143 -22443593 -23415482 -24084398 -24372279 -24207550 -23591169 -22568438 -21162990 -19410807
11992 -19410807 -17464112 -15591308 -14068723 -13078740 -12617325 -12526786 -12671834 -13020406 -13612588
11983 -13612588 -14525635 -15787177 -17281677 -18784772 -20081286 -21032554 -21597856 -21834030 -21868035
11974 -21868035 -21878195 -22020953 -22292812 -22517267 -22579673 -22666605 -23132212 -24135233 -25518860
11965 -25518860 -26942076 -28030247 -28551435 -28580767 -28467893 -28630356 -29300330 -30378197 -31531787
11956 -31531787 -32427544 -32897429 -32962082 -32747195 -32379537 -31933408 -31430621 -30869288 -30258941
11947 -30258941 -29604318 -28859500 -27939299 -26808608 -25566347 -24414761 -23523804 -22906526 -22444651
11938 -22444651 -22053423 -21767239 -21679776 -21874182 -22360564 -23000475 -23542512 -23818702 -23866701 -23784891
11928 -23784891 -23553717 -23101289 -22487305 -21902029 -21483180 -21239210 -21148041 -21260543 -21684266
11919 -21684266 -22467512 -23493434 -24504163 -25266261 -25701475 -25864943 -25869817 -25864380 -26020359 -26464385
11909 -26464385 -27199900 -28099557 -28955860 -29569559 -29814745 -29634817 -29025772 -28019878 -26683320
11900 -26683320 -25163496 -23725438 -22651125 -22090087 -22058985 -22504078 -23301689 -24236751 -25060702
11891 -25060702 -25645879 -26064784 -26505031 -27123233 -27929993 -28762951 -29393855 -29691737 -29685679 -29499116
11881 -29499116 -29260166 -29075176 -28981068 -28869686 -28555780 -27928623 -27016042 -25974596 -24998115
11872 -24998115 -24186584 -23541505 -23021428 -22567182 -22167581 -21923886 -21975128 -22321124 -22798227
11863 -22798227 -23291698 -23890132 -24784426 -26050674 -27543474 -28992497 -30173346 -30946613 -31213438
11854 -31213438 -30938965 -30192723 -29128130 -27909915 -26626230 -25262719 -23816452 -22428558
11846 -22428558 -21343024 -20713751 -20471543 -20412673 -20435331 -20610643 -20996389 -21507564 -22035585
11837 -22035585 -22608724 -23323960 -24179928 -25058996 -25808619 -26335087 -26646462 -26820408 -26949198
11828 -26949198 -27079744 -27218886 -27356537 -27416752 -27271799 -26920516 -26603689 -26592761 -26860512 -27034500
11818 -27034500 -26683040 -25641116 -24082246 -22359219 -20799009 -19590975 -18816802 -18544140
11810 -18544140 -18806454 -19471944 -20265950 -20984582 -21584663 -22064678 -22380303 -22482479 -22384130
11801 -22384130 -22186584 -22052717 -22139162 -22486778 -22974470 -23400124 -23575326 -23399494 -22961852
11792 -22961852 -22545402 -22415331 -22612665 -22964027 -23210296 -23118965 -22576261 -21648284 -20522526
11783 -20522526 -19398745 -18462331 -17870718 -17728369 -18068779 -18805692 -19731433 -20634042 -21423011
11774 -21423011 -22123715 -22777575 -23348357 -23701672 -23726688 -23485878 -23167275 -22908242 -22722608
11765 -22722608 -22530767 -22230114 -21788811 -21299907 -20969969 -21056831 -21722294 -22859422 -24104841
11756 -24104841 -25079766 -25647417 -25914527 -26033931 -26102977 -26167377 -26207517 -26161870 -26009089 -25769391
11746 -25769391 -25421471 -24893215 -24157070 -23320840 -22591714 -22130622 -21966046 -22026108 -22195165
11737 -22195165 -22357524 -22444718 -22444669 -22375830 -22281105 -22205037 -22137105 -21998810 -21702825 -21223266 -20652841
11726 -20652841 -20179161 -19939468 -19956784 -20223247 -20752957 -21522260 -22402453 -23188685 -23692771
11717 -23692771 -23838988 -23694272 -23430833 -23285404 -23468161 -24028096 -24817212 -25596643 -26243776
11708 -26243776 -26863852 -27648706 -28676035 -29829292 -30856149 -31529544 -31743312 -31479160 -30805291
11699 -30805291 -29919250 -29075222 -28418695 -27949201 -27647487 -27504586 -27423189 -27220468 -26734686
11690 -26734686 -25938459 -25004004 -24216915 -23781266 -23719714 -23924425 -24257068 -24633207 -25056066
11681 -25056066 -25569397 -26173922 -26784788 -27255913 -27487840 -27495666 -27331864 -27029710 -26622026 -26141767
11671 -26141767 -25637532 -25210764 -24975144 -24936484 -24959223 -24890712 -24677471 -24328152 -23820641 -23124995
11661 -23124995 -22266444 -21295902 -20258891 -19257111 -18510072 -18311290 -18894309 -20316941 -22394910
11652 -22394910 -24708488 -26770189 -28277434 -29188030 -29555798 -29368674 -28587997 -27328215 -25919040
11643 -25919040 -24699207 -23775029 -23040168 -22349129 -21606801 -20793874 -19958551 -19148259 -18378651
11634 -18378651 -17718705 -17333392 -17345897 -17712763 -18300825 -19018911 -19810456 -20612946 -21368611
11625 -21368611 -22026433 -22540702 -22884113 -23059914 -23082257 -22884467 -22323596 -21398955 -20373462
11616 -20373462 -19574761 -19125484 -18914933 -18810195 -18845737 -19145354 -19694391 -20303068 -20767479
11607 -20767479 -20992538 -21013030 -21012708 -21270458 -21974200 -23102706 -24477291 -25858875 -27013863
11598 -27013863 -27751259 -27950790 -27626157 -26956873 -26208860 -25609976 -25246644 -25008190 -24685508
11589 -24685508 -24180864 -23590905 -23080226 -22717025 -22450075 -22227228 -22089649 -22116422 -22333681
11580 -22333681 -22710231 -23214282 -23872802 -24759869 -25903403 -27207631 -28469284 -29482654 -30133148
11571 -30133148 -30396174 -30333026 -30096355 -29830842 -29597074 -29477687 -29627210 -30112548 -30819305
11562 -30819305 -31540309 -32064078 -32189838 -31776407 -30851982 -29618262 -28296753 -26996546 -25730919
11553 -25730919 -24478492 -23179975 -21755529 -20180140 -18564381 -17157516 -16219504 -15852961
11545 -15852961 -15957600 -16348300 -16876964 -17445459 -17943012 -18231452 -18247819 -18084949 -17900559
11536 -17900559 -17794711 -17826698 -18037625 -18419892 -18980585 -19806578 -20954522 -22332195 -23722356
11527 -23722356 -24867193 -25563682 -25724628 -25377194 -24674841 -23872070 -23193577 -22771795 -22673090
11518 -22673090 -22849530 -23120681 -23292225 -23251452 -22931498 -22271890 -21275797 -20065333 -18885537
11509 -18885537 -18054521 -17793405 -18067206 -18625100 -19176460 -19507246 -19494134 -19108767 -18431794
11500 -18431794 -17614682 -16780340 -15994465 -15357912 -15096530 -15479495 -16603196 -18244480 -19920940
11491 -19920940 -21176857 -21895140 -22319460 -22798699 -23545964 -24507494 -25384673 -25851223 -25755763
11482 -25755763 -25181410 -24371989 -23552630 -22793301 -22028514 -21162722 -20176904 -19188454 -18424684
11473 -18424684 -18109311 -18342019 -19077008 -20165857 -21382589 -22457273 -23190728 -23587715 -23839946
11464 -23839946 -24154969 -24624435 -25214848 -25806583 -26235527 -26378723 -26264086 -26077360 -26046294
11455 -26046294 -26321903 -26903849 -27611674 -28156356 -28331052 -28187862 -27972865 -27871459 -27883214
11446 -27883214 -27926212 -27965058 -28006542 -28046937 -28037771 -27873473 -27428883 -26650363 -25635135 -24575870
11436 -24575870 -23612202 -22829612 -22370136 -22357504 -22709192 -23140837 -23389917 -23447396 -23559992 -23961924
11426 -23961924 -24633606 -25364377 -25970127 -26346865 -26400493 -26115548 -25637568 -25155249 -24779375
11417 -24779375 -24544839 -24399879 -24177010 -23691753 -22904409 -21948437 -21026514 -20293437 -19827393
11408 -19827393 -19678129 -19884352 -20429686 -21180685 -21914349 -22456055 -22788792 -22989438 -23052755
11399 -23052755 -22927402 -22724909 -22708424 -23075936 -23811488 -24684935 -25361581 -25605907 -25468583
11390 -25468583 -25258369 -25310735 -25769518 -26545316 -27439109 -28294499 -29042945 -29641929 -30021371
11381 -30021371 -30115618 -29943857 -29628197 -29298539 -28992404 -28696336 -28404866 -28077678 -27642027
11372 -27642027 -27034898 -26220297 -25240321 -24249276 -23435935 -22928504 -22723939 -22655103 -22506191
11363 -22506191 -22154477 -21589606 -20904914 -20290192 -19910745 -19775422 -19775481 -19797824 -19727436 -19456815
11353 -19456815 -18983599 -18380357 -17727791 -17171153 -16943999 -17249344 -18084338 -19200112 -20267803
11344 -20267803 -21069877 -21531184 -21675275 -21620983 -21549946 -21597868 -21772587 -22003637 -22266868 -22568669
11334 -22568669 -22841662 -22965644 -22850672 -22480682 -21929534 -21344872 -20884697 -20655533 -20668390
11325 -20668390 -20817038 -20952206 -20999746 -20959042 -20817020 -20537348 -20112159 -19579336 -18995009 -18404925
11315 -18404925 -17860715 -17467372 -17372610 -17679837 -18384119 -19366032 -20456738 -21518299 -22432598
11306 -22432598 -23098343 -23483549 -23621078 -23592282 -23529730 -23539178 -23620977 -23735747 -23897632 -24136271
11296 -24136271 -24413762 -24652213 -24849863 -25093335 -25473851 -26086101 -26983328 -28017817 -28804105
11287 -28804105 -28905200 -28121376 -26667909 -25068397 -23861566 -23361525 -23569662 -24220842 -24959565
11278 -24959565 -25547711 -25916626 -26066612 -25993422 -25707419 -25295513 -24922966 -24704057 -24627691 -24666935
11268 -24666935 -24834219 -25070355 -25209535 -25094953 -24669876 -24011139 -23337580 -22914225 -22873830
11259 -22873830 -23134065 -23509442 -23898210 -24289766 -24601083 -24668854 -24447847 -24070408 -23675403
11250 -23675403 -23320030 -23064310 -22978733 -23039669 -23139612 -23256861 -23526564 -24056424 -24760687 -25431976
11240 -25431976 -25860290 -25876734 -25409165 -24507548 -23298562 -21978100 -20822706 -20124717 -20081362
11231 -20081362 -20687463 -21682520 -22678801 -23425854 -23923254 -24268874 -24526772 -24776339 -25133370
11222 -25133370 -25672510 -26370504 -27090818 -27614778 -27772823 -27574477 -27166265 -26636440 -25903164
11213 -25903164 -24855307 -23571688 -22315757 -21318332 -20630821 -20167023 -19826623 -19611652 -19629210
11204 -19629210 -19978150 -20673374 -21624974 -22619507 -23378901 -23724816 -23673370 -23361737 -22911412
11195 -22911412 -22381494 -21848548 -21441827 -21250260 -21255538 -21389297 -21582343 -21754834 -21855823 -21905055
11185 -21905055 -21933229 -21887250 -21700824 -21454653 -21365532 -21610779 -22202892 -23016277 -23869280 -24628947
11175 -24628947 -25294251 -25907006 -26386686 -26551995 -26303356 -25686719 -24788082 -23694220 -22545762
11166 -22545762 -21508018 -20681708 -20072815 -19651496 -19430146 -19476576 -19870076 -20641876 -21739145
11157 -21739145 -23020134 -24271862 -25287646 -26002349 -26509193 -26894923 -27132679 -27162531 -27007690
11148 -27007690 -26750019 -26416909 -25959489 -25333738 -24595457 -23895675 -23354927 -22969040 -22648622
11139 -22648622 -22297234 -21840362 -21240256 -20513937 -19744738 -19050746 -18497241 -18074218 -17782901
11130 -17782901 -17665227 -17746613 -17996168 -18327844 -18670842 -19016944 -19353516 -19631960 -19839398
11121 -19839398 -20013723 -20146869 -20134963 -19874136 -19392388 -18872425 -18564095 -18642376 -19078882 -19660187
11111 -19660187 -20143363 -20397637 -20442914 -20369768 -20274509 -20300624 -20600057 -21173392 -21873549 -22623214
11101 -22623214 -23501630 -24613565 -25968266 -27455833 -28877790 -30017744 -30706115 -30844437
11093 -30844437 -30410502 -29462631 -28178120 -26858265 -25829392 -25329447 -25403162 -25826263 -26251383
11084 -26251383 -26519125 -26766947 -27209394 -27864903 -28502811 -28831856 -28717743 -28203898 -27405606
11075 -27405606 -26471070 -25564536 -24800635 -24206440 -23743574 -23377487 -23106783 -22871961 -22571956
11066 -22571956 -22238607 -22033091 -22053369 -22221732 -22357441 -22364915 -22367724 -22598331 -23146979 -23865365
11056 -23865365 -24473870 -24749561 -24650600 -24301521 -23935575 -23804858 -24060404 -24675712 -25461752
11047 -25461752 -26169092 -26553942 -26434624 -25803149 -24852002 -23896270 -23268600 -23160420 -23513339
11038 -23513339 -24108781 -24691404 -25024234 -24962338 -24498006 -23769638 -23013166 -22427286 -22138971
11029 -22138971 -22285954 -22977748 -24169387 -25615862 -26985056 -28082023 -28933109 -29639213 -30191905
11020 -30191905 -30487295 -30485893 -30298084 -30121621 -30072309 -30110180 -30178857 -30303409 -30485910 -30623450
11010 -30623450 -30579301 -30316137 -29961196 -29679969 -29484243 -29252487 -28895290 -28406451 -27822072
11001 -27822072 -27214244 -26654623 -26143346 -25653859 -25252466 -25094444 -25257124 -25629275 -25987410
10992 -25987410 -26117295 -25899431 -25360352 -24667611 -24027924 -23546587 -23215530 -23041851 -23099923
10983 -23099923 -23437738 -23973245 -24507132 -24834042 -24851065 -24617819 -24312294 -24074121 -23918687
10974 -23918687 -23813971 -23790775 -23945822 -24318336 -24807576 -25278480 -25734963 -26299859 -26990832
10965 -26990832 -27637468 -28066782 -28200721 -27955625 -27249395 -26134068 -24794823 -23420266 -22127956
10956 -22127956 -21005566 -20163152 -19684496 -19557405 -19694281 -19984048 -20348947 -20818697 -21494134
10947 -21494134 -22393466 -23388845 -24318200 -25118182 -25808804 -26419854 -26990066 -27545208 -28054081
10938 -28054081 -28495249 -28966010 -29626453 -30478377 -31311834 -31944108 -32388830 -32718066 -32868314
10929 -32868314 -32692661 -32141440 -31296538 -30281843 -29228147 -28272788 -27506658 -26935285 -26503549
10920 -26503549 -26181894 -26025313 -26082684 -26275935 -26423869 -26380432 -26133587 -25744893 -25211335 -24489332
10910 -24489332 -23696308 -23147426 -23124403 -23688941 -24660428 -25689650 -26427189 -26703249 -26564585
10901 -26564585 -26180868 -25751409 -25424307 -25222557 -25083564 -24974738 -24929994 -24978164 -25092761 -25240560
10891 -25240560 -25418635 -25630137 -25896721 -26315352 -26990855 -27901686 -28912529 -29892560 -30763583
10882 -30763583 -31438407 -31799233 -31804179 -31573457 -31301015 -31106290 -31008415 -31002638 -31132919 -31464473
10872 -31464473 -31945492 -32381889 -32654689 -32867625 -33209198 -33752344 -34388946 -34921747 -35199879
10863 -35199879 -35159231 -34824041 -34312111 -33747720 -33150477 -32505664 -31865009 -31252496 -30608417
10854 -30608417 -29928526 -29313595 -28844036 -28527069 -28335748 -28239981 -28228628 -28324800 -28558783 -28910259
10844 -28910259 -29296905 -29603918 -29698081 -29445844 -28810010 -27931969 -27065502 -26446618 -26217040
10835 -26217040 -26428966 -27079992 -28075527 -29211740 -30286269 -31185202 -31855746 -32291853 -32580542
10826 -32580542 -32873777 -33236597 -33552986 -33633767 -33400864 -32920485 -32277916 -31482746 -30508480
10817 -30508480 -29378529 -28137855 -26803600 -25426714 -24137912 -23099141 -22443274 -22248522
10809 -22248522 -22518574 -23135597 -23868983 -24496538 -24900129 -25052286 -25000619 -24860359 -24746166
10800 -24746166 -24715282 -24757392 -24803059 -24776276 -24663020 -24519372 -24391531 -24232296 -23897729 -23212529
10790 -23212529 -22105772 -20701129 -19240385 -17978325 -17112682 -16679969 -16564049 -16650829 -16895919
10781 -16895919 -17240859 -17579616 -17866621 -18203974 -18778573 -19724224 -21050650 -22670465 -24463745
10772 -24463745 -26318875 -28119718 -29690589 -30757310 -31079455 -30688575 -29873218 -28948151 -28118394
10763 -28118394 -27482710 -27085507 -26946051 -27061997 -27399872 -27867327 -28310129 -28557581 -28473904
10754 -28473904 -27998101 -27185193 -26188191 -25141325 -24067640 -22925342 -21704344 -20464370
10746 -20464370 -19294762 -18263352 -17417539 -16816664 -16558069 -16724727 -17282623 -18063506 -18890055
10737 -18890055 -19701978 -20536145 -21428139 -22354112 -23240457 -24028902 -24710624 -25271216 -25656252
10728 -25656252 -25798063 -25642343 -25220096 -24732848 -24459861 -24553439 -25005234 -25758576 -26749508
10719 -26749508 -27845526 -28829410 -29504151 -29779616 -29653177 -29195959 -28545337 -27813523 -27029001
10710 -27029001 -26244738 -25646069 -25469200 -25808855 -26479129 -27062166 -27147483 -26565359 -25435175
10701 -25435175 -24082930 -22917527 -22230286 -22032097 -22099990 -22136985 -21882778 -21208104 -20213073
10692 -20213073 -19173099 -18344344 -17853790 -17718755 -17892239 -18320125 -18999434 -19935774 -21003311
10683 -21003311 -21942974 -22578656 -22980386 -23329286 -23659442 -23868244 -23908356 -23808533 -23581923 -23195944
10673 -23195944 -22615467 -21864402 -21024408 -20223363 -19639290 -19396108 -19427689 -19526186 -19508874 -19283082
10663 -19283082 -18840385 -18274861 -17721593 -17225277 -16740654 -16284272 -15995531 -16007501 -16348213
10654 -16348213 -16942863 -17608214 -18130925 -18412241 -18468471 -18293621 -17808764 -16983995 -15941092
10645 -15941092 -14902208 -14109779 -13820628 -14277728 -15576871 -17565024 -19882733 -22115934
10637 -22115934 -23967888 -25368084 -26441000 -27299513 -27878576 -28009321 -27593406 -26697151 -25532636
10628 -25532636 -24359744 -23355878 -22533154 -21788404 -21077281 -20528701 -20306637 -20416934 -20763676
10619 -20763676 -21302799 -22025022 -22831980 -23529635 -23985544 -24215448 -24281730 -24185050 -23852867 -23180096
10609 -23180096 -22149075 -20946378 -19884372 -19200423 -18948194 -19019507 -19219702 -19361777 -19352946
10600 -19352946 -19226779 -19127081 -19255823 -19781281 -20747138 -22048741 -23439301 -24562018 -25151266
10591 -25151266 -25238329 -25046215 -24753193 -24466626 -24291946 -24292806 -24454504 -24730485 -25057532 -25325900
10581 -25325900 -25422977 -25320681 -25109386 -24938192 -24870744 -24816520 -24669955 -24473539 -24364099 -24374592
10571 -24374592 -24359093 -24172883 -23880447 -23686555 -23681287 -23729549 -23644542 -23394072 -23058347 -22687784
10561 -22687784 -22273037 -21811002 -21391342 -21134465 -21037954 -21003826 -20982937 -21010484 -21137080 -21383000
10551 -21383000 -21717093 -22062250 -22365921 -22693414 -23231998 -24120982 -25252037 -26314435 -27023140
10542 -27023140 -27280095 -27177213 -26890824 -26550930 -26189232 -25803251 -25427767 -25132983 -24961125
10533 -24961125 -24883156 -24861263 -24920110 -25070747 -25243213 -25381156 -25512625 -25701301 -25997891 -26399559
10523 -26399559 -26803403 -27026272 -26908456 -26422851 -25710813 -24982757 -24371683 -23897521 -23500629
10514 -23500629 -23079314 -22551687 -21914134 -21258917 -20709984 -20298658 -19929784 -19520471 -19134068
10505 -19134068 -18919891 -18954582 -19151738 -19309344 -19261939 -19024551 -18790413 -18711672 -18688065 -18449430
10495 -18449430 -17850089 -17028694 -16300646 -15944897 -16083932 -16705946 -17734260 -19055771 -20525337
10486 -20525337 -22009539 -23425529 -24723271 -25889029 -26955441 -27932270 -28727696 -29207732
10478 -29207732 -29336271 -29183690 -28817505 -28264623 -27528177 -26594287 -25464471 -24182784 -22806287
10469 -22806287 -21364996 -19908425 -18576096 -17555233 -16945339 -16727535 -16880995 -17407080 -18205226
10460 -18205226 -19030677 -19643326 -20029007 -20442749 -21137903 -22069228 -22950643 -23540846 -23820236
10451 -23820236 -23946178 -24068663 -24246696 -24497022 -24767246 -24931193 -24895942 -24650468 -24244996
10442 -24244996 -23764445 -23283822 -22823188 -22338757 -21772625 -21139087 -20544821 -20117150 -19926815
10433 -19926815 -19955918 -20142040 -20463068 -20944952 -21598820 -22418358 -23418587 -24585959 -25795705
10424 -25795705 -26843847 -27557092 -27859446 -27807469 -27572767 -27342577 -27214572 -27145662 -26976604
10415 -26976604 -26546081 -25839861 -25032653 -24401077 -24170642 -24356954 -24724203 -24942058 -24867887
10406 -24867887 -24664787 -24568603 -24631510 -24769895 -24902622 -24923973 -24698841 -24242891 -23763703 -23451082
10396 -23451082 -23347420 -23374828 -23401672 -23330218 -23134829 -22839142 -22475518 -22035258 -21513600 -21005097
10386 -21005097 -20637168 -20408463 -20201573 -19942968 -19676380 -19496964 -19477141 -19651881 -20041159
10377 -20041159 -20678153 -21564622 -22580072 -23481713 -24034844 -24164193 -23937425 -23419351 -22629729
10368 -22629729 -21626030 -20559535 -19668847 -19237440 -19471424 -20352834 -21621249 -22918191 -23966948
$$ [...]
##END NTUPLES=NMR SPECTRUM
##END=
