##TITLE=31P ikalashn
DE-77H
11.12.2024
##JCAMPDX= 6.0         $$ Bruker NMR JCAMP-DX V2.0
##DATA TYPE= NMR SPECTRUM
##DATA CLASS= NTUPLES
##ORIGIN= UXNMR, Bruker Analytische Messtechnik GmbH
##OWNER= root
$$ TOPSPIN		Version 1.3
$$ 2024-12-11 16:02:23.968 +0400  Irina@DPX200
$$ Compression mode = diff/dup
##.OBSERVE FREQUENCY= 81.01967998063
##.OBSERVE NUCLEUS= ^31P
##.ACQUISITION MODE= SIMULTANEOUS
##.ACQUISITION SCHEME= undefined
##.AVERAGES= 128
##.DIGITISER RES= 17
##SPECTROMETER/DATA SYSTEM= spect
##.PULSE SEQUENCE= zgpg
##.SOLVENT NAME= D2O
##.SHIFT REFERENCE= INTERNAL, D2O, 1, 298.5841
##AUDIT TRAIL= $$ (NUMBER, WHEN, WHO, WHERE, WHAT)
$$ ##TITLE= Audit trail, TOPSPIN		Version 1.3
$$ ##JCAMPDX= 5.01
$$ ##ORIGIN= Bruker BioSpin GmbH
$$ ##OWNER= Irina
$$ $$ F:/spectra/data/iren/nmr/P31dec/1/pdata/1/auditp.txt
$$ ##AUDIT TRAIL=  $$ (NUMBER, WHEN, WHO, WHERE, VERSION, WHAT)
(   1,<2024-12-11 15:58:40.546 +0400>,<Irina>,<DPX200>,<TOPSPIN 1.3>,
      <created by zg
	started at 2024-12-11 15:55:21.671 +0400,
	POWCHK disabled, PULCHK disabled
       configuration hash MD5:
       BE 6D 3F 07 2A EA 11 49 91 17 2B D3 AF B3 58 0D
       data hash MD5: 32K
       01 60 00 FB 94 EF DA 81 07 7A 2A 0B 76 20 C7 2C>)
(   2,<2024-12-11 16:00:15.812 +0400>,<Irina>,<DPX200>,<TOPSPIN 1.3>,
      <Start of raw data processing
       efp BC_mod = 2 LB = 15 FT_mod = 6 PKNL = 1 PHC0 = 58.08414 PHC1 = 346.9353 SI = 32K 
       data hash MD5: 32K
       72 44 52 8D 41 B4 AB BB 62 43 63 0A DB A3 75 74>)
(   3,<2024-12-11 16:02:01.687 +0400>,<Irina>,<DPX200>,<TOPSPIN 1.3>,
      <apk 
       data hash MD5: 32K
       D5 27 C6 3F A9 C2 25 64 75 8E 10 B3 62 8F 2A 47>)
(   4,<2024-12-11 16:02:03.812 +0400>,<Irina>,<DPX200>,<TOPSPIN 1.3>,
      <abs n ABSG = 5 
       data hash MD5: 32K
       39 CD D7 2B 97 F1 36 C1 96 38 47 93 8A C4 EF 41>)
$$ ##END=
$$ 
$$ $$ hash MD5
$$ $$ DC 7F 32 AE 97 98 53 90 C5 6E B6 96 9E 57 72 B7
##$RELAX= 
##$RELAX= 
##$RELAX= 
##$RELAX= 
##$RELAX= 
##$RELAX= 
##$RELAX= 
##$RELAX= 
##$RELAX= 
##$RELAX= 
##$RELAX= 
$$ Bruker specific parameters
$$ --------------------------
##$DU= <F:/spectra>
##$EXPNO= 1
##$NAME= <P31dec>
##$PROCNO= 1
##$TYPE= <nmr>
##$USER= <iren>
##$AMP= (0..31)
100 100 100 100 100 100 100 100 100 100 100 100 100 100 100 100 100 100 
100 100 100 100 100 100 100 100 100 100 100 100 100 100 
##$ANAVPT= -1
##$AQSEQ= 0
##$AQ_mod= 1
##$AUNM= <au_zg>
##$AUTOPOS= <>
##$BF1= 81.014009
##$BF2= 200.13
##$BF3= 200.13
##$BF4= 200.13
##$BF5= 200.13
##$BF6= 200.13
##$BF7= 200.13
##$BF8= 200.13
##$BYTORDA= 1
##$CFDGTYP= 0
##$CFRGTYP= 5
##$CHEMSTR= <none>
##$CNST= (0..63)
1 1 145 1 1 1 1 1 1 1 1 1 1 1 1 1 1 1 1 1 1 1 1 1 1 1 1 1 1 1 1 1 1 1 
1 1 1 1 1 1 1 1 1 1 1 1 1 1 1 1 1 1 1 1 1 1 1 1 1 1 1 1 1 1 
##$CPDPRG= <waltz16>
##$CPDPRG1= <>
##$CPDPRG2= <waltz16>
##$CPDPRG3= <>
##$CPDPRG4= <mlev>
##$CPDPRG5= <mlev>
##$CPDPRG6= <mlev>
##$CPDPRG7= <mlev>
##$CPDPRG8= <mlev>
##$CPDPRGB= <>
##$CPDPRGT= <>
##$D= (0..63)
$$ [...]
##$SW_h= 37037.037037037
##$TD= 32768
##$TD0= 1
##$TE= 300
##$TE2= 300
##$TE3= 300
##$TEG= 300
##$TL= (0..7)
0 120 53 12 22 120 120 120 
##$TP= (0..7)
150 150 150 150 150 150 150 150 
##$TP07= 0
##$TPNAME0= <>
##$TPNAME1= <>
##$TPNAME2= <>
##$TPNAME3= <>
##$TPNAME4= <>
##$TPNAME5= <>
##$TPNAME6= <>
##$TPNAME7= <>
##$TPOAL= (0..7)
0.5 0.5 0.5 0.5 0.5 0.5 0.5 0.5 
##$TPOFFS= (0..7)
0 0 0 0 0 0 0 0 
##$TUNHIN= 0
##$TUNHOUT= 0
##$TUNXOUT= 0
##$USERA1= <user>
##$USERA2= <user>
##$USERA3= <user>
##$USERA4= <user>
##$USERA5= <user>
##$V9= 5
##$VALIST= <valist>
##$VCLIST= <CCCCCCCCCCCCCCC>
##$VD= 0
##$VDLIST= <DDDDDDDDDDDDDDD>
##$VPLIST= <PPPPPPPPPPPPPPP>
##$VTLIST= <TTTTTTTTTTTTTTT>
##$WBST= 1024
##$WBSW= 4
##$XGAIN= (0..3)
0 0 0 0 
##$XL= 0
##$YL= 0
##$YMAX_a= 12617
##$YMIN_a= -1539
##$ZGOPTNS= <>
##$ZL1= 120
##$ZL2= 120
##$ZL3= 120
##$ZL4= 120
##$ABSF1= 298.5841
##$ABSF2= -158.5842
##$ABSG= 5
##$ABSL= 5
##$ALPHA= 0
##$AQORDER= 0
##$ASSFAC= 0
##$ASSFACI= 0
##$ASSFACX= 0
##$ASSWID= 0
##$AUNMP= <proc_1d>
##$AXLEFT= 0
##$AXRIGHT= 0
##$AXTYPE= 0
##$AXUNIT= <>
##$AZFE= 0.1
##$AZFW= 0.5
##$BCFW= 0
##$BC_mod= 2
##$BYTORDP= 0
##$COROFFS= 0
##$CY= 12.5935478210449
##$DATMOD= 1
##$DC= 0
##$DFILT= <>
##$DTYPP= 0
##$F1P= 47.1127640792319
##$F2P= -24.0371245302204
##$FCOR= 0.5
##$FTSIZE= 32768
##$FT_mod= 6
##$GAMMA= 0
##$GB= 0
##$INTBC= 1
##$INTSCL= 7.269226e-011
##$ISEN= 30
##$LB= 15
##$LEV0= 0
##$LPBIN= 0
##$MAXI= 12.09355
##$MC2= 0
##$MEAN= 0
##$ME_mod= 0
##$MI= 0.7550151
##$NCOEF= 0
##$NC_proc= -14
##$NLEV= 6
##$NOISF1= 298.5841
##$NOISF2= 270.0111
##$NSP= 0
##$NTH_PI= 0
##$NZP= 0
##$OFFSET= 298.5841
##$PC= 1.4
##$PHC0= 81.6438
##$PHC1= 289.3192
##$PH_mod= 1
##$PKNL= yes
##$PPARMOD= 0
##$PPDIAG= 0
##$PPIPTYP= 0
##$PPMPNUM= 100
##$PPRESOL= 1
##$PSCAL= 0
##$PSIGN= 0
##$REVERSE= no
##$SF= 81.014009
##$SI= 32768
##$SIGF1= 270.0111
##$SIGF2= -158.5842
##$SINO= 77.54984
##$SIOLD= 32768
##$SREGLST= <31P.CDCl3>
##$SSB= 0
##$STSI= 32768
##$STSR= 0
##$SW_p= 37037.037037037
##$SYMM= 0
##$S_DEV= 0
##$TDeff= 32768
##$TDoff= 0
##$TI= <>
##$TILT= no
##$TM1= 0
##$TM2= 0
##$TOPLEV= 0
##$USERP1= <user>
##$USERP2= <user>
##$USERP3= <user>
##$USERP4= <user>
##$USERP5= <user>
##$WDW= 1
##$XDIM= 32768
##$YMAX_p= 404440564
##$YMIN_p= -117812365
$$ End of Bruker specific parameters
$$ ---------------------------------
##NTUPLES= NMR SPECTRUM
##VAR_NAME=  FREQUENCY,     SPECTRUM/REAL,   SPECTRUM/IMAG
##SYMBOL=    X,             R,               I
##VAR_TYPE=  INDEPENDENT,   DEPENDENT,       DEPENDENT
##VAR_FORM=  AFFN,          ASDF,            ASDF
##VAR_DIM=   32768,         32768,           32768
##UNITS=     HZ,            ARBITRARY UNITS, ARBITRARY UNITS
##FACTOR=    1.13031516577767, 1,            1
##FIRST=     37037.037037037, 44065239,      -47728772
##LAST=      0,             16621450,        -2936784
##MIN=       0,             -117812365,      0
##MAX=       37037.037037037, 404440564,     0
$$ Real data points
##PAGE= N=1
##DATA TABLE= (X++(R..R)), XYDATA
$$ [...]
17731 -18019218 -16613983 -15184868 -14088084 -13592549 -13738513 -14273597 -14735911 -14652305 -13739767
17722 -13739767 -12005335 -9703422 -7188367 -4763467 -2623333 -897253 288874 812290
17714 812290 620454 -186260 -1318722 -2356935 -2898190 -2717991 -1844754 -513118 956318
17705 956318 2274577 3249923 3789904 3858249 3433426 2515869 1173441 -442215 -2145453
17696 -2145453 -3791120 -5313784 -6715857 -8024779 -9253073 -10392439 -11436877 -12389544
17688 -12389544 -13224834 -13842920 -14082783 -13801998 -12957238 -11619345 -9914739 -7934563 -5676044
17679 -5676044 -3070043 -81939 3206660 6618188 9982751 13228557 16377765 19446666
17671 19446666 22330958 24781398 26505586 27316515 27213617 26365879 25050632 23594049
17663 23594049 22314362 21458382 21138343 21296362 21727051 22158443 22353214 22176905 21603476
17654 21603476 20683080 19520247 18268137 17099479 16134466 15367277 14658925 13817211 12710156
17645 12710156 11333823 9797541 8247157 6789170 5479018 4359305 3465762 2777277
17637 2777277 2188035 1561923 818640 -38047 -964423 -1937564 -2985249 -4172858 -5554002
17628 -5554002 -7109877 -8711015 -10113507 -10983002 -10953862 -9735935 -7234847 -3609188 778681
17619 778681 5477306 10043888 14093093 17330458 19598043 20913097 21452090 21457091 21120719
17610 21120719 20547052 19802106 18963560 18106338 17263567 16426481 15573183 14673056 13669608
17601 13669608 12487691 11063391 9355409 7332331 4972069 2293402 -613370 -3604952
17593 -3604952 -6549166 -9377225 -12079890 -14660693 -17092308 -19313804 -21270212 -22947958
17585 -22947958 -24367805 -25573928 -26666993 -27829629 -29258543 -31029260 -33018205 -34959963
17577 -34959963 -36589445 -37755959 -38462651 -38863537 -39222569 -39812487 -40797976 -42182633 -43831388
17568 -43831388 -45523083 -47004139 -48039958 -48459695 -48186326 -47250123 -45787254 -44015814
17560 -44015814 -42182055 -40494035 -39073530 -37939798 -37023364 -36209951 -35410525 -34634410 -34020578
17551 -34020578 -33786672 -34107704 -34988070 -36192366 -37283086 -37772904 -37317020 -35826028 -33433354
17542 -33433354 -30364000 -26816220 -22914844 -18715296 -14238521 -9532012 -4718036 19654
17534 19654 4506065 8640300 12401537 15810649 18900464 21707797 24257775 26522035
17526 26522035 28376448 29607906 29990324 29393348 27849015 25523856 22630837 19371305
17518 19371305 15938942 12533281 9344946 6540917 4275800 2697103 1911001 1937089
17510 1937089 2697618 4042744 5787091 7744123 9762824 11766871 13758738 15745727
17502 15745727 17628066 19162988 20063605 20159370 19489057 18266175 16759584 15179473 13631045
17493 13631045 12137261 10693204 9305987 7990170 6732405 5473373 4129409 2622889
17485 2622889 890936 -1118130 -3448647 -6147515 -9269016 -12844911 -16820914 -21009328
17477 -21009328 -25108182 -28782314 -31753438 -33856427 -35065329 -35500091 -35389472 -34981021
17469 -34981021 -34457713 -33925015 -33459223 -33165208 -33203828 -33768071 -35011942 -36972334 -39540186
17460 -39540186 -42507332 -45651874 -48786534 -51737400 -54313494 -56347891 -57789051 -58736806
17452 -58736806 -59371865 -59836885 -60160097 -60260029 -60007769 -59296489 -58075902 -56352179 -54190943
17443 -54190943 -51736291 -49211632 -46866895 -44886070 -43322057 -42109001 -41127224 -40267994
17435 -40267994 -39476391 -38765924 -38200968 -37868095 -37866277 -38306539 -39288071 -40856774 -42981366
17426 -42981366 -45545634 -48329593 -50992872 -53107883 -54259403 -54169892 -52777834 -50216782
17418 -50216782 -46717223 -42511459 -37801435 -32790496 -27735197 -22961349 -18820714 -15612779
17410 -15612779 -13515677 -12561810 -12671305 -13717684 -15572161 -18092368 -21067287 -24167154
17402 -24167154 -26963668 -29051958 -30218107 -30537045 -30322877 -29947354 -29625854 -29303657 -28715711
17393 -28715711 -27563200 -25668659 -23019504 -19721282 -15936971 -11859396 -7710981 -3744994
17385 -3744994 -235470 2549777 4407112 5280514 5312131 4795192 4037944 3226928 2382418
17376 2382418 1418224 236788 -1212124 -2926567 -4866548 -6946803 -9020199 -10903446
17368 -10903446 -12454130 -13644389 -14574870 -15420389 -16334876 -17341008 -18243290 -18645762 -18121260
17359 -18121260 -16439257 -13679791 -10164149 -6294056 -2429304 1150285 4232951 6655883
17351 6655883 8290166 9035196 8850118 7823112 6209980 4373340 2645244 1211984
17343 1211984 89747 -827178 -1690895 -2616585 -3615573 -4583011 -5348653 -5750473 -5676289
17334 -5676289 -5060848 -3877059 -2155853 -20115 2316626 4608018 6647822 8303766
17326 8303766 9510181 10258630 10600873 10637730 10483235 10237290 9999389 9902815 10106057 10716114
17316 10716114 11702322 12881195 13993168 14819402 15255037 15292142 14951121 14241373 13181683
17307 13181683 11838249 10328718 8782481 7279981 5812441 4303196 2681700 948961
17299 948961 -818731 -2531415 -4163439 -5774395 -7446069 -9190722 -10901136 -12361995
17291 -12361995 -13305740 -13491745 -12784922 -11203974 -8924434 -6250130 -3563081 -1239492
17283 -1239492 454698 1425486 1735275 1555731 1126621 688902 384091 194682 -20856
17274 -20856 -439028 -1187825 -2290433 -3650552 -5096507 -6467831 -7685958 -8758674 -9722962
17265 -9722962 -10573441 -11219284 -11476370 -11084997 -9777207 -7424304 -4198226 -600474 2703905
17256 2703905 5146908 6452452 6676147 6097555 5036873 3699716 2132493 292056
17248 292056 -1850380 -4269525 -6930232 -9833184 -12987744 -16347956 -19795167 -23178549
17240 -23178549 -26360778 -29239132 -31748769 -33844412 -35445957 -36375528 -36359354 -35130034
17232 -35130034 -32567674 -28780658 -24082537 -18890968 -13610023 -8558177 -3960242 32619
17224 32619 3328799 5889835 7726509 8893084 9473694 9568253 9288336 8754028 8076352
17215 8076352 7327071 6519342 5630765 4669788 3734922 3012629 2713481 2984296 3827337
17206 3827337 5053406 6310140 7211572 7522567 7281702 6770043 6348084 6277430 6634938
17197 6634938 7339559 8235300 9171401 10058069 10879066 11642329 12310863 12797721 13034955
17188 13034955 13029575 12838915 12499115 11987669 11248309 10232607 8906078 7228655 5167281
17179 5167281 2757656 146186 -2463703 -4932137 -7254646 -9513217 -11748934 -13860588
17171 -13860588 -15605603 -16695685 -16910884 -16170021 -14555694 -12309968 -9794816 -7409031
17163 -7409031 -5483208 -4191152 -3506954 -3234808 -3120406 -2992893 -2844743 -2796600 -2985346
17154 -2985346 -3471983 -4239385 -5262172 -6560853 -8165113 -10001638 -11807916 -13167521
17146 -13167521 -13672224 -13121794 -11636626 -9615460 -7584132 -6043036 -5377189 -5808643 -7347245
17137 -7347245 -9753615 -12576892 -15289493 -17453633 -18822676 -19345534 -19128268 -18406470 -17514936
17128 -17514936 -16821358 -16633097 -17112358 -18217753 -19680936 -21055874 -21873594 -21847083 -20997246
17119 -20997246 -19610364 -18054131 -16572334 -15181479 -13715776 -11978467 -9903555 -7618052
17111 -7618052 -5348245 -3233873 -1201261 1003961 3665403 6938237 10749319 14769507
17103 14769507 18485418 21374654 23095084 23571733 22962178 21571744 19775912 17956588
17095 17956588 16449343 15498967 15207775 15484019 16046405 16530653 16657957 16350900 15718607
17086 15718607 14942422 14146413 13313701 12284578 10851992 8913439 6584009 4195063
17078 4195063 2176395 883499 459104 795793 1605194 2544894 3339895 3856951 4119921
17069 4119921 4269722 4478176 4845602 5348463 5888603 6396562 6876413 7350267 7771141
17060 7771141 7991889 7818772 7112182 5863446 4197256 2302483 342067 -1590264 -3446894
17051 -3446894 -5194828 -6831449 -8423573 -10108136 -12035979 -14292728 -16847524 -19566456
17043 -19566456 -22284224 -24872946 -27250003 -29343480 -31081875 -32427727 -33404015 -34064379
17035 -34064379 -34426477 -34433944 -33988683 -33038404 -31664287 -30102231 -28655937 -27529002 -26681223
17026 -26681223 -25829009 -24617883 -22861825 -20690904 -18510852 -16799821 -15869603 -15731599
17018 -15731599 -16122490 -16640172 -16907258 -16710117 -16081093 -15295533 -14791467 -15052242 -16470934
17009 -16470934 -19201900 -23050464 -27486069 -31814054 -35432371 -38022385 -39567576 -40235539
17001 -40235539 -40245861 -39800029 -39056540 -38115233 -37014667 -35751645 -34310270 -32686993 -30909085
16992 -30909085 -29054405 -27277239 -25807477 -24870906 -24551691 -24707431 -25019784 -25149760 -24888662
16983 -24888662 -24216592 -23269221 -22265014 -21421293 -20876517 -20661820 -20738047 -21039496 -21455287
16974 -21455287 -21772012 -21683491 -20916766 -19389811 -17275313 -14928682 -12743259 -11022022 -9902316
16965 -9902316 -9328200 -9074583 -8826316 -8278824 -7218701 -5582636 -3506509 -1333656 467021
16956 467021 1466405 1451040 518261 -971327 -2571147 -3949383 -4978236 -5671033 -6062844
16947 -6062844 -6150478 -5897010 -5242832 -4123975 -2523154 -521488 1695906 3890063 5849751
16938 5849751 7451072 8655393 9470885 9928045 10078805 9996317 9764633 9459927 9117122
16929 9117122 8700163 8129179 7371550 6521557 5798603 5467616 5725088 6603556 7954744
16920 7954744 9526091 11064752 12378777 13353715 13950231 14180012 14054012 13535224 12542245
16911 12542245 11001725 8894163 6256973 3178138 -174073 -3510763 -6448472 -8623155
16903 -8623155 -9807714 -9936492 -9045678 -7217565 -4574045 -1290047 2406678 6248624
16895 6248624 9937735 13142895 15510231 16722357 16593772 15146648 12626703 9445722
16887 9445722 6054775 2792560 -208667 -3003194 -5720504 -8439760 -11122912 -13638263
16879 -13638263 -15849594 -17705182 -19269310 -20684762 -22105335 -23649370 -25378932 -27270986
16871 -27270986 -29179931 -30838947 -31930060 -32194175 -31520118 -29968915 -27731616 -25039732
16863 -25039732 -22060271 -18844871 -15387689 -11734504 -8018858 -4390630 -930674 2342778
16855 2342778 5375411 7993219 9934892 10977207 11031468 10143280 8451566 6176551 3621439
16846 3621439 1134139 -976756 -2522817 -3464558 -3877348 -3884852 -3613812 -3195979 -2783568
16837 -2783568 -2536845 -2582367 -2962313 -3597623 -4286708 -4747782 -4686049 -3860385 -2142766 440242
16827 440242 3704260 7345204 11008225 14363187 17154621 19225120 20535244 21185346
16819 21185346 21420973 21591648 22051451 23046417 24655561 26802277 29305255 31944069 34523641
16810 34523641 36901966 38961572 40567937 41573353 41867306 41422067 40291361 38570230
16802 38570230 36357151 33744884 30830935 27727301 24565095 21501677 18725075 16431490
16794 16431490 14769214 13783280 13401184 13464607 13775001 14118840 14279030 14073145 13429846
16785 13429846 12450761 11391796 10561252 10196238 10374913 10995836 11842613 12700191 13434211
16776 13434211 13987182 14337069 14479169 14432980 14237308 13917757 13458361 12822925 12011479
16767 12011479 11076647 10073994 9018969 7911257 6786162 5729768 4870230 4384467
16759 4384467 4484865 5324792 6872765 8888131 11044829 13096390 14936364 16521725
16751 16521725 17754829 18438034 18345861 17362444 15566990 13195201 10520878 7749850 4973569
16742 4973569 2180710 -682895 -3626126 -6555605 -9300873 -11681581 -13529908 -14661441
16734 -14661441 -14866195 -13955747 -11833282 -8543857 -4289890 584876 5637356 10395715
16726 10395715 14458138 17591099 19780381 21204648 22139236 22830095 23385324 23730573 23665602
16717 23665602 23001808 21691207 19866918 17786059 15722850 13877323 12339860 11104571
16709 11104571 10105585 9263761 8535243 7941269 7560650 7491638 7810177 8545402 9678439
16700 9678439 11153112 12880988 14748768 16639378 18443399 20047955 21331381 22172779
16692 22172779 22451665 22044909 20857037 18881678 16249460 13223887 10140625 7317501
16684 7317501 4970692 3159616 1781142 631418 -480747 -1629723 -2749309 -3709947
16676 -3709947 -4429564 -4910749 -5164769 -5104954 -4537342 -3285719 -1357051 985801 3300701
16667 3300701 5141823 6228348 6518296 6173154 5471961 4742160 4315864 4466759 5309695
16658 5309695 6727909 8415613 10033662 11371250 12401563 13213011 13900285 14505717 15017140
16649 15017140 15374257 15462136 15120497 14204544 12678619 10666716 8405799 6134940 4008281
16640 4008281 2092335 433026 -881035 -1724476 -2008456 -1756654 -1111749 -261619 644761
16631 644761 1524571 2349064 3136111 3929668 4742521 5509454 6104685 6403675 6333275 5881414
16621 5881414 5068884 3911613 2415214 603921 -1466771 -3742563 -6205075 -8856949
16613 -8856949 -11677630 -14605276 -17546309 -20381498 -22968612 -25144829 -26714002 -27439426
16605 -27439426 -27094713 -25564410 -22909307 -19339737 -15128089 -10526488 -5730983 -901347
16597 -901347 3782674 8071517 11643100 14157580 15343483 15072701 13397806 10543369
16589 10543369 6849305 2688241 -1602905 -5760601 -9607882 -13051231 -16077269 -18752573
16581 -18752573 -21194288 -23499596 -25684655 -27677958 -29355454 -30586569 -31268391 -31338261
16573 -31338261 -30778641 -29624549 -27957618 -25883889 -23526025 -21040562 -18626740 -16505808
16565 -16505808 -14891260 -13968466 -13873833 -14657614 -16229576 -18313902 -20470177 -22220416 -23232591
16556 -23232591 -23441455 -23029870 -22302736 -21551125 -20978608 -20693560 -20729750 -21062809 -21628619
16547 -21628619 -22364453 -23253087 -24321868 -25588734 -27004830 -28446386 -29768479 -30889688
16539 -30889688 -31840344 -32725447 -33632543 -34560202 -35416367 -36075820 -36437484 -36441201 -36059636 -35290607
16529 -35290607 -34153686 -32687524 -30943338 -28973097 -26823423 -24552019 -22264749 -20137219
16521 -20137219 -18371792 -17083143 -16181437 -15357945 -14218955 -12488153 -10132150 -7346839
16513 -7346839 -4470485 -1904653 -47037 795286 500056 -828536 -2908658 -5380303
16505 -5380303 -7879019 -10059560 -11613790 -12323726 -12125141 -11123520 -9553566 -7730507
16497 -7730507 -6022437 -4816220 -4448425 -5131273 -6929366 -9793335 -13596855 -18135718
16489 -18135718 -23109716 -28130414 -32772034 -36655352 -39535424 -41357734 -42259879 -42510093
16481 -42510093 -42396418 -42123702 -41785383 -41417382 -41076111 -40873981 -40945067 -41359631 -42036907
16472 -42036907 -42724881 -43100047 -42951997 -42321227 -41469335 -40691298 -40108584 -39587226 -38819190
16463 -38819190 -37493296 -35444758 -32713561 -29506042 -26088182 -22663033 -19317342 -16081099
16455 -16081099 -13019465 -10239586 -7811774 -5705566 -3802328 -1953223 -27398 2055786
16447 2055786 4282963 6499441 8417712 9716832 10177910 9764569 8618176 7005893
16439 7005893 5260717 3714226 2612542 2039527 1900315 1990540 2103673 2093471 1864085
16430 1864085 1346983 526744 -507815 -1562425 -2418413 -2945563 -3152097 -3128622 -2947403
16421 -2947403 -2609243 -2057622 -1222431 -76219 1311665 2777406 4152088 5386348 6623367
16412 6623367 8173752 10407366 13604033 17811588 22780187 28027101 33002352 37258971
16404 37258971 40548536 42822760 44178989 44809207 44968717 44924444 44861911 44800818 44592243
16395 44592243 44014068 42902616 41227962 39061215 36465200 33408863 29796296 25605060
16387 25605060 21035004 16555610 12794745 10297583 9262032 9388906 9947488 10040506 8928379
16378 8928379 6254184 2101987 -3084603 -8675692 -14066519 -18830513 -22745095 -25746782
16370 -25746782 -27909297 -29441055 -30647008 -31854211 -33346414 -35331694 -37929615 -41159106
16362 -41159106 -44919013 -48965838 -52921237 -56349920 -58894443 -60384407 -60845604 -60425924
16354 -60425924 -59318242 -57724366 -55843822 -53866052 -51962045 -50270519 -48882477 -47843083
16346 -47843083 -47165873 -46829049 -46753961 -46795770 -46759038 -46435754 -45662886 -44379831 -42653610
16337 -42653610 -40668806 -38711283 -37144944 -36347131 -36608681 -38043011 -40520196 -43643001
16329 -43643001 -46832554 -49546007 -51510838 -52823655 -53872313 -55159955 -57136709 -60088112
16321 -60088112 -64074825 -68932495 -74361371 -80078860 -85939662 -91943767 -98125425 -104381464
16313 -104381464 -110318303 -115166760 -117812365 -117053745 -112131869 -103240550 -91536950 -78575725
16305 -78575725 -65651394 -53498082 -42359185 -32217118 -23013625 -14765550 -7556766
16298 -7556766 -1471105 3450462 7194411 9725377 10964556 10840988 9388452 6811404
16290 6811404 3477633 -139575 -3537880 -6282704 -8123336 -9082007 -9438874 -9583933 -9825301
16281 -9825301 -10285988 -10921847 -11599303 -12167828 -12490338 -12436959 -11888087 -10767915 -9082664
16272 -9082664 -6951986 -4630346 -2474330 -831378 84661 245159 -222990 -1095510 -2103706
16263 -2103706 -2993625 -3600498 -3910798 -4074903 -4365315 -5101804 -6554937 -8841106 -11852758
16254 -11852758 -15267275 -18639089 -21544552 -23724814 -25161463 -26049144 -26692982 -27396102
16246 -27396102 -28381849 -29753500 -31479777 -33409267 -35322709 -37011310 -38350222 -39338779
16238 -39338779 -40086120 -40730324 -41318177 -41728615 -41716437 -41053321 -39652630 -37591997 -35050520
16229 -35050520 -32227602 -29283100 -26303655 -23290379 -20172072 -16854552 -13290940 -9528957
16221 -9528957 -5704500 -1996007 1415020 4355255 6662462 8201725 8893683 8743918
16213 8743918 7859929 6439161 4720950 2915119 1140917 -582617 -2287916 -3989890
16205 -3989890 -5633023 -7075034 -8130790 -8670529 -8700434 -8355249 -7823649 -7281213 -6863192
16196 -6863192 -6658273 -6716688 -7087690 -7858993 -9131936 -10929755 -13122016 -15428549 -17481380
16187 -17481380 -18892362 -19318067 -18542909 -16557477 -13562893 -9873722 -5787074 -1519571
16179 -1519571 2760469 6869885 10587738 13691773 16025758 17538984 18255395 18207698 17420854
16170 17420854 15967113 14022725 11852835 9717982 7763854 5981476 4271545 2548702
16162 2548702 781519 -1060989 -3073741 -5402938 -8168124 -11389101 -14956844 -18650873
16154 -18650873 -22195966 -25339362 -27913952 -29851642 -31141753 -31774262 -31719322 -30955902 -29506466
16145 -29506466 -27434665 -24828011 -21809107 -18558557 -15301800 -12263427 -9626708 -7497111
16137 -7497111 -5853488 -4534196 -3331049 -2159839 -1160534 -617389 -750875 -1539121 -2686646
16128 -2686646 -3741037 -4265597 -3968670 -2755854 -728093 1853895 4633884 7238497
16120 7238497 9352443 10781459 11487541 11584153 11299671 10918305 10693213 10741030 10974392
16111 10974392 11139816 10953964 10243408 8991630 7278663 5186839 2767620 98303
16103 98303 -2632391 -5096339 -6894564 -7692870 -7353434 -5997342 -3970590 -1729683 300778
16094 300778 1836447 2769929 3136502 3034304 2526358 1561278 -29533 -2431022 -5692383
16085 -5692383 -9626790 -13837482 -17850146 -21259188 -23809546 -25402175 -26060464 -25891899
16077 -25891899 -25056804 -23752209 -22212057 -20698468 -19445036 -18547918 -17873052 -17070931 -15707509
16068 -15707509 -13430103 -10090184 -5790867 -853082 4284880 9196362 13577815 17300688
16060 17300688 20380806 22890231 24881337 26374427 27383098 27915042 27940851 27374705 26095730
16051 26095730 24008616 21123864 17621480 13854128 10262677 7231448 4960503 3417310
16043 3417310 2376613 1520293 550054 -733735 -2407543 -4448278 -6773727 -9254528
16035 -9254528 -11697428 -13860244 -15537257 -16665879 -17360649 -17843369 -18336240 -18991913 -19862715
16026 -19862715 -20879685 -21845936 -22477242 -22503430 -21797014 -20452749 -18743369 -16962253 -15269443
16017 -15269443 -13653308 -12014773 -10304301 -8628944 -7262912 -6553191 -6782812 -8059599
16009 -8059599 -10261148 -13060675 -16049542 -18907245 -21505885 -23862896 -25978026 -27701215
16001 -27701215 -28758916 -28928423 -28213424 -26866204 -25243450 -23630026 -22169132 -20911046
15993 -20911046 -19879957 -19085496 -18505862 -18086083 -17758153 -17487354 -17330606 -17446491 -18017045
15984 -18017045 -19129922 -20711919 -22551628 -24373396 -25902366 -26896312 -27167576 -26617453
15976 -26617453 -25266507 -23254183 -20797696 -18118364 -15379869 -12692224 -10162001 -7906338
15968 -7906338 -6001907 -4426381 -3051197 -1694185 -212016 1396654 2925136 3989230
15960 3989230 4168939 3192868 1064941 -1921186 -5271190 -8433779 -10929530 -12413493
15952 -12413493 -12694985 -11781211 -9938724 -7678397 -5610292 -4235637 -3789820 -4200004 -5162916
15943 -5162916 -6314652 -7423521 -8499058 -9738436 -11343473 -13337339 -15495134 -17417875
15935 -17417875 -18704387 -19123010 -18676599 -17531143 -15881991 -13859874 -11516089 -8853894
15927 -8853894 -5873358 -2623556 761645 4078333 7115813 9730997 11895540 13696465
15919 13696465 15288821 16817844 18346358 19825381 21128773 22132411 22778705 23083928
15911 23083928 23103674 22900539 22545278 22152126 21909384 22054845 22793692 24211343 26235696
15902 26235696 28666208 31241689 33694027 35766608 37233813 37958646 37964719 37457263 36749349
15893 36749349 36114944 35659588 35301777 34865050 34190551 33194085 31866776 30255572 28446371
15884 28446371 26547759 24667854 22889487 21257029 19791715 18541727 17627067 17212147
15876 17212147 17409387 18204035 19457087 20954461 22455471 23734149 24623147 25051639 25056716
15867 25056716 24754727 24279326 23719406 23102890 22446260 21827764 21409523 21376683 21834339
15858 21834339 22737045 23894715 25040769 25922423 26375567 26349913 25870911 24971826 23646221
15849 23646221 21833952 19437250 16378778 12688211 8563822 4366910 545312 -2482370
15841 -2482370 -4428574 -5188085 -4835271 -3580307 -1708285 472191 2656483 4553119
15833 4553119 5901588 6518445 6345612 5450913 3970866 2035431 -282894 -2975841 -6058044
15824 -6058044 -9494919 -13148009 -16783299 -20131445 -22941584 -24993727 -26100277 -26149986
15816 -26149986 -25182981 -23416389 -21176099 -18780004 -16443370 -14247024 -12177194 -10203061
15808 -10203061 -8328533 -6584940 -4987681 -3503986 -2061693 -585654 978482 2661994
15800 2661994 4462537 6321592 8126265 9748028 11085812 12091709 12790329 13289289
15792 13289289 13757965 14375226 15266413 16440996 17742106 18835880 19272997 18616410 16580636
15783 16580636 13126776 8490393 3140897 -2318602 -7281726 -11261763 -13981499 -15408751
15775 -15408751 -15724718 -15232056 -14228110 -12898631 -11299081 -9429774 -7323043 -5060065
15767 -5060065 -2731310 -409554 1846740 3988610 5979069 7782902 9324624 10434047
15759 10434047 10846065 10300537 8696561 6188656 3145407 -870 -2899089 -5332329
15751 -5332329 -7205320 -8535089 -9441378 -10095366 -10637810 -11118099 -11488087 -11652382 -11546998
15742 -11546998 -11195798 -10711926 -10253175 -9959375 -9902846 -10075646 -10413924 -10843781 -11327530
15733 -11327530 -11886487 -12591580 -13540436 -14837622 -16554780 -18645781 -20872225 -22847398
15725 -22847398 -24218080 -24854905 -24895414 -24615271 -24249888 -23899141 -23533517 -23041685 -22290298
15716 -22290298 -21194237 -19759230 -18057173 -16157942 -14073132 -11738898 -9044993 -5916572
15708 -5916572 -2421782 1165632 4398389 6776662 7917058 7688950 6228185 3823818
15700 3823818 775083 -2680707 -6348571 -10020192 -13454635 -16416696 -18725423 -20266508
15692 -20266508 -20990570 -20944966 -20321919 -19450525 -18706318 -18395363 -18677548 -19539545 -20798604
15683 -20798604 -22128307 -23118680 -23386390 -22705169 -21080930 -18728102 -15986248 -13249610
15675 -13249610 -10927353 -9389240 -8872204 -9395936 -10766153 -12691103 -14933079 -17368134
15667 -17368134 -19913487 -22414093 -24603106 -26159166 -26798171 -26339979 -24742702 -22105577
15659 -22105577 -18622210 -14506248 -9960052 -5212948 -564838 3646352 7153089 9852742
15651 9852742 11800037 13109734 13879233 14217428 14336430 14576030 15292254 16674126 18619627
15642 18619627 20755034 22571152 23589549 23503272 22270986 20136293 17550175 15019121
15634 15019121 12948581 11553832 10853505 10700793 10812713 10813303 10330280 9131767 7220864
15625 7220864 4817176 2242901 -205868 -2341018 -4101095 -5508791 -6587942 -7298129
15617 -7298129 -7541703 -7226212 -6314984 -4835353 -2867744 -531756 2047065 4790365 7685833
15608 7685833 10715292 13729034 16396422 18321329 19248130 19186329 18378224 17182239 15953924
15599 15953924 14941680 14219704 13711902 13312970 13017781 12936553 13155017 13554950 13790039
15590 13790039 13476659 12437306 10792372 8858948 6979211 5404017 4246277 3466329
15582 3466329 2896316 2327447 1620355 757428 -184039 -1080099 -1788657 -2179232 -2177588 -1786206
15572 -1786206 -1051202 -19012 1259154 2697263 4190966 5687180 7228849 8917864
15564 8917864 10828313 12943170 15148341 17262440 19076268 20407682 21167981 21391568
15556 21391568 21204720 20778777 20298922 19925356 19751303 19807251 20113176 20715466 21674701
15547 21674701 23037288 24824005 27021619 29556945 32275371 34960698 37384787 39342246
15539 39342246 40662653 41229726 41012880 40084787 38613125 36833972 35005978 33351031
15531 33351031 32007337 31009412 30281357 29632467 28774578 27390207 25240509 22258979 18584194
15522 18584194 14517800 10422290 6606831 3264916 494209 -1628646 -2984283 -3416490
15514 -3416490 -2814017 -1212026 1163539 3935999 6668882 8966846 10561538 11360784
15506 11360784 11444897 11011501 10296800 9509352 8786833 8175074 7644338 7141089 6633068
15497 6633068 6115899 5601627 5122728 4744163 4554925 4644538 5087445 5927996 7151179
15488 7151179 8655014 10254364 11732165 12919247 13741780 14184907 14199299 13650280 12384830
15479 12384830 10369988 7769513 4884236 2010804 -666995 -3088210 -5251586 -7150213
15471 -7150213 -8752661 -10028914 -10974334 -11588719 -11831705 -11618659 -10885320 -9678841 -8193132
15462 -8193132 -6706930 -5473434 -4640758 -4231593 -4162018 -4275197 -4381605 -4306285 -3941292
15453 -3941292 -3286963 -2446729 -1554483 -673155 253711 1345945 2666533 4152735 5668172
15444 5668172 7102515 8396000 9479914 10224083 10449121 9984921 8727425 6662621 3868957
15435 3868957 528398 -3063265 -6537481 -9554640 -11896080 -13482030 -14335805 -14556920
15427 -14556920 -14324399 -13887009 -13491426 -13276665 -13223051 -13193705 -13017912 -12554302 -11727249 -10557602
15417 -10557602 -9175887 -7788568 -6611804 -5815411 -5489573 -5631577 -6166866 -6999038 -8039886
15408 -8039886 -9196731 -10370789 -11513934 -12688356 -14032141 -15633048 -17419529 -19150870
15400 -19150870 -20484579 -21072159 -20680058 -19317213 -17286694 -15104777 -13333262 -12408748
15392 -12408748 -12520734 -13573790 -15249007 -17117016 -18718215 -19591637 -19320366 -17633295
15384 -17633295 -14504921 -10171627 -5044035 439157 5936141 11240529 16237285 20844282
15376 20844282 24996464 28663882 31860553 34630657 37029775 39105215 40868214 42277369
15368 42277369 43258942 43742264 43664677 42948189 41497818 39256890 36296708 32874690 29407162
15359 29407162 26355634 24083777 22767535 22398649 22847477 23931738 25482636 27409598
15351 27409598 29714797 32409792 35379512 38311745 40760602 42298658 42664917 41846980
15343 41846980 40069589 37689716 35050402 32378941 29777727 27275663 24874145 22572111
15335 22572111 20401911 18473484 16977013 16115185 15984916 16462254 17165778 17546059 17066965
15326 17066965 15388512 12472228 8574603 4149942 -273224 -4193291 -7219966 -9153189
15318 -9153189 -10021488 -10044888 -9544652 -8846538 -8201402 -7735165 -7443591 -7236246 -7014470 -6744547
15308 -6744547 -6468294 -6234606 -6020968 -5725674 -5230011 -4466513 -3441166 -2202417 -792207
15299 -792207 766835 2432302 4101780 5636615 6952990 8095880 9202402 10374736
15291 10374736 11584527 12683861 13482743 13827422 13658476 13034981 12098781 10985399 9741890
15282 9741890 8321624 6665215 4798754 2864156 1058835 -457519 -1618583 -2457317
15274 -2457317 -3088989 -3679890 -4394611 -5330866 -6475237 -7723430 -8967036 -10169166 -11350202
15265 -11350202 -12503647 -13521549 -14182289 -14220304 -13458154 -11915535 -9804429 -7417199 -5005499
15256 -5005499 -2728536 -665653 1149487 2697935 3960137 4925637 5612365 6064452 6324304
15247 6324304 6401837 6259606 5819490 4988008 3699968 1979145 -19260 -2037860 -3811313
15238 -3811313 -5155824 -6019298 -6514367 -6921073 -7594687 -8778211 -10441634 -12278997 -13860670
15229 -13860670 -14814007 -14919106 -14113952 -12471757 -10189790 -7566872 -4934157 -2559101
15221 -2559101 -586691 942442 2024362 2643545 2785058 2491069 1915276 1323244 1014096
15212 1014096 1205327 1957552 3177763 4685059 6290310 7829393 9134649 9999780 10189908
15203 10189908 9490920 7771687 5045981 1513650 -2459622 -6448140 -10122610 -13369291
15195 -13369291 -16297035 -19139600 -22123848 -25368171 -28846139 -32416173 -35882612 -39057057
15187 -39057057 -41809382 -44084173 -45859013 -47081165 -47662054 -47546953 -46778044 -45477506
15179 -45477506 -43781341 -41805782 -39661933 -37453155 -35223162 -32920042 -30439070 -27702393
15171 -27702393 -24692396 -21434085 -17978199 -14396243 -10769368 -7180172 -3727980 -565640
15163 -565640 2073922 3904569 4675807 4271544 2741375 237901 -3064422 -6964649 -11162353
15154 -11162353 -15242163 -18765234 -21384006 -22902972 -23291200 -22667417 -21258155 -19349997
15146 -19349997 -17262661 -15326441 -13830451 -12954110 -12741752 -13147352 -14094536 -15489714 -17201791
15137 -17201791 -19072099 -20977971 -22890386 -24854928 -26908969 -29017381 -31083447 -33017447
15129 -33017447 -34806272 -36531443 -38304560 -40145266 -41897751 -43272540 -43991185 -43919585
15121 -43919585 -43101437 -41702364 -39927286 -37948824 -35859108 -33660862 -31304129 -28746161
15113 -28746161 -26002480 -23175576 -20457612 -18101128 -16363263 -15442236 -15427800 -16283245 -17854471
15104 -17854471 -19886110 -22046731 -23983799 -25402757 -26133765 -26159854 -25604472 -24686116 -23652564
15095 -23652564 -22713118 -21999190 -21575342 -21467098 -21642437 -21946387 -22066623 -21599232 -20202790
15086 -20202790 -17760944 -14462295 -10748376 -7154903 -4132749 -1936213 -608048 -27440
15078 -27440 19046 -242692 -642532 -1092134 -1573607 -2127683 -2855744 -3902890 -5397474 -7385013
15068 -7385013 -9805959 -12509718 -15276363 -17853145 -20021385 -21672039 -22839922 -23657424
15060 -23657424 -24235133 -24538437 -24354902 -23395116 -21469208 -18608813 -15037634 -11035989 -6843841
15051 -6843841 -2666805 1291215 4851825 7915939 10460334 12456670 13791315 14270893
15043 14270893 13721118 12103627 9556571 6335771 2719139 -1050081 -4760743 -8213945
15035 -8213945 -11229784 -13668584 -15433255 -16460747 -16732235 -16297629 -15280211 -13845525
15027 -13845525 -12155062 -10334529 -8467698 -6611643 -4824345 -3191328 -1839805 -928925
15019 -928925 -603648 -928125 -1847666 -3211066 -4840152 -6609356 -8491428 -10537265 -12794334
15010 -12794334 -15207040 -17563591 -19532758 -20772340 -21049037 -20321312 -18771552 -16779981
15002 -16779981 -14820266 -13292073 -12374783 -11993166 -11902598 -11813404 -11468650 -10655701 -9198281
14993 -9198281 -6988210 -4053430 -593875 3056054 6510665 9421364 11553143 12830109
14985 12830109 13318231 13141347 12388143 11094459 9326763 7291850 5362524 3984765
14977 3984765 3529679 4167122 5794935 8047247 10413601 12444473 13916833 14829295 15246782
14968 15246782 15153998 14437195 12976603 10760980 7940504 4779846 1552054 -1544767
14960 -1544767 -4408837 -7010272 -9350557 -11424577 -13182251 -14493134 -15160745 -15022998
14952 -15022998 -14079282 -12530413 -10692446 -8855289 -7179253 -5670192 -4222265 -2690713
14944 -2690713 -953873 1057548 3363343 5955886 8814774 11888239 15055218 18116001
14936 18116001 20834600 23001698 24478926 25222193 25288051 24803248 23891873 22598685 20863723
14927 20863723 18575406 15676536 12258066 8586265 5049811 2043184 -166341 -1516419
14919 -1516419 -2132311 -2236460 -2038442 -1662247 -1141630 -455597 451324 1675277 3344650
14910 3344650 5561202 8305990 11376019 14420264 17069824 19066287 20295024 20722812
14902 20722812 20308332 18951823 16519047 12931842 8266819 2790870 -3087153 -8903866
14894 -8903866 -14217207 -18656047 -21945642 -23921253 -24542163 -23886182 -22104417 -19373107
14886 -19373107 -15898394 -11962244 -7935232 -4217009 -1149625 1033947 2217042 2386315
14878 2386315 1613276 37571 -2141764 -4673016 -7271071 -9657580 -11607607 -12968190
14870 -12968190 -13639997 -13560517 -12718135 -11170488 -9027821 -6417396 -3475983 -366157 2735144
14861 2735144 5693288 8471054 11117127 13668935 16025853 17888640 18828297 18466342
14853 18466342 16673066 13661873 9909958 5958343 2225655 -1071628 -3897912 -6330781
14845 -6330781 -8485153 -10454332 -12297769 -14068463 -15820466 -17556741 -19150219 -20310680
14837 -20310680 -20650105 -19829351 -17698817 -14363060 -10173046 -5662227 -1417566 2093166
14829 2093166 4656325 6323593 7286612 7702750 7599469 6909778 5578496 3648958 1288739
14820 1288739 -1237578 -3628198 -5622308 -7067664 -7934177 -8275504 -8197313 -7861332 -7481683
14811 -7481683 -7265913 -7319870 -7590719 -7901600 -8057857 -7949706 -7566065 -6890208 -5769523
14802 -5769523 -3911050 -1039744 2911096 7718291 12913292 17903108 22140132 25298702
14794 25298702 27358018 28523402 29050323 29102280 28709349 27808289 26317695 24210815 21563233
14785 21563233 18564202 15490636 12660661 10388953 8949264 8540343 9249601 11012993
14777 11012993 13596141 16627928 19678258 22348163 24351918 25578177 26107886 26159760
14769 26159760 25964712 25631184 25086385 24132581 22585081 20414628 17818749 15178533 12912654
14760 12912654 11310013 10449220 10250879 10593366 11368265 12441339 13614731 14676878 15495934
14751 15495934 16050691 16376912 16508211 16488488 16438756 16581173 17157372 18294956 19939029
14742 19939029 21898506 23937983 25826385 27343404 28296509 28555743 28064775 26810385
14734 26810385 24793177 22041812 18638363 14696053 10308728 5549482 533647 -4527619
14726 -4527619 -9345430 -13625566 -17135119 -19733583 -21384486 -22157807 -22210284 -21746706 -20984905
14717 -20984905 -20129592 -19338151 -18681856 -18146095 -17690930 -17308302 -17000627 -16715618 -16337917
14708 -16337917 -15752244 -14889532 -13700196 -12109012 -10027454 -7421968 -4378372 -1102787
14700 -1102787 2155762 5202740 7933114 10292741 12230671 13695605 14666293 15170523
14692 15170523 15263959 14981868 14303217 13158405 11487257 9322344 6842267 4348573 2170512
14683 2170512 541106 -507854 -1185696 -1873685 -2943216 -4540137 -6468517 -8258400
14675 -8258400 -9378780 -9470139 -8479905 -6658492 -4451048 -2349280 -746368 177944 503634
14666 503634 522092 618455 1139740 2289137 4073108 6324419 8792977 11247349 13523265
14657 13523265 15511895 17140131 18378677 19247353 19777948 19961373 19739062 19042349 17835255
14648 17835255 16143703 14074377 11801489 9517576 7395780 5590556 4239344 3421649
14640 3421649 3087403 3011977 2828110 2139696 670357 -1630949 -4581895 -7843624 -11027140
14631 -11027140 -13789343 -15905416 -17306338 -18075299 -18413297 -18579186 -18811672 -19271410 -20028141
14622 -20028141 -21060213 -22233880 -23292751 -23914505 -23833865 -22949373 -21328135 -19112433 -16419509
14613 -16419509 -13318812 -9877341 -6193913 -2380169 1472726 5286982 8955469 12315269
14605 12315269 15161266 17274411 18450982 18557063 17604865 15791062 13450674 10948365
14597 10948365 8574978 6503974 4808244 3498480 2551042 1921771 1554226 1376711 1275901
14588 1275901 1059246 442249 -906159 -3251986 -6660946 -10928626 -15626631 -20209532
14580 -20209532 -24099995 -26759701 -27803605 -27131171 -24966809 -21761299 -18027230 -14214753
14572 -14214753 -10668034 -7631579 -5262589 -3630495 -2710920 -2394638 -2515324 -2872695 -3233913
14563 -3233913 -3327346 -2859243 -1573987 647215 3693258 7208700 10699416 13711326 15975441
14554 15975441 17447386 18253131 18595216 18661305 18560483 18315880 17920064 17398890 16818207
14545 16818207 16243183 15710745 15243235 14886834 14734147 14889265 15387312 16136558 16929741
14536 16929741 17515531 17694777 17398958 16717026 15865838 15120423 14725258 14819247 15409510
14527 15409510 16404340 17678175 19114525 20596520 21973428 23048549 23602314 23435665
14519 23435665 22418494 20540678 17948002 14922132 11797887 8859041 6244189 3886300
14511 3886300 1539593 -1071824 -4045862 -7169707 -9961893 -11868924 -12491641 -11713082
14503 -11713082 -9685836 -6723005 -3164523 722464 4777348 8919548 13092052 17196071
14495 17196071 21038609 24336897 26799935 28241296 28643549 28129230 26872754 25037461
14487 25037461 22777913 20268952 17710140 15289271 13123091 11216737 9476133 7770835
14479 7770835 6011190 4199582 2433519 863465 -364826 -1150192 -1455057 -1328173 -935217
14470 -935217 -553017 -495739 -1012965 -2224935 -4118331 -6582091 -9443315 -12477339 -15411802
14461 -15411802 -17966865 -19933601 -21235066 -21921695 -22124018 -22016371 -21794826 -21636413 -21636436
14452 -21636436 -21755692 -21815235 -21559233 -20765824 -19360514 -17497387 -15566258 -14072085 -13409210
14443 -13409210 -13668011 -14605652 -15784959 -16780749 -17339247 -17418733 -17109396 -16507833 -15656976
14434 -15656976 -14597990 -13455414 -12437261 -11733554 -11410424 -11388726 -11496383 -11530524 -11304449
14425 -11304449 -10692830 -9672705 -8335207 -6847654 -5369845 -3965331 -2567956 -1031904
14417 -1031904 766652 2842352 5080142 7284516 9256289 10858754 12066582 12989323
14409 12989323 13845622 14884778 16283314 18050588 19985161 21725538 22887140 23209444
14401 23209444 22635431 21293427 19395437 17109572 14496416 11561774 8370408 5104047
14393 5104047 2015480 -663453 -2784842 -4300293 -5252699 -5763053 -6006572 -6166193 -6379001
14384 -6379001 -6714047 -7199324 -7874476 -8822376 -10149104 -11935175 -14201913 -16889691 -19824250
14375 -19824250 -22699620 -25128687 -26756300 -27378024 -27013666 -25915826 -24516461 -23324809
14367 -23324809 -22798287 -23223085 -24646059 -26873426 -29521189 -32106061 -34174067 -35433318
14359 -35433318 -35824101 -35485097 -34641002 -33484919 -32133329 -30679139 -29277551 -28164909
14351 -28164909 -27586481 -27697081 -28495044 -29798339 -31260384 -32448369 -32991688 -32732595 -31773540
14342 -31773540 -30386027 -28853872 -27358167 -25953711 -24619758 -23346400 -22205244 -21345634
14334 -21345634 -20903476 -20886270 -21132331 -21394572 -21491755 -21400660 -21215733 -21020769 -20775359 -20292405
14324 -20292405 -19326887 -17726915 -15532644 -12941896 -10196022 -7499271 -5005676 -2833762
14316 -2833762 -1073591 224214 1072646 1563276 1835082 1979832 1926917 1401775 21479
14307 21479 -2518725 -6287264 -11070809 -16444185 -21904066 -27001638 -31426210 -35021311
14299 -35021311 -37742857 -39594278 -40579443 -40688571 -39912235 -38276694 -35878504 -32892583
14291 -32892583 -29565595 -26216481 -23213819 -20888809 -19418045 -18758148 -18672989 -18839189 -18985910
14282 -18985910 -19001497 -18948486 -18978635 -19191022 -19512079 -19678202 -19348961 -18294192 -16534165
14273 -16534165 -14330749 -12034142 -9901658 -8021769 -6375209 -4943893 -3764877 -2907825
14265 -2907825 -2409103 -2196115 -2042535 -1604239 -544046 1321499 3945877 7086438 10413741
14256 10413741 13624033 16498521 18912361 20838188 22361142 23670317 24995975 26516362
14248 26516362 28289024 30239059 32193339 33927468 35211798 35876485 35900743 35465586 34897029
14239 34897029 34518865 34517536 34895143 35507974 36149426 36630453 36813150 36591248 35863726 34540991
14229 34540991 32574670 29983290 26856019 23338871 19632192 16007108 12798866 10346954
14221 10346954 8915001 8639118 9502596 11309300 13672237 16068822 17980828 19067267
14213 19067267 19275469 18824886 18073814 17339408 16762893 16290497 15778312 15149563 14488207
14204 14488207 14003916 13920859 14393224 15490398 17230961 19628009 22698135 26407189 30596002
14195 30596002 34959665 39104165 42649579 45328935 47033013 47779639 47642921 46719384
14187 46719384 45161592 43204999 41097521 38951716 36645325 33881843 30391255 26125047
14179 26125047 21310935 16354985 11677908 7580021 4182719 1449977 -737533 -2501231
14171 -2501231 -3919475 -5039906 -5933506 -6743369 -7685050 -8989476 -10813487 -13157559 -15828410
14162 -15828410 -18475076 -20693041 -22135230 -22559974 -21816467 -19841564 -16719308 -12749949
14154 -12749949 -8427463 -4306932 -851530 1639280 3012122 3236935 2436807 918021
14146 918021 -891325 -2595641 -3971035 -4989947 -5744923 -6360045 -6936713 -7517427 -8065584
14137 -8065584 -8487262 -8690551 -8638251 -8358691 -7920447 -7405873 -6904159 -6501515 -6234388 -6020314
14127 -6020314 -5635560 -4791834 -3278087 -1071457 1648044 4572540 7384878 9862743
14119 9862743 11920029 13574627 14866441 15773840 16182805 15925137 14862075 12970808 10374101
14110 10374101 7289740 3962404 643852 -2402725 -4933322 -6787235 -7934647 -8471811
14102 -8471811 -8571466 -8433190 -8264797 -8273979 -8642835 -9491851 -10847923 -12626475 -14645087
14093 -14645087 -16671404 -18467103 -19794119 -20420443 -20186334 -19099264 -17351501 -15226708
14085 -15226708 -12977533 -10759228 -8620617 -6511618 -4305905 -1867579 854998 3772298
14077 3772298 6672241 9294137 11409619 12878643 13677824 13904061 13745614 13415563 13068224
14068 13068224 12746822 12399782 11953009 11391328 10803234 10356628 10215999 10471604 11137317
14059 11137317 12188808 13579129 15217045 16939072 18501536 19610788 20008883 19585953
14051 19585953 18438189 16819950 15017825 13218417 11440503 9567195 7449520 5017426
14043 5017426 2350311 -327615 -2736647 -4657815 -5991712 -6736703 -6940391 -6692828 -6164852
14034 -6164852 -5621798 -5363506 -5622826 -6478967 -7812516 -9320382 -10608642 -11341529 -11371621
14025 -11371621 -10777563 -9801489 -8738265 -7827692 -7173123 -6710831 -6258570 -5622982 -4688114
14016 -4688114 -3431383 -1889990 -121432 1832844 3973400 6326776 8881785 11528953
14008 11528953 14056557 16203942 17735180 18501905 18478940 17761759 16530302 14995460 13339602
13999 13339602 11669265 10008216 8341986 6696723 5215008 4166157 3841228 4385602
13991 4385602 5705087 7520416 9519822 11502385 13430361 15380693 17461603 19767606
13983 19767606 22374815 25327493 28591894 32008414 35303730 38189661 40485703 42159700
13975 42159700 43256108 43787827 43686269 42837332 41155436 38635033 35367180 31547132
13967 31547132 27487452 23610517 20382419 18194441 17251563 17537029 18862684 20936798
13959 20936798 23398100 25852797 27960040 29522223 30488146 30853725 30564016 29528823
13951 29528823 27740968 25377744 22787915 20371093 18424341 17031961 16051862 15205271
13943 15205271 14207291 12859854 11092393 8978441 6723126 4588513 2773919 1337671
13935 1337671 223509 -655241 -1376508 -2037600 -2776896 -3742821 -5039886 -6685886 -8591730
13926 -8591730 -10583309 -12476251 -14167974 -15681877 -17127596 -18610251 -20163510 -21746863
13918 -21746863 -23275606 -24641742 -25738199 -26502852 -26950101 -27159119 -27225677 -27199310 -27041336
13909 -27041336 -26649352 -25945440 -24950970 -23775784 -22533489 -21256701 -19875770 -18270805
13901 -18270805 -16349477 -14077792 -11440270 -8388706 -4842986 -740175 3909728 8993245
13893 8993245 14300210 19560375 24488472 28820487 32336927 34878288 36368825 36857789
13885 36857789 36549460 35773795 34880176 34088210 33376419 32491295 31076857 28839824 25670278
13876 25670278 21679071 17145136 12413923 7815929 3641077 148802 -2434312 -3951614
13868 -3951614 -4360062 -3746199 -2310018 -324028 1921186 4165850 6221231 8004171
13860 8004171 9540791 10916118 12194766 13368169 14361015 15078530 15446844 15417124 14955846
13851 14955846 14065533 12827936 11406294 9980227 8675168 7564035 6735124 6343092
13843 6343092 6582429 7606166 9455162 12039650 15169486 18596406 22038192 25198238
13835 25198238 27807901 29680227 30740261 31017063 30610576 29672094 28425294 27180257
13827 27180257 26270981 25941082 26264142 27134810 28317105 29534700 30561228 31238633 31412012
13818 31412012 30871288 29390881 26851028 23338170 19140487 14642420 10189037 5991008
13810 5991008 2104658 -1513810 -4915941 -8094143 -10985509 -13533813 -15758846 -17780583
13802 -17780583 -19772392 -21867413 -24084059 -26326628 -28457403 -30389360 -32145496 -33847921
13794 -33847921 -35632676 -37538312 -39443510 -41088081 -42149335 -42339340 -41503220 -39671855
13786 -39671855 -37021743 -33773279 -30111574 -26168847 -22042138 -17808406 -13533060 -9296216
13778 -9296216 -5232316 -1538861 1563305 3893294 5371056 6044947 6056768 5571984 4740737
13769 4740737 3705090 2614318 1621448 862437 434124 392429 771908 1601089 2901964
13760 2901964 4688704 6960220 9658734 12620142 15592156 18324777 20646126 22481695
13752 22481695 23864573 24953253 25999201 27241453 28800209 30657576 32731003 34962790
13744 34962790 37348771 39893231 42546112 45191041 47690192 49931199 51841966 53397293
13736 53397293 54633218 55631453 56450926 57058942 57335507 57155568 56470458 55306668 53693496
13727 53693496 51614489 49043898 46026269 42719728 39387381 36371787 34048901 32728097
13719 32728097 32520435 33256747 34517891 35768192 36525559 36491933 35602615 33999279 31955332
13710 31955332 29788635 27797782 26236709 25310682 25174776 25922875 27555465 29945679
13702 29945679 32852591 35992431 39115930 42042737 44658892 46907239 48777847 50283656
13694 50283656 51419725 52143204 52416846 52301183 52021342 51940736 52439970 53772657 55981840
13685 55981840 58892702 62134143 65167641 67364490 68156675 67205346 64504913 60387268
13677 60387268 55432822 50314768 45623905 41733058 38739444 36490333 34681173 32996201
13669 32996201 31227328 29306552 27252610 25102259 22888875 20660893 18487969 16421519
13661 16421519 14432002 12393287 10156645 7662064 5007121 2460037 427967 -643495
13653 -643495 -437432 1094645 3732769 7127049 10955095 14989091 19068369 23046262
13645 23046262 26766498 30073331 32836898 34980810 36491958 37392805 37703902 37452746
13637 37452746 36732787 35748306 34773143 34016002 33483306 32952482 32073076 30519545 28116549
13628 28116549 24902892 21133236 17223581 13643401 10776698 8811439 7722160 7359982
13620 7359982 7580644 8301010 9446894 10877729 12400611 13878724 15320110 16847772
13612 16847772 18591549 20621469 22951365 25530209 28179488 30554733 32227688 32874741
13604 32874741 32444597 31183813 29516399 27879495 26606629 25867711 25652800 25825527 26243566
13595 26243566 26860607 27731424 28940850 30537551 32516613 34826123 37366577 40000365
13587 40000365 42596204 45085297 47475081 49800263 52057292 54182188 56080752 57676378
13579 57676378 58934995 59849651 60406426 60573212 60331397 59733559 58943898 58216973 57808521
13570 57808521 57867628 58379040 59184106 60061866 60835839 61456083 62006288 62635670 63461431
13561 63461431 64487898 65577170 66496019 67024562 67048613 66559850 65585959 64137859 62216354
13552 62216354 59854717 57166917 54385834 51856822 49955328 48973196 49067994 50304021
13544 50304021 52714450 56305769 61000619 66578642 72680238 78884014 84794803 90076189
13536 90076189 94441446 97674633 99720460 100791019 101373266 102071817 103362995 105405291
13528 105405291 107987847 110612540 112662789 113593616 113077987 111066368 107753908 103494075
13520 103494075 98715996 93873545 89417813 85777398 83324920 82300938 82710217 84266283
13512 84266283 86447304 88648215 90350812 91237143 91220650 90407422 89016733 87304325 85525825
13503 85525825 83942046 82832182 82471607 83065327 84680596 87229239 90503539 94228524
13495 94228524 98104925 101849045 105227720 108068192 110254252 111748267 112637534 113151568
13487 113151568 113606871 114294793 115379138 116859656 118599614 120388795 122033110 123454560
13479 123454560 124743816 126122901 127851350 130141814 133115793 136788653 141067131 145768307
13471 145768307 150677289 155616506 160473136 165181841 169706889 174048186 178256251 182435265
13463 182435265 186731328 191301784 196262432 201641722 207380903 213381304 219563982 225908645
13455 225908645 232463594 239335553 246662693 254567485 263101765 272205684 281692440 291269258
13447 291269258 300603365 309412855 317527918 324888929 331513309 337479399 342933451 348091287
13439 348091287 353200344 358459518 363948500 369620699 375351321 380990394 386389751 391401303
13431 391401303 395856124 399554593 402299006 403948134 404440564 403775454 401978753 399072090
13423 399072090 395054117 389909787 383645531 376321141 368052851 358996096 349344626 339362983
13415 339362983 329401103 319822206 310875237 302624787 294983471 287793443 280903918 274220799
13407 274220799 267713939 261389684 255251301 249266704 243367011 237491195 231647021 225928803
13399 225928803 220475742 215414096 210818993 206696007 202977793 199532589 196177620 192707690
13391 192707690 188953112 184834153 180356909 175553735 170439075 165041371 159478683 153976365
13383 153976365 148790487 144116341 140049178 136567649 133510549 130592480 127503257 124052454
13375 124052454 120257210 116300819 112399404 108696442 105260168 102150084 99478538 97425091
13367 97425091 96192424 95912414 96549486 97873361 99529042 101150773 102435975 103147540
13359 103147540 103089420 102119767 100217284 97552825 94497867 91537975 89112898 87452696
13351 87452696 86512244 86062133 85865337 85791833 85803198 85873940 85940541 85892156 85571086 84784118
13341 84784118 83350435 81174534 78294604 74861946 71052106 66968726 62613525 57944767
13333 57944767 52982350 47881122 42913005 38370943 34463228 31251574 28647842 26470048
13325 26470048 24537519 22755494 21147189 19829842 18960836 18687841 19118077 20294800
13317 20294800 22176092 24640631 27540416 30774543 34323327 38207769 42409995 46830680
13309 46830680 51318661 55724278 59908837 63722434 67015413 69687094 71705577 73067909
13301 73067909 73755390 73753076 73129514 72100721 71010323 70227936 70019422 70453821 71396612
13292 71396612 72580389 73686937 74395811 74412473 73503533 71547463 68584396 64822183 60567988
13283 60567988 56125216 51743559 47653075 44106593 41342737 39488669 38503544 38220054
13275 38220054 38446285 39052754 39992444 41251188 42780032 44468511 46172084 47769382
13267 47769382 49206757 50482301 51574017 52390668 52805302 52741864 52243181 51475705 50669639
13258 50669639 50026743 49648102 49527307 49605538 49830996 50171908 50585111 50974858 51177949
13249 51177949 50997054 50265707 48897658 46895233 44332328 41335304 38065329 34697913
13241 34697913 31411738 28396788 25858627 23988403 22908122 22624984 23009188 23797658
13233 23797658 24640794 25205668 25305693 24978938 24438828 23902487 23413192 22798353 21795114
13224 21795114 20235318 18160060 15825232 13623773 11950367 11046619 10899895 11266256
13216 11266256 11813543 12288690 12610963 12874714 13292483 14099895 15457205 17400632 19857689
13207 19857689 22690994 25732604 28796532 31675707 34132933 35897583 36691436 36306414
13199 36306414 34712235 32113225 28886535 25433362 22054916 18930147 16167038 13846926
13191 13846926 12020105 10678922 9758752 9177079 8873785 8823206 9022258 9463198 10101639
13182 10101639 10849419 11598571 12236026 12633856 12657457 12211143 11278089 9918791 8248695
13173 8248695 6429950 4667026 3171773 2105070 1538288 1457788 1798615 2477898 3406485
13164 3406485 4479369 5571356 6568328 7419380 8147008 8788575 9335294 9748536 10026206
13155 10026206 10214640 10347387 10417579 10449841 10584400 11053428 12050499 13589671 15444612
13146 15444612 17205529 18428582 18800944 18238484 16875519 14965419 12761292 10464494
13138 10464494 8272520 6444369 5263048 4890832 5249953 6042170 6882907 7450182 7587148
13129 7587148 7339178 6907848 6533734 6372671 6424452 6527311 6410174 5781096 4419601
13120 4419601 2250975 -618472 -3924278 -7308740 -10395216 -12857507 -14468805 -15119165
13112 -15119165 -14827005 -13763934 -12254154 -10702035 -9466350 -8752551 -8581298 -8827306 -9275597
13103 -9275597 -9662845 -9717361 -9214547 -8025716 -6121716 -3532226 -308019 3471871 7656422
13094 7656422 11990311 16131978 19718088 22440774 24104902 24651296 24153206 22794865
13086 22794865 20834417 18558363 16237323 14092119 12274507 10861727 9873659 9316867
13078 9316867 9219124 9609907 10464767 11676250 13079504 14496609 15748272 16641885 17004167
13069 17004167 16779748 16105023 15252636 14470540 13851161 13322996 12726121 11882135 10637202
13060 10637202 8911106 6741515 4271623 1681116 -874910 -3274913 -5408106 -7159110
13052 -7159110 -8406908 -9028148 -8913800 -8007788 -6348168 -4078545 -1411010 1440323 4299618
13043 4299618 7008374 9374700 11158003 12121453 12129648 11238259 9717621 7985927 6492617
13034 6492617 5611706 5560269 6339424 7730590 9379062 10930988 12142089 12904172 13203671
13025 13203671 13066936 12526495 11595910 10238011 8350450 5799157 2484376 -1614722
13017 -1614722 -6447320 -11919696 -17897276 -24174250 -30446282 -36326204 -41417354 -45414973
13009 -45414973 -48178663 -49742989 -50273157 -49989992 -49099564 -47766422 -46136082 -44367473
13001 -44367473 -42634250 -41085526 -39789981 -38713199 -37758989 -36835589 -35876497 -34804098
12993 -34804098 -33494613 -31807374 -29675782 -27178514 -24511479 -21872883 -19349334 -16880258
12985 -16880258 -14309996 -11480410 -8315492 -4874395 -1360170 1922823 4661382 6654970
12977 6654970 7903201 8584964 8934465 9111459 9152763 9011505 8638341 8054499 7378891
12968 7378891 6798061 6512563 6704721 7518447 9009397 11077041 13448890 15763869 17718251
12959 17718251 19189848 20281726 21269401 22474183 24132590 26337657 29060617 32198024
12951 32198024 35600753 39087592 42458471 45506635 48024957 49814653 50710964 50627787
12943 50627787 49606282 47840003 45649379 43396301 41358457 39621855 38064706 36457352
12935 36457352 34613734 32491430 30209267 28026359 26292600 25342701 25361162 26301251 27909627
12926 27909627 29832692 31740498 33412181 34754381 35766880 36504781 37064689 37575964
12918 37575964 38174741 38964437 39981356 41185296 42485050 43795798 45117747 46593827
12910 46593827 48470859 50944176 53981195 57253021 60223337 62346796 63276710 62972470
12902 62972470 61651524 59647381 57296183 54903586 52747537 51056351 49948391 49380314
12894 49380314 49167733 49071495 48871827 48393799 47517947 46193349 44429868 42265253 39739517
12885 39739517 36904758 33866449 30817790 28016588 25703709 24028574 23036602 22703726
12877 22703726 22962408 23688934 24678873 25657077 26336424 26505278 26107904 25276335 24293984
12868 24293984 23515349 23271368 23762922 24963473 26592760 28199802 29324764 29661898 29143711
12859 29143711 27918391 26259779 24463772 22755525 21226787 19837692 18491566 17141711
12851 17141711 15866351 14858931 14333001 14414106 15102837 16314570 17931802 19823311 21835483
12842 21835483 23777514 25419831 26517224 26844069 26229256 24603220 22052040 18837584
12834 18837584 15354468 12037131 9261860 7285043 6232712 6139660 7015044 8884691
12826 8884691 11775386 15652373 20346844 25527128 30769525 35711885 40174897 44160162
12818 44160162 47766466 51122743 54365865 57621661 60967475 64420567 67995985 71786612
12810 71786612 75970824 80729589 86151197 92203930 98771714 105684881 112721293 119614516
12802 119614516 126085973 131880276 136788835 140662574 143423022 145093378 145853885 146067246
12794 146067246 146212071 146740987 147943413 149888675 152476145 155544530 158947764 162544691
12786 162544691 166130230 169384370 171916124 173410198 173774482 173173873 171941698 170442942
12778 170442942 168954519 167588787 166274165 164807360 162958885 160562367 157530728 153821467
12770 153821467 149415063 144336997 138706631 132771472 126885153 121421572 116659554 112690141
12762 112690141 109391384 106480653 103615161 100505803 97011438 93163775 89096109 84927586
12754 84927586 80693519 76365109 71929856 67462349 63120889 59067723 55388725 52090696
12746 52090696 49166162 46641899 44556968 42903178 41599314 40525730 39579203 38702459
12738 38702459 37889690 37186502 36676943 36437918 36462142 36582456 36456126 35658072 33857801
12729 33857801 30971724 27191237 22898752 18578222 14774022 12028974 10746217 11049355
12721 11049355 12748590 15429723 18612717 21913235 25133769 28232302 31204068 33989346
12713 33989346 36479200 38576395 40223374 41374211 41957010 41862170 40955154 39111940 36276881
12704 36276881 32524188 28101690 23436710 19063442 15455823 12844889 11143524 10024571
12696 10024571 9086504 8000195 6584878 4835826 2929347 1194405 49225 -78883
12688 -78883 1147409 3865857 7957642 13092838 18847625 24831349 30779749 36578428
12680 36578428 42207049 47649090 52834287 57644585 61960051 65701084 68839232 71369887
12672 71369887 73268126 74479564 74981465 74870089 74378792 73797549 73365986 73211671 73340044
12663 73340044 73652741 73977601 74110331 73879778 73222455 72204253 70946779 69515002 67872144
12654 67872144 65934292 63663467 61122778 58456867 55810030 53240274 50702191 48114966
12646 48114966 45440353 42690562 39883356 37018104 34097096 31160415 28307315 25691060
12638 25691060 23475256 21766698 20578368 19859403 19555881 19639345 20102528 20964174 22281373
12629 22281373 24136901 26603835 29713281 33430416 37622815 42022925 46229385 49788993
12621 49788993 52330459 53668965 53831836 53019207 51535342 49703635 47766245 45805912
12613 45805912 43758222 41522868 39081678 36527048 34002301 31630373 29492099 27648710
12605 27648710 26155850 25043047 24294903 23866836 23713036 23793763 24060952 24440608 24822575
12596 24822575 25051622 24929993 24271773 23012815 21295920 19444829 17842125 16808592
12588 16808592 16546568 17126936 18485527 20433790 22695398 24961337 26961250 28547775
12580 28547775 29740785 30669292 31451073 32121425 32647422 32969344 33024528 32765677 32182467
12571 32182467 31304471 30181315 28875924 27497751 26249516 25428104 25350193 26231633 28079255
12562 28079255 30657759 33577608 36467643 39102586 41398294 43333069 44902234 46122732
12554 46122732 47030614 47648746 47965179 47960850 47671083 47226874 46833905 46698209 46952121 47624900
12544 47624900 48651963 49892296 51154008 52250690 53074441 53630259 53998009 54252680 54406750
12535 54406750 54412631 54218545 53838445 53374942 52946848 52556873 52020827 51037806 49347168
12526 49347168 46857113 43682508 40096080 36430508 32983021 29958942 27462242 25520928
12518 25520928 24108184 23123320 22356300 21496884 20207815 18221210 15410248 11819005
12510 11819005 7647368 3192448 -1223598 -5293255 -8727321 -11264871 -12703980 -12915235
12502 -12915235 -11817946 -9359202 -5549182 -552247 5239656 11246010 16866010 21672496
12494 21672496 25507623 28461467 30792273 32826026 34850650 37033794 39392823 41825371
12486 41825371 44183097 46338570 48197839 49677560 50699762 51203931 51138810 50441548 49050338
12477 49050338 46950676 44207583 40968379 37456638 33956644 30768518 28143017 26237667
12469 26237667 25117199 24773085 25126351 26014098 27185587 28328637 29138788 29411331 29090323
12460 29090323 28238765 26976464 25446615 23816354 22280102 21048409 20321838 20242424 20832307
12451 20832307 21973058 23462931 25110392 26786029 28406807 29891677 31124590 31929011
12443 31929011 32070252 31323600 29602481 27055684 24036750 20963219 18174552 15865516
12435 15865516 14093301 12813554 11916046 11268920 10767225 10351707 10002800 9751154 9696688
12426 9696688 9981524 10705255 11842391 13225691 14591729 15638702 16090450 15799160 14842990
12417 14842990 13511960 12170555 11117892 10557575 10654877 11563759 13356732 15916249 18902871
12408 18902871 21846392 24309743 26050125 27107692 27757207 28326258 28993427 29701379 30224104
12399 30224104 30318393 29856367 28871696 27515163 25973582 24416128 22984841 21796063 20919051
12390 20919051 20344031 19989312 19757989 19575762 19357657 18958635 18197674 16964861 15329392
12381 15329392 13552139 11989042 10964819 10698180 11295245 12777619 15099814 18138235
12373 18138235 21683088 25478891 29314349 33101430 36878971 40748070 44805726 49113163
12365 49113163 53672280 58385780 63041012 67380025 71235775 74616722 77652050 80445967
12357 80445967 82969172 85065083 86540669 87256486 87162152 86281860 84679445 82430677 79627652
12348 79627652 76418823 73041541 69791242 66933125 64631623 62958275 61952856 61652723
12340 61652723 62040717 62964310 64138128 65273831 66244388 67146679 68232410 69787949 72030018
12331 72030018 75026829 78656577 82628097 86558513 90069462 92869307 94807975 95884245
12323 95884245 96195164 95876824 95102433 94120244 93251148 92818092 93055684 94052288 95746818
12314 95746818 97991910 100669045 103779189 107433051 111765960 116864878 122748385 129382749
12306 129382749 136702677 144608287 152940854 161475451 169949355 178101802 185699856 192555112
12298 192555112 198545074 203634645 207890599 211507197 214844859 218420077 222785137 228332167
12290 228332167 235140201 242962938 251346894 259785544 267836027 275194024 281741669 287566223
12282 287566223 292932697 298184760 303584914 309182654 314807896 320177843 325009137 329072920
12274 329072920 332229646 334485716 336044551 337284482 338639232 340438655 342798566 345610972
12266 345610972 348627038 351583207 354305970 356740188 358892832 360760584 362329575 363649720
12258 363649720 364894036 366321900 368155763 370463920 373131630 375913386 378509339 380630822
12250 380630822 382041216 382571194 382128713 380709337 378383087 375259067 371464475 367147923
12242 367147923 362478633 357634846 352808850 348226757 344133083 340713755 338008517 335891627
12234 335891627 334139336 332528849 330902625 329170573 327265340 325100772 322580260 319640566
12226 319640566 316276041 312523631 308434420 304057257 299443116 294657059 289767816 284814646
12218 284814646 279789305 274649133 269343187 263847852 258212307 252571511 247083650 241824794
12210 241824794 236724815 231589866 226192625 220390776 214227487 207959976 201998309 196789842
12202 196789842 192688816 189839895 188120979 187176417 186514385 185626406 184115933 181815243
12194 181815243 178831133 175476916 172132920 169124108 166649471 164740628 163253373 161928648
12186 161928648 160511988 158855502 156945079 154864314 152740787 150706501 148869057 147279030
12178 147279030 145912891 144710482 143653146 142798410 142216122 141891112 141700872 141481076 141108866
12169 141108866 140556788 139907463 139310586 138878012 138575687 138200257 137472495 136186135 134309925
12160 134309925 131984205 129425693 126806198 124180712 121500733 118695730 115771508 112862420
12152 112862420 110197241 107995117 106353759 105188209 104244123 103176518 101652463 99428585
12144 99428585 96389486 92558901 88089991 83241617 78346879 73759307 69763786 66482201
12136 66482201 63834478 61603959 59594015 57766786 56239175 55136267 54436809 53938911
12128 53938911 53356301 52464533 51205495 49696183 48153439 46804509 45846154 45450261 45761901
12119 45761901 46846995 48613628 50777879 52917076 54596437 55509034 55545538 54758488 53282301
12110 53282301 51289660 48994939 46669958 44644888 43275476 42874994 43638251 45585091
12102 45585091 48538456 52161523 56070961 59989778 63850438 67771006 71917844 76352112
12094 76352112 80943203 85373715 89229220 92132027 93850467 94338805 93706054 92152547
12086 92152547 89938456 87393696 84896483 82787816 81291767 80509000 80464177 81130432 82382606
12077 82382606 83930263 85332125 86120102 85962322 84768703 82682325 79970636 76887678
12069 76887678 73586357 70115088 66466726 62624068 58587789 54410314 50235053 46299024
12061 46299024 42867277 40129596 38139212 36837393 36114820 35832816 35800708 35776673 35539287
12052 35539287 34994676 34230345 33466662 32954194 32901258 33455161 34703515 36679948 39388548
12043 39388548 42833936 47011739 51844129 57098024 62346287 67025254 70600115 72772859
12035 72772859 73610533 73502379 72969617 72449178 72165887 72135333 72264545 72462968 72684079
12026 72684079 72891500 73001933 72850859 72197426 70783437 68448412 65236081 61396957 57278634
12017 57278634 53206786 49448363 46231020 43732312 42020992 41020643 40555104 40444234
12009 40444234 40562080 40820651 41120643 41321643 41260942 40819998 39995629 38917184 37784245
12000 37784245 36759550 35896680 35157444 34481038 33818471 33110370 32261627 31149273 29652822
11991 29652822 27704100 25359744 22849329 20536808 18806428 17943802 18063280 19085580
11983 19085580 20752027 22682109 24489857 25924560 26948709 27701175 28383983 29151309
11975 29151309 30047716 31008814 31919856 32684790 33239359 33508041 33374298 32716880 31494415
11966 31494415 29812879 27921429 26136644 24740206 23899845 23647280 23914399 24586844 25527461
11957 25527461 26560776 27458711 27984591 27999713 27553727 26875420 26263090 25939393 25946787 26139865
11947 26139865 26275494 26142835 25666643 24940337 24173448 23580007 23270995 23208840 23242013 23200088
11937 23200088 23006449 22748557 22647043 22918318 23615832 24568112 25457315 25973078 25932603
11928 25932603 25307878 24196390 22811070 21490096 20642621 20591288 21406329 22879629 24678933
11919 24678933 26562160 28484697 30535917 32788436 35194693 37586616 39734036 41399280
11911 41399280 42372599 42505101 41733815 40072392 37582889 34383431 30688927 26807944
11903 26807944 23063655 19707174 16896883 14738261 13333879 12801913 13230697 14575441
11895 14575441 16578441 18790728 20681491 21774906 21774355 20643372 18608892 16078094 13507761
11886 13507761 11299222 9767193 9148688 9588997 11105027 13566487 16701282 20114312
11878 20114312 23344047 25976872 27761073 28627528 28611302 27767755 26153818 23854484 21013183
11869 21013183 17852615 14668608 11778247 9436134 7758763 6697818 6077698 5675744
11861 5675744 5314410 4938512 4638263 4589764 4947397 5772707 7054154 8798338 11119571
11852 11119571 14246296 18418341 23734237 30038962 36906799 43726486 49848608 54722195
11844 54722195 57983394 59512798 59452454 58138499 55962184 53247494 50219381 47050969
11836 47050969 43913607 40969403 38315431 35937540 33719446 31505385 29182921 26747106
11828 26747106 24303129 21981479 19812252 17670644 15356560 12731662 9777095 6542359
11820 6542359 3077554 -581661 -4390702 -8265772 -12069279 -15644653 -18900723 -21862392
11812 -21862392 -24602094 -27098105 -29169584 -30564564 -31115688 -30821864 -29810355 -28255082
11804 -28255082 -26333854 -24219845 -22056877 -19917812 -17804446 -15714640 -13718549 -11970790
11796 -11970790 -10643874 -9826272 -9458880 -9372502 -9411154 -9536102 -9814985 -10312205 -10984214
11787 -10984214 -11664465 -12140985 -12257162 -11959147 -11274411 -10255560 -8924011 -7241410 -5124955
11778 -5124955 -2498942 636242 4140783 7717792 10976266 13551024 15203975 15851272
11770 15851272 15526428 14333269 12428706 10025176 7378518 4752761 2385498 470271
11762 470271 -858305 -1547285 -1629972 -1186361 -280801 1077481 2927457 5308971 8199678
11753 8199678 11464985 14844117 17989900 20558791 22313131 23184089 23259937 22697404 21604527
11744 21604527 19977421 17734525 14810268 11243075 7224343 3091298 -746622 -3922305
11736 -3922305 -6209112 -7557753 -8066554 -7914964 -7305198 -6435799 -5488617 -4603645 -3847256
11727 -3847256 -3192874 -2531927 -1731847 -720757 461126 1675103 2739168 3486662 3806910
11718 3806910 3662797 3087164 2166398 1025387 -180353 -1271369 -2055934 -2348021 -1988701
11709 -1988701 -863447 1094045 3904633 7527855 11831373 16595974 21574981 26547946
11701 26547946 31312658 35643435 39281508 41981501 43581552 44042732 43434060 41892722
11693 41892722 39597123 36749572 33546574 30146698 26673126 23262423 20119994 17524977
11685 17524977 15767080 15048294 15397077 16644947 18499752 20681902 23029470 25509770
11677 25509770 28154979 30971214 33870551 36675123 39196452 41328107 43086085 44579935
11669 44579935 45946526 47294216 48671398 50040754 51266599 52143385 52455573 52038025
11661 52038025 50828884 48903616 46452305 43689666 40766277 37769236 34799273 32012532
11653 32012532 29566778 27539119 25913149 24653238 23793427 23450051 23740066 24681285 26157434
11644 26157434 27950851 29794104 31415542 32589810 33204832 33327705 33221060 33273043 33866393
11635 33866393 35254587 37493380 40431736 43742971 46994489 49766233 51775880 52930435
11627 52930435 53285507 52965835 52093842 50745813 48953614 46748541 44208660 41473897
11619 41473897 38719446 36100616 33701397 31513137 29441065 27326401 24982680 22247252
11611 22247252 19039047 15405688 11538272 7731054 4294186 1480176 -529756 -1612274
11603 -1612274 -1711952 -861757 825150 3191806 6075757 9329784 12813364 16358984 19745786
11594 19745786 22718034 25044591 26575710 27265680 27163351 26386612 25090485 23422330
11586 23422330 21463943 19202363 16581893 13623725 10518049 7592548 5167117 3416960
11578 3416960 2359661 1954772 2188588 3050874 4456164 6228716 8173298 10136342 11990500
11569 11990500 13593541 14802753 15544431 15863101 15890853 15756524 15509297 15115346 14526295
11560 14526295 13765862 12967495 12328265 12007492 12045419 12356318 12775784 13100961 13103961 12557197
11550 12557197 11299157 9314879 6781831 4042978 1502613 -507453 -1821554 -2456442
11542 -2456442 -2560779 -2333853 -1955329 -1559451 -1254015 -1140451 -1286344 -1662325 -2115873
11533 -2115873 -2432717 -2457024 -2179414 -1712925 -1180215 -621644 9405 797256 1824470
11524 1824470 3165332 4893488 7075083 9738640 12852550 16346387 20156482 24238750
11516 24238750 28534920 32940566 37311580 41481504 45253429 48388830 50645035 51869495
11508 51869495 52091958 51540125 50566949 49546477 48796965 48545128 48905580 49847772 51167328
11499 51167328 52510680 53465532 53677290 52947923 51298936 48988833 46469817 44282787
11491 44282787 42914071 42644839 43433711 44890069 46380915 47253786 47079319 45782611 43601938
11482 43601938 40929681 38137675 35461716 32982771 30697000 28605685 26745111 25145105
11474 25145105 23780081 22581220 21511192 20630897 20085128 20001133 20364758 20959596 21424439
11465 21424439 21415328 20771793 19569344 18046657 16507238 15267184 14615397 14738836 15640980
11456 15640980 17118600 18831764 20447236 21776794 22818444 23682531 24477393 25236578
11448 25236578 25905562 26370037 26517148 26310094 25829367 25249256 24768173 24542639 24664271
11439 24664271 25175213 26080190 27332494 28818231 30368629 31802145 32975925 33818207
11431 33818207 34326713 34548101 34561931 34464020 34320582 34097982 33636416 32723716 31223158
11422 31223158 29151435 26663220 23985842 21363134 19024844 17166046 15929911 15402083
11414 15402083 15613847 16544011 18123615 20254369 22837029 25780618 28964814 32178078
11406 32178078 35091770 37302718 38427521 38208436 36585154 33702681 29857562 25400790
11398 25400790 20633629 15762225 10945766 6380651 2325785 -969087 -3386240 -5018769
11390 -5018769 -6130571 -7012162 -7833986 -8597129 -9197626 -9540188 -9620003 -9526443 -9372906 -9214955
11380 -9214955 -9043110 -8860316 -8747330 -8830700 -9193601 -9839562 -10732961 -11833181 -13069261
11371 -13069261 -14298530 -15310841 -15885579 -15872816 -15274059 -14289122 -13268032 -12547670 -12275188
11362 -12275188 -12366178 -12621616 -12884404 -13113497 -13340412 -13560883 -13665002 -13469251 -12819230
11353 -12819230 -11686946 -10211148 -8669878 -7393772 -6644328 -6514469 -6914897 -7649011 -8508037
11344 -8508037 -9323283 -9979193 -10424998 -10694058 -10906515 -11232873 -11823962 -12738611 -13898445
11335 -13898445 -15080275 -15956888 -16198580 -15600608 -14154110 -12021182 -9462655 -6783784
11327 -6783784 -4309434 -2354551 -1158110 -799403 -1159281 -1966324 -2910655 -3770824 -4489727
11318 -4489727 -5157862 -5917301 -6847221 -7888375 -8830082 -9365703 -9211586 -8247240 -6592917
11309 -6592917 -4562155 -2524047 -780428 475315 1131923 1119401 398159 -1014465 -3009128
11300 -3009128 -5372148 -7800580 -9940134 -11462226 -12183609 -12161589 -11670250 -11053334 -10562114
11291 -10562114 -10287742 -10200174 -10234482 -10368368 -10651612 -11167878 -11960643 -12989776 -14149261
11282 -14149261 -15312143 -16353752 -17143372 -17532560 -17374889 -16582056 -15178096 -13309520 -11202086
11273 -11202086 -9079677 -7080613 -5223053 -3448966 -1723342 -123691 1146147 1833687
11265 1833687 1753189 858042 -761222 -2916768 -5362009 -7826454 -10051197 -11822562 -13005479
11256 -13005479 -13567996 -13576005 -13159537 -12485782 -11763008 -11242228 -11169984 -11711115 -12900454 -14650385
11246 -14650385 -16802534 -19202751 -21772936 -24539455 -27590721 -30997576 -34769488 -38859495
11238 -38859495 -43162790 -47496779 -51605221 -55193098 -57967091 -59681571 -60197270 -59531978
11230 -59531978 -57874936 -55558744 -52995410 -50582709 -48603501 -47157891 -46150895 -45337436
11222 -45337436 -44421227 -43177119 -41532636 -39566575 -37451874 -35398314 -33613405 -32269131
11214 -32269131 -31467120 -31208342 -31387043 -31825421 -32330414 -32729995 -32870518 -32601463 -31795655
11205 -31795655 -30421013 -28605181 -26614387 -24754665 -23272049 -22288787 -21771950 -21551329
11197 -21551329 -21394489 -21099517 -20561756 -19795083 -18898574 -17980218 -17087647 -16200562 -15283127
11188 -15283127 -14327260 -13328057 -12226476 -10909739 -9296863 -7440440 -5552736 -3921645
11180 -3921645 -2773937 -2187351 -2102962 -2410611 -3041013 -3999122 -5316255 -6973579 -8881469
11171 -8881469 -10932040 -13049517 -15170822 -17186036 -18911868 -20121638 -20614572 -20305433
11163 -20305433 -19295369 -17861553 -16343194 -14987977 -13867479 -12922799 -12093230 -11405265
11155 -11405265 -10945191 -10770012 -10869353 -11208139 -11778707 -12589574 -13603918 -14714321 -15811642
11146 -15811642 -16903996 -18175938 -19908633 -22294746 -25285845 -28586111 -31774272 -34451773
11138 -34451773 -36347505 -37368729 -37598083 -37240313 -36554069 -35806972 -35237905 -34987476 -35020904
11129 -35020904 -35119326 -34965760 -34271720 -32877612 -30792572 -28164302 -25193176 -22039695 -18786770
11120 -18786770 -15477503 -12184055 -9039687 -6208850 -3833769 -2003674 -746453 -26229
11112 -26229 244075 164664 -192711 -794333 -1617416 -2623168 -3763828 -5011001 -6367813
11103 -6367813 -7854591 -9485623 -11246509 -13074800 -14854643 -16432024 -17648415 -18387318
11095 -18387318 -18614226 -18381558 -17794861 -16965569 -15975257 -14862145 -13631792 -12285962 -10848484
11086 -10848484 -9361058 -7850943 -6311464 -4734554 -3186206 -1863675 -1073988 -1130185
11078 -1130185 -2220381 -4322621 -7208455 -10522642 -13885757 -16966574 -19508654 -21332675
11070 -21332675 -22333184 -22461973 -21690298 -19972468 -17248278 -13485727 -8722338 -3076635
11062 -3076635 3253777 9976398 16684342 22893724 28146367 32101891 34566105 35480076
11054 35480076 34902188 32980755 29916026 25935924 21297987 16287779 11183521 6203292
11046 6203292 1479568 -2906338 -6838847 -10096181 -12372520 -13405720 -13120665 -11676427
11038 -11676427 -9391898 -6621641 -3669569 -773322 1868669 4078489 5716543 6721374
11030 6721374 7137033 7114692 6898380 6790278 7083291 7984748 9577773 11831975 14628261
11021 14628261 17762789 20940828 23810399 26062914 27544014 28271572 28339849 27809927 26691138
11012 26691138 25018402 22941639 20733493 18696013 17038270 15815604 14955725 14330280
11004 14330280 13825453 13384634 13008289 12718592 12517632 12363674 12165966 11784853 11042213
10995 11042213 9768951 7889876 5490469 2810263 178608 -2049204 -3536346 -4017782
10987 -4017782 -3378840 -1718319 667629 3384430 6057296 8413978 10319702 11767648
10979 11767648 12831439 13596441 14096944 14289349 14075346 13359582 12111080 10397929 8377198
10970 8377198 6252968 4239072 2545481 1365153 826745 920816 1459598 2126772 2605171
10961 2605171 2700864 2378487 1697762 724804 -506304 -1968399 -3584582 -5190299 -6560743
10952 -6560743 -7495068 -7885661 -7720268 -7041481 -5911761 -4394754 -2548056 -434398 1858201
10943 1858201 4215983 6521078 8667404 10558604 12109075 13264606 14024258 14437276
10935 14437276 14577471 14518833 14326488 14058523 13773594 13540598 13432605 13495624 13718435 14034285
10925 14034285 14356123 14622202 14820700 14984022 15177439 15495732 16041419 16868058 17928524
10916 17928524 19085384 20185821 21137084 21919077 22537051 22958446 23061989 22619613 21342921
10907 21342921 19003410 15578557 11333202 6765748 2437473 -1207747 -3929469 -5676628
10899 -5676628 -6539222 -6707109 -6435496 -6012740 -5719568 -5759921 -6183363 -6865439 -7574657 -8075837
10889 -8075837 -8206037 -7903309 -7204896 -6232372 -5150980 -4087492 -3047851 -1914047 -543543
10880 -543543 1097468 2858314 4433816 5495981 5871323 5666999 5254304 5093935 5504508
10871 5504508 6522549 7918846 9320349 10356076 10785533 10583239 9936887 9155599 8545975
10862 8545975 8303935 8451753 8862851 9371346 9876331 10353766 10794333 11156807 11375332
10853 11375332 11385022 11138570 10621404 9865204 8932429 7860178 6610045 5087096 3227674
10844 3227674 1075645 -1239136 -3612932 -6063788 -8720670 -11731399 -15169231 -18973899
10836 -18973899 -22935948 -26734936 -30021923 -32519030 -34101821 -34825443 -34883398 -34533992 -34035658
10827 -34035658 -33605087 -33395286 -33482010 -33844393 -34348853 -34766501 -34835096 -34339697 -33168711
10818 -33168711 -31324143 -28906178 -26098121 -23145174 -20300567 -17739875 -15494994 -13466141
10810 -13466141 -11511843 -9545840 -7565665 -5618600 -3771896 -2116833 -772840 145748
10802 145748 590617 617398 361357 -39651 -529148 -1161561 -2036455 -3181074 -4488979
10793 -4488979 -5768132 -6851867 -7694335 -8401150 -9188365 -10295798 -11896880 -14047413 -16702046
10784 -16702046 -19787567 -23263911 -27103092 -31200249 -35299847 -39001700 -41845124 -43417670
10776 -43417670 -43441259 -41833158 -38741441 -34521301 -29639090 -24547930 -19591259 -14969849
10768 -14969849 -10781763 -7090702 -3937263 -1269121 1116033 3503875 6086417 8810245
10760 8810245 11372061 13364308 14471546 14605266 13915734 12687655 11185031 9535846
10752 9535846 7719778 5650190 3275235 624483 -2201143 -5046160 -7709387 -9981003
10744 -9981003 -11718743 -12920607 -13736080 -14380883 -14996339 -15577095 -16046876 -16403901 -16781951
10735 -16781951 -17369191 -18268817 -19424355 -20649093 -21706744 -22384461 -22540402 -22128339 -21200899
10726 -21200899 -19889194 -18368382 -16832123 -15472587 -14444163 -13823206 -13599538 -13711806
10718 -13711806 -14106952 -14784551 -15776546 -17049639 -18408482 -19501867 -19933256 -19390258 -17727571
10709 -17727571 -14992067 -11403598 -7304845 -3090790 861859 4249061 6886096 8749549
10701 8749549 9980667 10823372 11536727 12344156 13414174 14825481 16523868 18323066 19959587
10692 19959587 21163232 21716067 21494632 20486022 18770091 16487928 13833707 11067459
10684 11067459 8498359 6412664 4984733 4233020 4048912 4269304 4733525 5287733 5756844
10675 5756844 5946175 5716076 5101073 4378534 3999184 4389423 5738786 7911832 10550684
10666 10550684 13294288 15952791 18533632 21149468 23905508 26831433 29869876 32906216
10658 32906216 35811339 38462652 40729428 42460944 43523315 43864595 43549025 42733073
10650 42733073 41598959 40280462 38816688 37162071 35254859 33102723 30829354 28651239
10642 28651239 26791539 25384275 24445687 23933568 23821947 24111155 24776414 25715698 26749418
10633 26749418 27683507 28391564 28845426 29074068 29104703 28945374 28613581 28165536 27682129
10624 27682129 27220595 26773010 26248349 25483052 24302196 22631406 20601860 18569020 17003809
10615 17003809 16289985 16542903 17577371 19041182 20596865 22021972 23201571 24084115
10607 24084115 24670978 25040910 25364120 25864411 26726166 27994281 29530613 31055051 32249543
10598 32249543 32866029 32777154 31959752 30462010 28404250 26001691 23552773 21360129 19611187
10589 19611187 18292241 17209921 16121468 14880723 13488719 12019257 10498739 8856086
10581 8856086 6982046 4821241 2398798 -215202 -2922403 -5567499 -7920656 -9718397
10573 -9718397 -10748201 -10921335 -10276747 -8907020 -6872456 -4182726 -852202 3031279
10565 3031279 7274168 11594658 15688296 19314106 22346685 24771970 26659804 28138966
10557 28138966 29358058 30420156 31319923 31934050 32088946 31661251 30631845 29062122 27027702
10548 27027702 24564896 21662505 18292036 14457729 10258139 5933766 1847425 -1628112
10540 -1628112 -4256285 -6007086 -7000484 -7386411 -7266035 -6695834 -5745577 -4560896 -3383110
10531 -3383110 -2505618 -2196928 -2631501 -3834729 -5650553 -7775170 -9867722 -11670904 -13067547
10522 -13067547 -14063766 -14740764 -15220780 -15656784 -16223618 -17103385 -18469011 -20428755 -22905368
10513 -22905368 -25548103 -27827086 -29288400 -29751105 -29283219 -28035921 -26130212 -23662805
10505 -23662805 -20743836 -17490675 -13991730 -10285138 -6381543 -2322996 1771741 5715867
10497 5715867 9304834 12373497 14836887 16691434 17967202 18670140 18769895 18240923 17111861
10488 17111861 15472174 13424625 11030841 8324622 5403391 2503556 -34725 -1900213
10480 -1900213 -2940588 -3192489 -2797534 -1884792 -508818 1338022 3680651 6534277 9911925
10471 9911925 13832255 18274026 23085400 27939485 32403843 36088119 38776908 40471342
10463 40471342 41320324 41500732 41145348 40351811 39208059 37783692 36122845 34269331 32282779
10454 32282779 30217755 28110894 26011836 24015514 22241907 20778712 19643520 18795402
10446 18795402 18179825 17772747 17603908 17750993 18292132 19222542 20382368 21449319 22012794
10437 22012794 21705649 20337761 17961703 14834602 11307007 7707836 4279390 1175237
10429 1175237 -1506756 -3699471 -5369136 -6524622 -7198962 -7399589 -7069154 -6110811 -4472266
10420 -4472266 -2204756 558396 3652902 6892886 10046761 12844378 15046763 16524190
10412 16524190 17257605 17264583 16549769 15142693 13164749 10836068 8417537 6154559 4257401
10403 4257401 2880338 2071296 1733174 1643551 1528871 1168729 494886 -375670 -1202741
10394 -1202741 -1723547 -1707852 -955519 688982 3248161 6509225 10021712 13216510 15564921
10385 15564921 16699215 16482354 15050761 12811831 10339433 8177841 6660120 5838120
10377 5838120 5536269 5477330 5412910 5206922 4845380 4382157 3869647 3319633 2696766 1927546
10367 1927546 926855 -345620 -1815903 -3262513 -4358403 -4780171 -4330778 -3009677
10359 -3009677 -997707 1418975 3934264 6296933 8382305 10234947 12035570 13988921
10351 13988921 16190256 18556847 20865747 22844835 24242747 24876317 24687391 23778830
10343 23778830 22368056 20670555 18803582 16782635 14596489 12282705 9943891 7707491
10335 7707491 5672913 3895948 2425469 1350558 804629 921235 1779988 3375322 5607018
10326 5607018 8277891 11104665 13764370 15981218 17619574 18722615 19462761 20035748
10318 20035748 20565151 21063448 21452880 21616652 21452660 20924477 20099357 19137438 18216529
10309 18216529 17453808 16913047 16687537 16943192 17844039 19414187 21458364 23602869 25418618
10300 25418618 26559337 26868854 26416884 25441661 24226947 22968891 21690321 20249047
10292 20249047 18440761 16131862 13336755 10208336 6985942 3960936 1459798 -204000
10284 -204000 -814451 -314571 1197019 3514043 6374846 9505530 12662734 15686213 18551466
10275 18551466 21380283 24366717 27634670 31110068 34488591 37314836 39129995 39616495
10267 39616495 38674629 36425422 33182412 29402188 25580528 22101242 19116408 16537416
10259 16537416 14151957 11808247 9555588 7647110 6407159 6055354 6590906 7788769
10251 7788769 9286760 10697499 11694911 12076806 11822322 11125241 10355137 9931665 10164287
10242 10164287 11141606 12715395 14556314 16241671 17360027 17615062 16900583 15322845
10234 15322845 13149094 10694010 8209585 5842386 3665255 1743120 173930 -935515
10226 -935515 -1531959 -1640939 -1320297 -588669 600822 2321812 4604301 7379833 10478009
10217 10478009 13675122 16751375 19508495 21749371 23275641 23947758 23774215 22942645
10209 22942645 21745741 20444671 19151986 17788106 16122811 13879759 10862401 7053662
10201 7053662 2641198 -2058904 -6747376 -11266331 -15625242 -19923401 -24232836 -28520166
10193 -28520166 -32635033 -36336655 -39342873 -41415428 -42453030 -42522135 -41803376 -40501319
10185 -40501319 -38775798 -36722621 -34397371 -31852310 -29157831 -26402615 -23679645 -21067658
10177 -21067658 -18624834 -16406139 -14486095 -12954096 -11877970 -11265718 -11053518 -11118489 -11292329
10168 -11292329 -11366927 -11115485 -10349891 -8991770 -7100993 -4832756 -2359359 185221 2720388
10159 2720388 5213824 7666521 10079883 12419931 14624476 16667866 18621882 20633709
10151 20633709 22816805 25132563 27351853 29124310 30102279 30037714 28815089 26444417
10143 26444417 23054424 18893964 14310251 9681138 5333418 1491279 -1741206 -4364917
10135 -4364917 -6427247 -7947990 -8891417 -9205777 -8887280 -8022900 -6802157 -5489036 -4347829
10126 -4347829 -3573087 -3286554 -3571592 -4457289 -5842987 -7457195 -8928001 -9926087 -10274119
10117 -10274119 -9969677 -9153705 -8068462 -7003801 -6210377 -5799753 -5697903 -5694237 -5552843
10108 -5552843 -5116342 -4364552 -3429178 -2563861 -2057833 -2101156 -2653922 -3414547 -3950604 -3917772
10098 -3917772 -3194663 -1845720 416 2213820 4638441 7062391 9236649 10917778
10090 10917778 11914701 12150851 11715420 10835557 9760609 8647045 7527571 6359113 5094823
10081 5094823 3736254 2352714 1078145 88054 -457585 -495585 -107930 502585 1071018
10072 1071018 1311726 962282 -123628 -1857762 -3868447 -5589951 -6460069 -6126358 -4563019
10063 -4563019 -2048545 973989 4065222 6891815 9237034 10969745 12039077 12510367
10055 12510367 12585679 12546299 12634141 12957494 13486316 14122665 14776383 15396342 15962827 16464389
10045 16464389 16868779 17095062 17009408 16471115 15411014 13872190 11973616 9839964 7558642
10036 7558642 5179006 2742050 323389 -1940689 -3871521 -5311244 -6201892 -6631462
10028 -6631462 -6805207 -6943339 -7159607 -7404985 -7531856 -7438281 -7173004 -6916166 -6867789 -7145202
10018 -7145202 -7755256 -8639477 -9741564 -11031232 -12466352 -13945475 -15310257 -16404210
10010 -16404210 -17150508 -17605191 -17946085 -18375344 -18975569 -19624766 -20049044 -19982413 -19325859
10001 -19325859 -18212897 -16956959 -15922470 -15393709 -15495513 -16174896 -17233451 -18397089
9993 -18397089 -19393512 -20009403 -20132460 -19791559 -19165880 -18511577 -18025877 -17759381 -17642639
9984 -17642639 -17561200 -17396211 -17039991 -16425359 -15552305 -14476081 -13265572 -11968230 -10600636
9975 -10600636 -9164377 -7676962 -6197659 -4831038 -3711398 -2993593 -2866425 -3547929 -5204073
9966 -5204073 -7825485 -11180139 -14892106 -18571699 -21913669 -24754026 -27096564 -29087638
9958 -29087638 -30923459 -32727562 -34466654 -35948224 -36894650 -37057676 -36328195 -34790410 -32679431
9949 -32679431 -30253973 -27663251 -24894020 -21819909 -18314793 -14372978 -10172291 -6027143
9941 -6027143 -2248317 993369 3712573 6062934 8252151 10462349 12795632 15251290
9933 15251290 17729159 20048753 21978212 23271458 23712857 23170832 21656087 19357258
9925 19357258 16609408 13786962 11190723 9003853 7299172 6037868 5067702 4175924
9917 4175924 3188447 2030212 698143 -796317 -2430823 -4126708 -5738382 -7112651
9909 -7112651 -8154970 -8851036 -9269084 -9559611 -9912916 -10465070 -11224498 -12087491 -12919973
9900 -12919973 -13636511 -14244119 -14841947 -15568586 -16522958 -17713662 -19066024 -20466534 -21807099
9891 -21807099 -23016738 -24080411 -25022183 -25842589 -26465081 -26757548 -26612892 -26008659 -25003644
9882 -25003644 -23703928 -22233619 -20708483 -19217813 -17837092 -16664360 -15831973 -15463259
9874 -15463259 -15607915 -16211836 -17133998 -18185500 -19164907 -19870422 -20087625 -19590974 -18203907
9865 -18203907 -15901759 -12876446 -9492881 -6153671 -3173341 -753180 963124 1859250
9857 1859250 1900040 1209463 69654 -1187953 -2326901 -3286388 -4152792 -5048142 -6013436
9848 -6013436 -6971463 -7790150 -8378439 -8725408 -8857631 -8773220 -8430619 -7806340 -6969186 -6114481
9838 -6114481 -5531954 -5512767 -6238818 -7725822 -9864401 -12512256 -15534403 -18761424 -21949296
9829 -21949296 -24822641 -27175479 -28931158 -30114241 -30781415 -30970778 -30688818 -29933007 -28729315
9820 -28729315 -27150040 -25299163 -23284907 -21202349 -19133677 -17167182 -15427923 -14089469
9812 -14089469 -13338638 -13309893 -14031682 -15407032 -17221737 -19171416 -20915928 -22167407 -22789295
9803 -22789295 -22851942 -22591170 -22274660 -22057752 -21931683 -21798269 -21597580 -21376869 -21264816 -21415209
9793 -21415209 -21982638 -23115468 -24922837 -27412364 -30433853 -33665417 -36652260 -38886048
9785 -38886048 -39912791 -39449608 -37468560 -34214106 -30146303 -25808481 -21644662 -17851004
9777 -17851004 -14357365 -10950394 -7449073 -3836849 -310825 2762799 4978409 6055707
9769 6055707 5963102 4936974 3386782 1738895 297049 -820121 -1647722 -2290441 -2850603
9760 -2850603 -3395570 -3946778 -4473717 -4898461 -5117419 -5028894 -4552164 -3645170 -2340525 -795283
9750 -795283 687377 1701299 1841455 842306 -1290148 -4220496 -7362447 -10083187 -11938715
9741 -11938715 -12828636 -13012033 -12992662 -13324119 -14404324 -16338264 -18931960 -21809438 -24568801
9732 -24568801 -26897415 -28623091 -29711738 -30226265 -30265085 -29907825 -29194159 -28140245 -26770780
9723 -26770780 -25139314 -23327362 -21427936 -19529956 -17718360 -16068963 -14602552 -13223704
9715 -13223704 -11722637 -9867490 -7517015 -4670092 -1444292 1975392 5390650 8625348
9707 8625348 11519168 13900090 15594399 16492579 16619502 16140958 15286956 14239296 13063904
9698 13063904 11738613 10244365 8628023 6982452 5377283 3816307 2269719 755487
9690 755487 -614660 -1677935 -2306458 -2446012 -2091161 -1276646 -136787 1041301 1883936
9681 1883936 2110433 1689584 849606 -53502 -708276 -970565 -899722 -707373 -654494 -964391
9671 -964391 -1797415 -3258371 -5365660 -7978060 -10775490 -13365793 -15452223 -16929553 -17860670
9662 -17860670 -18393604 -18684363 -18833904 -18835114 -18559791 -17817501 -16470055 -14540013 -12242416
9653 -12242416 -9909500 -7857042 -6282800 -5242708 -4682191 -4481192 -4483377 -4496410 -4285914
9644 -4285914 -3609092 -2295711 -325172 2153466 4871122 7545855 10000949 12210700
9636 12210700 14237064 16117042 17792217 19119253 19927946 20072499 19464072 18106944 16130940
9627 16130940 13768754 11257639 8726645 6156653 3450765 583171 -2268735 -4725294
9619 -4725294 -6366817 -6946809 -6516120 -5407511 -4106664 -3060273 -2510178 -2463688 -2806830
9610 -2806830 -3424222 -4212620 -5025441 -5654174 -5884832 -5574187 -4684296 -3279785 -1523641
9601 -1523641 327687 1962849 3099413 3574651 3392352 2710026 1784507 900626 298414
9592 298414 106275 293982 669881 934850 774685 -48172 -1633249 -3916728 -6680471
9583 -6680471 -9593463 -12272163 -14345294 -15526839 -15702783 -14995347 -13731363 -12291999 -10928451
9574 -10928451 -9663107 -8325198 -6684226 -4599575 -2104954 600974 3222920 5454032
9566 5454032 7058471 7925846 8067986 7571323 6554592 5157144 3544985 1915579 488457
9557 488457 -525281 -969372 -793582 -103203 812651 1528379 1638540 945476 -463219
9548 -463219 -2288805 -4160028 -5749646 -6851274 -7419418 -7555516 -7432673 -7209156 -6997915
9539 -6997915 -6882739 -6919584 -7110635 -7383705 -7590832 -7528398 -6992844 -5861454 -4142901 -1955560
9529 -1955560 532189 3121900 5549963 7469188 8509500 8399365 7073299 4701227
9521 4701227 1632049 -1706691 -4902587 -7615835 -9600237 -10703640 -10856406 -10052684 -8342996
9512 -8342996 -5852416 -2797596 544780 3916394 7138623 10105866 12737245 14950761
9504 14950761 16672677 17838643 18370647 18178550 17217763 15546107 13312762 10699610 7877483
9495 7877483 4997707 2200320 -384735 -2658711 -4590327 -6233786 -7700524 -9104164
9487 -9104164 -10525632 -12000223 -13484368 -14805125 -15659844 -15702614 -14675496 -12526895 -9480954
9478 -9480954 -6019283 -2755503 -249801 1148071 1363149 551996 -1015978 -3083721 -5473892
9469 -5473892 -8084385 -10850995 -13720257 -16631627 -19491754 -22160173 -24475465 -26299765
9461 -26299765 -27536233 -28125489 -28061078 -27427931 -26426172 -25346306 -24500540 -24146321 -24436031
9452 -24436031 -25404700 -26983450 -29018434 -31295698 -33583755 -35674777 -37386684 -38533325
9444 -38533325 -38918745 -38386336 -36890847 -34535694 -31544756 -28197052 -24781487 -21581868
9436 -21581868 -18847845 -16732564 -15242910 -14251918 -13574404 -13070523 -12718081 -12598749 -12807474
9427 -12807474 -13352440 -14097289 -14766961 -15032458 -14642367 -13509401 -11709692 -9452191 -7060180
9418 -7060180 -4919802 -3363545 -2555557 -2471430 -2981923 -3970296 -5406724 -7334137 -9770461
9409 -9770461 -12598853 -15538594 -18230868 -20379011 -21839398 -22620492 -22829273 -22606894 -22063705
9400 -22063705 -21239071 -20128460 -18763373 -17265950 -15830343 -14654823 -13864173 -13450047 -13269887
9391 -13269887 -13126262 -12872840 -12463824 -11932605 -11350558 -10805012 -10397886 -10246920 -10474785
9382 -10474785 -11189964 -12459221 -14261422 -16450678 -18789783 -21060933 -23182505 -25253080
9374 -25253080 -27492016 -30110527 -33199017 -36704007 -40489253 -44409703 -48335316 -52125176
9366 -52125176 -55601163 -58559425 -60815596 -62256105 -62869343 -62749940 -62087030 -61139215 -60182624
9357 -60182624 -59422924 -58902590 -58475404 -57884426 -56891392 -55377274 -53385414 -51122395 -48916145
9348 -48916145 -47116774 -45968073 -45514764 -45592353 -45899461 -46094218 -45843052 -44826251 -42766779
9339 -42766779 -39509087 -35101920 -29822491 -24121999 -18516601 -13459623 -9231408 -5889399
9331 -5889399 -3304343 -1250542 516837 2218397 4006326 5902323 7758887 9295706
9323 9295706 10199579 10219752 9206888 7101161 3913067 -271061 -5265709 -10772852 -16404466
9314 -16404466 -21741256 -26395641 -30060836 -32562708 -33913584 -34328974 -34179834 -33894725 -33844968
9305 -33844968 -34241701 -35081321 -36178872 -37274479 -38135019 -38594040 -38542365 -37913861 -36694976
9296 -36694976 -34943958 -32773765 -30281655 -27476615 -24277666 -20599372 -16465703 -12063817
9288 -12063817 -7682311 -3562985 217568 3723498 7007799 9974129 12368776 13889468
9280 13889468 14321328 13627110 11961889 9622384 6970193 4369573 2152860 591975
9272 591975 -149357 -69067 664088 1773170 2973003 4042307 4835343 5257728 5247763 4772756
9262 4772756 3824858 2419912 625411 -1393179 -3370495 -5017747 -6127181 -6632663 -6614250
9253 -6614250 -6263164 -5801064 -5369622 -4959519 -4429886 -3594175 -2317880 -600718 1373110
9244 1373110 3254601 4633413 5166127 4668103 3167432 914150 -1692732 -4242452 -6428714
9235 -6428714 -8091140 -9193174 -9759160 -9794594 -9238599 -7986615 -5965021 -3207329 113845
9226 113845 3719111 7288992 10514299 13119253 14886013 15701518 15609662 14825819 13679660
9217 13679660 12493795 11460524 10589644 9741547 8710797 7326805 5540304 3457342
9209 3457342 1304447 -650400 -2185746 -3203662 -3770780 -4090654 -4412539 -4927983 -5708978
9200 -5708978 -6717623 -7880635 -9168829 -10616908 -12288528 -14238274 -16496886 -19064430
9192 -19064430 -21888389 -24830219 -27644188 -29994746 -31537442 -32049919 -31537260 -30237323
9184 -30237323 -28514417 -26685604 -24866287 -22938502 -20673890 -17920337 -14724459 -11334929
9176 -11334929 -8114964 -5432750 -3583859 -2741014 -2898672 -3823292 -5075655 -6152888 -6685055
9167 -6685055 -6533264 -5718330 -4279824 -2208817 508306 3801295 7464980 11187044 14646424
9158 14646424 17629288 20085383 22081009 23688559 24900574 25616401 25690271 25016326 23617750
9149 23617750 21675508 19454350 17185210 15000692 12936806 10957837 8990757 6965648
9141 6965648 4824563 2480971 -203699 -3343628 -6878414 -10480126 -13616635 -15738472
9133 -15738472 -16470692 -15723223 -13708149 -10879095 -7803318 -4993209 -2758962 -1155493
9125 -1155493 -55617 699153 1187907 1424201 1441257 1328902 1196627 1130269 1180397 1356500
9115 1356500 1609735 1829809 1876385 1626623 1006007 -5585 -1372038 -2990858 -4695453
9106 -4695453 -6295518 -7643181 -8683269 -9460381 -10084798 -10676054 -11303593 -11942953 -12477049
9097 -12477049 -12757479 -12688720 -12275622 -11607534 -10799584 -9937005 -9046933 -8086911 -6957700
9088 -6957700 -5571656 -3949603 -2255570 -725236 458191 1252344 1752945 2114654 2473265
9079 2473265 2927215 3561934 4463522 5688408 7210700 8909113 10626776 12263725 13823752
$$ [...]
##END NTUPLES=NMR SPECTRUM
##END=
