##TITLE=31P ikalashn
DE-77 F_NaOH
22.11.2024
##JCAMPDX= 6.0         $$ Bruker NMR JCAMP-DX V2.0
##DATA TYPE= NMR SPECTRUM
##DATA CLASS= NTUPLES
##ORIGIN= UXNMR, Bruker Analytische Messtechnik GmbH
##OWNER= root
$$ TOPSPIN		Version 1.3
$$ 2024-11-22 16:02:34.265 +0400  Irina@DPX200
$$ Compression mode = diff/dup
##.OBSERVE FREQUENCY= 81.01967998063
##.OBSERVE NUCLEUS= ^31P
##.ACQUISITION MODE= SIMULTANEOUS
##.ACQUISITION SCHEME= undefined
##.AVERAGES= 65
##.DIGITISER RES= 17
##SPECTROMETER/DATA SYSTEM= spect
##.PULSE SEQUENCE= zgpg
##.SOLVENT NAME= DMSO
##.SHIFT REFERENCE= INTERNAL, DMSO, 1, 298.5841
##AUDIT TRAIL= $$ (NUMBER, WHEN, WHO, WHERE, WHAT)
$$ ##TITLE= Audit trail, TOPSPIN		Version 1.3
$$ ##JCAMPDX= 5.01
$$ ##ORIGIN= Bruker BioSpin GmbH
$$ ##OWNER= Irina
$$ $$ F:/spectra/data/iren/nmr/P31dec/1/pdata/1/auditp.txt
$$ ##AUDIT TRAIL=  $$ (NUMBER, WHEN, WHO, WHERE, VERSION, WHAT)
(   1,<2024-11-22 16:00:36.812 +0400>,<Irina>,<DPX200>,<TOPSPIN 1.3>,
      <acquisition in progress>)
(   2,<2024-11-22 16:02:20.046 +0400>,<Irina>,<DPX200>,<TOPSPIN 1.3>,
      <Start of raw data processing
       efp BC_mod = 2 LB = 10 FT_mod = 6 PKNL = 1 PHC0 = 232.4765 PHC1 = 45.10144 SI = 32K 
       data hash MD5: 32K
       7B 8C 84 77 A9 0F AA B6 55 3C C8 FA A6 E3 C0 DD>)
(   3,<2024-11-22 16:02:22.984 +0400>,<Irina>,<DPX200>,<TOPSPIN 1.3>,
      <abs n ABSG = 5 
       data hash MD5: 32K
       0B 6C F3 CE 10 30 CF 05 E2 D4 B5 51 8F 14 DE 33>)
$$ ##END=
$$ 
$$ $$ hash MD5
$$ $$ 8F FC 5B CE D2 C2 B7 4F 7B 78 EB B2 62 C8 8E 66
##$RELAX= 
##$RELAX= 
##$RELAX= 
##$RELAX= 
##$RELAX= 
##$RELAX= 
##$RELAX= 
##$RELAX= 
##$RELAX= 
##$RELAX= 
##$RELAX= 
$$ Bruker specific parameters
$$ --------------------------
##$DU= <F:/spectra>
##$EXPNO= 1
##$NAME= <P31dec>
##$PROCNO= 1
##$TYPE= <nmr>
##$USER= <iren>
##$AMP= (0..31)
100 100 100 100 100 100 100 100 100 100 100 100 100 100 100 100 100 100 
100 100 100 100 100 100 100 100 100 100 100 100 100 100 
##$ANAVPT= -1
##$AQSEQ= 0
##$AQ_mod= 1
##$AUNM= <au_zg>
##$AUTOPOS= <>
##$BF1= 81.014009
##$BF2= 200.13
##$BF3= 200.13
##$BF4= 200.13
##$BF5= 200.13
##$BF6= 200.13
##$BF7= 200.13
##$BF8= 200.13
##$BYTORDA= 1
##$CFDGTYP= 0
##$CFRGTYP= 5
##$CHEMSTR= <none>
##$CNST= (0..63)
1 1 145 1 1 1 1 1 1 1 1 1 1 1 1 1 1 1 1 1 1 1 1 1 1 1 1 1 1 1 1 1 1 1 
1 1 1 1 1 1 1 1 1 1 1 1 1 1 1 1 1 1 1 1 1 1 1 1 1 1 1 1 1 1 
##$CPDPRG= <waltz16>
##$CPDPRG1= <>
##$CPDPRG2= <waltz16>
##$CPDPRG3= <>
##$CPDPRG4= <mlev>
##$CPDPRG5= <mlev>
##$CPDPRG6= <mlev>
##$CPDPRG7= <mlev>
##$CPDPRG8= <mlev>
##$CPDPRGB= <>
##$CPDPRGT= <>
##$D= (0..63)
0 1 0 0 0 0 0 0 0 0.06 0 0.03 2e-005 3e-006 0 0 0.0002 0 0 0 0 0 0 0 0 
0 0 0 0 0 0 0 0 0 0 0 0 0 0 0 0 0 0 0 0 0 0 0 0 0 0 0 0 0 0 0 0 0 0 0 
0 0 0 0 
##$DATE= 1732276937
##$DBL= (0..7)
120 120 120 11 120 120 24 19 
##$DBP= (0..7)
150 150 150 150 150 150 150 150 
##$DBP07= 0
##$DBPNAM0= <>
##$DBPNAM1= <>
##$DBPNAM2= <>
##$DBPNAM3= <>
##$DBPNAM4= <>
##$DBPNAM5= <>
##$DBPNAM6= <>
##$DBPNAM7= <>
##$DBPOAL= (0..7)
$$ [...]
##$SW_h= 37037.037037037
##$TD= 32768
##$TD0= 1
##$TE= 300
##$TE2= 300
##$TE3= 300
##$TEG= 300
##$TL= (0..7)
0 120 53 12 22 120 120 120 
##$TP= (0..7)
150 150 150 150 150 150 150 150 
##$TP07= 0
##$TPNAME0= <>
##$TPNAME1= <>
##$TPNAME2= <>
##$TPNAME3= <>
##$TPNAME4= <>
##$TPNAME5= <>
##$TPNAME6= <>
##$TPNAME7= <>
##$TPOAL= (0..7)
0.5 0.5 0.5 0.5 0.5 0.5 0.5 0.5 
##$TPOFFS= (0..7)
0 0 0 0 0 0 0 0 
##$TUNHIN= 0
##$TUNHOUT= 0
##$TUNXOUT= 0
##$USERA1= <user>
##$USERA2= <user>
##$USERA3= <user>
##$USERA4= <user>
##$USERA5= <user>
##$V9= 5
##$VALIST= <valist>
##$VCLIST= <CCCCCCCCCCCCCCC>
##$VD= 0
##$VDLIST= <DDDDDDDDDDDDDDD>
##$VPLIST= <PPPPPPPPPPPPPPP>
##$VTLIST= <TTTTTTTTTTTTTTT>
##$WBST= 1024
##$WBSW= 4
##$XGAIN= (0..3)
0 0 0 0 
##$XL= 0
##$YL= 0
##$YMAX_a= 5926
##$YMIN_a= -997
##$ZGOPTNS= <>
##$ZL1= 120
##$ZL2= 120
##$ZL3= 120
##$ZL4= 120
##$ABSF1= 298.5841
##$ABSF2= -158.5842
##$ABSG= 5
##$ABSL= 5
##$ALPHA= 0
##$AQORDER= 0
##$ASSFAC= 0
##$ASSFACI= 0
##$ASSFACX= 0
##$ASSWID= 0
##$AUNMP= <proc_1d>
##$AXLEFT= 0
##$AXRIGHT= 0
##$AXTYPE= 0
##$AXUNIT= <>
##$AZFE= 0.1
##$AZFW= 0.5
##$BCFW= 0
##$BC_mod= 2
##$BYTORDP= 0
##$COROFFS= 0
##$CY= 12.5935478210449
##$DATMOD= 1
##$DC= 0
##$DFILT= <>
##$DTYPP= 0
##$F1P= 47.1127640792319
##$F2P= -24.0371245302204
##$FCOR= 0.5
##$FTSIZE= 32768
##$FT_mod= 6
##$GAMMA= 0
##$GB= 0
##$INTBC= 1
##$INTSCL= 7.269226e-011
##$ISEN= 30
##$LB= 10
##$LEV0= 0
##$LPBIN= 0
##$MAXI= 12.09355
##$MC2= 0
##$MEAN= 0
##$ME_mod= 0
##$MI= 0.7550151
##$NCOEF= 0
##$NC_proc= -12
##$NLEV= 6
##$NOISF1= 298.5841
##$NOISF2= 270.0111
##$NSP= 0
##$NTH_PI= 0
##$NZP= 0
##$OFFSET= 298.5841
##$PC= 1.4
##$PHC0= 232.4765
##$PHC1= 45.10144
##$PH_mod= 1
##$PKNL= yes
##$PPARMOD= 0
##$PPDIAG= 0
##$PPIPTYP= 0
##$PPMPNUM= 100
##$PPRESOL= 1
##$PSCAL= 0
##$PSIGN= 0
##$REVERSE= no
##$SF= 81.014009
##$SI= 32768
##$SIGF1= 270.0111
##$SIGF2= -158.5842
##$SINO= 77.54984
##$SIOLD= 32768
##$SREGLST= <31P.CDCl3>
##$SSB= 0
##$STSI= 32768
##$STSR= 0
##$SW_p= 37037.037037037
##$SYMM= 0
##$S_DEV= 0
##$TDeff= 32768
##$TDoff= 0
##$TI= <>
##$TILT= no
##$TM1= 0
##$TM2= 0
##$TOPLEV= 0
##$USERP1= <user>
##$USERP2= <user>
##$USERP3= <user>
##$USERP4= <user>
##$USERP5= <user>
##$WDW= 1
##$XDIM= 32768
##$YMAX_p= 326889678
##$YMIN_p= -17582485
$$ End of Bruker specific parameters
$$ ---------------------------------
##NTUPLES= NMR SPECTRUM
##VAR_NAME=  FREQUENCY,     SPECTRUM/REAL,   SPECTRUM/IMAG
##SYMBOL=    X,             R,               I
##VAR_TYPE=  INDEPENDENT,   DEPENDENT,       DEPENDENT
##VAR_FORM=  AFFN,          ASDF,            ASDF
##VAR_DIM=   32768,         32768,           32768
##UNITS=     HZ,            ARBITRARY UNITS, ARBITRARY UNITS
##FACTOR=    1.13031516577767, 1,            1
##FIRST=     37037.037037037, 5496727,       10875540
##LAST=      0,             3464784,         -7739581
##MIN=       0,             -17582485,       0
##MAX=       37037.037037037, 326889678,     0
$$ Real data points
##PAGE= N=1
##DATA TABLE= (X++(R..R)), XYDATA
$$ [...]
16682C080555j08918l05368m64141n59793n88596n90647n96170n62135m15112
16673a110325j24701K46597N29621N47903K68708j71132n43825o29607l40083
16664a326844J97471O85731Q72524P55111M85478J40388k80965o97663r59728
16655a28497j006053r15386q09920p39957o78413o34541o38916o06655m13655
16646f571993q3440K23078L84352M30678M64067N04763M72579K83150l4659l46020
16636d273445n44175o03540n48416m21045k29903M3214L77627O95282R23613J025165
16626c555623R29181N93438J51159j74661k97398l13214l50781m06105l47813
16617c771817j17585J49654K80858K20051K9607j19010m2089K84848P02967R58834
$$ y = [3080555, 2971637, 2666269, 2202128, 1642335, 1053739, 463092, -133078, -695213, -1110325, -1235026, -988429, -458808, 89095, 357803, 186671, -357154, -986761, -1326844, -1129373, -443642, 428882, 1183993, 1669471, 1809859, 1528894, 831231, -128497, -1134550, -2049936, -2859856, -3599813, -4278226, -4912767, -5551683, -6158338, -6571993, -6655433, -6432355, -6048003, -5617325, -5153258, -4648495, -4175916, -3892766, -3927425, -4273445, -4817620, -5421160, -5969576, -6390621, -6620524, -6577310, -6199683, -5504401, -4580788, -3555623, -2626442, -2033004, -1881845, -2056506, -2353904, -2667118, -3017899, -3424004, -3771817, -3889402, -3739748, -3458890, -3238839, -3209232, -3328242, -3370331, -3085483, -2382516, -1423682]
16607a423682Q31877K94305l85753p48445n67137r1199K84086L68377J74550k11710
16597a474731p03816j201667j578565j752707j712996j442641r12433j66594O11307
16588a0334843J156375J330479J198610R03977O05967L94546K01256n5687l17914
16579d917234m72966m78975l57464j26496K02995N77699R03020J069041J033687
16570b566693R14071R00393J022830J061179P54976Q5060o93378j303440j629270
16561a454272j628324j284896p06305r9634L74501P10337J017378J327769J485802
16552b57644J294834P75374K07556j51470k90718l30508l63202m49847o10615
16543a76240p68200q02947o32454k36378K54776N81576N62985K39593k08839n79942
$$ y = [-1423682, -591805, -297500, -683253, -1431698, -1998835, -2090034, -1805948, -1437571, -1263021, -1474731, -2178547, -3380214, -4958779, -6711486, -8424482, -9867123, -10779556, -10946150, -10334843, -9178468, -7847989, -6649379, -5745402, -5139435, -4744889, -4543633, -4599320, -4917234, -5390200, -5869175, -6226639, -6353135, -6150140, -5572441, -4669421, -3600380, -2566693, -1652622, -752229, 270601, 1331780, 2086756, 2171816, 1478438, 174998, -1454272, -3082596, -4367492, -5073797, -5173431, -4798930, -4088593, -3071215, -1743446, -257644, 1037190, 1812564, 2020120, 1868650, 1577932, 1247424, 884222, 434375, -176240, -944440, -1747387, -2379841, -2616219, -2361443, -1779867, -1216882, -977289, -1186128, -1766070]
16533a766070p18753o52108n61162n24915m57987l16666j87869j51207j53627
16524e490364m6533K35088N48706O80193N69625L60728K39402K55637L19551L14961
16514b013006J82748l5927k38211l44966l40927l26179m47330o93698r00923r70555
16504f128974r22626p90313n78833l10829m4211J93324L93813M80711L82069J84071
16494g141798O3587O3030O2916j0514q9757q7565K7965K64231N88428Q99496J074729
16483d285252J061982R00559O38892K93705q7446m12431o10952o56167n38572
16474c695682k82679L843J79107K20220K69258M56869P39694R87207J097501R68859
16464I44197N26852k10679j140428k049055k612620k630003k261081j851154j597746
$$ y = [-1766070, -2484823, -3136931, -3698093, -4223008, -4680995, -4997661, -5185530, -5336737, -5490364, -5536897, -5301809, -4753103, -4072910, -3503285, -3142557, -2903155, -2647518, -2327967, -2013006, -1830258, -1866185, -2104396, -2449362, -2790289, -3116468, -3563798, -4257496, -5158419, -6128974, -7051600, -7841913, -8420746, -8731575, -8775786, -8582462, -8188649, -7707938, -7325869, -7141798, -7078211, -7015181, -6952265, -6962779, -7052536, -7140101, -7112136, -6847905, -6259477, -5359981, -4285252, -3223270, -2322711, -1683819, -1390114, -1477560, -1889991, -2500943, -3157110, -3695682, -3978361, -3974518, -3795411, -3575191, -3305933, -2849064, -2109370, -1122163, -24662, 944197, 1471049, 1260370, 119942, -1929113, -4541733, -7171736, -9432817, -11283971, -12881717]
16455a2881717j471713j339926j082418o60445j46266L23197O53721Q74953J056075
16446a4674539J156091J063843P87888M68853K34353J38025J59403K25722K79368
16437a0160993L55513N19734P45041R45689J068637J116189J125206J094590R36345
16428b254049N82385J26672k26136l42697k88090k49327k92880k95923j54297
16419c394342O0572J93824J92233J43941J82196L40024N46281P62244R74767J130386
16409A132126J194237J181995J110926J002197R04604Q41581P66122O11108L43093
16400I087989j5427m29790q81876j313819j628138j757211j668141j331121p50894
16391f88428p4740M08648M79158J62143k83191n52329n31575l34525j04790P8811
$$ y = [-12881717, -14353430, -15693356, -16775774, -17436219, -17582485, -17259288, -16605567, -15730614, -14674539, -13518448, -12454605, -11666717, -11197864, -10963511, -10825486, -10666083, -10440361, -10160993, -9805480, -9285746, -8540705, -7595016, -6526379, -5410190, -4284984, -3190394, -2254049, -1671664, -1544992, -1771128, -2113825, -2401915, -2651242, -2944122, -3240045, -3394342, -3333770, -3139946, -2947713, -2803772, -2621576, -2281552, -1735271, -973027, 1740, 1132126, 2326363, 3508358, 4619284, 5621481, 6526085, 7367666, 8133788, 8744896, 9087989, 9072562, 8642772, 7760896, 6447077, 4818939, 3061728, 1393587, 62466, -688428, -763168, -354520, 124638, 286781, 3590, -548739, -1080314, -1414839, -1519629, -1440818]
16381a440818J30387R052k11573m25262n25950m24331j22054K94876O91478R24483
16371a099712R15323P03362M07750J39847m7864j74719k49970k28439j21873q361
16361B35344Q1557J50608J45822k399k56478m48959m10776j24397K44702M41632
16351E6656K85262j69861o61164r60634j057884j052116r81897q59258p30273
16342f131169o19632m62645j95852J31750M30360O68485Q42360R34845R53756
16333c447742R53727R88886J050652J069637R53981O79883L46351R0322k9509
16324B656188q7951k11458l99314m87286l15286J21916O45645J014776J107490
16315D044720R82508P75728N50083K57729k04984r07285j725441k245601k039264
$$ y = [-1440818, -1310431, -1301379, -1512952, -1938214, -2464164, -2888495, -3010549, -2715673, -2024195, -1099712, -184389, 518973, 926723, 1066570, 1018706, 843987, 594017, 365578, 243705, 235344, 316901, 467509, 613331, 610932, 354454, -94505, -505281, -629678, -384976, 56656, 341918, 172057, -489107, -1449741, -2507625, -3559741, -4541638, -5400896, -6131169, -6750801, -7213446, -7409298, -7277548, -6847188, -6178703, -5336343, -4401498, -3447742, -2494015, -1505129, -454477, 615160, 1569141, 2249024, 2595375, 2685697, 2656188, 2568237, 2356779, 1957465, 1470179, 1154893, 1276809, 1922454, 2937230, 4044720, 5027228, 5802956, 6353039, 6610768, 6405784, 5498499, 3773058, 1527457, -511807]
16306e11807j217247l43277K21211M62619M91006M56236M91031O17658P57628
16297A425058Q31374Q01272O44285L90052J16070j07816k14147j90915j34615
16288C560618j54508k53206l54346m27278n23258o58794p72938q14505p28688
16279a126903m50247n5271K53215L96440M52417M76463M29331K38782j11490n02157
16269E80p20554o56791l92902j07531L0074m8482k36191l52625l18962j53352
16259b956736N1205J46561J20984J19396K07012L37315M83957O03988N68190K87724
16249c0404j22351m38379n74101o37622p62206r26655j017940r84981q33814n76169
16239f904622k40382J07217M10462O80293R50821J210235J405937J482101J429180
$$ y = [-511807, -1729054, -2072331, -1851120, -1388501, -897495, -441259, 49772, 667430, 1425058, 2256432, 3057704, 3701989, 4092041, 4208111, 4100295, 3886148, 3695233, 3560618, 3406110, 3152904, 2798558, 2371280, 1848022, 1189228, 416290, -398215, -1126903, -1577150, -1632421, -1379206, -982766, -530349, -53886, 375445, 614227, 502737, 580, -719974, -1376765, -1769667, -1877198, -1847124, -1895606, -2131797, -2484422, -2803384, -2956736, -2905531, -2758970, -2637986, -2518590, -2311578, -1974263, -1490306, -886318, -318128, -30404, -152755, -591134, -1165235, -1802857, -2565063, -3491718, -4509658, -5494639, -6328453, -6904622, -7145004, -7037787, -6627325, -5947032, -4996211, -3785976, -2380039, -897938, 531242]
16230E31242J321918J255217J234191J158605R09929M62349q4229n76046q85222
16221E327954r46671q11420o18991m56023l07428j33896R1114L45866M88285L27267
16211C306057j71594p90284j206569j248864j021005p90440p08658o94418o12348
16202c938123m28051j83868P0186K73642L65088L13640J20903j45173l66193m76425
16192d394374m88266m43912m28660n27768o88155p48656o31569l57649K2985L93991
16182h292033O15253O72313O83189P15435P07471O01440M38629K94676J60416
16173c403211p8370m52702p70432q21822o26810l80043k25514j41782L234L07357
16163f590095P04473J004687J043852Q08124M77388K83072K95951M19610N06197
$$ y = [531242, 1853160, 3108377, 4342568, 5501173, 6411102, 6873451, 6789222, 6213176, 5327954, 4381283, 3569863, 2950872, 2494849, 2187421, 2053525, 2144639, 2490505, 2978790, 3306057, 3134463, 2344179, 1137610, -111254, -1132259, -1922699, -2631357, -3325775, -3938123, -4366174, -4550042, -4479856, -4206214, -3841126, -3527486, -3406583, -3551756, -3917949, -4394374, -4882640, -5326552, -5755212, -6282980, -6971135, -7719791, -8351360, -8709009, -8686024, -8292033, -7676780, -7004467, -6321278, -5605843, -4898372, -4296932, -3858303, -3563627, -3403211, -3481581, -3934283, -4704715, -5526537, -6153347, -6533390, -6758904, -6900686, -6897452, -6590095, -5885622, -4880935, -3837083, -3028959, -2551571, -2268499, -1972548, -1552938, -1046741]
16154a046741M34549K27932O4963P8307J94137J93956m2403l58402m74220l11050
16144a038972o8309M4403K7018q253n080K2316L5863K1340m067n5823j46949k22193
16132a398706k10006j31923j01427j50248j52362j6939J69477L02153L87127M10608
16122h92246L09088J19269j7726Q54J30845K32384K24849J52414P3517m3103k29964
16111F0181m26706n52361o04557o64630p85417q77109p81151m74745j24532Q9326
16101e141701J26042M1037j12464k97878m82099o21264o46336n13855k56832M7496
16091g857854L17597M95073N61280N25507M20441L24198L28292M17114M57816
16082d010536L84148K81032K65821M13958P13084J029630J228575J299925J300144
$$ y = [-1046741, -612192, -384260, -319297, -240990, -46853, 147103, 104700, -253702, -727922, -1038972, -1107281, -1062878, -1035860, -1044113, -1049193, -1026877, -991014, -969674, -973741, -1029564, -1176513, -1398706, -1608712, -1740635, -1842062, -1992310, -2144672, -2161611, -1992134, -1689981, -1302854, -892246, -583158, -463889, -481615, -480761, -349916, -117532, 107317, 259731, 333248, 290145, 60181, -366525, -918886, -1523443, -2188073, -2973490, -3850599, -4631750, -5106495, -5231027, -5141701, -5015659, -4974622, -5087086, -5384964, -5867063, -6488327, -7134663, -7648518, -7905350, -7857854, -7540257, -7045184, -6483904, -5958397, -5537956, -5213758, -4885466, -4468352, -4010536, -3626388, -3345356, -3079535, -2665577, -1952493, -922863, 305712, 1605637, 2905781]
16073B905781J223372R90087N96998J85533j38704l84863n44053n24970l00239
16064D008942k3605J15438O2184r8843k14208j83005n9294k454j18880l59384
16054C126891n73875o55129n82995l73312j03854J17247K64218L63469L75534
16045A958194K00041j60386n19812o59863n18542k15766J6529o441k68547o15162
16035g89755q67189q66963n97826k48366m2694m5826j82481l84174o40625r26306
16025e592205j126363j098745q21141m11394q422L44094O63105Q95222R47121
16016f208728Q21909N82943K73712M541l8897J90924N18623P56950Q74033R03614
16006a320376Q48143P12867N15461K87822Q4702p5292k20144k96590j52177K60250
$$ y = [2905781, 4129153, 5119240, 5716238, 5901771, 5763067, 5378204, 4834151, 4309181, 4008942, 3985337, 4100775, 4162959, 4064116, 3849908, 3666903, 3607609, 3605155, 3486275, 3126891, 2553016, 1897887, 1314892, 941580, 837726, 954973, 1219191, 1582660, 1958194, 2158235, 1997849, 1478037, 818174, 299632, 83866, 100395, 93954, -174593, -789755, -1656944, -2523907, -3121733, -3370099, -3412793, -3458619, -3641100, -4025274, -4665899, -5592205, -6718568, -7817313, -8638454, -9049848, -9058270, -8714176, -8051071, -7155849, -6208728, -5386819, -4803876, -4530164, -4525623, -4564520, -4373596, -3854973, -3098023, -2223990, -1320376, -472233, 240634, 756095, 1043917, 1128619, 1053327, 833183, 536593, 384416, 644666]
15996F44666P60143J073727J065238Q41623N96909L53096j1980m67064p96006
15987D060352q93499q42659p09129m68317j42547J43684K82982K49544N3738k27886
15977A506263m24024m46561l96700m13147n57394q32095j148506j319734j200506
15968e232404q00761k57763K44813N89879Q23037J052386J262419J329091J171079
15959A81776Q50828N22616K86518J54425J12447J23176J23314R3252N4140J7447
15949B519939K10J2455J3144n8330j79696k25934j19190O4347K00655K68413L21221
15938B817234L94494M47434L70584J27844j66009l44051l08433j22229N7787J67725
15928C442380K43459L27496M18904M76465M57518L49597K12980J50959J65314
$$ y = [644666, 1404809, 2478536, 3543774, 4385397, 4982306, 5335402, 5323422, 4856358, 4060352, 3166853, 2324194, 1615065, 1146748, 1004201, 1147885, 1430867, 1680411, 1734149, 1506263, 1082239, 635678, 238978, -174169, -731563, -1563658, -2712164, -4031898, -5232404, -6033165, -6290928, -6046115, -5456236, -4633199, -3580813, -2318394, -989303, 181776, 1032604, 1555220, 1841738, 1996163, 2108610, 2231786, 2355100, 2448352, 2502492, 2519939, 2520149, 2532604, 2545748, 2487418, 2307722, 2081788, 1962598, 2026945, 2227600, 2496013, 2817234, 3211728, 3659162, 4029746, 4157590, 3991581, 3647530, 3339097, 3216868, 3274655, 3442380, 3685839, 4013335, 4432239, 4908704, 5366222, 5715819, 5928799, 6079758, 6245072]
15919F245072J09816j09067l65110m79192m38352l00018o5204K46563N44110O88531
15909F077149N67423J73700m05380r77451j316452j352778j179452r05487n78993
15900A02279j78916L12219P75737J022556J006832Q41547O33234M00029J22579
15891E038096j90976m83895o70412p05263o46315n77727n36233n53493o40441
15882C3341p18815o93018n39533k83898J2510K73715M73791O06533O31540N17644
15872C13810K93545O6325j1096J27325L67746N26564M90035K60824k8784k25268
15862B181026l11694l98406n77191q24814j038470j125282j047653p90791l65030
15853d298305J62635O59520R46390R06186O15029L32658K74613L94786M95103
$$ y = [6245072, 6354888, 6245821, 5880711, 5401519, 4963167, 4663149, 4597945, 4844508, 5388618, 6077149, 6644572, 6818272, 6412892, 5435441, 4118989, 2766211, 1586759, 681272, 102279, -76637, 235582, 1011319, 2033875, 3040707, 3882254, 4515488, 4915517, 5038096, 4847120, 4363225, 3692813, 2987550, 2341235, 1763508, 1227275, 673782, 33341, -685474, -1378492, -1918025, -2201923, -2189413, -1915698, -1441907, -835374, -203834, 313810, 607355, 673680, 662584, 789909, 1157655, 1684219, 2174254, 2435078, 2406294, 2181026, 1869332, 1470926, 893735, 68921, -969549, -2094831, -3142484, -3933275, -4298305, -4135670, -3476150, -2529760, -1623574, -1008545, -675887, -401274, -6488, 488615]
15844D88615M70957L50165K09404Q2553l9295j28986j39084r7195j15960k33016
15834H48158k98841j58006J34160M33265P18365R97635J103794Q44214L08756
15825D931500k02340n07889o35804o98105q02829r83174j126752j058529p53105
15816a837027l36776Q3786M61863P66465R93987J176914J294305J217992Q50254
15807D671763K33018n06120j174239j552945j591759j466442j382588j382713
15799d152025j325661j091789p26989l47104j7471K53875M22217L97559J73712
15790f413676j00337k33651j78962o0070R595M3437R4748J61085K01839K19522
15780f256470K47172K94062L61913M65025O22364Q46620J124160J372561J485638
$$ y = [488615, 959572, 1309737, 1519141, 1601694, 1562399, 1433413, 1294329, 1197134, 1081174, 848158, 549317, 391311, 525471, 958736, 1677101, 2674736, 3778530, 4622744, 4931500, 4729160, 4221271, 3585467, 2887362, 2084533, 1101359, -25393, -1083922, -1837027, -2173803, -2090017, -1628154, -861689, 132298, 1309212, 2603517, 3821509, 4671763, 4904781, 4398661, 3224422, 1671477, 79718, -1386724, -2769312, -4152025, -5477686, -6569475, -7296464, -7643568, -7661039, -7407164, -6984947, -6587388, -6413676, -6514013, -6747664, -6926626, -6986696, -6977101, -6933664, -6838916, -6677831, -6475992, -6256470, -6009298, -5715236, -5353323, -4888298, -4265934, -3419314, -2295154, -922593, 563045]
15771E63045J421678J188544P98093K69925l44359q91675j151193j058345p73538
15762B2175m62697j62494J13204L06744L72203L28268K52025K06265J81601J54688
15752A311982J22322M1153j49237m51591p98444j080870j212537j143113q32215
15743d192550l46720O9288K00999R8667j9444l6036j1779n3486j85198l20526
15733d796785l48712k37159n7430O9951O7826m4622j54511j25185J14576N20163
15723d991888R26349J133198J063642Q30042O06981M66326L83511L39503L30974
15714A088638L26498K84187K07315J42112J34091J89910K59273K40606P0476j68251
15704B774855l81093o14786r06327j129625j113426q53819m90142j32498J90242
$$ y = [563045, 1984723, 3173267, 3971360, 4241285, 3896926, 3005251, 1854058, 795713, 22175, -440522, -603016, -489812, -183068, 189135, 517403, 769428, 975693, 1157294, 1311982, 1434304, 1475457, 1326220, 874629, 76185, -1004685, -2217222, -3360335, -4192550, -4539270, -4469982, -4268983, -4170316, -4189760, -4225796, -4237575, -4291061, -4476259, -4796785, -5145497, -5382656, -5440086, -5370135, -5302309, -5346931, -5501442, -5626627, -5512051, -4991888, -4065539, -2932341, -1868699, -1038657, -431676, 34650, 418161, 757664, 1088638, 1415136, 1699323, 1906638, 2048750, 2182841, 2372751, 2632024, 2872630, 2943106, 2774855, 2393762, 1778976, 872649, -256976, -1370402, -2224221, -2714363, -2846861, -2656619]
15695b656619M87564P48098Q92922Q36962N90005K27956j54650m32998m95832
15686D3408l49526j32938P808M2017j495j21749l14203n53975q39346j177843
15676c397842j501367j667941j556962j134730n00744J45915O25272Q62682R11927
15667g213790Q96735R21499J007186J035505Q43354M14110r4429m73788n77753
15658c241371l70324J3914L28259M20092L16954J69724R6336P4711L1058m3131
15648b203778j04753j48945k11450l05718m06819m44957l54152j42430J34296
15639d188706L95135N33692M45265J13771l51112q03675j117367j242946j239813
15630g455756j172099j020385p24660k84666J94103N48312O49961N05804K94367
$$ y = [-2656619, -2169055, -1420957, -528035, 308927, 898932, 1126888, 972238, 539240, 43408, -306118, -439056, -431248, -389231, -390726, -512475, -826678, -1380653, -2219999, -3397842, -4899209, -6567150, -8124112, -9258842, -9759586, -9613671, -8988399, -8125717, -7213790, -6317055, -5395556, -4388370, -3352865, -2509511, -2095401, -2189830, -2663618, -3241371, -3611695, -3597781, -3269522, -2849430, -2532476, -2362752, -2266416, -2191705, -2160647, -2203778, -2308531, -2457476, -2668926, -2974644, -3381463, -3826420, -4180572, -4323002, -4188706, -3793571, -3259879, -2814614, -2700843, -3051955, -3855630, -4972997, -6215943, -7455756, -8627855, -9648240, -10372900, -10657566, -10463463, -9915151, -9265190, -8759386, -8465019]
15621h465019K10737K87320M13291M87976N25135N81613O39458O45346O43814
15612d030329P28532Q60923R01682Q21866P25737O93556P40148Q43620R03735
15603C189470P87554M88859J17064k23141m60583n50167m78286k89665p3677O6250
15593B573678M3718j46734m02615o05510p19565p51019o91387n33949l35261k29005
15583a797649l15212n46004p42496p58616o02673l76798j38985J52050M89433
15574d636950O94759O36011M21157K12177N6556o6250j62624j98053j21667Q7201
15564c077683L63783N92402P15271P34378O81927O20880O01813O17304N94440
15555B444515M69045K85563J00707j39857m99645r27130j269188j376693j177759
$$ y = [-8465019, -8254282, -7966962, -7553671, -7065695, -6540560, -5958947, -5319489, -4674143, -4030329, -3301797, -2440874, -1539192, -717326, 8411, 701967, 1442115, 2285735, 3189470, 3977024, 4465883, 4582947, 4359806, 3899223, 3349056, 2870770, 2581105, 2507428, 2573678, 2617396, 2470662, 2068047, 1462537, 742972, -8047, -699434, -1233383, -1568644, -1797649, -2112861, -2658865, -3401361, -4159977, -4762650, -5139448, -5278433, -5126383, -4636950, -3942191, -3306180, -2885023, -2672846, -2616290, -2682540, -2845164, -3043217, -3164884, -3077683, -2713900, -2121498, -1406227, -671849, 10078, 630958, 1232771, 1850075, 2444515, 2913560, 3199123, 3299830, 3159973, 2660328, 1733198, 464010, -912683, -2090442]
15546b090442p04468j34660L28488O45228Q84430J052185J096306J023294R17581
15537C017942Q73978R37188J049002J106527J055371Q72528N69726K26947o3780
15528I645429k73995m03285l97464k23305l0753j3866j52959k94113l63429l16768
15518G175492o8142L31337O10666N47157K25696q3101k09805k31489l57466o80117
15508G260228j090853j413716j566795j548120j356464j033246o66587l20246
15500a735799j3189K57899M70837N71285N81611O20930P40089Q69286R17040Q14910
15490D094899N22034O8051m16438p63124q84711p99743n68225k78980o7040m428
15480I02295l5004r2762j25219n9870R1092K06461K03537J20123Q1043K07569
$$ y = [-2090442, -2794910, -2929570, -2601082, -1955854, -1071424, -19239, 1077067, 2100361, 3017942, 3891920, 4829108, 5878110, 6984637, 8040008, 8912536, 9482262, 9709209, 9645429, 9371434, 8968149, 8570685, 8347380, 8316627, 8302761, 8149802, 7855689, 7492260, 7175492, 7107350, 7438687, 8049353, 8596510, 8822206, 8739105, 8529300, 8297811, 7940345, 7260228, 6169375, 4755659, 3188864, 1640744, 284280, -748966, -1415553, -1735799, -1748988, -1491089, -1020252, -448967, 132644, 753574, 1493663, 2362949, 3279989, 4094899, 4616933, 4684984, 4268546, 3505422, 2620711, 1820968, 1252743, 973763, 906723, 902295, 867291, 774529, 649310, 589440, 680532, 886993, 1090530, 1210653, 1291696, 1499265]
15470A499265M90640P45517P46403M22043m0366l06953k36605J035K07440L13562
15460C841981K97779J81283O597j96110l45474l47948k15344m8532M2217Q652
15450C225101j08946k68301m64383o67882q45944j019088j221437j421738j550280
15441d342898j574824j466960j189722p75432k83777K45849O72073P90888O03388
15432g321415L52315K98922M91196P19025P96082P80186Q12445R30690J083217
15423a057337J176409J136794R92739Q68549Q60224R23871R38772Q34628O13430
15414G288079L63387J93621N9581j97903o21195j057676j290490j228829r51877
15405B556698o05354l43371k81807l93655n26111n74869n30651m29981l54055
$$ y = [1499265, 1989905, 2735422, 3481825, 3903868, 3863502, 3556549, 3319944, 3320979, 3528419, 3841981, 4139760, 4321043, 4327640, 4131530, 3786056, 3438108, 3222764, 3174232, 3216449, 3225101, 3116155, 2847854, 2383471, 1715589, 869645, -149443, -1370880, -2792618, -4342898, -5917722, -7384682, -8574404, -9349836, -9633613, -9387764, -8715691, -7924803, -7321415, -6969100, -6670178, -6178982, -5459957, -4663875, -3883689, -3071244, -2140554, -1057337, 119072, 1255866, 2248605, 3117154, 3977378, 4901249, 5840021, 6674649, 7288079, 7651466, 7845087, 7904668, 7706765, 7085570, 6027894, 4737404, 3508575, 2556698, 1951344, 1607973, 1326166, 932511, 406400, -168469, -699120, -1129101, -1483156]
15396a483156l58678m06161m47658m74509m37263k47731R9919M74981P18831P84003
15386a777422P28651O23447N04982L74683K25912Q7324K3111M8940J07759J68440
15376A115827K57366L59442L90395L06350J25551j24419l86318n39453m75297
15367A029444k22313O5072K38900K71586J82985n8859m40240q56570j206972j376597
15357b373564j221160p16982l7260N36862Q19852Q51270P30860M63894R9004j59025
15347a006249j42286Q4704L16453M26730M41422M19046L28426J32034q2569j92360
15337G25351j93741j90603k66290l81980m15856l50963l24800m20364n36525n21722
15327b877493l23361q565L13291N89512Q16534R72642J023225R48670P63657N66035
$$ y = [-1483156, -1841834, -2247995, -2695653, -3170162, -3607425, -3855156, -3755237, -3280256, -2561425, -1777422, -1048771, -425324, 79658, 454341, 680253, 767577, 790688, 839628, 947387, 1115827, 1373193, 1732635, 2123030, 2429380, 2554931, 2430512, 2044194, 1504741, 1029444, 807131, 872203, 1111103, 1382689, 1565674, 1506815, 1066575, 210005, -996967, -2373564, -3594724, -4311706, -4348966, -3812104, -2992252, -2140982, -1410122, -946228, -847224, -1006249, -1148535, -1063831, -747378, -320648, 120774, 539820, 868246, 1000280, 917711, 725351, 531610, 341007, 74717, -307263, -723119, -1074082, -1398882, -1819246, -2355771, -2877493, -3200854, -3209419, -2896128, -2306616, -1490082, -517440, 505785, 1454455, 2218112, 2784147]
15317B784147M64391M43739L91621K53256O0643j65505l75594m56517l35851m3406
15307C020924L12808N83853O54643N26701L32274K01823J08387o3980l63898p36612
15297D576923j075822j314169j449410j471045j310643r07264l15705K93431P24346
15288b249358Q57685P01709L73929K5410k44679m30589n82488o98768p05333n22691
15278c475173j40989L28817O87867P94681O91330N40047M53963M17704L26806
15269F25053R5485k53302n88140p37511n94672k11473K35286O01829Q66124J057954
15259A096633J173628J206820J163595J057024R46309Q64117P33403N02684K44494
15250H988707K8457j36993k57380l69943m85654m67012j52044L52767O95192O83721
$$ y = [2784147, 3248538, 3692277, 4083898, 4337154, 4397797, 4232292, 3856698, 3400181, 3064330, 3020924, 3333732, 3917585, 4572228, 5098929, 5431203, 5633026, 5741413, 5677433, 5313535, 4576923, 3501101, 2186932, 737522, -733523, -2044166, -2951430, -3267135, -2973704, -2249358, -1391673, -689964, -316035, -290625, -535304, -965893, -1548381, -2247149, -2952482, -3475173, -3616162, -3287345, -2599478, -1804797, -1113467, -573420, -119457, 298247, 625053, 720538, 467236, -120904, -858415, -1453087, -1664560, -1429274, -827445, 38679, 1096633, 2270261, 3477081, 4640676, 5697700, 6644009, 7508126, 8241529, 8744213, 8988707, 9017164, 8880171, 8622791, 8252848, 7767194, 7300182, 7148138, 7500905, 8196097, 8879818]
15240H879818M64299K57885J25043l62j54714k98498m07951n02921n97168p29908
15230G035523r62898j255551j427508j324565r68703n00589l2468L68012O08062
15221A539315N86502K69232k38233o80969q13241n95821j80656K38380N09298
15212F33807N30335L01303m0687l30110m69541m52240l23466j15891J36772L95384
15202B65666O59860R02956J062907J120772J044850Q02035M75940K28159J30200
15193F693345J08551O9772m594p7073p0698J06495M33340P30368Q50812Q11263
15183I651581O59013L66475k1770l30693m84602o04737p73372q93305q58093p20384
15173E990113n89269m84542l79383k96106l00454m19162o07901q09507r82672
$$ y = [8879818, 9344117, 9602002, 9727045, 9726683, 9571969, 9273471, 8865520, 8362599, 7765431, 7035523, 6072625, 4817074, 3389566, 2065001, 1096298, 595709, 563241, 931253, 1539315, 2125817, 2395049, 2156816, 1475847, 662606, 66785, -113871, 124509, 633807, 1164142, 1465445, 1424758, 1094648, 625107, 172867, -150599, -266490, -129718, 265666, 925526, 1828482, 2891389, 4012161, 5057011, 5859046, 6334986, 6563145, 6693345, 6801896, 6871668, 6867074, 6790001, 6719303, 6825798, 7259138, 7989506, 8840318, 9651581, 10310594, 10677069, 10655299, 10324606, 9840004, 9235267, 8461895, 7568590, 6710497, 5990113, 5400844, 4916302, 4536919, 4240813, 3940359, 3521197, 2913296, 2103789, 1121117]
15164A121117j068231r96543p54133m25202j29381N7736J38670J88798K39228
15155a627941K06850N7605q1118n5121J84116N55740Q60534R25797P67065N23984
15145B317511L45947L35237M48388M73866K44081j72775n59882p51624p15107
15136A965642n30608l83996m56024p13427r23544q87727o04991k16716J77206
15127b574185N65123R08961J148516J252628J178590Q99823M56124q0521o11736
15118C143323r95722j118293j006305q19841o74907n61578m44679l08124j49887
15109b936013n3J46712L31764N22298O55752P51361Q19051P58237N26585K86758
15099A862452K60826M91920Q36632J137014J275106J150918P19661M1310o82831
$$ y = [1121117, 52886, -943657, -1697790, -2122992, -2252373, -2194637, -2055967, -1867169, -1627941, -1421091, -1363486, -1444604, -1499725, -1315609, -759869, 100665, 1026462, 1793527, 2317511, 2663458, 2998695, 3447083, 3920949, 4165030, 3992255, 3432373, 2680749, 1965642, 1435034, 1051038, 595014, -118413, -1041957, -1929684, -2534675, -2751391, -2574185, -2009062, -1100101, 48415, 1301043, 2479633, 3379456, 3835580, 3755059, 3143323, 2147601, 1029308, 23003, -796838, -1471745, -2033323, -2478002, -2786126, -2936013, -2936066, -2789354, -2457590, -1935292, -1279540, -528179, 290872, 1049109, 1575694, 1862452, 2123278, 2615198, 3451830, 4588844, 5863950, 7014868, 7734529, 7775839, 7093008]
15090G093008j186386j317386j109802o98401k15773K39986N45190N61366L33823
15081D245625P7375q2714j44630r3432P4542K76998M19730M83921M82043M01900
15071F141358K31686m1k05543k85666k47267k28808l32758m61549m30826k09257
15061C971329O9591K80812L79550L75549L29351L23199L92109M69499M22643J94472
15051G208104j34977m80384q38422j154400j239632r40419l28408K98096O23538
15042C013096N37641J21309m64908j007857j296579j250704r95483p42879o15189
15033b701553o13626o48051o01890m63227l20991k19703j52823j61373k61593
15024f144830l51992l29973j97848J3817K94021N72360O94154N02753K676n18489
$$ y = [7093008, 5906622, 4589236, 3479434, 2781033, 2565260, 2805246, 3350436, 3911802, 4245625, 4323000, 4240286, 4095656, 4002224, 4076766, 4353764, 4773494, 5257415, 5739458, 6141358, 6373044, 6373003, 6167460, 5881794, 5634527, 5405719, 5072961, 4611412, 4180586, 3971329, 4040920, 4321732, 4701282, 5076831, 5406182, 5729381, 6121490, 6590989, 7013632, 7208104, 7073127, 6592743, 5754321, 4599921, 3360289, 2419870, 2091462, 2389558, 3013096, 3550737, 3672046, 3207138, 2199281, 902702, -348002, -1343485, -2086364, -2701553, -3315179, -3963230, -4565120, -5028347, -5349338, -5569041, -5721864, -5883237, -6144830, -6496822, -6826795, -7024643, -7010826, -6716805, -6144445, -5450291, -4947538, -4944862, -5463351]
15014e463351o99129m46999O9776O29042J037591J174225J046818P39146L42030
15005a570851k1490k51591l54419l80291l29132j82076L945R4600J772j83885
14995c173418k28552K0311M50478Q16265R75225R15194O87971L81841Q9185j36581
14985G97919k74074k98994j96405M2159M01218P64415R52655R27808Q25849P58299
14975D700849O97308N45354K33230k20665o61238q93482q72738p40404o42304
14966B145910o05261o11978o53526p21533p83203p55734n65349k16179J79151
14957b587702M61776N36883L88430J05620j19243j59230q0161n825P2820K43709
14947a142923N27160Q30117R96650R49366P48942M67065J10734l10321p49701
$$ y = [-5463351, -6162480, -6609479, -6539703, -5910661, -4873070, -3698845, -2652027, -1912881, -1570851, -1592341, -1843932, -2198351, -2578642, -2907774, -3089850, -3085905, -2991305, -2989533, -3173418, -3401970, -3381659, -2931181, -2114916, -1139691, -224497, 463474, 845315, 934500, 797919, 523845, 224851, 28446, 70605, 471823, 1236238, 2188893, 3116701, 3942550, 4700849, 5398157, 5943511, 6176741, 5956076, 5294838, 4401356, 3528618, 2788214, 2145910, 1540649, 928671, 275145, -446388, -1229591, -1985325, -2550674, -2766853, -2587702, -2125926, -1589043, -1200613, -1094993, -1214236, -1373466, -1453627, -1459452, -1386632, -1142923, -615763, 214354, 1211004, 2160370, 2909312, 3376377, 3487111, 3176790, 2427089]
14938B427089j106185j218517r84310m69667J30284N87313P44782O11059L19165
14929A041013j1521l34502o32436q70551r82832r00999o25808k42785J66304N85097
14919b809020R76308J196417J090131P13971L50914J84083J49394J33493P7409
14910B063100l0721j09923o2324Q9657K69275M32165M83941L07135o4310m34804
14900B943191o07836n30624l00564m7858J32051J59239J7135j76981k78119k82601
14890A027033l39730o23633j131787j586068j667630j382310j017116p52694n37298
14881h011233k91909m8390J06284J52718J59062J67649J86210K66756M49018O77157
14871f186678Q63537R84748J065236J139716J216666J222383J085374Q33493N64130
$$ y = [2427089, 1320904, 102387, -881923, -1351590, -1221306, -633993, 110789, 721848, 1041013, 1029492, 694990, 62554, -807997, -1790829, -2691828, -3317636, -3560421, -3394117, -2809020, -1832712, -636295, 453836, 1167807, 1518721, 1702804, 1852198, 1985691, 2063100, 2032379, 1922456, 1860132, 1949789, 2219064, 2651229, 3135170, 3442305, 3377995, 2943191, 2335355, 1804731, 1504167, 1456309, 1588360, 1747599, 1764734, 1587753, 1309634, 1027033, 687303, 63670, -1068117, -2654185, -4321815, -5704125, -6721241, -7473935, -8011233, -8303142, -8351532, -8245248, -8092530, -7933468, -7765819, -7579609, -7312853, -6863835, -6186678, -5323141, -4338393, -3273157, -2133441, -916775, 305608, 1390982, 2224475, 2788605]
14862B788605L65233K58056K43527L00445L61122L50426K13246l4384k70716l73237
14852D202323l54311l38407m28264o05414p37373p03603n27366l15403j35449
14843E6733k7376k4859j26726k70160l16064j77277N4563K36936L08409K47600
14833c8221P4335j16181k05268j76045j64582l04727n94608r35207j174609j173086
14823d808199q79708l62447J96635O07648Q16318Q86275Q57417P36103N70937
14814a379021M15094K66872J07957o9738k58238m01900m18772k99802j33638O523
14804b164663J10921J50917P8361p3608j97320k41807k31918j77989j13271j50949
14794c011326l08849m07743k70881R0000N05324P92460Q60511P48471O03766N84403
$$ y = [2788605, 3153838, 3411894, 3655421, 3955866, 4316988, 4667414, 4880660, 4846276, 4575560, 4202323, 3848012, 3509605, 3081341, 2475927, 1738554, 1034951, 507585, 192182, 56733, 29357, 4498, -122228, -392388, -708452, -885729, -831166, -594230, -285821, -38221, 36114, -80067, -285335, -461380, -625962, -930689, -1525297, -2460504, -3635113, -4808199, -5687907, -6050354, -5853719, -5246071, -4429753, -3543478, -2686061, -1949958, -1379021, -963927, -697055, -589098, -658836, -917074, -1318974, -1737746, -2037548, -2171186, -2164663, -2053742, -1902825, -1824464, -1898072, -2095392, -2337199, -2569117, -2747106, -2860377, -3011326, -3320175, -3727918, -3998799, -3908799, -3403475, -2611015, -1750504, -1002033, -398267, 186136]
14784A86136P17554Q59124Q28922N71830J63895k89552o86708r32324j012673
14775D06204r84229q57324o16785l50114j89109j42683j09522k8102N6287J14944
14765b700433K41216N13428Q60460J139313J244671J117864P43773K04093k95692
14756C068693n74255o55330p05380q33904r86812j054587j025706r72245r52719
14747d692245r42971q75636o97882m03388r6098N7252k855j71763l25317m13317
14737h564220m30393m12037l77558k64438J7727M55852Q72169J074255J047098
14728f581545Q84833O35203K73447k14529p00192r49191q69570o18958l96366
14719h536868k09210Q0741M88682Q39056R49590P34459K61109k73130p18435r86943
$$ y = [186136, 903690, 1762814, 2591736, 3163566, 3327461, 3037909, 2351201, 1418877, 406204, -578025, -1435349, -2052134, -2402248, -2591357, -2734040, -2843562, -2871664, -2815377, -2700433, -2459217, -1945789, -1085329, 53984, 1298655, 2416519, 3160292, 3364385, 3068693, 2494438, 1839108, 1133728, 299824, -686988, -1741575, -2767281, -3739526, -4692245, -5635216, -6510852, -7208734, -7612122, -7708220, -7650968, -7653823, -7825586, -8150903, -8564220, -8994613, -9406650, -9784208, -10048646, -10030919, -9575067, -8702898, -7628643, -6581545, -5696712, -5061509, -4788062, -5002591, -5702783, -6651974, -7521544, -8140502, -8536868, -8746078, -8665337, -8176655, -7337599, -6388009, -5653550, -5392441, -5665571, -6384006, -7370949]
14709g370949r64935o10636p0899M36346P95197R70940R43850P42962M53094J80912
14699d494118K1253J218N9485R2367L4879m1416K6649K63326N14387O59088O77105
14688b185777N52667K82279m0126k54334k75629j40583O2662K76355M60716N44825
14678g16945M88070L44524K17386J81839K73707M78074P02517Q22469P50624M88071
14668D030336J39466j47145k77191k56792j59803o8924n8618j44739k60305l43576
14658B452709m31709o01481q10592r15609q20880n44269j90359J47859M68820
14649a245511P82941J004708J031675Q31669M20895q8711m83814o20246n31067
14640A102539l24460j06326N3704J79335K65098J90721n7657k87091l27893k15753
$$ y = [-7370949, -8335884, -8946520, -9017419, -8581073, -7785876, -6814936, -5871086, -5128124, -4675030, -4494118, -4472865, -4471647, -4412162, -4319795, -4284916, -4326332, -4299683, -4036357, -3521970, -2862882, -2185777, -1633110, -1350831, -1390957, -1645291, -1920920, -2061503, -1998841, -1722486, -1261770, -716945, -228875, 115649, 333035, 514874, 788581, 1266655, 1969172, 2791641, 3542265, 4030336, 4169802, 4022657, 3745466, 3488674, 3328871, 3259947, 3201329, 3056590, 2796285, 2452709, 2021000, 1419519, 608927, -306682, -1127562, -1671831, -1862190, -1714331, -1245511, -462570, 542138, 1573813, 2405482, 2826377, 2737666, 2253852, 1633606, 1102539, 778079, 671753, 725457, 904792, 1169890, 1360611, 1302954, 1015863, 687970, 472217]
14630D72217j23840j65977k73858l27713k97015j60724P6830L29084N56009P88174
14620H73187J007260J135370J081011P98237L60718p5661l94676n59180n73030
14611C653236m81002l41015k05780j48645j76487j60239M925K59467M52059M80915
14601C337434L80580K52238J15945p2442k98724m88040n96578o22669n61232m06351
14591A040161j97746K715J50333J95101R9204j01785k76344k81322r2898J59717
14581F97136L03121K82081J90677J14060L4137n7738r5990l9167O2561J19658
14571A610536R0890J1789n7197j01140j61101k80441m72160p07918q75897q20872
14561a763511m80642K0383M35325N89865M79576K09334o4143j91803r3451K09206
$$ y = [472217, 348377, 182400, -91458, -419171, -716186, -876910, -800080, -470996, 85013, 873187, 1880447, 3015817, 4096828, 4895065, 5255783, 5180122, 4785446, 4226266, 3653236, 3172234, 2831219, 2625439, 2476794, 2300307, 2140068, 2144993, 2404460, 2856519, 3337434, 3718014, 3970252, 4086197, 4013755, 3715031, 3226991, 2630413, 2007744, 1446512, 1040161, 842415, 845130, 995463, 1190564, 1289768, 1187983, 911639, 630317, 537419, 697136, 1000257, 1282338, 1473015, 1587075, 1621212, 1563474, 1467484, 1428317, 1490878, 1610536, 1701426, 1713215, 1656018, 1554878, 1393777, 1113336, 641176, -66742, -942639, -1763511, -2244153, -2223770, -1788445, -1198580, -719004, -509670, -573813, -765616, -859067, -649861]
14551f49861N53431P04162N35592J13519l59403o84150p83391o66551l62304P5323
14541a523633N52445R66889J241433J314193J131317P12755J68650l43057o18478
14532C602514n31600j74599K41108N63806P40127P27981N02172J08197l91775
14523E387931r43512j469637j857064j977423j770813j266959n56552J61521O22243
14514c670265P11053N52460L21250J51055J74650L90429O02449O25090M21665
14505B79836O0441l31434n88949o21866n27134m97952n72935n58411k79916K05329
14495c432991O99038J078250J336065J456541J381300J130050Q30089N89188M50497
14486E518027M28885M90089N31080M42152J90034j67203n49604r05054j166206
$$ y = [-649861, -96430, 607732, 1143324, 1256843, 897440, 213290, -570101, -1236652, -1598956, -1523633, -971188, -4299, 1237134, 2551327, 3682644, 4395399, 4564049, 4220992, 3602514, 3070914, 2896315, 3137423, 3701229, 4441356, 5169337, 5671509, 5779706, 5387931, 4444419, 2974782, 1117718, -859705, -2630518, -3897477, -4454029, -4292508, -3670265, -2959212, -2406752, -2085502, -1934447, -1759797, -1369368, -766919, -141829, 279836, 340277, 8843, -580106, -1201972, -1729106, -2227058, -2799993, -3358404, -3638320, -3432991, -2733953, -1655703, -319638, 1136903, 2518203, 3648253, 4478342, 5067530, 5518027, 5946912, 6437001, 6968081, 7410233, 7600267, 7433064, 6883460, 5978406, 4812200]
14477D812200j253903j176031j068508j088514j206756j196042q89441l10150
14469c377145M27250J161815J694554J905030J803165J428710Q50115K25549k70266
14460E848777n49086o34877o28390o14641n91395m79067k07699J71693M98465
14451B813780O17360M93102K55851P9917J5270n857l6348p7173j33255j87248
14441C835399j67005l6335J34781K57943L19506L23004K16837l0867l09198m53999
14431D090066m60840m70456n61455o54664o13799l90034n4282K81798N18369O07755
14421B292458O03548N75927M64378J47676l57856q55070j088888r20679m32437
14412D29057J18328M97169O34111N81459M18834K15180L0385j04024k09843l60198
$$ y = [4812200, 3558297, 2382266, 1313758, 225244, -981512, -2177554, -3066995, -3377145, -2949895, -1788080, -93526, 1811504, 3614669, 5043379, 5893494, 6119043, 5848777, 5299691, 4664814, 4036424, 3421783, 2830388, 2351321, 2143622, 2315315, 2813780, 3431140, 3924242, 4180093, 4260010, 4275280, 4269423, 4233075, 4155902, 4022647, 3835399, 3668394, 3632059, 3766840, 4024783, 4344289, 4667293, 4884130, 4853263, 4544065, 4090066, 3629226, 3158770, 2597315, 1942651, 1328852, 938818, 884536, 1166334, 1684703, 2292458, 2896006, 3471933, 3936311, 4083987, 3726131, 2871061, 1782173, 861494, 429057, 547385, 1044554, 1678665, 2260124, 2678958, 2894138, 2924523, 2820499, 2610656, 2250458]
14402B250458n96607q18385q22197n12175l4403L76477O35073P60768P66970P48192
14392B754171Q39887J019369J113927J003450O91042K38837k31714n70496o92219
14383F166254o11360m02319j67514n8163j98363n66716j027595j396496j488494
14374B49234j220060o65024M557N97673R50531R99088Q21746N52318K71040j3764
14364B547339l13126n98907q30622r94886j093946j119771j021237p38832l12388
14355d476376R4283L11199L19087K05880J8143k02423l59332l34500m7354M61891
14345d009502J011308J363783J376463J089361O70806K85238L828j73400k42156
14336A375729j79480k6381Q4458O2155p0913k54133m13799m33803k40227J00113
$$ y = [2250458, 1653851, 835466, 13269, -498906, -533309, -156832, 478241, 1239009, 2005979, 2754171, 3594058, 4613427, 5727354, 6730804, 7421846, 7660683, 7428969, 6858473, 6166254, 5554894, 5152575, 4985061, 4926898, 4728535, 4161819, 3134224, 1737728, 249234, -970826, -1635850, -1631293, -1033620, -83089, 915999, 1737745, 2290063, 2561103, 2547339, 2234213, 1635306, 804684, -190202, -1284148, -2403919, -3425156, -4163988, -4476376, -4382093, -4070894, -3751807, -3545927, -3527784, -3730207, -4089539, -4424039, -4471393, -4009502, -2998194, -1634411, -257948, 831413, 1502219, 1787457, 1791285, 1617885, 1375729, 1196249, 1169868, 1254326, 1316481, 1245568, 991435, 577636, 143833, -96394, 3719]
14326C719M29863O22318O59517O09911N37558M54772L41173K01267L9879k01157
14316C698820n39138q59654j028378j032920r37009p42000m25163k3369L80976
14307a507835O78439Q07997P97587P18925O17076M61824K13237r8475l80667m99024
14297A809084l80414j31056J12373L26520M66610M47508L13694K21992K58690
14288C445001L60332M08942L73237L11098K84331L28375M24897M66938L04219
14279F707370j04455n75640q26705p12990l29557P1506K93365L15317K12078Q6625
14269E136914P8931K70607N87011Q99918J171169J432699J656916J742909J639400
14260A4616474J394618J126618R54298R25379J032526J232184J467078J707616
$$ y = [3719, 433582, 1055900, 1715417, 2325328, 2862886, 3317658, 3658831, 3860098, 3899977, 3698820, 3159682, 2300028, 1271650, 238730, -698279, -1440279, -1865442, -1888811, -1507835, -829396, -21399, 776188, 1495113, 2112189, 2574013, 2787250, 2688775, 2308108, 1809084, 1428670, 1297614, 1409987, 1736507, 2203117, 2650625, 2964319, 3186311, 3445001, 3805333, 4214275, 4587512, 4898610, 5182941, 5511316, 5936213, 6403151, 6707370, 6602915, 6027275, 5200570, 4487580, 4158023, 4229529, 4522894, 4838211, 5050289, 5136914, 5215845, 5486452, 6073463, 6973381, 8144550, 9577249, 11234165, 12977074, 14616474, 16011092, 17137710, 18092008, 19017387, 20049913, 21282097, 22749175, 24456791]
14252B4456791J892791J909859J716122J398143J055695O73050J88855l69507
14244C2921799q76332j176254j218450j141979j136261j246764j383214j449681
14236B3292864j384135j173755q97710o56877m81087l45531k24889j58809k10284
14227A7759787l37766m12001l74655l02572k78721k87110k56627j45287L4601
14218A5399649K30449L93188N10273N75770N66407M49652K26113q2246m68429
14209A7800826q80803j170742j191280r72032p09183n56914n06619m64700l75232
14200A0973321k31470m8802P7004q920l20665o52115p53836n40467j59091J18322
14190H453281J38507k0215k04563k78301j17961K64498O71613R30380J058037
$$ y = [24456791, 26349582, 28259441, 29975563, 31373706, 32429401, 33102451, 33291306, 32921799, 32045467, 30869213, 29650763, 28508784, 27372523, 26125759, 24742545, 23292864, 21908729, 20734974, 19837264, 19180387, 18699300, 18353769, 18128880, 17970071, 17759787, 17422021, 17010020, 16635365, 16332793, 16054072, 15766962, 15510335, 15365048, 15399649, 15630098, 16023286, 16533559, 17109329, 17675736, 18125388, 18351501, 18269255, 17800826, 16920023, 15749281, 14558001, 13585969, 12876786, 12319872, 11813253, 11348553, 10973321, 10741851, 10693049, 10770053, 10761133, 10440468, 9788353, 9034517, 8494050, 8334959, 8453281, 8591788, 8571573, 8367010, 8088709, 7970748, 8235246, 8906859, 9837239, 10895276]
14181A0895276J164181J260525J240526J019896O12339J41904k17934m01644m77368
14172A5237701n25757n78493n78735m28916j21859K43213N33319O53942N80673
14163A5015088L43502J9174k96311n27087o15475n21030k37855J68895N37793
14154A3886694O56130M07137r2239n54562p82224p95442o90774m90686j70681
14145A1373353K05841M87798N65271M27838J69409p2579k08422j66635R3360M88385
14135A3363619Q52083J029164R21726N51863P8935l12563n25748n42308l67069
14126A5049702l6991L05243M98172N70076O96679R66813J281044J487405J575228
14117B2393371J618606J595554J450818J260267J191531J354396J756644K328901
$$ y = [10895276, 12059457, 13319982, 14560508, 15580404, 16192743, 16334647, 16116713, 15715069, 15237701, 14711944, 14133451, 13554716, 13125800, 13003941, 13247154, 13780473, 14434415, 15015088, 15358590, 15377764, 15081453, 14554366, 13938891, 13417861, 13180006, 13348901, 13886694, 14542824, 14949961, 14857722, 14303160, 13520936, 12725494, 12034720, 11544034, 11373353, 11579194, 12066992, 12632263, 13060101, 13229510, 13156931, 12948509, 12781874, 12875234, 13363619, 14215702, 15244866, 16166592, 16718455, 16797390, 16484827, 15959079, 15416771, 15049702, 15012711, 15317954, 15816126, 16386202, 17082881, 18049694, 19330738, 20818143, 22393371, 24011977, 25607531, 27058349, 28318616, 29510147, 30864543, 32621187, 34950088]
14109C4950088K930726L412781L696314L750245L586386L325185L146139L111784
14101F1909648L148938L268829L628847M284511N062400N690952N898338N482377
14093I8374840M478252L176505J890627P32482l72798j487247k556734l456463
14085A00779464m098586m512264m769978m894640m901802m805466m549756m093350
14077F4153622l508614k890724k327383j928402j706092j537072j302443r77828
14069D7975064o16949l01955j14298j37851m15390q47764j222820j403060j413586
14060D1501391j348557j244045j049915p36243l41807N7896L60431M61629L29189
14051C7989969M3353k73258n02646n71278n64602o54443q84992j166660j388806
$$ y = [34950088, 37880814, 41293595, 44989909, 48740154, 52326540, 55651725, 58797864, 61909648, 65058586, 68327415, 71956262, 76240773, 81303173, 86994125, 92892463, 98374840, 102853092, 106029597, 107920224, 108652706, 108279908, 106792661, 104235927, 100779464, 96680878, 92168614, 87398636, 82503996, 77602194, 72796728, 68246972, 64153622, 60645008, 57754284, 55426901, 53498499, 51792407, 50255335, 48952892, 47975064, 47358115, 47056160, 46941862, 46804011, 46388621, 45540857, 44318037, 42914977, 41501391, 40152834, 38908789, 37858874, 37122631, 36780824, 36838720, 37199151, 37660780, 37989969, 38033322, 37760064, 37257418, 36686140, 36121538, 35467095, 34582103, 33415443, 32026637]
14042C2026637j467341j396050j259086j114682r16901n92467j24043M81833J192541
14033B6830441J877557K351695K536139K496950K323945K070494J780437J539722
14025D3807380J458039J558529J784972K080709K376711K571171K541611K166767
14017F0345889J442806N90912r0517m51133n13743l67020j49141l7167j15517
14008F0655369l22686n63684q05289j022385j151154j166856j081071q50755m89431
13999E3202058j42292R8280K88827N13275P68074R94832J195144J456106J824267
13990F0198571K209792K487049K658342K862163L239765L863353M719822N673124
13982H7911981O589039P461354Q328067R215333J0181418J1341709J2834789J4717939
$$ y = [32026637, 30559296, 29163246, 27904160, 26789478, 25872577, 25280110, 25156067, 25637900, 26830441, 28707998, 31059693, 33595832, 36092782, 38416727, 40487221, 42267658, 43807380, 45265419, 46823948, 48608920, 50689629, 53066340, 55637511, 58179122, 60345889, 61788695, 62379607, 62289090, 61837957, 61324214, 60957194, 60808053, 60770886, 60655369, 60332683, 59768999, 58963710, 57941325, 56790171, 55623315, 54542244, 53691489, 53202058, 53059766, 53158046, 53446873, 53960148, 54728222, 55723054, 56918198, 58374304, 60198571, 62408363, 64895412, 67553754, 70415917, 73655682, 77519035, 82238857, 87911981, 94501020, 101962374, 110290441, 119505774, 129687192, 141028901, 153863690, 168581629]
13974A68581629J6895431J9151683K1188480K2623611K2941071K1499230J7781753
13967C10662888J1815031M411759l063391r282193j3454843j5497703j5849405
13960B69742143j5101217j3738304j2137697j0673562r647276r106343q856621
13953A90481123q646660q333113p893248p351220o759662o227359n848770n609652
13945A33811439n463873n406617n432881n489113n470240n264115m795752m064144
13937I2424704l214188k492355j992595j558196j026500m13269J43183N04355
13929H2375139O05396M70838K25168L2035o5627j49309k99365n42553q37363j116447
13919H0697912j356281j586874j860516k192641k460606k467671k193398j862061
$$ y = [168581629, 185477060, 204628743, 225817223, 248440834, 271381905, 292881135, 310662888, 322477919, 326889678, 323826287, 314544094, 301089251, 285591548, 269742143, 254640926, 240902622, 228764925, 218091363, 208444087, 199337744, 190481123, 181834463, 173501350, 165608102, 158256882, 151497220, 145269861, 139421091, 133811439, 128347566, 122940949, 117508068, 112018955, 106548715, 101284600, 96488848, 92424704, 89210516, 86718161, 84725566, 83167370, 82140870, 81727601, 81870784, 82375139, 82980535, 83451373, 83676541, 83708576, 83642949, 83493640, 83194275, 82651722, 81814359, 80697912, 79341631, 77754757, 75894241, 73701600, 71240994, 68773323, 66579925, 64717864]
13911F4717864j702388j727762j802798j851512j907305k008208k137233k220981
13903D9359677k172046j927496j455845q07807j80800J63140J01773k80808p72941
13894D2026847j143398j291755j303817j298383j263900j089577p10583k21902
13886C3703532J61309K95828K04298M072j70986k24265j69154j25378k05214m16065
13876C3057977o49074p53533o76444m87370k78667j08724M7044K44949M45353
13867C0841511N24277L62545o2321o18332j079856j260688j136343q71000o95422
13858B6004371p16915q32546p92160m00813K77327R78701J480497J706809J672755
13849B9378026J441270J068378N38409j03298o30430q35879p30157m45974j05054
$$ y = [64717864, 63015476, 61287714, 59484916, 57633404, 55726099, 53717891, 51580658, 49359677, 47187631, 45260135, 43804290, 42996483, 42815683, 42978823, 43080596, 42799788, 42026847, 40883449, 39591694, 38287877, 36989494, 35725594, 34636017, 33925434, 33703532, 33864841, 34160669, 34364967, 34369039, 34198053, 33973788, 33804634, 33679256, 33474042, 33057977, 32408903, 31655370, 30978926, 30491556, 30212889, 30104165, 30151209, 30396158, 30841511, 31365788, 31728333, 31666012, 31047680, 29967824, 28707136, 27570793, 26699793, 26004371, 25287456, 24454910, 23662750, 23261937, 23539264, 24517965, 25998462, 27705271, 29378026, 30819296, 31887674, 32426083, 32322785, 31692355, 30856476, 30126319, 29680345, 29575291]
13840B9575291J99951M49754O72818Q32294Q49217P00974M46458J59351j32364
13831C3753744m21352p11175r76972j126424j119791j055909j030445j017910
13823B6293766r64686q89816q16825p01471n05600k87132j53542j56372k86356
13814B1531966m94825o67526o56203m04536l2882K33838K42906L1086k37381m40204
13804A9106239n60805o12975n98104n47495n53675o73234p99326p65169n49878
13795A3445578k84715r5343J6532J27985K68577L81491L86922K55117J4853k97636
13785A4219361o56638j004546j244490j303465j171263q94319n34579j55633J67675
13776G422103M06319N59752N55344L00498j56256o20720r03054r30283p63654
$$ y = [29575291, 29775242, 30224996, 30897814, 31730108, 32579325, 33280299, 33726757, 33886108, 33753744, 33332392, 32621217, 31644245, 30517821, 29398030, 28342121, 27311676, 26293766, 25329080, 24439264, 23622439, 22920968, 22415368, 22128236, 21974694, 21818322, 21531966, 21037141, 20369615, 19713412, 19308876, 19275994, 19509832, 19752738, 19783824, 19546443, 19106239, 18545434, 17932459, 17334355, 16786860, 16233185, 15559951, 14760625, 13995456, 13445578, 13160863, 13065520, 13082052, 13210037, 13478614, 13860105, 14247027, 14502144, 14516997, 14219361, 13562723, 12558177, 11313687, 10010222, 8838959, 7944640, 7410061, 7254428, 7422103, 7828422, 8388174, 8943518, 9244016, 9087760, 8467040, 7563986, 6633703, 5870049]
13767E870049n16962k02577K68271Q31184J238254J339979J172262Q44867M68387
13758A1313714Q0649l58812q12462j118685j149703r23545n34122j20422J14137
13749F490749P1409r2936j90291k13552j43952J23620N52099R65352J257877J421227
13739A0241602J400289J084554M77991k51717q72462j193498j186671j000145
13731H699943p95633n89690l20415k6158J67298K01114J37894J15683K63910N71601
13721H425547Q89914J102517J214266J227307J028171N30688j60999p84684j100030
13712A2372697j060888p89025m33261j03892J61947M07128O56369Q48258R06587
13703A2965920Q54534Q24765R33018J120547J208219J103552Q57161N59816K63017
$$ y = [5870049, 5353087, 5150510, 5418781, 6249965, 7488219, 8828198, 10000460, 10845327, 11313714, 11394363, 11035551, 10223089, 9104404, 7954701, 7031156, 6497034, 6376612, 6490749, 6562158, 6469222, 6278931, 6065379, 5921427, 6045047, 6597146, 7562498, 8820375, 10241602, 11641891, 12726445, 13204436, 12952719, 12080257, 10886759, 9700088, 8699943, 7904310, 7314620, 6994205, 6968047, 7135345, 7336459, 7474353, 7590036, 7853946, 8425547, 9315461, 10417978, 11632244, 12859551, 13887722, 14418410, 14257411, 13472727, 12372697, 11311809, 10522784, 10089523, 9985631, 10147578, 10554706, 11211075, 12059333, 12965920, 13820454, 14645219, 15578237, 16698784, 17907003, 19010555, 19867716, 20427532, 20690549]
13694B0690549j7924k58697m16787m50322l26599p6292K19864N61423J020259
13685B0945474J560353K024272K327212K522098K664536K759645K803700K790124
13677D0397414K708632K521660K159192J567224P86785l3506p44029j276616j641184
13668D6445572j873678j995785k004464j903160j765617j687892j664115j639970
13660C1910891j626773j633510j607693j518735j374371j179243r98748r72862
13652B0998956j141850j355139j414299j231950q61947m39887j14945M0675Q4211
13643A4563825J21091K17182L61648M85435N31071M76479L31544J41070l1501
13634A7197844j56027k60080l73935m93371o23212p75521q84030q28825n85480
$$ y = [20690549, 20672625, 20413928, 19997141, 19546819, 19220220, 19143928, 19363792, 19925215, 20945474, 22505827, 24530099, 26857311, 29379409, 32043945, 34803590, 37607290, 40397414, 43106046, 45627706, 47786898, 49354122, 50140907, 50107401, 49363372, 48086756, 46445572, 44571894, 42576109, 40571645, 38668485, 36902868, 35214976, 33550861, 31910891, 30284118, 28650608, 27042915, 25524180, 24149809, 22970566, 21971818, 20998956, 19857106, 18501967, 17087668, 15855718, 14993771, 14553884, 14438939, 14479614, 14563825, 14684916, 14902098, 15263746, 15749181, 16280252, 16756731, 17088275, 17229345, 17197844, 17041817, 16781737, 16407802, 15914431, 15291219, 14515698, 13631668, 12802843, 12217363]
13625A2217363k84922p9589M2088J76204L03633L26292J96830j8037j60548j51015
13615A2568299n8492Q0873K83206M29866L59876R3458k55131o06477q61410r43499
13605A1090569r08203q95964r49340r28877o46461j19642M01617P42234R28374
13596H714307R88209Q46814M79877M6319k81665m52964m15095j41758K23828M80729
13586A0488601N30298L54530K0583l07995m84681m70587l36806k16341k05372
13577I372230l16467m85595n86469n39778l78220j82200m2427m6522k21115m72472
13567F100965o41371o43723n21106l65006k64026k78684l67887m14475l84314
13558B220373l64353m45409o23195p70441p50972n72131k98727Q1965N33165Q55456
$$ y = [12217363, 11932441, 11852852, 11894940, 12071144, 12374777, 12701069, 12897899, 12879862, 12719314, 12568299, 12509807, 12590680, 12873886, 13303752, 13663628, 13757086, 13501955, 12895478, 12034068, 11090569, 10182366, 9286402, 8337062, 7408185, 6761724, 6642082, 7043699, 7785933, 8714307, 9702516, 10549330, 11029207, 11075526, 10793861, 10340897, 9925802, 9784044, 10007872, 10488601, 11018899, 11373429, 11394012, 11086017, 10601336, 10130749, 9793943, 9577602, 9372230, 9055763, 8570168, 7983699, 7443921, 7065701, 6883501, 6841074, 6794552, 6573437, 6100965, 5459594, 4815871, 4294765, 3929759, 3665733, 3387049, 3019162, 2604687, 2220373, 1856020, 1410611, 787416, 16975, -733997, -1306128, -1604855, -1522890, -989725, -134269]
13548a34269Q61867N65935J63695j33262k41684j95962o3230Q8302J68798J07368
13538A187558q3663k92701l77071l07468j94042j35600j08106k2429J50734L29139
13528A46351L72194J47628l40201q71289j169388j117432p86738l23512R5881
13519c846506L31603M24804N42915P51726R23243Q75941N62377J30792j83878
13510E13017l02818l63207m81083n78188n36668l92639k21484p531K64614N22285
13500a583702O40571N29948K09487j78189m70785n96216n55390l48727L9667N66188
13490a747148J032477J204062J073718Q15315N25934K27584p100j06099o5202
13481B953541P2876K48145L98594M84698M84199L64427J22352j75350m35526n91277
$$ y = [-134269, 727598, 1293533, 1457228, 1323966, 1082282, 886320, 823090, 911392, 1080190, 1187558, 1103895, 811194, 434123, 126655, -67387, -202987, -311093, -333522, -182788, 146351, 518545, 666173, 325972, -545317, -1714705, -2832137, -3618875, -3942387, -3846506, -3514903, -3090099, -2547184, -1795458, -872215, 3726, 566103, 696895, 513017, 210199, -153008, -634091, -1212279, -1748947, -2141586, -2363070, -2370601, -2105987, -1583702, -943131, -413183, -203696, -381885, -852670, -1448886, -2004276, -2353003, -2313336, -1747148, -714671, 489391, 1563109, 2378424, 2904358, 3131942, 3124842, 3018743, 2953541, 3026417, 3274562, 3673156, 4157854, 4642053, 5006480, 5128832, 4953482, 4517956, 3926679]
13471C926679o16004n32849m12046l28111k75614j52917J08921M09971N39769
13462B667799M13422J90653R5571J97334L78120M39528K92276O1092o7989m0840
13452D626966O4512J45285J53344J02983K4076p3349j95850l35444m74800o13164
13442C424559p22452p55131p37249p52426q21403q63645p69138m86154q9517K67190
13432b305366M69499M56804K35862q9581l41338l63305j36045K05090M38011M16521
13422a013848J94825m6671j63072j26564K8429K91148O45247R82439J165728J192556
13412C150217J165228J101462R00663M92397n2852n33857p62661p31940n50828
13403D177829k99717o2738N2380K6100m6385o4710j5387N2106Q1452J2523j79210
$$ y = [3926679, 3310675, 2777826, 2365780, 2037669, 1762055, 1609138, 1718059, 2128030, 2667799, 3081221, 3271874, 3367445, 3564779, 3942899, 4382427, 4674703, 4735795, 4667806, 4626966, 4691478, 4836763, 4990107, 5093090, 5117166, 5043817, 4847967, 4512523, 4037723, 3424559, 2702107, 1946976, 1209727, 457301, -364102, -1227747, -1996885, -2483039, -2572556, -2305366, -1835867, -1379063, -1143201, -1232782, -1574120, -1937425, -2073470, -1868380, -1430369, -1013848, -819023, -865694, -1028766, -1155330, -1126901, -835753, -190506, 791933, 1957661, 3150217, 4315445, 5416907, 6317570, 6809967, 6757115, 6223258, 5460597, 4728657, 4177829, 3878112, 3815374, 3867754, 3893854, 3847469, 3782759, 3767372, 3819478, 3900930, 3913453, 3734243]
13392C734243m52571p33937r26179r49844p93487m67145r557M03061N71213N03446
13382H79243L38837J62209N645j10197j66343j07776J39908N59394R85514J247262
13372C933696J301167J173258Q91347N10973J36320j16915j77350p5048M5074
13363G622522L7845j16584l34920n59520q03700j067466j297262j427500j421067
13354F32348j280477j047487p76930n04274j94387K13537O54564R81454J140106
13345a81546J131863Q81999L48793k89271p43393q81250p90503o22183m48779
13336a594270k82403j19079M0693J50579J64504J65534L02171N74859Q13131Q55908
13326A071627P12102N20568M07693L92621L94829L67576L54124L67710L54925
$$ y = [3734243, 3281672, 2547735, 1621556, 671712, -121775, -588920, -598477, -195416, 375797, 879243, 1218080, 1380289, 1385934, 1275737, 1109394, 1001618, 1141526, 1700920, 2686434, 3933696, 5234863, 6408121, 7299468, 7810441, 7946761, 7829846, 7652496, 7577448, 7622522, 7660367, 7543783, 7208863, 6649343, 5845643, 4778177, 3480915, 2053415, 632348, -648129, -1695616, -2472546, -2976820, -3171207, -2957670, -2303106, -1321652, -181546, 950317, 1832316, 2181109, 1891838, 1148445, 267195, -523308, -1145491, -1594270, -1876673, -1995752, -1955059, -1804480, -1639976, -1474442, -1172271, -597412, 215719, 1071627, 1783729, 2304297, 2711990, 3104611, 3499440, 3867016, 4221140, 4588850, 4943775]
13317D943775K97966K25560J40668L1071j04258k76525m80551o50402p19273o92255
13307B715776o26492n74986n80570o92812q77839r82926q84530n76964j70914
13298c252257J78388M07970N42744O05107O28128O60971P08354P32986P15228
13289A927619O51715N41299M35130M19789M94402N40145M22886J28891j80921
13280E380955l51213l92359l33125j35264J39898L21302L24869K40555K05517
13271E401135K53418L20545L41201L03430K22444J05760j5843j13967k10547l22155
13261F285421m23768m97534n76117p16115q88966r48351p75558l93179R8249O09038
13251A773120J028152J185786R61400M37203j29766n52060q48054j082225j213197
$$ y = [4943775, 5241741, 5467301, 5607969, 5639040, 5534782, 5258257, 4777706, 4127304, 3408031, 2715776, 2089284, 1514298, 933728, 240916, -636923, -1619849, -2504379, -3081343, -3252257, -3073869, -2665899, -2123155, -1518048, -889920, -228949, 479405, 1212391, 1927619, 2579334, 3120633, 3555763, 3975552, 4469954, 5010099, 5432985, 5561876, 5380955, 5029742, 4637383, 4304258, 4168994, 4308892, 4630194, 4955063, 5195618, 5401135, 5654553, 5975098, 6316299, 6619729, 6842173, 6947933, 6932090, 6818123, 6607576, 6285421, 5861653, 5364119, 4788002, 4071887, 3182921, 2234570, 1459012, 1065833, 1164082, 1773120, 2801272, 3987058, 4948458, 5385661, 5255895, 4703835, 3855781, 2773556, 1560359]
13242A560359j135309p92908k48272L49212Q32478J075699J088208J006694R15438
13233D651599Q14337O92625N05763K10943j32026l90488m83871m11993k54368
13224E202521j77850l25831o77441j044300j215283j115020p97824l54689Q3559
13215d22158L94218N50748O04956O66327Q63496J226965J607600J765966J584807
13206H842925J194966Q36605O46199O25692P05478P84426P91570P55649P44840
13197A5928350P10115N00643L7517n92774j187865j576578j695925j567574j258311
13188I297598q51111m30265q0134J69907L62149M84455M38699J79604j88135n07602
13178H875165o85071o56788m41012j96888q3883j29697k66409m23224n32794n45089
$$ y = [1560359, 425050, -367858, -616130, -266918, 565560, 1641259, 2729467, 3736161, 4651599, 5465936, 6158561, 6664324, 6875267, 6743241, 6352753, 5868882, 5456889, 5202521, 5024671, 4698840, 4021399, 2977099, 1761816, 646796, -151028, -505717, -422158, -27940, 522808, 1127764, 1794091, 2657587, 3884552, 5492152, 7258118, 8842925, 10037891, 10874496, 11520695, 12146387, 12851865, 13636291, 14427861, 15183510, 15928350, 16638465, 17139108, 17176625, 16583851, 15395986, 13819408, 12123483, 10555909, 9297598, 8446487, 8016222, 7936088, 8105995, 8468144, 8952599, 9391298, 9570902, 9382767, 8875165, 8190094, 7533306, 7092294, 6895406, 6811523, 6681826, 6415417, 5992193, 5459399, 4914310]
13168D914310m69992l62496k92382k84406k78690k09191j04627p5375j97239m30571
13158B209341o62541p74784p08555n37330m07078l73425l46231k48341j80979
13149b029923k60209l70477k75861Q7382N28302P95002Q12152O49727L54761J488
13139B92344k46621l03848k44048j73059j13749k6072J39901M43152Q53270J162020
13129A783290J139715P57200K28244j78176l49387l27612k14480q4867J04773
13120B858700M31103Q08953J026187R58534O49609K21621j93924m59539m90964
13111E810280l62780k75350l70097o15954q82129j041728j013434q01907m95824
13102d8923j62051J98605N34470P30952P15355M91558J41069k18637n06487p10911
$$ y = [4914310, 4444318, 4081822, 3789440, 3505034, 3226344, 3017153, 2912526, 2837151, 2639912, 2209341, 1546800, 772016, 63461, -473869, -880947, -1254372, -1600603, -1848944, -2029923, -2290132, -2660609, -2936470, -2849088, -2320786, -1525784, -713632, -63905, 290856, 292344, 45723, -258125, -502173, -675232, -788981, -815053, -675152, -232000, 621270, 1783290, 2923005, 3680205, 3908449, 3730273, 3380886, 3053274, 2838794, 2753927, 2858700, 3289803, 4098756, 5124943, 6083477, 6733086, 6954707, 6760783, 6301244, 5810280, 5447500, 5172150, 4802053, 4186099, 3303970, 2262242, 1248808, 446901, -48923, -210974, -12369, 522101, 1253053, 1968408, 2459966, 2601035, 2382398, 1875911, 1165000]
13092A165000q55944r44096r72231r73015r58370q89275p42976n37498k77060
13083e985465P2198N11080Q97453J003675P45674K75941j68232m16154m51134
13074c514964m20418m30096l95516j97947J11814L31474K97888L0713k85825m53079
13064d925956l69904l7743M29832Q10506R06924P22056M19449J29839j27313l76410
13054b418720n79050o33582n07032k65511K543K23221L79194N01084N90908O62503
13044b044442P67871Q95228R61622R02285P21228M82996L03337K51437K40768
13035C482330J41676p1717l50073o35930q73322j012757j027955r53462q53837
13026b155047p64868p24866p46166p46037o27283l53263Q3318N82910Q91193Q20469
$$ y = [1165000, 309056, -635040, -1607271, -2580286, -3538656, -4427931, -5170907, -5708405, -5985465, -5913267, -5402187, -4504734, -3501059, -2755385, -2479444, -2647676, -3063830, -3514964, -3935382, -4365478, -4760994, -4958941, -4847127, -4515653, -4217765, -4187052, -4472877, -4925956, -5295860, -5333603, -4903771, -4093265, -3186341, -2464285, -2044836, -1914997, -2042310, -2418720, -2997770, -3631352, -4138384, -4403895, -4401352, -4178131, -3798937, -3297853, -2706945, -2044442, -1276571, -381343, 580279, 1482564, 2203792, 2686788, 2990125, 3241562, 3482330, 3624006, 3552289, 3202216, 2566286, 1692964, 680207, -347748, -1301210, -2155047, -2919915, -3644781, -4390947, -5136984, -5764267, -6117530, -6034212, -5451302, -4560109, -3739640]
13016c739640M49384N6541o0025K02620O63550J030322J110319R01724O01670
13007A216465M66355N61967P31484Q37472Q46745O83193K40694m08175r43970
12998D232230j049524o94873j18762M06383P23124P97873O98703M94557J49069
12989E638780l67307r15883j297574j451128j432283j296427j114564r90398r43235
12980d170019q64631o49971l28733n1002N2619M41o4129k617K22585N50705Q91513
12969d413239J201891J523353J874382K141619K201120K065554J844607J636912
12961A0076199J447173J181226P82486K71385l06922q43768j189007j259121j099719
12952I059932q37912n62836l38160k98075n54990j014431j421319j584522j489201
$$ y = [-3739640, -3290256, -3233715, -3293740, -3091120, -2427570, -1397248, -286929, 614795, 1216465, 1682820, 2244787, 2976271, 3813743, 4660488, 5343681, 5584375, 5176200, 4232230, 3182706, 2487833, 2369071, 2775454, 3498578, 4296451, 4995154, 5489711, 5638780, 5271473, 4355590, 3058016, 1606888, 174605, -1121822, -2236386, -3226784, -4170019, -5034650, -5684621, -6013354, -6064356, -6011737, -6011296, -6075425, -6078042, -5855457, -5304752, -4413239, -3211348, -1687995, 186387, 2328006, 4529126, 6594680, 8439287, 10076199, 11523372, 12704598, 13487084, 13758469, 13451547, 12607779, 11418772, 10159651, 9059932, 8222020, 7659184, 7321024, 7022949, 6467959, 5453528, 4032209, 2447687, 958486]
12943I58486j217572q29783l75923M4245L44023N68146Q30512J136691J342349
12934B801174J266511Q72166L41427p6914k30738j17134J15496K80794L26724
12925E579506L48562M46752O17244P37102O30264K11298l99778r67494j312011
12916E891445j361807j157431q19970m77711j98493K2123J66458J68543m695l10494
12906A917968o47039q96944r66143q23213n13874j36687J85113L66002M37534
12897a077283M82919M51924K00144k78376p92044j120581j186567j063504q59637
12888e243005o43649m21597j49282J58337M01696N38454O28279P11900P77049
12879c241818Q08230P89611P48293P46884P07412M37006j01856p30584j203010
$$ y = [958486, -259086, -1088869, -1464792, -1420547, -1076524, -508378, 322134, 1458825, 2801174, 4067685, 4939851, 5281278, 5204364, 4973626, 4856492, 4971988, 5252782, 5579506, 5928068, 6374820, 6992064, 7729166, 8359430, 8570728, 8170950, 7203456, 5891445, 4529638, 3372207, 2552237, 2074526, 1876033, 1898156, 2064614, 2233157, 2228462, 1917968, 1270929, 373985, -592158, -1415371, -1929245, -2065932, -1880819, -1514817, -1077283, -594364, -142440, 57704, -220672, -1012716, -2133297, -3319864, -4383368, -5243005, -5886654, -6308251, -6457533, -6299196, -5897500, -5359046, -4730767, -4018867, -3241818, -2433588, -1643977, -895684, -148800, 558612, 995618, 893762, 163178, -1039832]
12870a039832j361189j200540q21114l88299q8241l882o0182j02482j8848J72699
12860d911910L44999M08547M06534M18574M21852L35931J88486J10161J40749
12851b136077J96768K14469J93886J54069J49687K51439M34025O13894P75100
12842H47260R31312J017118R33611O54508K33161k05973m90058n31397m03180
12833B986362k44087j70771k60849m68155n77049m13242o8397K08082K85473K49781
12823A527148K68056M29020P00354R83479J183037J219230J048794P20946L46273
12814H426337l1285m09109p33395r45593j017614r10854o01680j98969Q8139J70079
12804C836056J25551O9125P4403J51873K68771L92349M98266N66245N82190N32978
$$ y = [-1039832, -2401021, -3601561, -4422675, -4810974, -4899215, -4903097, -4963279, -5065761, -5084609, -4911910, -4566911, -4158364, -3751830, -3333256, -2911404, -2575473, -2386987, -2276826, -2136077, -1939309, -1724840, -1530954, -1376885, -1227198, -975759, -541734, 72160, 847260, 1778572, 2795690, 3729301, 4383809, 4616970, 4410997, 3920939, 3389542, 2986362, 2742275, 2571504, 2310655, 1842500, 1265451, 852209, 783812, 991894, 1277367, 1527148, 1795204, 2224224, 2924578, 3908057, 5091094, 6310324, 7359118, 8080064, 8426337, 8395052, 7985943, 7252548, 6306955, 5289341, 4378487, 3776807, 3577838, 3665977, 3836056, 3961607, 4030732, 4105135, 4257008, 4525779, 4918128, 5416394, 5982639, 6564829, 7097807]
12794G097807M39458L28830J57814j51543n63862q85519r59493q37650o42912
12785C982930m01536j12126J77897M41897P07880R79003J163187J108245P83228
12776H830605L77341J12771L1321M93q9772k16557l15798l56328l17736j98785
12766G857555m7623R8871K44945L55589L45878J49849k00909n20048n65648k84069
12756G434390J10772L79021M50778L50223J10586j81735l82186m13506l58477
12747G499866l67803m88714o65306q68582j066757j160624j122960j022844q57506
12738a21230n59022j45701K42802M22117K97636l5634l87187o37334p28665o11450
12728b263668l19933K7518L17315M71328N25056O30508Q37381R89312R23189O74742
$$ y = [7097807, 7537265, 7866095, 8023909, 7872366, 7308504, 6422985, 5463492, 4625842, 3982930, 3581394, 3469268, 3647165, 4089062, 4796942, 5775945, 6939132, 8047377, 8830605, 9207946, 9320717, 9352038, 9352531, 9262759, 9046202, 8730404, 8374076, 8056340, 7857555, 7809932, 7908803, 8153748, 8509337, 8855215, 9005064, 8804155, 8284107, 7718459, 7434390, 7545162, 7924183, 8374961, 8725184, 8835770, 8654035, 8271849, 7858343, 7499866, 7132063, 6643349, 5978043, 5109461, 4042704, 2882080, 1759120, 736276, -121230, -680252, -825953, -583151, -161034, 136602, 100968, -286219, -923553, -1652218, -2263668, -2583601, -2556083, -2238768, -1767440, -1242384, -611876, 225505, 1214817, 2138006, 2812748]
12718B812748L94229J31069j49988m20806n98994o41604n64626m04691k18078
12709C39259j08315k05570n42305r09010r67157o05096p5045L18444N21689O18353
12699a614753N98026M03862J01635j62410l05282l32383k74510j90768j90661
12690a967244l19959m49642l97145j17944K91428P29495J132232J439202J619525
12681A959948J652955J464469J018014M19268j70418o49060r71805j116575j077144
12672B529652q61258n27547j63172J87391M82449O78820P75044P54786N70405
12663D426570K41293j10743l54162m33568m03227l75311m09390m83099n39364
12654A558999n22544m02270j92443K0856J15244Q9868R5780K46769N14327P95165
$$ y = [2812748, 3206977, 3338046, 3188058, 2767252, 2168258, 1526654, 962028, 557337, 339259, 230944, 25374, -516931, -1425941, -2393098, -2998194, -3073239, -2754795, -2233106, -1614753, -1016727, -612865, -511230, -673640, -978922, -1311305, -1585815, -1776583, -1967244, -2287203, -2736845, -3133990, -3251934, -2960506, -2231011, -1098779, 340423, 1959948, 3612903, 5077372, 6095386, 6514654, 6344236, 5695176, 4723371, 3606796, 2529652, 1668394, 1140847, 977675, 1165066, 1647515, 2326335, 3101379, 3856165, 4426570, 4667863, 4557120, 4202958, 3769390, 3366163, 2990852, 2581462, 2098363, 1558999, 1036455, 634185, 441742, 462598, 577842, 667710, 763490, 1010259, 1524586, 2319751]
12644B319751R77217R81927Q35902O42731M98290M45110M26733L46619J70525
12635G644805o1225l00172n06437o24659o31501n33736l60833j63023P1004L61622
12625D895845O12085O82128N47018L34590J78191P4190m538K8166K22351M42327
12615H012353M84525K99594M3255j03007r6068k1895P521j00374l76339p15839
12605G433726r35014r49551p89758m74177o7590K39751K71354M3053k54409m57339
12595D060046n37528n40465n22359n05628m56052l75634l62194m71428o25931
12586c37173p40330q12700q74189r22171q83866o55346j88925M24514R82251J349844
12576b658091J523366J518554J313423Q99596L50710j74419n60336q18974r78740
$$ y = [2319751, 3296968, 4278895, 5114797, 5757528, 6255818, 6700928, 7127661, 7474280, 7644805, 7583580, 7283408, 6776971, 6152312, 5520811, 4987075, 4626242, 4463219, 4534223, 4895845, 5507930, 6190058, 6737076, 7071666, 7249857, 7324047, 7319509, 7347675, 7570026, 8012353, 8496878, 8796472, 8839727, 8736720, 8640652, 8618757, 8626278, 8525904, 8149565, 7433726, 6498712, 5549161, 4759403, 4285226, 4217636, 4457387, 4728741, 4771794, 4517385, 4060046, 3522518, 2982053, 2459694, 1954066, 1498014, 1122380, 760186, 288758, -337173, -1077503, -1890203, -2764392, -3686563, -4570429, -5225775, -5414700, -4990186, -4007935, -2658091, -1134725, 383829, 1697252, 2596848, 2947558, 2773139, 2212803, 1393829, 415089]
12567D15089j006854r19028q31516p90431o94525m48591n7655M24854Q87575J095618
12557a925464Q59037L07575j94714l94529l21348j76994j01564o6064K768J24213
12547a887084L00946M96888O13936N75580L91848J46334m9016j25617p9978Q2172
12537D66009L37810N56325N38964K25990k21242n78974p53210p42610n38506k35716
12527i45160o5523j86651n20128q25532r36670q47132n98846k69877K1476K48708
12517d925335M57940O11872O36370N73955N77589P72496J115968J406502J434992
12508B662349J102036M97007j11103m82121n80962n15658m08072l57989l80560
12499A424927l75645k77343j06365J53839N10165Q46131J010148R52022P46280
$$ y = [415089, -591765, -1510793, -2342309, -3132740, -3827265, -4275856, -4333511, -3908657, -3021082, -1925464, -1066427, -758852, -953566, -1348095, -1669443, -1846437, -1948001, -2014065, -2011297, -1887084, -1586138, -1089250, -475314, 100266, 492114, 638448, 589432, 463815, 383837, 466009, 803819, 1360144, 1899108, 2125098, 1903856, 1324882, 571672, -170938, -709444, -945160, -1010683, -1197334, -1717462, -2542994, -3479664, -4326796, -4925642, -5195519, -5174043, -4925335, -4467395, -3855523, -3219153, -2645198, -2067609, -1295113, -179145, 1227357, 2662349, 3764385, 4261392, 4150289, 3668168, 3087206, 2571548, 2163476, 1805487, 1424927, 1049282, 771939, 665574, 819413, 1329578, 2175709, 3185857, 4137879, 4884159]
12490D884159M90416K16931n0609k62322l96783m65225m87200m73133m17245l47210
12480B691779l19069l36121l53848m02987n58447p48589p65849m88796k6135M11435
12470h96627O76908O98269M96607K06048k2594j57913k76048m14874n13884n06145
12460g10253m07077k97088k31539k19393k36332j74070R5563N49905J021213J369898
12450G60827J537133J499226J282248R58059N96497K62842N7833J809n2936j97316
12440F706222l44750m32930n10932o10017o85012o72362n35727k68598Q0134L81845
12430C107873N12887M63675L13658J44504j9606j88725l46626m76521n67477n71169
12420B372473m54718k97629k27694k58018k86592k57032k11850j76484j12214
$$ y = [4884159, 5374575, 5591506, 5540897, 5278575, 4881792, 4416567, 3929367, 3456234, 3038989, 2691779, 2372710, 2036589, 1682741, 1279754, 721307, -27282, -793131, -1281927, -1308062, -896627, -219719, 478550, 975157, 1181205, 1158611, 1000698, 724650, 309776, -204108, -710253, -1117330, -1414418, -1645957, -1865350, -2101682, -2275752, -2180189, -1630284, -609071, 760827, 2297960, 3797186, 5079434, 6037493, 6633990, 6896832, 6954665, 6956474, 6903538, 6706222, 6361472, 5928542, 5417610, 4807593, 4122581, 3450219, 2914492, 2645894, 2726028, 3107873, 3620760, 4084435, 4398093, 4542597, 4522991, 4334266, 3987640, 3511119, 2943642, 2372473, 1917755, 1620126, 1392432, 1134414, 847822, 590790, 378940, 202456, 90242]
12411I0242k6088R49k2936M873J10143K43538L88227N53503O78561O68562N22447
12400C212021L21353J18233q4869k68998m02568n16429o92430r51296j225139
12391d90122j434285j543059j557894j472885j248885q90497m63661p5330J12510
12382i064108K1707k11814l65010l32346j17843K15834M77482M69420J95492j67503
12372h878689m18340m22845j68264K43148O82531J048101J246827J251988J165219
12363d250324J129452J169041J147335R28885N41171J45623r6293j16855M9349
12354F47384L18746O01978P70832O82902L32125p8993l00073k65001j31998j07632
12344B470270k59670m86857n96804m34881m0288L32393M44814L08334J02387l2093
$$ y = [90242, 64154, 65103, 42167, 47040, 157183, 400721, 788948, 1342451, 2021012, 2689574, 3212021, 3533374, 3651607, 3566738, 3297740, 2895172, 2378743, 1686313, 735017, -490122, -1924407, -3467466, -5025360, -6498245, -7747130, -8637627, -9101288, -9176618, -9064108, -9042401, -9254215, -9619225, -9951571, -10069414, -9853580, -9376098, -8906678, -8711186, -8878689, -9297029, -9719874, -9888138, -9644990, -8962459, -7914358, -6667531, -5415543, -4250324, -3120872, -1951831, -804496, 124389, 665560, 811183, 714890, 598035, 647384, 966130, 1568108, 2338940, 3021842, 3353967, 3274974, 2974901, 2709900, 2577902, 2470270, 2210600, 1723743, 1126939, 692058, 651770, 984163, 1428977, 1737311, 1839698, 1807605]
12334A807605o1031l7204j2362Q470M407m6491r1099p3013m6400j18059k73971
12323A060852l46550k27724j6449J22012J26206K8631j04331j85465j52573p7221
12313B27388q9088j75122j93437l9025K61029O11186R58231J222072J216327Q46459
12303D846020K77957k51368o20830p68717o89205m86980k51856K6506L24755N48651
12293B954933O41852O36053N79047M21414J04815k56295m92547o23281p74063
12284C191928r25409r34130p43866m39111j60106k8222j00191l44001o39973q30550
12274a953631p85069m57410O5963N81215Q85909R09860P34327N18019L59298K37586
12264A096067J24388P1020J50548L65517O29478P95303P44579N12442K25434p3789
$$ y = [1807605, 1746574, 1709370, 1697008, 1705478, 1709885, 1663394, 1572295, 1499282, 1452882, 1334823, 1060852, 714302, 486578, 470129, 592141, 718347, 746978, 642647, 457182, 304609, 227388, 138300, -36822, -230259, -269284, -8255, 602931, 1561162, 2783234, 3999561, 4846020, 5123977, 4872609, 4251779, 3483062, 2793857, 2306877, 2055021, 2081527, 2406282, 2954933, 3596785, 4232838, 4811885, 5233299, 5338114, 5081819, 4589272, 3965991, 3191928, 2266519, 1332389, 588523, 149412, -10694, -38916, -139107, -483108, -1123081, -1953631, -2738700, -3196110, -3130147, -2548932, -1663023, -753163, -18836, 499183, 858481, 1096067, 1220455, 1291475, 1442023, 1807540, 2437018, 3232321, 3976900, 4489342, 4714776, 4640987]
12254D640987l71166n61663n91784n50116n15449m89750m68703m46929m08671
12245B36756l75535l76738l61005k53259q6885P0706K48914M71712O42621O35716
12235H53003M70169L30373L44018M31446M36673K91162K3795k65074m22336l31720
12225B161509j6501L73775O79325Q14814P65245N71725L13470L5493k71534n79407
12215D847914p92037q66347q67097q33555p04048m32307j06448J16262J70177
12206E32514J05756j2948j33953j78251q7139P0681J50035R2463o4389k36524
12196B38245l62405m69128n81957o67719o98852o56842n29672l32584r3868J38604
12186d016178L53797O12692R33304J212677J295304J098406O70709J91461j27372
$$ y = [4640987, 4269821, 3708158, 3116374, 2566258, 2050809, 1561059, 1092356, 645427, 236756, -138779, -515517, -876522, -1129781, -1216666, -1145960, -897046, -425334, 217287, 853003, 1323172, 1653545, 1997563, 2429009, 2865682, 3156844, 3180639, 2915565, 2493229, 2161509, 2145008, 2518783, 3198108, 4012922, 4778167, 5349892, 5663362, 5698855, 5427321, 4847914, 4055877, 3189530, 2322433, 1488878, 784830, 352523, 246075, 362337, 532514, 638270, 625322, 491369, 313118, 225979, 296660, 446695, 539158, 474769, 238245, -124160, -593288, -1175245, -1842964, -2541816, -3198658, -3728330, -4060914, -4154782, -4016178, -3662381, -3049689, -2116385, -903708, 391596, 1490002, 2160711, 2352172, 2224800]
12177B224800j88028l4154J75002K70497K14721O2528j39407l22771l90313l18853
12167A554022j93289j01380m9802Q634J30411K94848L47430J32994l31634q07886
12157I84348r75589p13658k39471O1968m8363n01711j018254j335362j367251
12148e153343j180436q55896m30690J7347L35143M43473M12497L42543K79905
12139e789457K55207L24540M81592O09813O05784M34298R7748l33529o93496p74211
12129d781711n34156k22297r6826j62744k95956l96014m05684k94838n6335K37089
12119g009472M25732L85989J51131p9449j17018M4113K78834M69963O16263P83949
12109d049965R51353R91784Q56699O55286M53257J78181j94014n34602o96836
$$ y = [2224800, 2036772, 2002618, 2177620, 2448117, 2662838, 2725366, 2585959, 2263188, 1872875, 1554022, 1360733, 1259353, 1209551, 1218185, 1348596, 1643444, 1990874, 2123868, 1792234, 984348, 8759, -704899, -944370, -882402, -930765, -1432476, -2450730, -3786092, -5153343, -6333779, -7189675, -7620365, -7603018, -7267875, -6824402, -6411905, -6069362, -5789457, -5534250, -5209710, -4728118, -4118305, -3512521, -3078223, -2980475, -3314004, -4007500, -4781711, -5315867, -5538164, -5634990, -5797734, -6093690, -6489704, -6895388, -7190226, -7246561, -7009472, -6583740, -6197751, -6046620, -6126069, -6243087, -6198974, -5920140, -5450177, -4833914, -4049965, -3098612, -2106828, -1250129, -594843, -141586, 36595, -157419, -692021, -1388857]
12100a388857o49711m37439p7419M08310Q94243J178028J133523P95259L01805
12091B157742j74216m64546m56843j94667J19755L33894M64511N67090O06380
12082B959100M95855K52045L9403j7320L7646J18779K23990L77868N30244N70105
12072E587715M29508J24808k92535p52971j159843j441023j581795j600876j529780
12063b216792j408515j271117j114731q96717n75238j78715J78431L93523M63365
12054f626506M79746N66045P56785R37589R69548Q41493O52473N06459M29529
12045d86839L72148K95785J96020Q6112K4k3583M698j0939j47843l32143m09942
12034d56502l05183n4945K32127M40379N18849M77624L51730J80895p420j52714
$$ y = [-1388857, -2038568, -2476007, -2553426, -2145116, -1250873, -72845, 1060678, 1855937, 2157742, 1983526, 1518980, 1062137, 867470, 987225, 1321119, 1785630, 2352720, 2959100, 3454955, 3707000, 3746403, 3729083, 3766729, 3885508, 4109498, 4487366, 5017610, 5587715, 6017223, 6142031, 5849496, 5096525, 3936682, 2495659, 913864, -687012, -2216792, -3625307, -4896424, -6011155, -6907872, -7483110, -7661825, -7483394, -7089871, -6626506, -6146760, -5580715, -4823930, -3886341, -2916793, -2075300, -1422827, -916368, -486839, -114691, 181094, 377114, 463226, 463250, 439667, 444365, 433426, 285583, -46560, -456502, -761685, -816630, -584503, -144124, 374725, 852349, 1204079, 1384974, 1377554, 1224840]
12024A224840j59675L96K57771M92337N87111N04637L10340J11224j3744m2489
12014C272748k5828o4445k06329m03282n43808n01191k60007K1270J91301K28471
12004A708900J18148j68351n32875p54158o88674m09376j36214o0007k08005m44842
11994a575454o16314p00593p61933q06201p37046m32230Q3009O05927R35646J041752
11984b963437J065039J119542J162683J111133R50750P32785N43069M16451K77471
11975D415486M7424k37902m87058o62751p95691r26782j044404j085103j011678
11966a788459q43391o06111l47433j64011j46065k70332m33676n55298n43463
11957e698239l45598n0071J92128L20138M17439N81732P74830Q91718R11545Q81077
$$ y = [1224840, 1065165, 1065561, 1323332, 1815669, 2402780, 2907417, 3217757, 3328981, 3315237, 3272748, 3246920, 3182475, 2976146, 2572864, 2029056, 1527865, 1267858, 1289128, 1480429, 1708900, 1827048, 1658697, 1125822, 371664, -317010, -726386, -862600, -922607, -1130612, -1575454, -2191768, -2892361, -3654294, -4460495, -5197541, -5629771, -5546762, -4940835, -4005189, -2963437, -1898398, -778856, 383827, 1494960, 2445710, 3178495, 3721564, 4138015, 4415486, 4462910, 4225008, 3737950, 3075199, 2279508, 1352726, 308322, -776781, -1788459, -2631850, -3237961, -3585394, -3749405, -3895470, -4165802, -4599478, -5154776, -5698239, -6043837, -6093908, -5901780, -5581642, -5164203, -4582471, -3807641, -2915923, -2004378, -1123301]
11947a123301Q01160O12971L14568M0245o9857l944J57732K95098K72640J9670
11937A316982l54412o06856o11525m68620l36615k30373n0638J98090L68540L39319
11927d36108P8444l39228o73870o61387k71705K47523N93832O76948O23062N66592
11917D04103N37519N20190M99872M68101M78802O02159P58593P63865N80033L61717
11907E974954K69177L50377N18048O05888M96480J74224k78543p08705r75947
11898F425953j026823q81719n97118k75264l9124N7182N5945K2280j0134j7728
11888C713450j085n342n1433j03735r8406K0791K33058M22426M80107M06695K68786
11877E285312J28128N6071J31771L89431P30681R11709P14425J20811o60773j334316
$$ y = [-1123301, -322141, 290830, 605398, 645643, 575786, 571842, 729574, 1024672, 1297312, 1316982, 962570, 355714, -255811, -724431, -1061046, -1291419, -1342057, -1143967, -775427, -436108, -357664, -696892, -1370762, -2032149, -2303854, -2056331, -1462499, -785551, -162489, 404103, 941622, 1461812, 1961684, 2429785, 2908587, 3510746, 4269339, 5033204, 5613237, 5974954, 6244131, 6594508, 7112556, 7718444, 8214924, 8389148, 8110605, 7401900, 6425953, 5399130, 4517411, 3920293, 3645029, 3605905, 3663087, 3719032, 3741312, 3731178, 3713450, 3712365, 3707023, 3655590, 3551855, 3453449, 3474240, 3707298, 4129724, 4609831, 5016526, 5285312, 5413440, 5469511, 5601282, 5990713, 6721394, 7633103, 8347528, 8468339, 7807566, 6473250]
11867F473250j701534j721857j486805j159064q68650o61157n10614l77240k82334
11858b296005k17038p7606J53164L32886L47156K18191M7267n2199j2881J41426
11848a415639L42732N74487Q31531J025962J056420R21940O89578M05451R5000
11839D527462j97461m05083m73145m19331l39410l22255l63406l59540k27898
11830A419933m4012M9194J7360n2536l3978J64628N55517J020076J368352J491973
11820E956507J363375R54230L10315l72321q98444j200619j280220j156275r21645
11811B754903p74063q32634r57888r08359o31870l00222p7351M1351J61247L67825
11801a157061O60060R45095J088771J006751P12982K75862j91868n54802p76789
$$ y = [6473250, 4771716, 3049859, 1563054, 403990, -464660, -1125817, -1636431, -2013671, -2296005, -2513043, -2590649, -2437485, -2104599, -1757443, -1539252, -1491985, -1544184, -1557065, -1415639, -1072907, -498420, 333111, 1359073, 2415493, 3337433, 4027011, 4432462, 4527462, 4330001, 3924918, 3451773, 3032442, 2693032, 2370777, 2007371, 1647831, 1419933, 1375921, 1425115, 1442475, 1389939, 1355961, 1520589, 2076106, 3096182, 4464534, 5956507, 7319882, 8274112, 8584427, 8212106, 7313662, 6113043, 4832823, 3676548, 2754903, 1980840, 1148206, 190318, -718041, -1349911, -1650133, -1727484, -1686133, -1524886, -1157061, -497001, 448094, 1536865, 2543616, 3256598, 3532460, 3340592, 2785790, 2009001]
11792B009001r32614j040704r83689o64350j94202J81077L39251L30340K17594
11783g38296O4165m218J04625L23314M30196K48452j51024n15379o61847o15247
11773a515259n01127m28231m38425m79048m65829l48738j43711Q9827L27619N63267
11763c339655P35457P87511P47112O50545M64734J94469k6345n5781P1498J57315
11753C86860O6157j56334l82387n15149n19264m02970k22796p8487m2552q3537
11743a950459j15488j25194j33563j16365m5013O1688J38872J55764J91343L33317
11733a605098N60361Q33752J137213J365696J377145J173889Q95816O79250N16316
11724F934340K44941k41598q40201j339929j602064j607025j412691j116549p89138
$$ y = [2009001, 1076387, 35683, -948006, -1612356, -1806558, -1625481, -1286230, -955890, -738296, -674131, -678349, -573724, -250410, 179786, 428238, 277214, -238165, -900012, -1515259, -2016386, -2444617, -2883042, -3362090, -3827919, -4176657, -4320368, -4230541, -3902922, -3339655, -2604198, -1816687, -1069575, -419030, 45704, 240173, 213828, 158047, 229545, 386860, 453017, 296683, -85704, -600853, -1120117, -1523087, -1745883, -1824370, -1866922, -1950459, -2065947, -2191141, -2324704, -2441069, -2486082, -2424394, -2285522, -2129758, -1938415, -1605098, -1044737, -210985, 926228, 2291924, 3669069, 4842958, 5738774, 6418024, 6934340, 7179281, 6937683, 6097482, 4757553, 3155489, 1548464, 135773, -980776, -1769914]
11715a769914m74380k55968k09073l19249m84308n79834n57636m54769l24684
11706e429815k28167k25228k69550k16808k7726J31950O8116k02265m48489m43533
11696g291515j60425K32234N47501P07683P67368Q50339R77828J045742J002410
11687a320835R24277R09655R69182J065221J141315J062056P03225J18229m97385
11678E074940r42905j086743r05173n07147j51618q0175k68841m75917n07907
11669A48514m16098m08321n51945o65234n40071k20196L6351L7893j62417l37407
11659c078931l32553j95301l1269J35487L05533M31972M89308M78664L69338J48852
11649a278900j22388l32400l76796k23518Q2457M53037Q03375J035164J029193
$$ y = [-1769914, -2244294, -2500262, -2709335, -3028584, -3512892, -4092726, -4650362, -5105131, -5429815, -5657982, -5883210, -6152760, -6369568, -6397294, -6265344, -6197228, -6399493, -6847982, -7291515, -7451940, -7219706, -6672205, -5964522, -5197154, -4346815, -3368987, -2323245, -1320835, -396558, 513097, 1482279, 2547500, 3688815, 4750871, 5454096, 5572325, 5074940, 4132035, 3045292, 2140119, 1632972, 1481354, 1401179, 1132338, 656421, 148514, -267584, -675905, -1227850, -1893084, -2433155, -2653351, -2617000, -2579107, -2741524, -3078931, -3411484, -3606785, -3638054, -3502567, -3197034, -2765062, -2275754, -1797090, -1427752, -1278900, -1401288, -1733688, -2110484, -2334002, -2251545, -1798508, -995133, 40031, 1069224]
11640A069224Q07109N69370M49780L90096L14636K83937L71757M98248N06215
11631E260372L09738o8031n15408q63195r92490r21325p09404l72107K7145L21873
11621A477168L68894J58606j81733m56257n33353m35389k58486p3136N7991Q8249
11611B12554L8233k4687k2133J17808L86892O51881P43032N95350K89794m2896
11601B945828k96726m30569n35177p16380q98815r01755o57083k56433J61644
11592a585466N05878P60524R22424R57328Q56192O41600L84102J95089J02581
11583C740252J8307j33059l02128l40044j94704j1476M4615p8915l18338n10199
11573A914311n45806n11456n56032o76672p50799p36161p16140p35571p19917
$$ y = [1069224, 1876333, 2445703, 2895483, 3285579, 3600215, 3884152, 4255909, 4754157, 5260372, 5570110, 5502079, 4986671, 4123476, 3130986, 2209661, 1500257, 1128150, 1155295, 1477168, 1846062, 2004668, 1822935, 1366678, 833325, 397936, 139450, 66314, 124305, 212554, 250787, 226100, 203967, 321775, 708667, 1360548, 2103580, 2698930, 2988724, 2945828, 2649102, 2218533, 1683356, 966976, 68161, -833594, -1490677, -1747110, -1585466, -1079588, -319064, 603360, 1560688, 2416880, 3058480, 3442582, 3637671, 3740252, 3758559, 3625500, 3323372, 2983328, 2788624, 2777148, 2821763, 2742848, 2424510, 1914311, 1368505, 857049, 301017, -375655, -1126454, -1862615, -2578755, -3314326, -4034243]
11564d034243n88051l63899j43308K3439J60025L16035N08704O83178P60428P40518
11554a937174P07767O68323M74794J0244o24524j169613j441670j445857j259267
11545f016977r38324n83369l19952j73231r8842q0191j08077j37104j40659j46562
11535h743288j45468p4814M3800J11550R5718O5125J07857K40646M19480O02580
11525g276814P24862O87947M63479J55160m1953K3529L50993Q27906J286496J541149
11515a257246J497754J217711Q46515N30809L73265L63564L65169K56237M9648
11506D243426j59498l05155l97641m53054m76287n05437n47305n54244n19008
11497C25797m89957m75149m41325m18552m66532n35379n01329l21994q4412R3585
$$ y = [-4034243, -4622294, -4986193, -5129501, -5106062, -4946037, -4630002, -4121298, -3438120, -2677692, -1937174, -1229407, -561084, -86290, -76046, -700570, -1870183, -3311853, -4757710, -6016977, -6955301, -7538670, -7858622, -8031853, -8130695, -8210886, -8318963, -8456067, -8596726, -8743288, -8888756, -8963570, -8919770, -8808220, -8712502, -8647377, -8539520, -8298874, -7879394, -7276814, -6551952, -5864005, -5400526, -5245366, -5287319, -5263790, -4912797, -4084891, -2798395, -1257246, 240508, 1458219, 2304734, 2835543, 3208808, 3572372, 3937541, 4193778, 4243426, 4083928, 3778773, 3381132, 2928078, 2451791, 1946354, 1399049, 844805, 325797, -164160, -639309, -1080634, -1499186, -1965718, -2501097, -3002426, -3324420, -3408832, -3315247]
11487c315247J98387K79452L10962K21814k631l09218o12324q03656p78021n27029
11477e337511j45990K62492O09189Q34920R55837J040588J153447J312881J453616
11468B139469J423915J095002N33972l4192m40990o13946n39960l03000k1808
11459C238462K18553L35833K95584J72848M3584j10723l24224n73785p65825p46836
11449A783471m70151j43787L318K1449J01694K73961M04924M00140K80811J05258
11439B761088p5100k33854l55177l68454k28080m2126K1063q4793k74717m53978
11429F65872o05289p59769r38229j129968j238322j153743q88136m83228K9941
11420f500871N07870P47961O85253M52324K46560J53143J43471J84029K66761
$$ y = [-3315247, -3116860, -2837408, -2526446, -2304632, -2307263, -2616481, -3228805, -4032461, -4810482, -5337511, -5483501, -5221009, -4611820, -3776900, -2821063, -1780475, -627028, 685853, 2139469, 3563384, 4658386, 5192358, 5158166, 4717176, 4103230, 3563270, 3260270, 3238462, 3457015, 3792848, 4088432, 4261280, 4304864, 4194141, 3869917, 3296132, 2530307, 1783471, 1313320, 1169533, 1172851, 1194300, 1295994, 1569955, 1974879, 2375019, 2655830, 2761088, 2685988, 2452134, 2096957, 1728503, 1500423, 1458297, 1479360, 1394567, 1119850, 665872, 60583, -699186, -1637415, -2767383, -4005705, -5159448, -6047584, -6530812, -6500871, -5993001, -5245040, -4559787, -4107463, -3860903, -3707760, -3564289, -3380260, -3113499]
11411c113499L94341N44643O43443O23868N12353M56911O32271J011167J327400
11402C032898J322408R64173M52070L7988j49646j41206l0898Q9246J69989K33635
11392E980657K88105K64151J11981j36722l97603n77718p04217q89248j106502
11383B832884j200881j086150q02550m66841k06995o9019J3425J25952K62137
11374e98038L12543K10329P7764Q2677K01514K47275J07203j33757l23616l97546
11364b13652l83864l62158m29668o08007p72514p63800n65731k93983o0573P1388
11354d382562R2646N1789J3682O1005K67538N75513Q37640J009854J140802J200759
11344H68666J114631R39653P91822O66449M75792J87543j19795l16105l60825
$$ y = [-3113499, -2719158, -2174515, -1531072, -907204, -394851, 62060, 694331, 1705498, 3032898, 4355306, 5319479, 5771549, 5809537, 5659891, 5518685, 5487787, 5577033, 5747022, 5980657, 6268762, 6532913, 6644894, 6508172, 6110569, 5532851, 4828634, 3939386, 2832884, 1632003, 545853, -256697, -723538, -930533, -999552, -986127, -860175, -598038, -285495, -75166, 2598, 85275, 286789, 534064, 641267, 507510, 183894, -213652, -597516, -959674, -1389342, -1997349, -2769863, -3533663, -4099394, -4393377, -4453950, -4382562, -4289916, -4238127, -4224445, -4163440, -3895902, -3320389, -2482749, -1472895, -332093, 868666, 1983297, 2922950, 3714772, 4381221, 4857013, 5044556, 4924761, 4608656, 4247831]
11335D247831l28473k95098l45571n67259r04508j174318j256835j148784r04748
11326b677763o59613o04578q02217j068303j127929r00970n44406k32300l2636
11317h650715O1951J03033J47109K17982L18862M72858P22053J037025J284130
11308d285712J316210J089647P39529M47301K19662j7037k20125l02210k27271
11299a240006j3987K45090M56517O26428P92156R18242R27276Q03435O42749N58094
11289D715994N41319N00611L79969J96299K9940n7675r5513j32454j46555j14278
11279E817657r7892j38534j50344m8153J32594K79898K88819J59187J4117p1589
11269F185760k16650n84547j104409j456913j377609r23045l86548K114J85078
$$ y = [4247831, 3919358, 3624260, 3278689, 2711430, 1806922, 632604, -624231, -1773015, -2677763, -3337376, -3941954, -4744171, -5812474, -6940403, -7841373, -8385779, -8618079, -8650715, -8588764, -8485731, -8338622, -8120640, -7801778, -7328920, -6606867, -5569842, -4285712, -2969502, -1879855, -1140326, -693025, -473363, -490400, -710525, -1012735, -1240006, -1253993, -1008903, -552386, 74042, 866198, 1784440, 2711716, 3515151, 4157900, 4715994, 5257313, 5757924, 6137893, 6334192, 6364132, 6306457, 6210944, 6078490, 5931935, 5817657, 5719765, 5581231, 5430887, 5382734, 5515328, 5795226, 6084045, 6243232, 6257349, 6185760, 5969110, 5384563, 4280154, 2823241, 1445632, 522587, 136039, 138153, 323231]
11260C23231J72763j3149k69019m04487l17945r4311J32058K77872L04585K40622
11250C52220J16814j01160m03527o21999n57576j92673L17523P64079R21068O59959
11240A254728J41049k99105m66356l84731j48948J97179O09058R63447J134672
$$ y = [323231, 495994, 482845, 213826, -190661, -508606, -602917, -470859, -192987, 111598, 352220, 469034, 367874, -35653, -657652, -1215228, -1407901, -1090378, -326299, 594769, 1254728, 1395777, 1096672, 630316, 245585, 96637, 293816, 902874, 1866321, 3000993]
$$ [...]
##END NTUPLES=NMR SPECTRUM
##END=
