##TITLE=31P ikalashn
DE-76w_TFA
13.11.2024
##JCAMPDX= 6.0         $$ Bruker NMR JCAMP-DX V2.0
##DATA TYPE= NMR SPECTRUM
##DATA CLASS= NTUPLES
##ORIGIN= UXNMR, Bruker Analytische Messtechnik GmbH
##OWNER= root
$$ TOPSPIN		Version 1.3
$$ 2024-11-13 15:07:40.578 +0400  Irina@DPX200
$$ Compression mode = diff/dup
##.OBSERVE FREQUENCY= 81.01967998063
##.OBSERVE NUCLEUS= ^31P
##.ACQUISITION MODE= SIMULTANEOUS
##.ACQUISITION SCHEME= undefined
##.AVERAGES= 64
##.DIGITISER RES= 17
##SPECTROMETER/DATA SYSTEM= spect
##.PULSE SEQUENCE= zgpg
##.SOLVENT NAME= D2O
##.SHIFT REFERENCE= INTERNAL, D2O, 1, 298.5841
##AUDIT TRAIL= $$ (NUMBER, WHEN, WHO, WHERE, WHAT)
$$ ##TITLE= Audit trail, TOPSPIN		Version 1.3
$$ ##JCAMPDX= 5.01
$$ ##ORIGIN= Bruker BioSpin GmbH
$$ ##OWNER= Irina
$$ $$ F:/spectra/data/iren/nmr/P31dec/1/pdata/1/auditp.txt
$$ ##AUDIT TRAIL=  $$ (NUMBER, WHEN, WHO, WHERE, VERSION, WHAT)
(   1,<2024-11-13 15:05:45.968 +0400>,<Irina>,<DPX200>,<TOPSPIN 1.3>,
      <created by zg
	started at 2024-11-13 15:04:02.609 +0400,
	POWCHK disabled, PULCHK disabled
       configuration hash MD5:
       BE 6D 3F 07 2A EA 11 49 91 17 2B D3 AF B3 58 0D
       data hash MD5: 32K
       BF 66 E6 C4 69 09 24 7E CD 10 8F 75 C1 89 77 78>)
(   2,<2024-11-13 15:06:05.796 +0400>,<Irina>,<DPX200>,<TOPSPIN 1.3>,
      <Start of raw data processing
       efp BC_mod = 2 LB = 10 FT_mod = 6 PKNL = 1 PHC0 = 90.17021 PHC1 = 285.1274 SI = 32K 
       data hash MD5: 32K
       0F EA AA 2B 5A FE F2 FC CD A2 C6 8B F0 DA ED D9>)
(   3,<2024-11-13 15:06:11.015 +0400>,<Irina>,<DPX200>,<TOPSPIN 1.3>,
      <abs n ABSG = 5 
       data hash MD5: 32K
       0E C4 75 D1 32 5A 1D 67 82 A9 2A 87 5F 2E 4A D8>)
$$ ##END=
$$ 
$$ $$ hash MD5
$$ $$ 92 32 CE 88 C0 97 BD E4 0C E3 4F 03 53 14 A1 A9
##$RELAX= 
##$RELAX= 
##$RELAX= 
##$RELAX= 
##$RELAX= 
##$RELAX= 
##$RELAX= 
##$RELAX= 
##$RELAX= 
##$RELAX= 
##$RELAX= 
$$ Bruker specific parameters
$$ --------------------------
##$DU= <F:/spectra>
##$EXPNO= 1
##$NAME= <P31dec>
##$PROCNO= 1
##$TYPE= <nmr>
##$USER= <iren>
##$AMP= (0..31)
100 100 100 100 100 100 100 100 100 100 100 100 100 100 100 100 100 100 
100 100 100 100 100 100 100 100 100 100 100 100 100 100 
##$ANAVPT= -1
##$AQSEQ= 0
##$AQ_mod= 1
##$AUNM= <au_zg>
##$AUTOPOS= <>
##$BF1= 81.014009
##$BF2= 200.13
##$BF3= 200.13
##$BF4= 200.13
##$BF5= 200.13
##$BF6= 200.13
##$BF7= 200.13
##$BF8= 200.13
##$BYTORDA= 1
##$CFDGTYP= 0
##$CFRGTYP= 5
##$CHEMSTR= <none>
##$CNST= (0..63)
1 1 145 1 1 1 1 1 1 1 1 1 1 1 1 1 1 1 1 1 1 1 1 1 1 1 1 1 1 1 1 1 1 1 
1 1 1 1 1 1 1 1 1 1 1 1 1 1 1 1 1 1 1 1 1 1 1 1 1 1 1 1 1 1 
##$CPDPRG= <waltz16>
##$CPDPRG1= <>
##$CPDPRG2= <waltz16>
##$CPDPRG3= <>
##$CPDPRG4= <mlev>
##$CPDPRG5= <mlev>
##$CPDPRG6= <mlev>
##$CPDPRG7= <mlev>
##$CPDPRG8= <mlev>
##$CPDPRGB= <>
##$CPDPRGT= <>
##$D= (0..63)
0 1 0 0 0 0 0 0 0 0.06 0 0.03 2e-005 3e-006 0 0 0.0002 0 0 0 0 0 0 0 0 
0 0 0 0 0 0 0 0 0 0 0 0 0 0 0 0 0 0 0 0 0 0 0 0 0 0 0 0 0 0 0 0 0 0 0 
0 0 0 0 
##$DATE= 1731495941
##$DBL= (0..7)
$$ [...]
##$SW_h= 37037.037037037
##$TD= 32768
##$TD0= 1
##$TE= 300
##$TE2= 300
##$TE3= 300
##$TEG= 300
##$TL= (0..7)
0 120 53 12 22 120 120 120 
##$TP= (0..7)
150 150 150 150 150 150 150 150 
##$TP07= 0
##$TPNAME0= <>
##$TPNAME1= <>
##$TPNAME2= <>
##$TPNAME3= <>
##$TPNAME4= <>
##$TPNAME5= <>
##$TPNAME6= <>
##$TPNAME7= <>
##$TPOAL= (0..7)
0.5 0.5 0.5 0.5 0.5 0.5 0.5 0.5 
##$TPOFFS= (0..7)
0 0 0 0 0 0 0 0 
##$TUNHIN= 0
##$TUNHOUT= 0
##$TUNXOUT= 0
##$USERA1= <user>
##$USERA2= <user>
##$USERA3= <user>
##$USERA4= <user>
##$USERA5= <user>
##$V9= 5
##$VALIST= <valist>
##$VCLIST= <CCCCCCCCCCCCCCC>
##$VD= 0
##$VDLIST= <DDDDDDDDDDDDDDD>
##$VPLIST= <PPPPPPPPPPPPPPP>
##$VTLIST= <TTTTTTTTTTTTTTT>
##$WBST= 1024
##$WBSW= 4
##$XGAIN= (0..3)
0 0 0 0 
##$XL= 0
##$YL= 0
##$YMAX_a= 6639
##$YMIN_a= -531
##$ZGOPTNS= <>
##$ZL1= 120
##$ZL2= 120
##$ZL3= 120
##$ZL4= 120
##$ABSF1= 298.5841
##$ABSF2= -158.5842
##$ABSG= 5
##$ABSL= 5
##$ALPHA= 0
##$AQORDER= 0
##$ASSFAC= 0
##$ASSFACI= 0
##$ASSFACX= 0
##$ASSWID= 0
##$AUNMP= <proc_1d>
##$AXLEFT= 0
##$AXRIGHT= 0
##$AXTYPE= 0
##$AXUNIT= <>
##$AZFE= 0.1
##$AZFW= 0.5
##$BCFW= 0
##$BC_mod= 2
##$BYTORDP= 0
##$COROFFS= 0
##$CY= 12.5935478210449
##$DATMOD= 1
##$DC= 0
##$DFILT= <>
##$DTYPP= 0
##$F1P= 47.1127640792319
##$F2P= -24.0371245302204
##$FCOR= 0.5
##$FTSIZE= 32768
##$FT_mod= 6
##$GAMMA= 0
##$GB= 0
##$INTBC= 1
##$INTSCL= 7.269226e-011
##$ISEN= 30
##$LB= 10
##$LEV0= 0
##$LPBIN= 0
##$MAXI= 12.09355
##$MC2= 0
##$MEAN= 0
##$ME_mod= 0
##$MI= 0.7550151
##$NCOEF= 0
##$NC_proc= -14
##$NLEV= 6
##$NOISF1= 298.5841
##$NOISF2= 270.0111
##$NSP= 0
##$NTH_PI= 0
##$NZP= 0
##$OFFSET= 298.5841
##$PC= 1.4
##$PHC0= 90.17021
##$PHC1= 285.1274
##$PH_mod= 1
##$PKNL= yes
##$PPARMOD= 0
##$PPDIAG= 0
##$PPIPTYP= 0
##$PPMPNUM= 100
##$PPRESOL= 1
##$PSCAL= 0
##$PSIGN= 0
##$REVERSE= no
##$SF= 81.014009
##$SI= 32768
##$SIGF1= 270.0111
##$SIGF2= -158.5842
##$SINO= 77.54984
##$SIOLD= 32768
##$SREGLST= <31P.CDCl3>
##$SSB= 0
##$STSI= 32768
##$STSR= 0
##$SW_p= 37037.037037037
##$SYMM= 0
##$S_DEV= 0
##$TDeff= 32768
##$TDoff= 0
##$TI= <>
##$TILT= no
##$TM1= 0
##$TM2= 0
##$TOPLEV= 0
##$USERP1= <user>
##$USERP2= <user>
##$USERP3= <user>
##$USERP4= <user>
##$USERP5= <user>
##$WDW= 1
##$XDIM= 32768
##$YMAX_p= 470937964
##$YMIN_p= -71759613
$$ End of Bruker specific parameters
$$ ---------------------------------
##NTUPLES= NMR SPECTRUM
##VAR_NAME=  FREQUENCY,     SPECTRUM/REAL,   SPECTRUM/IMAG
##SYMBOL=    X,             R,               I
##VAR_TYPE=  INDEPENDENT,   DEPENDENT,       DEPENDENT
##VAR_FORM=  AFFN,          ASDF,            ASDF
##VAR_DIM=   32768,         32768,           32768
##UNITS=     HZ,            ARBITRARY UNITS, ARBITRARY UNITS
##FACTOR=    1.13031516577767, 1,            1
##FIRST=     37037.037037037, -31622758,     -43885756
##LAST=      0,             25370579,        30177435
##MIN=       0,             -71759613,       0
##MAX=       37037.037037037, 470937964,     0
$$ Real data points
##PAGE= N=1
##DATA TABLE= (X++(R..R)), XYDATA
$$ [...]
$$ plain form
17739 23147220 31318203 38047103 42359933 44163745 44273575 43717676 43202038 43072587 43527622
17730 43527622 44555447 45712949 46161556 45107912 42446979 38756614 34672061 30621975
17722 30621975 27011472 24204719 22233693 20732681 19156547 17250545 15520351 14845154
17714 14845154 15461369 16775565 17992078 18418045 17612484 15756681 13735293 12625658
17706 12625658 12873558 13957407 14902293 14936957 13862983 12097613 10182334 8267846 6319542
17697 6319542 4496667 2981884 1648762 219325 -1305224 -2543458 -3013677 -2561742
17689 -2561742 -1565781 -677049 -325769 -574934 -1462827 -3163583 -5728790 -8867632 -11996307
17680 -11996307 -14522138 -16109305 -16676687 -16249504 -14904389 -12904222 -10850834 -9532292
$$ packed form
17739B3147220Q170983O728900M312830J803812J09830n55899n15638j29451M55035
17730D3527622J027825J157502M48607j053644k660933l690365m084553m050086
17722C0621975l610503k806753j971026j501012j576134j906002j730194o75197
17714A4845154O16215J314196J216513M25967q05561j855803k021388j109635
17706A2625658K47900J083849R44886L4664j073974j765370j915279j914488j948304
17697F319542j822875j514783j333122j429437j524549j238234m70219M51935
17689b561742R95961Q88732L51280k49165q87893j700756k565207l138842l128675
17680a1996307k525831j587167n67382M27183J345115K000167K053388J318542
$$ plain form
17672 -9532292 -9560642 -11114764 -13917864 -17441186 -21179428 -24699742 -27625116 -29797057
17664 -29797057 -31215101 -31832577 -31719633 -31131153 -30208474 -28857209 -26996106 -24727148 -22244057
17655 -22244057 -19961165 -18597004 -18622651 -19675366 -20777009 -21129441 -20503533 -18945277 -16488983
17646 -16488983 -13384936 -10468551 -8902398 -9324212 -11256096 -13452952 -14675034 -14262432
17638 -14262432 -12503766 -10518757 -9527449 -10021695 -11746816 -14261993 -17212864 -20269703
17630 -20269703 -23012609 -25049593 -26204837 -26408445 -25603014 -23937435 -21827278 -19574206
17622 -19574206 -16967977 -13596455 -9492565 -5209385 -1541388 724734 1165617 -23791
17614 -23791 -2158002 -4532340 -6807570 -8899783 -10616114 -11670873 -12043583 -11986325 -11831403
$$ packed form
17672i532292k8350j554122k803100l523322l738242l520314k925374k171941
17664b9797057j418044o17476J12944N88480R22679J351265J861103K268958K483091
17655b2244057K282892J364161k5647j052715j101643l52432O25908J558256K456294
17646a6488983L104047K916385J566153m21814j931884k196856j222082M12602
17638a4262432J758666J985009R91308m94246j725121k515177k950871l056839
17630b0269703k742906k036984j155244k03608Q05431J665579K110157K253072
17622a9574206K606229L371522M103890M283180L667997K266122M40883j189408
17614b3791k134211k374338k275230k092213j716331j054759l72710N7258J54922
$$ plain form
17605 -11831403 -11864673 -12008681 -11690860 -10190614 -7116989 -2735781 2064934 6286589 9467978
17596 9467978 11788144 13609344 15110713 16254316 16832823 16677345 16027171 15552765 16038535
17587 16038535 17797097 20233879 22288706 23203805 22793235 21361048 19415773 17123319
17579 17123319 14218460 10813261 7813066 6078545 5663388 5985781 6350321 6329904 5814464
17570 5814464 4745604 3042920 728121 -2152588 -5523913 -9106283 -12371068 -14669809
17562 -14669809 -15559922 -15116334 -13844388 -12316731 -10920210 -9897912 -9480919 -9953235 -11554924
17553 -11554924 -14117309 -16877277 -18912320 -19888122 -20272960 -20571498 -20599856 -19777309 -17753215
17544 -17753215 -14685413 -11108967 -7472911 -3957340 -656664 2384211 5124189 7286053
$$ packed form
17605a1831403l3270j44008L17821J500246L073625M381208M800715M221655L181389
17596I467978K320166J821200J501369J143603N78507j55478o50174m74406M85770
17587A6038535J758562K436782K054827R15099m10570j432187j945275k292454
17579A7123319k904859l405199l000195j734521m15157L22393L64540k0417n15440
17570E814464j068860j702684k314799k880709l371325l582370l264785k298741
17562a4669809q90113M43588J271946J527657J396521J022298M16993m72316j601689
17553a1554924k562385k759968k035043r75802l84838k98538k8358Q22547K024094
17544a7753215L067802L576446L636056L515571L300676L040875K739978K161864
$$ plain form
17536 7286053 8360176 8034038 6522521 4430005 2534595 1606117 2027948 3514003 5337198
17527 5337198 6826815 7687752 7887439 7348311 6013123 3978112 1315999 -1913521 -5328306
17518 -5328306 -8222142 -10154978 -11285655 -11837987 -11544907 -9917384 -6759479 -2171804
17510 -2171804 3645799 10288859 17002552 22828709 26865282 28561601 28056701 26368129
17502 26368129 24958996 24688000 25264511 25867194 26079814 26093789 26196994 26322977 26040555
17493 26040555 24849484 22465557 18835141 14100983 8559598 2458976 -3994059 -10237930
17485 -10237930 -15093874 -17326904 -16689417 -14145195 -11205882 -9414285 -9867800 -12490329
17477 -12490329 -16120564 -19582163 -22347731 -24254291 -25080925 -24657909 -23117031 -20825741
$$ packed form
17536G286053J074123l26138j511517k092516j895410r28478M21831J486055J823195
17527E337198J489617Q60937J99687n39128j335188k035011k662113l229520l414785
17518e328306k893836j932836j130677n52332K93080J627523L157905M587675
17510b171804N817603O643060O713693N826157M036573J696319n04900j688572
17502B6368129j409133k70996N76511O02683K12620J3975J03205J25983k82422
17493B6040555j191071k383927l630416m734158n541385o100622o453035o243871
17485a0237930m855944k233030O37487K544222K939313J791597m53515k622529
17477a2490329l630235l461599k765568j906560q26634M23016J540878K291290
$$ plain form
17469 -20825741 -18324182 -16293745 -15261308 -15416943 -16706598 -18779933 -20831603 -21800558
17461 -21800558 -20936718 -18295628 -14621699 -10638100 -6642528 -2715985 1065852 4660555
17453 4660555 8097573 11411777 14486887 17141972 19522426 22142575 25357262 28888403
17445 28888403 31813147 33067034 32135060 29225862 24996380 20367965 16360993 13690892
17437 13690892 12529291 12647470 13523033 14451206 14810713 14151122 12178016 8867379 4481893
17428 4481893 -507939 -5399218 -9299264 -11586447 -12345883 -11977652 -10523523 -7649800
17420 -7649800 -3286959 1668995 5559917 7161276 6587769 4988324 3595322 3175601
17412 3175601 3850411 5100413 6311132 7291020 8191471 8991653 9096462 7929322 5748784
$$ packed form
17469b0825741K501559K030437J032437j55635j289655k073335k051670r68955
17461b1800558Q63840K641090L673929L983599L995572L926543L781837L594703
17453D660555L437018L314204L075110K655085K380454K620149L214687L531141
17445B8888403K924744J253887r31974k909198m229482m628415m006972k670101
17437A3690892j161601J18179Q75563R28173L59507o59591j973106l310637m385486
17428D481893m989832m891279l900046k287183p59436L68231J454129K873723
17420g649800M362841M955954L890922J601359n73507j599445j393002m19721
17412C175601O74810J250002J210719R79888R00451Q00182J04809j167140k180538
$$ plain form
17403 5748784 3413345 1861514 1997020 4434050 9020859 14775002 20385045 24744360
17395 24744360 27044366 26814469 24385958 21038425 18144137 16150219 14515425 12575624
17387 12575624 10152208 7225668 3719138 -254371 -4509531 -8910055 -12976075 -15751602
17379 -15751602 -16347643 -14560588 -11034116 -6997327 -3740131 -2241037 -2926483 -5250691
17371 -5250691 -7833927 -9350306 -9200622 -7497729 -4706428 -1423910 1802801 4767524
17363 4767524 7570470 10331796 13102855 15789681 18180054 20219428 22000932 23439760
17355 23439760 24242820 24210521 23385814 22031945 20465492 18694377 16334549 13015231 8815710
17346 8815710 4192310 -482732 -5102616 -9536223 -13407736 -16385616 -18608456 -20548400
$$ packed form
17403E748784k335439j551831J35506K437030M586809N754143N610043M359315
17395B4744360K300006k29897k428511l347533k894288j993918j634794j939801
17387A2575624k423416k926540l506530l973509m255160m400524m066020k775527
17379a5751602n96041J787055L526472M036789L257196J499094o85446k324208
17371e250691k583236j516379J49684J702893K791301L282518L226711K964723
17363D767524K802946K761326K771059K686826K390373K039374J781504J438828
17355B3439760Q03060l2299q24707j353869j566453j771115k359828l319318m199521
17346H815710m623400m675042m619884m433607l871513k977880k222840j939944
$$ plain form
17338 -20548400 -22495173 -24597100 -27167944 -30383240 -33852377 -36818485 -38627709 -38981047
17330 -38981047 -38053622 -36540866 -35442783 -35564796 -37205614 -40111367 -43480576 -46272565
17322 -46272565 -47761625 -47857815 -47080448 -46234188 -45822546 -45688552 -45200536 -43607478 -40298012
17313 -40298012 -34962138 -27706763 -18989327 -9489033 -226003 7454122 12481667 14711166
17305 14711166 14811900 13622776 11629794 8826690 5086803 643020 -3922317 -8026962
17297 -8026962 -11423352 -14229083 -16595560 -18450232 -19622211 -20020754 -19745067 -19231864 -18958416
17288 -18958416 -18763059 -17899182 -15935128 -13371019 -11379899 -10979776 -12485877 -15652110
17280 -15652110 -20023369 -25171723 -30710632 -36014364 -40100466 -42051855 -41443496 -38461439
$$ packed form
17338b0548400j946773k101927k570844l215296l469137k966108j809224l53338
17330c8981047R27425J512756J098083j22013j640818k905753l369209k791989
17322d6272565j489060r6190P77367Q46260M11642J33994M88016J593058L309466
17313d0298012N335874P255375Q717436R500294R263030P680125N027545K229499
17305A4711166J00734j189124j992982k803104l739887m443783m565337m104645
17297h026962l396390k805731k366477j854672j171979l98543K75687N13203K73448
17288a8958416J95357Q63877J964054K564109J991120M00123j506101l166233
17280a5652110m371259n148354n538909n303732m086102j951389O08359K982057
$$ plain form
17272 -38461439 -33938493 -29069889 -24800560 -21516767 -19207431 -17643555 -16494057 -15483878
17264 -15483878 -14380226 -12872790 -10750110 -8029024 -4762758 -1100864 2495854 5487400
17256 5487400 7605230 8785280 8925468 7792634 5232112 1587052 -2277353 -5461910
17248 -5461910 -7473911 -8239404 -7967269 -7274505 -7162425 -8301928 -10289764 -11985709 -12603276
17239 -12603276 -12262289 -11586648 -10957867 -10193706 -8875993 -6798541 -4082915 -919113 2688801
17230 2688801 6729666 10864240 14618661 17815760 20532409 22704988 24009411 24322252
17222 24322252 23956494 23223936 22114936 20429232 18104640 15324518 12323415 9229511
17214 9229511 6089883 3076867 494362 -1500858 -2946840 -3833342 -4012784 -3519792 -2856619
$$ packed form
17272c8461439M522946M868604M269329L283793K309336J563876J149498J010179
17264a5483878J103652J507436K122680K721086L266266L661894L596718K991546
17256E487400K117830J180050J40188j132834k560522l645060l864405l184557
17248e461910k012001p65493K72135O92764J12080j139503j987836j695945o17567
17239a2603276L40987O75641O28781P64161J317713K077452K715626L163802L607914
17230B688801M040865M134574L754421L197099K716649K172579J304423L12841
17222B4322252l65758p32558j109000j685704k324592k780122l001103l093904
17214I229511l139628l013016k582505j995220j445982q86502j79442M92992O63173
$$ plain form
17205 -2856619 -2577867 -2731357 -3076551 -3601452 -4468187 -5662793 -7020695 -8404683 -9556826
17196 -9556826 -10058954 -9731295 -9057593 -9036786 -10599476 -14188727 -19505098 -25543519 -30969379
17187 -30969379 -34554248 -35721016 -34888213 -33063773 -31165877 -29789748 -29228626 -29301723 -29313722
17178 -29313722 -28756364 -28050126 -28142268 -29470032 -31562578 -33488474 -34457206 -34080119 -32288590
17169 -32288590 -29228406 -25352877 -21501013 -18591493 -16936472 -16036236 -15376479 -15069637
17161 -15069637 -15361230 -15927754 -16096252 -15479219 -14152498 -12500997 -10872163 -9256415 -7492841
17152 -7492841 -5642543 -4069588 -3300021 -3620198 -4738355 -5956924 -6598833 -6371923 -5559143
17143 -5559143 -4801696 -4644412 -5159681 -5821767 -5790705 -4554004 -2468497 -517132 503759
$$ packed form
17205b856619K78752j53490l45194n24901q66735j194606j357902j383988j152143
17196i556826n02128L27659O73702K0807j562690l589251n316371o038421n425860
17187c0969379l584869j166768Q32803J824440J897896J376129N61122p3097j1999
17178b9313722N57358P06238r2142j327764k092546j925896r68732L77087J791529
17169c2288590L060184L875529L851864K909520J655021R00236O59757L06842
17161a5069637k91593n66524j68498O17033J326721J651501J628834J615748J763574
17152g492841J850298J572955P69567l20177j118157j218569o41909K26910Q12780
17143e559143P57447J57284n15269o62086L1062J236701K085507J951365J020891
$$ plain form
17134 503759 502379 29377 -162564 475372 2129587 4706284 8092209 12147877 16416794
17125 16416794 20239325 23153640 24979003 25664743 25198211 23525588 20465365 16022360
17117 16022360 10836121 5930033 1964693 -1016387 -3270622 -5152972 -7129716 -9523951
17109 -9523951 -11878597 -12957617 -11772074 -8487172 -4307496 -587996 1921650 3177321
17101 3177321 3514508 3287049 2653060 1575536 -58732 -2393476 -5437649 -8681996 -11033202
17092 -11033202 -11228219 -8556621 -3379870 3290437 10545403 17633325 23779872 28348558
17084 28348558 30979508 31612028 30551822 28448227 26043692 23885343 22212679 21027034
17076 21027034 20395902 20551304 21450867 22496552 22862604 21996310 19934352 17178229 14009170
$$ packed form
17134E03759j380m73002j91941O37936J654215K576697L385925M055668M268917
17125A6416794L822531K914315J825363O85740m66532j672623l060223m443005
17117A6022360n186239m906088l965340k981080k254235j882350j976744k394235
17109i523951k354646j079020J185543L284902M179676L719500K509646J255671
17101C177321L37187k27459o33989j077524j634268k334744l044173l244347k351206
17092a1033202j95017K671598N176751O670307P254966P087922O146547M568686
17084B8348558K630950O32520j060206k103595k404535k158349j672664j185645
17076B1027034o31132J55402Q99563J045685L66052q66294k061958k756123l169059
$$ plain form
17067 14009170 10201444 5687201 1115720 -2362508 -3730537 -2597582 545417 4451492
17059 4451492 7824910 9781287 9553480 6444607 476102 -7233582 -14984578 -21301076
17051 -21301076 -25273724 -26578240 -25566945 -23244656 -20848688 -19186389 -18223316 -17261354
17043 -17261354 -15563310 -13014791 -10267768 -8328333 -7955297 -9124395 -10951320 -12319765
17035 -12319765 -12702604 -12365824 -11913534 -11808687 -12168533 -12773699 -13379264 -13922728 -14283900
17026 -14283900 -13984294 -12334666 -9029429 -4516246 207278 4047824 6261179 6820953
17018 6820953 6320741 5455602 4735357 4424976 4508062 4936017 5860242 7313740 8983390
17009 8983390 10654719 12540416 14920569 17666172 20100206 21197258 20298248 17797483
$$ packed form
17067A4009170l807726m514243m571481l478228j368029J132955L142999L906075
17059D451492L373418J956377k27807l108873n968505p709684p750996o316498
17051b1301076l972648j304516J011295K322289K395968J662299R63073R61962
17043a7261354J698044K548519K747023J939435L73036j169098j826925j368445
17035a2319765l82839L36780M52290J04847l59846o05166o05565n43464l61172
17026a4283900K99606J649628L305237M513183M723524L840546K213355N59774
17018F820953n00212q65139p20245l10381Q3086M27955R24225J453498J669650
17009H983390J671329J885697K380153K745603K434034J097052q99010k500765
$$ plain form
17001 17797483 14844766 12397417 10593951 8935476 7022101 5067051 3605593 2913716
16993 2913716 2995354 3716429 4776762 5905096 6967519 7869460 8514128 8803163 8836076
16984 8836076 9073999 9925008 11230428 12437665 13106953 13275563 13347232 13598497 14103034
16975 14103034 14972357 16122782 17108032 17559787 17401097 16704894 15750912 15080755 15054886
16966 15054886 15270591 14638497 12182275 7712122 1820401 -4471464 -10143387 -14490848
16958 -14490848 -17013016 -17324204 -15491929 -12219192 -8617115 -5756234 -4150736 -3676953
16950 -3676953 -4105035 -5256200 -6609590 -7506063 -7614383 -6845965 -5317332 -3566095 -2383590
16941 -2383590 -2235321 -2885276 -3651730 -3939804 -3530904 -2695702 -2071397 -2193608 -3071203
$$ packed form
17001A7797483k952717k447349j803466j658475j913375j955050j461458o91877
16993B913716Q1638P21075J060333J128334J062423R01941O44668K89035L2913
16984H836076K37923Q51009J305420J207237O69288J68610P1669K51265N04537
16975A4103034Q69323J150425R85250M51755j58690o96203r53982o70157k5869
16966A5054886K15705o32094k456222m470153n891721o291865n671923m347461
16958a4490848k522168l11188J832275L272737L602077K860881J605498M73783
16950c676953m28082j151165j353390q96473j08320P68418J528633J751237J182505
16941b383590J48269o49955p66454k88074M08900Q35202O24305j22211q77595
$$ plain form
16932 -3071203 -4039579 -3879575 -1323780 4094832 11569225 19466974 26201995 30845935
16924 30845935 33259214 33795075 33041626 31791108 30765675 30177785 29760634 29209620 28405993
16915 28405993 27372381 26244340 25186418 24345018 23922441 24020461 24432452 24785944 24836574
16906 24836574 24703050 24858591 25752439 27395135 29348525 31036222 32044903 32272804 31890722
16897 31890722 31162648 30140203 28612735 26581714 24365680 21957043 18779922 14495731
16889 14495731 9739463 5793473 3720226 3740275 5240437 7367959 9564095 11582964
16881 11582964 13417791 15228436 17251344 19853858 23386586 27897620 33113189 38468881
16873 38468881 43044378 45780138 46213764 44904364 42780377 40251444 37173782 33392346
$$ packed form
16932c071203r68376J60004K555795N418612P474393P897749O735021M643940
16924C0845935K413279N35861p53449j250518j025433n87890m17151n51014q03627
16915B8405993j033612j128041j057922q41400m22577R8020M11991L53492N0630
16906B4836574j33524J55541Q93848J642696J953390J687697J008681K27901l82082
16897C1890722p28074j022445j527468k031021k216034k408637l177121m284191
16889A4495731m756268l945990k073247K0049J500162K127522K196136K018869
16881A1582964J834827J810645K022908K602514L532728M511034N215569N355692
16873C8468881M575497K735760M33626j309400k123987k528933l077662l781436
$$ plain form
16865 33392346 29108386 25080858 22576017 22439724 24094108 25979642 26761157 25995597
16857 25995597 24200572 22459579 21758508 22529973 24651702 27820565 31757675 35925987
16849 35925987 39412158 41373665 41487262 39869980 36889327 33234544 29739042 26791445
16841 26791445 24101379 21035266 16995246 11658813 5292852 -1123591 -6385329 -9612830
16833 -9612830 -10422479 -8913976 -5597669 -1196590 3573596 7970446 11181937 12610424
16825 12610424 12150314 10172260 7298368 4053652 601542 -3072713 -6772890 -10189566
16817 -10189566 -13079530 -15016242 -15557673 -14844269 -13639735 -12857202 -13099814 -14285255 -15673174
16808 -15673174 -16527407 -16574119 -15863214 -14542080 -12652463 -9976406 -6312156 -2029894 1801383
$$ packed form
16865C3392346m283960m027528k504841j36293J654384J885534P81515p65560
16857B5995597j795025j740993p01071P71465K121729L168863L937110M168312
16849C5925987L486171J961507J13597j617282k980653l654783l495502k947597
16841B6791445k690066l066113m040020n336433o365961o416443n261738l227501
16833i612830q09649J508503L316307M401079M770186M396850L211491J428487
16825A2610424m60110j978054k873892l244716l452110l674255l700177l416676
16817a0189566k889964j936712n41431P13404J204534P82533k42612j185441j387919
16808a5673174q54233m6712P10905J321134J889617K676057L664250M282262L831277
$$ plain form
16799 1801383 4114061 4581604 3457409 980497 -2817573 -7798602 -13360140 -18495406
16791 -18495406 -22324078 -24637754 -25805868 -26250067 -26222047 -25870744 -25189491 -23868120 -21486820
16782 -21486820 -17990921 -13921883 -10113678 -7016148 -4339698 -1548086 1367872 3708554
16774 3708554 4613354 3858086 2063711 37114 -1947764 -4200346 -7127487 -10759855
16766 -10759855 -14667916 -18262591 -21084064 -22885867 -23695025 -23761766 -23425217 -23101031 -23135607
16757 -23135607 -23468419 -23627532 -23039079 -21272018 -18372128 -15075231 -12411430 -11136467
16749 -11136467 -11650007 -13929555 -17363104 -21037033 -24052912 -25708792 -25813418 -24721273
16741 -24721273 -22901721 -20492103 -17339100 -13371227 -8935339 -4922014 -2381661 -1806760
$$ packed form
16799A801383K312678M67543j124195k476912l798070m981029n561538n135266
16791a8495406l828672k313676j168114m44199K8020L51303O81253J321371K381300
16782b1486820L495899M069038L808205L097530K676450K791612K915958K340682
16774C708554R04800p55268j794375k026597j984878k252582k927141l632368
16766a0759855l908061l594675k821473j801803q09158o6741L36549L24186l4576
16757b3135607l32812j59113N88453J767061K899890L296897K663801J274963
16749a1136467n13540k279548l433549l673929l015879j655880j04626J092145
16741b4721273J819552K409618L153003L967873M435888M013325K540353N74901
$$ plain form
16733 -1806760 -2772673 -4275102 -5383703 -5780513 -5854075 -6132522 -6615296 -6667258 -5509780
16724 -5509780 -2950457 358092 3467348 5704519 6702680 6409906 5328861 4271632
16716 4271632 3608038 3233693 3303386 4542808 7624264 12292658 17385818 21671756 24543486
16707 24543486 26041000 26515978 26449484 26296768 26266878 26155933 25436927 23643850 20616955
16698 20616955 16398520 11241293 5827454 1078274 -2454178 -4916361 -6884608 -8901451
16690 -8901451 -11182854 -13414710 -14889786 -15110044 -14088945 -12124498 -9731611 -7737378
16682 -7737378 -6983375 -7745240 -9583575 -11759960 -13563829 -14302885 -13492377 -11230917 -8133821
16673 -8133821 -4866480 -1645410 1788740 5474077 8853825 11276262 12507631 12731573
$$ packed form
16733a806760r65913j502429j108601l96810p3562k78447m82774n1962J157478
16724e509780K559323L308549L109256K237171R98161k92774j081045j057229
16716D271632o63594l74345O9693J239422L081456M668394N093160M285938K871730
16707B4543486J497514M74978o6494j52716k9890j10945p19006j793077l026895
16698B0616955m218435n157227n413839m749180l532452k462183j968247k016843
16690h901451k281403k231856j475076k20258J021099J964447K392887J994233
16682g737378P54003p61865j838335k176385j803869p39056Q10508K261460L097096
16673h133821L267341L221070L434150L685337L379748K422437J231369K23942
$$ plain form
16665 12731573 12273296 11484334 10809576 10685901 11306330 12475474 13759028 14837463 15636866
16656 15636866 16208552 16649624 16986106 16954553 16169095 14596729 12690048 11015456 9746768
16647 9746768 8707274 7805147 7063386 6315121 5162843 3365576 1199153 -747765 -2106281
16638 -2106281 -2906033 -3469375 -4286651 -5870791 -8505235 -11979783 -15686838 -18945678 -21094150
16629 -21094150 -21421915 -19332838 -14772639 -8544250 -2095244 3221681 6885847 9297082
16621 9297082 11301313 13706254 16751444 19739063 21432663 20947114 18307815 14324158
16613 14324158 10095032 6596258 4399218 3509251 3547177 4253329 5767606 8282159 11420088
16604 11420088 14425187 17077374 19854577 23272571 27233091 30992951 33825012 35529103
$$ packed form
16665A2731573m58277p88962o74758j23675O20429J169144J283554J078435P99403
16656A5636866N71686M41072L36482l1553p85458j572366j906681j674592j268688
16647I746768j039494r02127p41761p48265j152278j797267k166423j946918j358516
16638b106281p99752n63342q17276j584140k634444l474548l707055l258840k148472
16629b1094150l27765K089077M560199O228389O449006N316925L664166K411235
16621I297082K004231K404941L045190K987619J693600m85549k639299l983657
16613A4324158m229126l498774k197040q89967L7926P06152J514277K514553L137929
16604A1420088L005099K652187K777203L417994L960520L759860K832061J704091
$$ plain form
16596 35529103 36455815 37330856 38911272 41583861 45103404 48632476 51105483 51711621
16588 51711621 50295197 47316170 43392515 38948395 34087456 28595317 22339559 15837156
16580 15837156 10191033 6252898 3908736 2398699 1140761 32354 -816879 -1328615
16572 -1328615 -1420192 -980515 -104015 778310 1108072 418062 -1430014 -4074229 -6744991
16563 -6744991 -8366157 -7795145 -4475484 998547 7172213 12734771 17113574 20295956
16555 20295956 22463431 23986164 25562480 27760121 30374247 32630409 33896203 33841769
16547 33841769 32236244 28957474 24152307 18435053 12784002 8038764 4424944 1519849
16539 1519849 -1246863 -3965586 -6099388 -6967413 -6421352 -5013472 -3623183 -2931615 -3084444
$$ packed form
16596C5529103R26712Q75041J580416K672589L519543L529072K473007O06138
16588E1711621j416424k979027l923655m444120m860939n492139o255758o502403
16580A5837156n646123l938135k344162j510037j257938j108407q49233n11736
16572a328615r1577M39677Q76500Q82325L29762o90010j848076k644215k670762
16563f744991j621166N71012L319661N474031O173666N562558M378803L182382
16555B0295956K167475J522733J576316K197641K614126K256162J265794n4434
16547C3841769j605525l278770m805167n717254n651051m745238l613820k905095
16539A519849k766712k718723k133802q68025N46061J407880J390289O91568j52829
$$ plain form
16530 -3084444 -3756932 -4373628 -4310628 -3062115 -420328 3258408 6851458 8820624 8252910
16521 8252910 5603951 2291221 -317616 -1680855 -2218372 -2926600 -4698002 -7706348
16513 -7706348 -11401803 -15027311 -18033811 -20233414 -21850348 -23361327 -25192486 -27607032
16505 -27607032 -30519578 -33151442 -34363448 -33480604 -30584472 -26207787 -20933599 -15280691
16497 -15280691 -9716651 -4407332 825758 6001677 10786400 14823641 17781589 19257656
16489 19257656 19032613 17232439 14162358 10350235 6657664 3878203 2097497 777812
16481 777812 -472026 -1584850 -2496848 -3386136 -4348093 -5361944 -6573014 -8240240 -10514979
16472 -10514979 -13422371 -16897173 -20637583 -24119971 -27041288 -29504961 -31586343 -32947638
$$ packed form
16530c084444o72488o16696O3000J248513K641787L678736L593050J969166n67714
16521H252910k648959l312730k608837j363239n37517p08228j771402l008346
16513g706348l695455l625508l006500k199603j616934j510979j831159k414546
16505b7607032k912546k631864j212006Q82844K896132M376685N274188N652908
16497a5280691N564040N309319N233090N175919M784723M037241K957948J476067
16489A9257656k25043j800174l070081l812123l692571k779461j780706j319685
16481G77812j249838j112824r11998q89288r61957j013851j211070j667226k274739
16472a0514979k907392l474802l740410l482388k921317k463673k081382j361295
$$ plain form
16464 -32947638 -32929756 -30775798 -25884963 -18247711 -8784921 769691 8688905 14015977
16456 14015977 16510477 16351888 14098154 10797365 7653410 5214182 3336316 1951689
16448 1951689 1405482 2025932 3578260 5405163 6908187 7611215 7183268 5735815 3815322
16439 3815322 1958743 430592 -534299 -548888 597358 2681349 5217467 7723606 10027164
16430 10027164 12425343 15430919 19250161 23341413 26632714 28351063 28528304 27840824
16422 27840824 27047957 26371496 25509186 24423058 23718643 23922525 24710570 25229139 25072394
16413 25072394 24536043 23991034 23456021 22657394 21318100 19631775 18379974 18403164 19982543
16404 19982543 22661842 25414707 26969591 26388887 23485999 18672821 12546600 5729812
$$ packed form
16464c2947638J7882K153958M890835P637252R462790R554612P919214N327072
16456A4015977K494500j58589k253734l300789l143955k439228j877866j384627
16448A951689n46207O20450J552328J826903J503024P03028m27947j447453j920493
16439C815322j856579j528151r64891j4589J146246K083991K536118K506139K303558
16430A0027164K398179L005576L819242M091252L291301J718349J77241o87480
16422B7840824p92867o76461q62310j086128p04415K03882P88045N18569j56745
16413B5072394n36351n45009n35013p98627j339294j686325j251801K3190J579379
16404A9982543K679299K752865J554884n80704k902888m813178o126221o816788
$$ plain form
16396 5729812 -1001940 -6676761 -10455800 -12169850 -12462201 -12328684 -12620292 -13820485 -16117397
16387 -16117397 -19587857 -23893223 -27780293 -29579879 -28701640 -26201021 -23512746 -21041359
16379 -21041359 -18086135 -13862686 -8690697 -4044671 -1309176 -808685 -1956711 -3818897
16371 -3818897 -5404000 -5934290 -5216547 -3600209 -1485771 912000 3253711 5038156
16363 5038156 6012603 6221045 5737065 4649270 3212213 1750371 502649 -265702 -212435
16354 -212435 680873 1996881 3453274 4969033 6252851 7088013 7881943 9400227 11902390
16345 11902390 14805913 17381344 19538473 21627627 23685476 25291828 26157356 26484145
16337 26484145 26660529 26796755 26825422 27014876 27925038 29765257 32120888 34279463 35570983
$$ packed form
16396E729812o731752n674821l779039j714050k92351J33517k91608j200193k296912
16387a6117397l470460m305366l887070j799586Q78239K500619K688275K471387
16379b1041359K955224M223449N171989M646026K735495N00491j148026j862186
16371c818897j585103n30290P17743J616338K114438K397771K341711J784445
16363E038156R74447K08442m83980j087795j437057j461842j247722p68351N3267
16354b12435Q93308J316008J456393J515759J283818Q35162P93930J518284K502163
16345A1902390K903523K575431K157129K089154K057849J606352Q65528L26789
16337B6484145J76384J36226K8667J89454R10162J840219K355631K158575J291520
$$ plain form
16328 35570983 35606015 34751452 34315204 35659145 38954907 43048130 46420437 48103954 48027267
16319 48027267 46726149 44675993 42117955 39484301 37651164 37628645 39770835 43387428
16311 43387428 47265792 50161115 50952455 49206983 45692591 41630166 37725584 34176513
16303 34176513 30921745 27885741 25286595 23608799 23169017 23828669 25065210 26120076
16295 26120076 26247585 25211800 23463519 21683770 20310703 19301623 18301005 17174332
16287 17174332 16128169 15296523 14607522 14137532 14288281 15377311 17133136 18723222 19142991
16278 19142991 17596391 13958897 9116332 4576446 1516397 224019 354894 1402282
16270 1402282 2827572 4115913 5024416 5600295 5882752 5794655 5470446 5423184 6089530
$$ packed form
16328C5570983L5032q54563m36248J343941L295762M093223L372307J683517p6687
16319D8027267j301118k050156k558038k633654j833137k2519K142190L616593
16311D3387428L878364K895323P91340j745472l514392m062425l904582l549071
16303C4176513l254768l036004k599146j677796m39782O59652J236541J054866
16295B6120076J27509j035785j748281j779749j373067j009080j000618j126673
16287A7174332j046163q31646o89001m69990J50749J089030J755825J590086M19769
16278A9142991j546600l637494m842565m539886l060049j292378J30875J047388
16270A402282J425290J288341R08503N75879K82457q8097l24209m7262O66346
$$ plain form
16261 6089530 7350452 8708173 9803562 10569548 11212004 12174877 13741563 15610890 17115229
16252 17115229 17636413 16665614 14076557 10546349 7269660 5306507 5185942 6690115
16244 6690115 8853761 10495673 10974651 10389974 9237753 7949843 6755247 6004361 6303709
16235 6303709 7996856 10714391 13738694 16695989 19682581 22670652 25192132 26912396
16227 26912396 27967598 28409437 27763975 25551897 22061943 18219437 14682790 11220492
16219 11220492 7094897 2081901 -3157671 -7542498 -9975467 -9753383 -7021603 -2684607
16211 -2684607 1976704 5667087 7589483 7727253 6553380 4419868 1402240 -2029521
16203 -2029521 -4624680 -5115912 -3106015 900315 5952275 11045922 15311313 18035957
$$ packed form
16261F089530J260922J357721J095389P65986O42456R62873J566686J869327J504339
16252A7115229N21184r70799k589057l530208l276689j963153j20565J504173
16244F690115K163646J641912M78978n84677j152221j287910j194596p50886K99348
16235F303709J693147K717535L024303K957295K986592K988071K521480J720264
16227B6912396J055202M41839o45462k212078l489954l842506l536647l462298
16219A1220492m125595n012996n239572m384827k432969K22084K731780M336996
16211b684607M661311L690383J922396J37770j173873k133512l017628l431761
16203b029521k595159m91232K009897M006330N051960N093647M265391K724644
$$ plain form
16195 18035957 18758243 17496765 14788371 11413961 8121792 5466964 3493799 1662749
16187 1662749 -541067 -3000854 -5051576 -6011496 -5582075 -3993383 -1901275 66476
16179 66476 1637208 2687856 3108999 3127762 3382031 4296039 5511424 6232448 6004924
16170 6004924 5126499 4465843 4753449 5974220 7431505 8245638 7882166 6333078 3837417
16161 3837417 511758 -3682392 -8540518 -13423761 -17578233 -20463659 -21745021 -21290823
16153 -21290823 -19509868 -17492048 -16361824 -16516220 -17543138 -18722969 -19674817 -20520663
16145 -20520663 -21498229 -22555353 -23399851 -23922756 -24328154 -24929935 -26069141 -27889794 -29974180
16136 -29974180 -31565831 -32276874 -32327585 -32158879 -31928524 -31117264 -28695683 -24067132 -17701802
$$ packed form
16195A8035957P22286j261478k708394l374410l292169k654828j973165j831050
16187A662749k203816k459787k050722r59920M29421J588692K092108J967751
16179F6476J570732J050648M21143J8763K54269R14008J215385P21024k27524
16170F004924q78425o60656K87606J220771J457285Q14133l63472j549088k495661
16161C837417l325659m194150m858126m883243m154472k885426j281362M54198
16153b1290823J780955K017820J130224j54396j026918j179831r51848q45846
16145b0520663r77566j057124q44498n22905m05398o01781j139206j820653k084386
16136b9974180j591651p11043n0711J68706K30355Q11260K421581M628551O365330
$$ plain form
16127 -17701802 -10738452 -4215361 1264079 5481535 8515905 10741775 12717315 14793677
16119 14793677 17004506 19395265 22061727 24887369 27594511 29831675 31086413 30883618
16111 30883618 29032826 25585098 20749082 14825938 8220762 1695662 -3660874 -7212720
16103 -7212720 -9224492 -10271334 -10600400 -10053626 -8433102 -5874821 -2633254 1331536
16095 1331536 6159862 11458871 16147132 19241864 20599736 20714050 20110829 19049141
16087 19049141 17450094 15074763 12144410 9566112 8212710 8287528 9396339 10960502
16079 10960502 12417177 13093858 12345995 9915016 6001830 990984 -4717156 -10422944
16071 -10422944 -15032465 -17555448 -17645855 -15774986 -12974305 -10274798 -8282675 -7250039
$$ packed form
16127a7701802O963350O523091N479440M217456L034370K225870J975540K076362
16119A4793677K210829K390759K666462K825642K707142K237164J254738k02795
16111C0883618j850792l447728m836016n923144o605176o525100n356536l551846
16103g212720k011772j046842l29066N46774J620524K558281L241567L964790
16095A331536M828326N299009M688261L094732J357872J14314o03221j061688
16087A9049141j599047k375331k930353k578298j353402P4818J108811J564163
16079A0960502J456675O76681p47863k430979l913186n010846n708140n705788
16071a0422944m609521k522983r0407J870869K800681K699507J992123J032636
$$ plain form
16063 -7250039 -7202843 -7838573 -8631442 -9246290 -9880309 -10893142 -12095015 -12903476 -13129930
16054 -13129930 -13216395 -13714968 -14685961 -15675261 -16212988 -16199608 -15839078 -15309421 -14546143 -13318392
16044 -13318392 -11565279 -9659735 -8026309 -6484259 -4429813 -1647298 1385474 4041743
16036 4041743 6115745 7702531 8807243 9293078 9132806 8517826 7641264 6626931 5711974
16027 5711974 5097651 4718215 4313482 3490579 1787812 -1081255 -5078874 -9894005 -15136773
16018 -15136773 -20624479 -26208392 -31302918 -35024377 -36693136 -36061535 -33482690 -29934075
16010 -29934075 -26436900 -23461558 -21208861 -20078920 -20548315 -22643585 -25595136 -28301763
16002 -28301763 -30080531 -30811678 -30696016 -30044911 -29137238 -28176735 -27166010 -25741107 -23428072
$$ packed form
16063g250039M7196o35730p92869o14848o34019j012833j201873q08461k26454
16054a3129930q6465m98573r70993r89300n37727J3380L60530N29657P63278J227751
16044a3318392J753113J905544J633426J542050K054446K782515L032772K656269
16036D041743K074002J586786J104712M85835j60272o14980q76562j014333r14957
16027E711974o14323l79436m04733q22903j702767k869067l997619m815131n242768
16018a5136773n487706n583913n094526l721459j668759O31601K578845L548615
16010b9934075L497175K975342K252697J129941m69395k095270k951551k706627
16002b8301763j778768p31147J15662O51105R07673R60503J010725J424903K313035
$$ plain form
15993 -23428072 -20222956 -16735507 -13786844 -11947886 -11225366 -11158423 -11455089 -12494396 -14861129
15984 -14861129 -18404358 -22035074 -24580884 -25713328 -25982042 -26185157 -26772722 -27675222 -28577541
15975 -28577541 -29130549 -28970806 -27890323 -25903734 -23013214 -19178024 -14549771 -9516358
15967 -9516358 -4541935 -75452 3462253 5888379 7370311 8166986 8392598 8030865 7123544
15958 7123544 5866714 4601533 3897757 4413169 6343817 9150410 11921986 13851742
15950 13851742 14517386 14043204 12900950 11385581 9478764 7157153 4617766 2255190
15942 2255190 497733 -516088 -1270462 -2714522 -5709475 -10412678 -15889740 -20562800
15934 -20562800 -23344194 -24250430 -24006774 -23215171 -21844898 -19453596 -15876285 -11720058
$$ packed form
15993b3428072L205116L487449K948663J838958P22520O6943k96666j039307k366733
15984a4861129l543229l630716k545810j132444k68714k03115n87565r02500r02319
15975b8577541n53008J59743J080483J986589K890520L835190M628253N033413
15967i516358M974423M466483L537705K426126J481932P96675K25612l61733r07321
15958G123544j256830j265181p03776N15412J930648K806593K771576J929756
15950A3851742O65644m74182j142254j515369j906817k321611k539387k362576
15942B255190j757457j013821p54374j444060k994953m703203n477062m673060
15934b0562800k781394r06236K43656P91603J370273K391302L577311M156227
$$ plain form
15926 -11720058 -8078753 -5634543 -4084235 -2542245 -398049 2422953 5845352 9850258
15918 9850258 14217019 18511063 22462879 26057552 29238627 31709098 33122354 33320640
15910 33320640 32394639 30641034 28254925 25234864 21975652 19394373 18142145 18338538
15902 18338538 20043516 23308277 27792545 32726846 37178690 40260090 41423143 40660972
15894 40660972 38319500 34782528 30229489 24627242 18046668 10981790 4293533 -1143867
15886 -1143867 -4775479 -6500362 -6606837 -5642512 -4120996 -2234333 172827 3492306
15878 3492306 7920113 13119858 18496701 23449775 27529611 30806107 33745876 36606380
15870 36606380 39205782 41104380 41979023 41922940 41236506 40052283 38367992 36396533 34776245
$$ packed form
15926a1720058L641305K444210J550308J541990K144196K821002L422399M004906
15918I850258M366761M294044L951816L594673L181075K470471J413256J98286
15910C3320640r26001j753605k386109l020061l259212k581279j252228J96393
15902A8338538J704978L264761M484268M934301M451844L081400J163053p62171
15894D0660972k341472l536972m553039n602247o580574p064878o688257n437400
15886a143867l631612j724883j06475R64325J521516J886663K407160L319479
15878C492306M427807N199745N376843M953074M079836L276496K939769K860504
15870C6606380K599402J898598Q74643n6083o86434j184223j684291j971459j620288
$$ plain form
15861 34776245 34140729 34436649 34951781 34938627 34096017 32737112 31621409 31402301 32063141
15852 32063141 32837669 32759029 31312390 28650529 25338120 21824489 18311277 15080676
15844 15080676 12490032 10663578 9366555 8105061 6345227 3774410 462596 -3202753
15836 -3202753 -6709301 -9707358 -12267949 -14621112 -16617221 -17813826 -18014417 -17411518
15828 -17411518 -16094536 -13826583 -10617085 -7014411 -3528273 -63367 3943353 8891902
15820 8891902 14418174 19292988 22055208 22036309 19892881 17080915 14881783 13876697
15812 13876697 13902491 14374292 14835797 15250794 15898059 16977735 18382803 19982572 21657068
15803 21657068 22959334 23349701 22792653 21808536 20987798 20612567 20763500 21627955 23448173
$$ packed form
15861C4776245o35516K95920N15132j3154q42610j358905j115703k19108O60840
15852C2063141P74528p8640j446639k661861l312409l513631l513212l230601
15844A5080676k590644j826454j297023j261494j759834k570817l311814l665349
15836c202753l506548k998057k560591k353163j996109j196605k00591O02899
15828a7411518J316982K267953L209498L602674L486138L464906M006720M948549
15820H891902N526272M874814K762220j8899k143428k811966k199132j005086
15812A3876697K5794M71801M61505M14997O47265J079676J405068J599769J674496
15803B1657068J302266L90367n57048r84117q20738l75231J50933Q64455J820218
$$ plain form
15794 23448173 26128751 29020046 31091689 31461064 29974393 27225466 23992619 20755143
15786 20755143 17754146 15372522 14157201 14377579 15657565 17133961 17985895 17761575
15778 17761575 16485196 14673464 13049151 11993261 11344172 10779987 10226291 9727511 9129850
15769 9129850 8126171 6468446 4170271 1427446 -1693039 -5154116 -8718155 -12037159
15761 -12037159 -14965911 -17771744 -20832880 -24078431 -26807144 -28205832 -27988069 -26346613
15753 -26346613 -23526904 -19741346 -15303368 -10544018 -5738447 -1288501 2146691 3930210
15745 3930210 3883144 2250680 -520594 -3826819 -7083894 -10008914 -12590916 -14764813
15737 -14764813 -16175326 -16347448 -15288091 -13619547 -11855156 -9993352 -7895119 -5727969
$$ packed form
15794B3448173K680578K891295K071643L69375j486671k748927l232847l237476
15786B0755143l000997k381624j215321K20378J279986J476396Q51934k24320
15778A7761575j276379j811732j624313j055890o49089n64185n53696m98780n97661
15769I129850j003679j657725k298175k742825l120485l461077l564039l319004
15761a2037159k928752k805833l061136l245551k728713j398688K17763J641456
15753b6346613K819709L785558M437978M759350M805571M449946L435192J783519
15745C930210m7066j632464k771274l306225l257075k925020k582002k173897
15737a4764813j410513j72122J059357J668544J764391J861804K098233K167150
$$ plain form
15729 -5727969 -4106446 -3763920 -4862244 -6775407 -8786865 -10774527 -12912134 -14989200
15721 -14989200 -16404687 -16632127 -15440809 -12911140 -9550881 -6213886 -3656583 -2201140
15713 -2201140 -1721437 -1865114 -2353243 -3168712 -4483593 -6227839 -7845543 -8719043 -8647633
15704 -8647633 -7788978 -6327911 -4365986 -2040518 351099 2414886 3964104 5058790
15696 5058790 5657290 5586410 4892485 3953286 3217874 3006012 3543476 4894728 6768423
15687 6768423 8560730 9657914 9781618 9092097 8140937 7602107 7777361 8388150 8715254
15678 8715254 7972882 5800566 2407697 -1774656 -6131249 -9620354 -11372557 -11455127 -10535284
15669 -10535284 -9103004 -7376947 -5749917 -4843600 -5003268 -5959289 -7034993 -7606521 -7431599
$$ packed form
15729e727969J621523L42526j098324j913163k011458j987662k137607k077066
15721a4989200j415487k27440J191318K529669L360259L336995K557303J455443
15713b201140M79703j43677m88129q15469j314881j744246j617704q73500P1410
15704h647633Q58655J461067J961925K325468K391617K063787J549218J094686
15696E058790N98500p0880o93925r39199p35412k11862N37464J351252J873695
15687F768423J792307J097184J23704o89521r51160n38830J75254O10789L27104
15678H715254p42372k172316l392869m182353m356593l489105j752203q2570R19843
15669a0535284J432280J726057J627030R06317j59668r56021j075704n71528J74922
$$ plain form
15660 -7431599 -6794808 -6373306 -6642045 -7293627 -7456811 -6484250 -4389829 -1681702 1021678
15651 1021678 3337170 5176467 6465453 7080080 7033871 6537990 5884192 5282189 4723165
15642 4723165 3989283 2909934 1712319 1028412 1314262 2391278 4002297 6491090 10307461
15633 10307461 15275960 20652238 25636064 29821646 33135360 35415093 36453625 36459599
15625 36459599 35993458 35384593 34416644 32648476 29904754 26321316 22201851 18060588
15617 18060588 14467648 11665221 9558579 8063914 7293505 7465265 8754454 11183908
15609 11183908 14389707 17404139 18882241 17795527 14107313 8858014 3828116 794822
15601 794822 564911 2830502 6656296 10713115 13579398 14368232 13188819 10950968 8632158
$$ packed form
15660g431599O36791M21502k68739o51582j63184R72561K094421K708127K703380
15651A021678K315492J839297J288986O14627m6209m95881o53798o02003n59024
15642D723165p33882j079349j197615o83907K85850J077016J611019K488793L816371
15633A0307461M968499N376278M983826M185582L313714K279733J038532N974
15625C6459599m66141o08865r67949j768168k743722l583438m119465m141263
15617A8060588l592940k802427k106642j494665p70409J71760J289189K429454
15609A1183908L205799L014432J478102j086714l688214n249299n029898l033294
15601G94822k29911K265591L825794M056819K866283P88834j179413k237851k318810
$$ plain form
15592 8632158 6607053 4446238 1373714 -2939715 -8098844 -13362940 -17873301 -20648307
15584 -20648307 -20964683 -18800043 -14654807 -9288170 -3665302 1397866 5543800 8725995
15576 8725995 10954892 12226411 12572943 12089832 10848816 8764449 5868785 2794675
15568 2794675 646295 261284 1562890 3527285 4798024 4544760 2795819 174351
15560 174351 -2375321 -3874486 -3784342 -2245163 193026 3028035 5957483 8631257 10503945
15551 10503945 11104269 10322615 8429031 6105494 4379239 4027165 5016020 6825659 9072746
15542 9072746 11617350 14439893 17554111 20816842 23821533 26016531 26945849 26496554
15534 26496554 24861479 22512734 20255956 18797864 18262281 18291726 18447490 18485969 18423203
$$ packed form
15592H632158k025105k160815l072524m313429n159129n264096m510361k775006
15584b0648307l16376K164640M145236N366637N622868N063168M145934L182195
15576H725995K228897J271519L46532m83111j241016k084367k895664l074110
15568B794675k148380l85011J301606J964395J270739k53264j748941k621468
15560A74351k549672j499165R0144J539179K438189K835009K929448K673774J872688
15551A0503945O00324p81654j893584k323537j726255l52074R88855J809639K247087
15542I072746K544604K822543L114218L262731L004691K194998R29318m49295
15534B6496554j635075k348745k256778j458092n35583K9445J55764L8479o2766
$$ plain form
15525 18423203 18398760 18553606 19025077 19765368 20510329 21316938 22673970 24644484 26529543
15516 26529543 27700657 28193715 28247207 27721101 26324747 24050088 21163896 18007526 14753112
15507 14753112 11266966 7453727 3758432 908412 -756935 -1337878 -1014323 189274
15499 189274 2480306 6191582 11435200 17887450 24772569 30787492 34619918 35988377
15491 35988377 35798151 35197937 34710804 34221970 33491115 32465631 31233424 29796985 27938473
15482 27938473 25559066 23040160 20872633 19215106 18039983 17334663 17032650 17033976 17334737
15473 17334737 18054830 19421527 21606042 24518660 27742530 30604760 32562305 33726569
15465 33726569 34817645 36445551 38606841 40999572 43546624 46211730 48600239 50204609
$$ packed form
15525A8423203k4443J54846M71471P40291P44961Q06609J357032J970514J885059
15516B6529543J171114M93058N3492n26106j396354k274659k886192l156370l254414
15507A4753112l486146l813239l695295k850020j665347n80943L23555J203597
15499A89274K291032L711276N243618O452250O885119O014923L832426J368459
15491C5988377j90226o00214m87133m88834p30855j025484j232207j436439j858512
15482B7938473k379407k518906k167527j657527j175123p05320l02013J326L00761
15473A7334737P20093J366697K184515K912618L223870K862230J957545J164264
15465C3726569J091076J627906K161290K392731K547052K665106K388509J604370
$$ plain form
15457 50204609 50831289 50547010 49476541 47890856 46307858 45359232 45408562 46234949 47212813
15448 47212813 47813483 47903808 47792174 48103837 49176711 50435049 50743100 49479944 47069489
15439 47069489 44606395 43072977 42707311 43009359 43239626 42976584 42353652 41805067 41551068
15430 41551068 41346214 40608971 38651493 35051077 29955626 23848942 17204973 10694788
15422 10694788 5255388 1532114 -423124 -908088 -314443 956151 2438926 3621023
15414 3621023 4443787 5476780 7078869 8842568 10157768 11087955 12530649 15502478
15406 15502478 20328359 26488578 32950202 38538245 42213841 43319108 41972604 39279239
15398 39279239 36768695 35466894 35568906 36818649 38812920 40935723 42421246 42759756
$$ packed form
15457E0204609O26680k84279j070469j585685j582998r48626M9330Q26387R77864
15448D7212813O00670R0325j11634L11663J072874J258338L08051j263156k410455
15439D7069489k463094j533418l65666L02048K30267k63042o22932n48585k53999
15430D1551068k04854p37243j957478l600416n095451o106684o643969o510185
15422A0694788n439400l723274j955238m84964N93645J270594J482775J182097
15414C621023Q22764J032993J602089J763699J315200R30187J442694K971829
15406A5502478M825881O160219O461624N588043L675596J105267j346504k693365
15398C9279239k510544j301801J02012J249743J994271K122803J485523L38510
$$ plain form
15390 42759756 42001559 40598262 39017045 37433431 35728024 33769454 31668394 29826120
15382 29826120 28682770 28413573 28954807 30228914 32178339 34649286 37302961 39646191
15374 39646191 41262830 41937375 41538250 39960941 37306830 34161073 31438328 29737995
15366 29737995 29043907 28962275 28898944 28282483 26997874 25459025 24228355 23773728 24534303
15357 24534303 26660449 29667956 32828483 35855798 38955832 42168467 45063883 47199307
15349 47199307 48490761 49269840 50199964 51872394 54403183 57340320 59886820 61474549
15341 61474549 62292699 63228503 65149248 68206153 71922863 75843492 79927499 84410432
15333 84410432 89467056 95074875 101172347 107715774 114535559 121385085 127999618 134210356
$$ packed form
15390D2759756p58197j403297j581217j583614j705407j958570k101060j842274
15382B9826120j143350k69197N41234J274107J949425K470947K653675K343230
15374C9646191J616639O74545l99125j577309k654111l145757k722745j700333
15366B9737995o94088q1632o3331o16461j284609j538849j230670m54627P60575
15357B4534303K126146L007507L160527L027315L100034L212635K895416K135424
15349D7199307J291454P79079R30124J672430K530789K937137K546500J587729
15341F1474549Q18150R35804J920745L056905L716710L920629M084007M482933
15333H4410432N056624N607819O097472O543427O819785O849526O614533O210738
$$ plain form
15325 134210356 140189066 146252231 152475509 158932939 166212080 175115730 185957194 198479282
15317 198479282 212216997 226740621 241838068 257883934 275847198 296421174 319169424
15310 319169424 342667936 365450324 386801823 406664400 424949263 441093993 454307897
15303 454307897 463932006 469504260 470937964 468793601 464284653 458880746 453778336 449775045
15295 449775045 447461029 447311062 449513810 453616691 458365316 462213030 463924621 462518142
15287 462518142 457167310 447465038 433615894 416269386 396177390 373985499 350422611
15280 350422611 326648632 304153628 284279734 267758083 254611266 244424188 236482906
15273 236482906 229754413 223240851 216609269 210329102 205070002 200891776 196996374 192259618
$$ packed form
15325A34210356N978710O063165O223278O457430P279141Q903650J0841464J2522088
15317A98479282J3737715J4523624J5097447J6045866J7963264K0573976K2748250
15310C19169424K3498512K2782388K1351499J9862577J8284863J6144730J3213904
15303D54307897R624109N572254J433704k144363m508948n403907n102410m003291
15295D49775045k314016j49967K202748M102881M748625L847714J711591j406479
15287D62518142n350832r702272j3849144j7346508k0091996k2191891k3562888
15280C50422611k3773979k2495004j9873894j6521651j3146817j0187078p941282
15273B36482906o728493o513562o631582o280167n259100m178226l895402m736756
$$ plain form
15265 192259618 185927529 178050395 169584035 162031804 156881401 154949733 155781863 157913956
15257 157913956 159904720 160977619 160891430 159625501 157348133 154417457 151134609 147717947
15249 147717947 144575517 142170108 140574330 139371004 137818977 135156256 131157648 126583609
15241 126583609 123045347 122207815 124880256 130784966 138945475 148322042 158299158 168397245
15233 168397245 177686257 185124015 190721628 195914855 202381941 210844877 221148739 232933831
15225 232933831 246100230 260826525 277134058 294665769 312941151 331367471 349080283
15218 349080283 365248986 379392781 391073898 399392555 403221379 401929522 395498941
15211 395498941 384300443 369114710 351036892 331231515 310765052 290334243 270167326
$$ packed form
15265A92259618o332089p877134q466360p552231n150403j931668Q32130K132093
15257A57913956J990764J072899q6189j265929k277368k930676l282848l416662
15249A47717947l142430k405409j595778j203326j552027k662721l998608m574039
15241A26583609l538262q37532K672441N904710Q160509R376567R977116J0098087
15233A68397245R289012P437758N597613N193227O467086Q462936J0303862J1785092
15225B32933831J3166399J4726295J6307533J7531711J8275382J8426320J7712812
15218C49080283J6168703J4143795J1681117Q318657L828824j291857o430581
15211C95498941j1198498j5185733j8077818j9805377k0466463k0430809k0166917
$$ plain form
15204 270167326 250325092 230984430 212579581 195785003 181128495 168642260 158156667
15197 158156667 149757024 143650403 139627887 136759823 133672561 129214730 122853736 114552663
15189 114552663 104622960 93724252 82826341 72921204 64442803 57168929 50790927 45330102
15181 45330102 41134156 38601489 37665826 37610056 37603842 37317053 36975298 37011412 37754971 39301663
15171 39301663 41575895 44387123 47327059 49954989 52178507 54201230 56171490 58079176
15163 58079176 59893663 61652644 63435150 65182462 66583062 67263528 67120114 66434477
15155 66434477 65640636 64807096 63337439 60456076 56080460 51086669 46556504 42875141
15147 42875141 39688310 36584305 33545643 30681121 27967090 25381054 22967849 20812222
$$ packed form
15204B70167326j9842234j9340662j8404849j6794578j4656508j2486235j0485593
15197A58156667q399643o106621m022516k868064l087262m457831o360994q301073
15189A14552663r929703j0898708j0897911r905137q478401p273874o378002n460825
15181D5330102m195946k532667r35663n5770o214k86789l41755L6114P43559J546692
15171C9301663K274232K811228K939936K627930K223518K022723J970260J907686
15163E8079176J814487J758981J782506J747312J400600O80466j43414o85637
15155F6434477p93841q33540j469657k881363m375616m993791m530165l681363
15147D2875141l186831l104005l038662k864522k714031k586036k413205k155627
$$ plain form
15139 20812222 19045067 17791123 17139879 17145301 17724353 18514495 18922305 18357389 16566763
15130 16566763 13836677 10656712 7283769 3919224 1181260 59474 1315932 5046733
15122 5046733 10711439 17364088 24020186 30007264 34960462 38593767 40748274 41574441
15114 41574441 41386630 40405084 38719007 36433329 33848546 31470517 29699342 28514096
15106 28514096 27544271 26502403 25399156 24166242 22454206 20076133 17325720 14690062
15098 14690062 12369984 10254403 8433938 7386617 7401040 8148302 9013266 9554802 9681290
15089 9681290 9706965 10146509 11185005 12427357 13382717 14005640 14612495 15569452 17097275
15080 17097275 19147607 21554211 24269052 27340039 30767493 34441195 37977744 40621301
$$ packed form
15139B0812222j767155j253944o51244N422N79052P90142M07810n64916j790626
15130A6566763k730086l179965l372943l364545k737964j121786J256458L730801
15122E046733N664706O652649O656098N987078M953198L633305K154507Q26167
15114D1574441j87811r81546j686077k285678k584783k378029j771175j185246
15106B8514096r69825j041868j103247j232914j712036k378073k750413k635658
15098A4690062k320078k115581j820465j047321J4423P47262Q64964N41536J26488
15089I681290K5675M39544J038496J242352R55360O22923O06855R56957J527823
15080A7097275K050332K406604K714841L070987L427454L673702L536549K643557
$$ plain form
15072 40621301 41748218 41570088 41035986 41024009 41742114 42802232 43520273 43088558 40919024
15063 40919024 37186187 32927057 29364358 27053343 25711399 24780928 23828339 22402199
15055 22402199 20039258 16720657 12928477 9105869 5527114 2678884 1336410 1940618
15047 1940618 4002351 6622127 9482496 12853924 16596017 19811150 21793242 22763638
15039 22763638 23474931 24349658 24968940 24437972 22485946 19988846 18143123 17382146 17207029
15030 17207029 16937804 16466491 16081653 15776175 15284378 14519470 13444070 11870782 9763183
15021 9763183 7702301 6712161 7378695 9363411 11746240 13696467 14901828 15407091 15308997
15012 15308997 14786061 14141368 13581350 13161421 13140160 14030950 15996180 18534709 20898475
$$ packed form
15072D0621301J126917j78130n34102j1977P18105J060118P18041m31715k169534
15063D0919024l732837m259130l562699k311015j341944r30471r52589j426140
15055B2402199k362941l318601l792180l822608l578755k848230j342474O04208
15047A940618K061733K619776K860369L371428L742093L215133J982092R70396
15039B2763638P11293Q74727O19282n30968j952026k497100j845723p60977j75117
15030A7207029k69225m71313l84838l05478m91797p64908j075400j573288k107599
15021I763183k060882r90140O66534J984716K382829J950227J205361N05263r8094
15012A5308997n22936o44693n60018m19929k1261Q90790J965230K538529K363766
$$ plain form
15003 20898475 22431740 22550881 20850098 17349349 12550375 7417582 3278757 1380840
14995 1380840 2295176 5625781 10083871 13869674 15500391 14654236 12342000 10234115
14987 10234115 9467387 9918171 10553283 10406250 9170588 6999997 4199849 1272426 -1204101
14978 -1204101 -2911512 -3742019 -3592696 -2468500 -707287 928322 1490468 662692 -772084
14969 -772084 -1728067 -1748552 -1014848 29220 1028764 1938246 2883660 3865169 4663306 5199994
14959 5199994 5879002 7354243 10204491 14768188 20793013 27282750 32987458 37051653
14951 37051653 39298659 40210941 40656045 41259164 41972711 42357238 42101445 41126421 39396187
14942 39396187 36845264 33566899 29942003 26452829 23498464 21323840 19778167 18003413
$$ packed form
15003B0898475J533265J19141j700783l500749m798974n132793m138825j897917
14995A380840R14336L330605M458090L785803J630717q46155k312236k107885
14987A0234115p66728M50784O35112j47033j235662k170591k800148k927423k476527
14978a204101j707411q30507J49323J124196J761213J635609N62146q27776j434776
14969g72084r55983k0485P33704J044068R99544R09482R45414R81509P98137N36688
14959E199994O79008J475241K850248M563697O024825O489737N704708M064195
14951C7051653K247006R12282M45104O03119P13547L84527k55793r75024j730234
14942C9396187k550923l278365l624896l489174k954365k174624j545673j774754
$$ plain form
14934 18003413 14787148 9516836 2764283 -4067988 -9810194 -14260618 -17975719 -21554146
14926 -21554146 -25003746 -27804770 -29606792 -30518817 -30610059 -29464742 -26466294 -21496824
14918 -21496824 -15225464 -8801270 -3318713 678136 3247748 4603967 4860767 4156273
14910 4156273 2616023 234647 -2828883 -6061412 -9079908 -11899841 -14581989 -17001107
14902 -17001107 -18924260 -20142343 -20591780 -20431586 -20140713 -20436605 -21685405 -23403991 -24622254
14893 -24622254 -24607169 -23205335 -20804111 -18063999 -15491412 -13142614 -10696627 -7810643
14885 -7810643 -4577033 -1639825 306099 1072176 967110 408248 -268101 -782946 -1065070
14876 -1065070 -1281743 -1526706 -1772264 -1992733 -2013610 -1528405 -525157 531990 1130758
$$ packed form
14934A8003413l216265n270312o752553o832271n742206m450424l715101l578427
14926b1554146l449600k801024j802022r12025r1242J145317K998448M969470
14918b1496824O271360O424194N482557L996849K569612J356219K56800p04494
14910D156273j540250k381376l063530l232529l018496k819933k682148k419118
14902a7001107j923153j218083m49437J60194K90873k95892j248800j718586j218263
14893b4622254J5085J401834K401224K740112K572587K348798K445987K885984
14885g810643L233610K937208J945924P66077j05066n58862o76349n14845k82124
14876a065070k16673k44963k45558k20469k0877M85205J003248J057147N98768
$$ plain form
14867 1130758 1189942 1075955 1352086 2432667 4227740 6088336 7111216 6623154 4507925
14858 4507925 1071181 -3197402 -7623246 -11472255 -14195203 -15585673 -15895147 -15768727
14850 -15768727 -15858708 -16367113 -16976392 -17237376 -16982053 -16317370 -15539161 -15131833 -15411872
14841 -15411872 -16212031 -17207683 -18350337 -19769151 -21416186 -23085388 -24694437 -26221445
14833 -26221445 -27291282 -27092819 -24832916 -20381457 -14578217 -8719935 -3710569 271610
14825 271610 3370159 5490758 6302871 5626185 3636968 786767 -2283987 -4823386 -6211228
14816 -6211228 -6362330 -5923380 -5904267 -7019448 -9252064 -11974691 -14496694 -16402607 -17475423
14807 -17475423 -17616868 -16861464 -15256711 -12701745 -9032431 -4242048 1381783 7245608
$$ packed form
14867A130758N9184j13987K76131J080581J795073J860596J022880m88062k115229
14858D507925l436744m268583m425844l849009k722948j390470l09474J26420
14850a5768727q9981n08405o09279k60984K55323O64683P78209M07328k80039
14841a5411872q00159r95652j142654j418814j647035j669202j609049j527008
14833b6221445j069837J98463K259903M451459N803240N858282N009366L982179
14825B71610L098549K120599Q12113o76686j989217k850201l070754k539399j387842
14816f211228j51102M38950J9113j115181k232616k722627k522003j905913j072816
14807a7475423j41445P55404J604753K554966L669314M790383N623831N863825
$$ plain form
14799 7245608 12644416 17095725 20408584 22450161 23067757 22115108 19406432 14968507
14791 14968507 9439013 3801065 -1285421 -5598046 -9200193 -12444729 -15716672 -18972706
14783 -18972706 -21660674 -23088341 -22895626 -21279303 -18757893 -15861792 -13193244 -11483465
14775 -11483465 -11225511 -12403800 -14646502 -17378799 -19832391 -21244507 -21253371 -20000770 -17849996
14766 -17849996 -15052865 -11730900 -8262092 -5435284 -3971928 -4109551 -5691475 -8388138
14758 -8388138 -11731650 -15108832 -17957038 -19894178 -20612489 -19916157 -17992459 -15426183
14750 -15426183 -12729743 -9939074 -6849191 -3350655 578121 4788052 8788764 11968956
14742 11968956 13995741 14902433 14949429 14477277 13708932 12681730 11541117 10673101 10498220
$$ packed form
14799G245608N398808M451309L312859K041577O17596r52649k708676m437925
14791A4968507n529494n637948n086486m312625l602147l244536l271943l256034
14783a8972706k687968j427667J92715J616323K521410K896101K668548J709779
14775a1483465K57954j178289k242702k732297k453592j412116q864J252601K150774
14766a7849996K797131L321965L468808K826808J463356j37623j581924k696663
14758h388138l343512l377182k848206j937140p18311O96332J923698K566276
14750a5426183K696440K790669L089883L498536L928776M209931M000712L180192
14742A1968956K026785R06692M6996m72152p68345j027202j140613q68016j74881
$$ plain form
14733 10498220 11342298 13249832 15776576 18175901 19830939 20559109 20656230 20676252 20901023
14724 20901023 21004668 20443619 19035393 17066394 14989060 12894091 10270748 6566375
14716 6566375 1972516 -2715463 -6976228 -10801340 -14314373 -17598405 -20595395 -23053173
14708 -23053173 -24660027 -25240530 -24953655 -24340885 -24197949 -25228797 -27618596 -30900917 -34165080
14699 -34165080 -36417662 -36988084 -35870875 -33726138 -31487220 -29805522 -28656702 -27528244
14691 -27528244 -26081531 -24576618 -23680411 -23761080 -24334516 -24354070 -22954188 -20055052 -16457944
14682 -16457944 -13235827 -10963224 -9457085 -8086969 -6217417 -3384900 685687 5981529
14674 5981529 12114329 18392283 24184353 29244467 33628618 37471891 40809964 43536517
$$ packed form
14733A0498220Q44078J907534K526744K399325J655038P28170R7121K0022K24771
14724B0901023J03645n61049j408226j968999k077334k094969k623343l704373
14716F566375m593859m687979m260765l825112l513033l284032k996990k457778
14708b3053173j606854n80503K86875O12770J42936j030848k389799l282321l264163
14699c4165080k252582n70422J117209K144737K238918J681698J148820J128458
14691b7528244J446713J504913Q96207q0669n73436j9554J399882K899136L597108
14682a6457944L222117K272603J506139J370116J869552K832517M070587N295842
14674E981529O132800O277954N792070N060114M384151L843273L338073K726553
$$ plain form
14666 43536517 45458771 46292816 45754184 43596147 39439160 33127339 25602363 18771705
14658 18771705 14095556 11666402 10746194 10738264 11438399 12585792 13627755 13996737 13396185
14649 13396185 11894845 9796242 7504159 5476205 4022559 3159026 2746314 2799805 3543615
14640 3543615 4963424 6541797 7725974 8515837 9482498 11231290 13920442 17378698
14632 17378698 21598592 26812992 33015200 39590278 45512365 49793388 51811038 51510707
14624 51510707 49585327 47267475 45571016 44868422 44962781 45220791 45085564 44734128 44874300
14615 44874300 45985691 47991728 50333234 52274769 53414757 53785223 53490613 52542985
14607 52542985 51085969 49441365 47760163 45953776 44043805 42332548 41068680 40008425
$$ packed form
14666D3536517J922254Q34045n38632k158037m156987o311821p524976o830658
14658A8771705m676149k429154r20208p930P00135J147393J041963L68982o00552
14649A3396185j501340k098603k292083k027954j453646q63533m12712N3491P43810
14640C543615J419809J578373J184177P89863R66661J748792K689152L458256
14632A7378698M219894N214400O202208O575078N922087M281023K017650l00331
14624E1510707j925380k317852j696459p02594R4359K58010j35227l51436J40172
14615D4874300J111391K006037K341506J941535J139988L70466k94610r47628
14607E2542985j457016j644604j681202j806387j909971j711257j263868j060255
$$ plain form
14599 40008425 38576333 36408739 33734742 31292582 29672342 28785626 28036747 26928786
14591 26928786 25567698 24473141 23908765 23627638 23222542 22533465 21496240 19769772 17001889
14582 17001889 13407055 9741703 6721411 4715205 3830265 4027893 5273284 7431056
14574 7431056 9878547 11672598 12299215 11883755 10721744 9079372 7367270 6203292
14566 6203292 6169381 7294806 8905155 10260631 11185483 11854259 12365005 12821407 13462560
14557 13462560 14465341 15759702 17172614 18606350 20044031 21511450 22806526 23285807
14549 23285807 22250737 19618852 15926565 11773524 7707970 4414653 2476678 1854538
14541 1854538 1839480 1562075 576784 -870626 -2123823 -2640642 -2358921 -1637414 -588316
$$ packed form
14599D0008425j432092k167594k673997k442160j620240q86716p48879j107961
14591B6928786j361088j094557n64376k81127m05096o89077j037225j726468k767883
14582A7001889l594834l665352l020292k006206q84940J97628J245391K157772
14574G431056K447491J794051O26617m15460j162011j642372j712102j163978
14566F203292l3911J125425J610349J355476R24852O68776N10746M56402O41153
14557A3462560J002781J294361J412912J433736J437681J467419J295076M79281
14549B3285807j035070k631885l692287m153041m065554l293317j937975o22140
14541A854538j5058k77405r85291j447410j253197n16819K81721P21507J049098
$$ plain form
14532 -588316 1273624 4419446 8681375 13321079 17399964 20043215 20771533 19819929 18075064
14523 18075064 16632385 16238139 16976679 18404103 19910199 20907205 20911182 19728930 17519912
14514 17519912 14666099 11705210 9199780 7604487 7128922 7454650 7807553 7564364 6855162
14505 6855162 6446916 6868652 7829335 8632632 9043820 9568025 10862772 13053956 15713283
14496 15713283 18411091 21173428 24444686 28595268 33275001 37236821 39089654 38349396
14488 38349396 35575303 31735471 27744962 24230773 21300586 18608073 15809252 12850890
14480 12850890 9887684 7225546 5342181 4739437 5716288 8249943 11949168 16014338
14472 16014338 19511689 21791088 22464211 21296422 18448562 14783515 11610007 9808728
$$ packed form
14532e88316J861940L145822M261929M639704M078885K643251P28318r51604j744865
14523A8075064j442679l94246P38540J427424J506096R97006L977j182252k209018
14514A7519912k853813k960889k505430j595293m75565L25728L52903k43189p09202
14505F855162m08246M21736R60683Q03297M11188N24205J294747K191184K659327
14496A5713283K697808K762337L271258M150582M679733L961820J852833p40258
14488C8349396k774093l839832l990509l514189k930187k692513k798821k958362
14480A2850890k963206k662138j883365o02744R76851K533655L699225M065170
14472A6014338L497351K279399O73123j167789k847860l665047l173508j801279
$$ plain form
14464 9808728 9352708 9541254 9342565 7918930 5253460 2106882 -592453 -2259282 -2873691
14455 -2873691 -2929048 -3037522 -3489127 -4265354 -5387310 -7080146 -9526825 -12548524 -15611011
14446 -15611011 -18078674 -19534736 -19975259 -19507299 -17940556 -15147606 -11682983 -8459817
14438 -8459817 -5942283 -3887901 -1651879 1331468 5230407 9810932 14552695 18796348
14430 18796348 22037910 24165589 25317022 25578575 25037922 23961609 22612229 21012663
14422 21012663 18947394 16202882 13084539 10535960 9296988 9162847 9458627 9956667
14414 9956667 10771797 11604401 11670412 10350538 7713279 4330992 734066 -2728492 -5713415
14405 -5713415 -7965805 -9644191 -11407899 -13884618 -16978721 -19898247 -21830304 -22283537
$$ packed form
14464I808728m56020J88546j98689j423635k665470l146578k699335j666829o14409
14455b873691n5357j08474m51605p76227j121956j692836k446679l021699l062487
14446a5611011k467663j456062m40523M67960J566743K792950L464623L223166
14438h459817K517534K054382K236022K983347L898939M580525M741763M243653
14430A8796348L241562K127679J151433K61553n40653j076313j349380j599566
14422B1012663k065269k744512l118343k548579j238972j34141K95780M98040
14414I956667Q15130Q32604O6011j319874k637259l382287l596926l462558k984923
14405e713415k252390j678386j763708k476719l094103k919526j932057m53233
$$ plain form
14397 -22283537 -20943670 -17868193 -13954617 -10756756 -9476341 -10093796 -11493459 -12354556
14389 -12354556 -12069584 -11020657 -10016228 -9436606 -8896707 -7823918 -6162924 -4329192
14381 -4329192 -2740079 -1535468 -609929 166973 745864 913503 553732 -286429 -1619332
14372 -1619332 -3491913 -5697320 -7623608 -8412637 -7345606 -4228477 451624 5810521
14364 5810521 11110177 16004490 20354665 23919510 26307881 27332167 27385852 27330283 27884200
14355 27884200 29100443 30358318 30823568 30036692 28211647 26014493 23995343 22261559
14347 22261559 20617994 18884950 17177770 16005258 15913596 16850893 18109072 19057265 19541063
14338 19541063 19485184 18733399 17398731 15911188 14593551 13241198 11207921 7981705
$$ packed form
14397b2283537J339867L075477L913576L197861J280415o17455j399663q61097
14389a2354556K84972J048927J004429N79622N39899J072789J660994J833732
14381d329192J589113J204611R25539P76902N78891J67639l59771q40161j332903
14372a619332j872581k205407j926288p89029J067031L117129M680101N358897
14364E810521N299656M894313M350175L564845K388371J024286N3685n5569N53917
14355B7884200J216243J257875M65250p86876j825045k197154k019150j733784
14347B2261559j643565j733044j707180j172512r1662R37297J258179R48193M83798
14338A9541063n5879p51785j334668j487543j317637j352353k033277l226216
$$ plain form
14330 7981705 3705792 -862104 -4829764 -7634481 -9179201 -9598542 -9015293 -7493832
14322 -7493832 -5057668 -1691818 2359069 6226032 8897768 10146990 10600203 11031642
14314 11031642 11830218 13013069 14501431 16295652 18492920 21225221 24424352 27626054
14306 27626054 30139278 31328300 30689143 27873962 23021003 16939485 10697485 5182912
14298 5182912 1103322 -955935 -824044 954004 3202738 4740970 5153696 4819145 4126145
14289 4126145 2935672 904653 -1845222 -4586156 -6582521 -7588073 -7713236 -7202592
14281 -7202592 -6352791 -5378732 -4572492 -4482862 -5516416 -7697601 -10907058 -14862896 -18901888
14272 -18901888 -22039461 -23438222 -23001231 -21427398 -19606394 -18122564 -17222770 -16821150
$$ packed form
14330G981705m275913m567896l967660k804717j544720m19341N83249J521461
14322g493832K436164L365850M050887L866963K671736J249222M53213M31439
14314A1031642P98576J182851J488362J794221K197268K732301L199131L201702
14306B7626054K513224J189022o39157k815181m852959o081518o242000n514573
14298E182912m079590k059257J31891J778048K248734J538232M12726l34551o93000
14289D126145j190473k031019k749875k740934j996365j005552j25163N10644
14281g202592Q49801R74059Q06240Q9630j033554k181185l209457l955838m038992
14272a8901888l137573j398761M36991J573833J821004J483830Q99794M01620
$$ plain form
14264 -16821150 -16388929 -15098346 -12359791 -8257474 -3429172 1278014 5014459 7150562
14256 7150562 7468798 6225308 4095275 1874215 186874 -481686 220306 2174245 4599553
14247 4599553 6425982 6910041 6015435 4214660 1835145 -1223929 -5033157 -9077958
14239 -9077958 -12337402 -13937089 -13623891 -11714050 -9085683 -7164206 -7207332 -9350080 -12617934
14230 -12617934 -15823813 -18085132 -18794430 -17823396 -15733690 -13414490 -11572929 -10506305
14222 -10506305 -10091111 -10108635 -10642687 -11942644 -14006698 -16354958 -18132040 -18553853 -17351842
14213 -17351842 -14969145 -12286067 -9873502 -7491854 -4335134 121191 5482341 10770047
14205 10770047 15176657 18371887 20465331 21990135 23602520 25442799 27067508 28068687
$$ packed form
14264a6821150M32221J290583K738555M102317M828302M707186L736445K136103
14256G150562L18236j243490k130033k221060j687341o68560P01992J953939K425308
14247D599553J826429M84059q94606j800775k379515l059074l809228m044801
14239i077958l259444j599687L13198J909841K628367J921477m3126k142748l267854
14230a2617934l205879k261319p09298R71034K089706K319200J841561J066624
14222a0506305M15194j7524n34052j299957k064054k348260j777082m21813J202011
14213a7351842K382697K683078K412565K381648L156720M456325N361150N287706
14205A0770047M406610L195230K093444J524804J612385J840279J624709J001179
$$ plain form
14197 28068687 28405006 28173563 27389465 26012355 24189154 22358546 20835487 19411279
14189 19411279 17680658 15752554 14286405 13762517 14029896 14587356 15069172 15399801 15541730
14180 15541730 15363450 14847031 14263642 14099888 14677153 15920777 17617490 19640747 21906879
14171 21906879 24271358 26455359 28012359 28430206 27367460 24894231 21535216 18047112
14163 18047112 15162954 13237481 11943850 10725452 9517759 8563135 7837552 7044668
14155 7044668 5925045 4539741 3319527 2738156 2977684 3865289 4820944 4885988 3382513
14146 3382513 641480 -2442697 -5393460 -8222300 -10991511 -13796347 -16824676 -20119391
14138 -20119391 -23427237 -26271882 -28103475 -28453856 -27048246 -23965994 -19773535 -15376033
$$ packed form
14197B8068687L36319k31443p84098j377110j823201j830608j523059j424208
14189A9411279j730621j928104j466149n23888K67379N57460M81816L30629J41929
14180A5541730j78280n16419n83389j63754N77265J243624J696713K023257K266132
14171B1906879K364479K184001J557000M17847j062746k473229l359015l488104
14163A8047112k884158j925473j293631j218398j207693r54624p25583p92884
14155G044668j119623j385304j220214n81371K39528Q87605R55655O5044j503475
14146C382513k741033l084177k950763k828840k769211k804836l028329l294715
14138b0119391l307846k844645j831593l50381J405610L082252M192459M397502
$$ plain form
14130 -15376033 -11722436 -9548547 -9229960 -10688786 -13355174 -16339186 -18638938 -19214670
14122 -19214670 -17351124 -13219083 -7865152 -2590658 1652273 4576925 6534688 8034629
14114 8034629 9254882 9952413 9654414 8173010 6074781 4320841 3412108 3258344 3755350
14105 3755350 5066040 7373155 10504308 13773246 16222576 17108376 16276774 14329399
14097 14329399 12429084 11704604 12494972 14035279 15072876 14872296 13599610 12038778
14089 12038778 11050954 10902312 11083922 10969196 10438007 9707040 8888678 7978495 7019741
14080 7019741 5966005 4531125 2345792 -569040 -3498451 -5569661 -6445898 -6292565
14072 -6292565 -5490485 -4478247 -3370361 -1635161 1600078 6798617 13456321 20117902
$$ packed form
14130a5376033L653597K173889L18587j458826k666388k984012k299752n75732
14122a9214670J863546M132041N353931N274494M242931K924652J957763J499941
14114H034629J220253O97531k97999j481404k098229j753940r08733j53764M97006
14105C755350J310690K307115L131153L268938K449330Q85800q31602j947375
14097A4329399j900315p24480P90368J540307J037597k00580j272686j560832
14089A2038778r87824j48642J81610j14726n31189p30967q18362r10183r58754
14080G019741j053736j434880k185333k914832k929411k071210q76237J53333
14072f292565Q02080J012238J107886J735200L235239N198539O657704O661581
$$ plain form
14064 20117902 25021327 27159398 26820729 24953545 22343401 19652881 17567160 16352945
14056 16352945 15801253 15718939 15974459 16165194 15647392 14120361 12114151 10607488 10098510
14047 10098510 10247056 10428104 10364859 10164387 9950189 9770102 9987787 11225060 13612192
14038 13612192 16481284 18858105 19949420 19256952 16665614 12481015 7274068 1718560
14030 1718560 -3455857 -7686074 -10909852 -13202230 -14202914 -13563851 -11679050 -9311100
14022 -9311100 -6677993 -3522754 48674 3301666 5472591 6438362 6740033 7001140 7375061
14013 7375061 7674513 7795368 7797272 7857859 8264179 9198552 10530187 11788323 12396550 12155096
14003 12155096 11294562 9976868 8173149 6041246 3974133 2309479 1200732 514276
$$ packed form
14064B0117902M903425K138071l38669j867184k610144k690520k085721j214215
14056A6352945n51692q2314K55520J90735n17802j527031k006210j506663n08978
14047A0098510J48546J81048o3245k00472k14198j80087K17685J237273K387132
14038A3612192K869092K376821J091315o92468k591338m184599n206947n555508
14030A718560n174417m230217l223778k292378j000684O39063J884801K367950
14022i311100K633107L155239L571428L252992K170925R65771L01671K61107L73921
14013G375061K99452J20855J904O0587M06320R34373J331635J258136O08227k41454
14003A2155096q60534j317694j803719k131903k067113j664654j108747o86456
$$ plain form
13995 514276 -208721 -1368628 -2850785 -3951655 -3773971 -1649108 2657683 8661667 15193599
13986 15193599 21063656 25642843 28931683 31307724 33157003 34605934 35522927 35674628
13978 35674628 34615658 31803405 27393537 22517937 18369924 15348800 13254820 11921432
13970 11921432 11368596 11513372 11952925 12072574 11381038 9609455 6769888 3298023 -235161
13961 -235161 -3356585 -5476545 -6020530 -5142682 -3969178 -3752059 -4856097 -6668375 -8470951
13952 -8470951 -10171219 -12134821 -14658154 -17661867 -20719661 -23288336 -24896685 -25219455
13944 -25219455 -24248107 -22542185 -20978723 -20103254 -19912661 -20080597 -20201547 -19942963 -19168925
13935 -19168925 -18202314 -17890070 -18991745 -21426176 -24259426 -26445838 -27518855 -27532086 -26694141
$$ packed form
13995E14276p22997j159907j482157j100870J77684K124863M306791O003984O531932
13986A5193599N870057M579187L288840K376041J849279J448931R16993J51701
13978C5674628j058970k812253m409868m875600m148013l021124k093980j333388
13970A1921432n52836J44776M39553J19649o91536j771583k839567l471865l533184
13961b35161l121424k119960n43985Q77848J173504K17119j104038j812278j802576
13952h470951j700268j963602k523333l003713l057794k568675j608349l22770
13944b5219455R71348J705922J563462Q75469J90593j67936j20950K58584P74038
13935a9168925R66611L12244j101675k434431k833250k186412j073017j3231Q37945
$$ plain form
13926 -26694141 -25337673 -23862979 -22292560 -20139196 -17181941 -14078755 -11732081 -10257147
13918 -10257147 -8938302 -7187046 -5214474 -3549846 -2273458 -1003670 671555 2990431
13910 2990431 6034481 9623037 13220438 16071627 17343160 16404789 13394849 9310155
13902 9310155 5405502 2590439 1323006 1782988 3755129 6483933 9057271 10980279
13894 10980279 12178933 12675402 12473244 11614121 10320558 9031832 8234327 8231299 9016199
13885 9016199 10375910 12020499 13484070 14187451 13834340 12549265 10685778 8556972
13877 8556972 6300862 3965984 1587110 -819927 -3389824 -6445997 -10272303 -14859207
13869 -14859207 -19960157 -25267544 -30233966 -34045278 -36005403 -35813193 -33783042 -30840352
$$ packed form
13926b6694141J356468J474694J570419K153364K957255L103186K346674J474934
13918a0257147J318845J751256J972572J664628J276388J269788J675225K318876
13910B990431L044050L588556L597401K851189J271533r38371l009940m084694
13902I310155l904653k815063j267433M59982J972141K728804K573338J923008
13894A0980279J198654M96469k02158q59123j293563j288726p97505l028P84900
13885I016199J359711J644589J463571P03381l53111j285075j863487k128806
13877H556972k256110k334878k378874k407037k569897l056173l826306m586904
13869a4859207n100950n307387m966422l811312j960125J92210K030151K942690
$$ plain form
13861 -30840352 -27903026 -25306056 -22885311 -20257732 -17067278 -13350255 -9601061 -6436359
13853 -6436359 -4435187 -4143880 -5868971 -9398777 -13940129 -18403891 -22016141 -24628951
13845 -24628951 -26378299 -27277975 -27172591 -25967345 -23914661 -21573115 -19425074 -17532010
13837 -17532010 -15613374 -13557138 -11611148 -9944033 -8374749 -6560747 -4191474 -1124005
13829 -1124005 2474681 6242055 9832794 12820685 14663285 14946558 13409123 9986718
13821 9986718 5292910 689527 -2503328 -3805729 -3747049 -3322037 -3280519 -3984081 -5511687
13812 -5511687 -7673845 -10132440 -12595161 -15014154 -17635693 -20634491 -23701203 -26285746
13804 -26285746 -28163040 -29454076 -30291986 -30796680 -31128606 -31243441 -30848163 -29817200 -28374371
$$ packed form
13861c0840352K937326K596970K420745K627579L190454L717023L749194L164702
13853f436359K001172K91307j725091l529806m541352m463762l612250k612810
13845b4628951j749348q99676J05384J205246K052684K341546K148041J893064
13837a7532010J918636K056236J945990J667115J569284J814002K369273L067469
13829a124005L598686L767374L590739K987891J842600K83273j537435l422405
13821I986718m693808m603383l192855j302401N8680M25012M1518p03562j527606
13812e511687k162158k458595k462721k418993k621539k998798l066712k584543
13804b6285746j877294j291036q37910n04694l31926j14835L95278J030963J442829
$$ plain form
13795 -28374371 -26715150 -24758059 -22465583 -20045067 -17763890 -15814250 -14171398 -12557448
13787 -12557448 -10671516 -8615602 -7083273 -6896613 -8379097 -11071728 -13860140 -15701516
13779 -15701516 -16389324 -16410151 -16255734 -16060743 -15748416 -15318584 -14845592 -14315048 -13601370
13770 -13601370 -12618773 -11436141 -10163284 -8732675 -6883186 -4373024 -1210927 2186352
13762 2186352 5223641 7569519 9180690 10005340 9816555 8390038 5875281 2985947
13754 2985947 763331 -28146 710530 2610673 5091043 7283209 8290663 7977336 7171978
13745 7171978 6953085 7821653 9408513 10765550 10878290 9223922 6167717 2787171 189420
13736 189420 -964513 -598748 662395 1767419 2036695 1649521 1159755 677152 -279690
$$ packed form
13795b8374371J659221J957091K292476K420516K281177J949640J642852J613950
13787a2557448J885932K055914J532329J86660j482484k692631k788412j841376
13779a5701516o87808k0827J54417J94991L12327M29832M72992N30544P13678
13770a3601370R82597J182632J272857J430609J849489K510162L162097L397279
13762B186352L037289K345878J611171Q24650j88785j426517k514757k889334
13754B985947k222616p91477P38676J900143K480370K192166J007454l13327q05358
13745G171978k18893Q68568J586860J357037J12740j654368l056205l380546k597751
13736A89420j153933L65765J261143J105024K69276l87174m89766m82603r56842
$$ plain form
13727 -279690 -2271658 -5405925 -9230147 -13028236 -16168065 -18479374 -20424998 -22560238
13719 -22560238 -24767521 -26166174 -25840329 -23586295 -20015289 -16210719 -13206243 -11697760
13711 -11697760 -12055746 -14119875 -16876679 -18831869 -19071085 -17869033 -16282285 -15247065
13703 -15247065 -14953640 -14884692 -14348262 -13138109 -11659863 -10210793 -8464485 -5994969 -2904778
13694 -2904778 337029 3324153 5739003 7229556 7620684 7181652 6457154 5773582 5008973
13685 5008973 3895068 2427968 933281 -181233 -711985 -682800 -108242 1197914 3514150
13676 3514150 6851548 10798844 14752878 18018036 19853075 19723559 17559084 13930547
13668 13930547 9746604 5547000 1397274 -2588307 -6039294 -8507650 -9639243 -9427716
$$ packed form
13727b79690j991968l134267l824222l798089l139829k311309j945624k135240
13719b2560238k207283j398653L25845K254034L571006L804570L004476J508483
13711a1697760l57986k064129k756804j955190k39216J202052J586748J035220
13703a5247065K93425O8948N36430J210153J478246J449070J746308K469516L090191
13694b904778L241807K987124K414850J490553L91128m39032p24498o83572p64609
13685E008973j113905j467100j494687j114514n30752K9185N74558J306156K316236
13676C514150L337398L947296L954034L265158J835039j29516k164475l628537
13668A3930547m183943m199604m149726l985581l450987k468356j131593K11527
$$ plain form
13660 -9427716 -8202272 -6157573 -3218400 520020 4534538 8247006 11433824 14116690
13652 14116690 16318384 18006104 19089529 19384671 18663699 16859713 14341240 11935645
13644 11935645 10352686 9634458 9334988 8825845 7527720 5407036 3018432 736030
13636 736030 -1641330 -4334762 -7249089 -10316377 -13515918 -16363822 -17966999 -17707821
13628 -17707821 -15551392 -11847968 -7094495 -1725647 3927869 9348555 13734154 16468062
13620 16468062 17554309 17442084 16697984 15979655 15844620 16194136 16152004 14952820 12780548
13611 12780548 10531752 9174372 9241091 10375443 11448015 11655107 11426484 11928458 13945101
13602 13945101 17495753 22130371 27169249 31989518 36373078 40337461 43572634 45324370
$$ packed form
13660i427716J225444K044699K939173L738420M014518L712468L186818K682866
13652A4116690K201694J687720J083425K95142p20972j803986k518473k405595
13644A1935645j582959p18228k99470n09143j298125k120684k388604k282402
13636G36030k377360k693432k914327l067288l199541k847904j603177K59178
13628a7707821K156429L703424M753473N368848N653516N420686M385599K733908
13620A6468062J086247j12225p44100p18329j35035L49516m2132j199184k172272
13611A2780548k248796j357380O6719J134352J072572K07092k28623N01974K016643
13602A3945101L550652M634618N038878M820269M383560L964383L235173J751736
$$ plain form
13594 45324370 44908500 42284089 37977553 32630053 26942390 21612807 16965649 12886468
13586 12886468 9171991 5759360 2687445 66636 -1972668 -3427404 -4516659 -5656633
13578 -5656633 -7237805 -9270066 -11223577 -12180222 -11338437 -8751636 -5356087 -2221027
13570 -2221027 -216569 40109 -1516384 -4435665 -8323549 -13048879 -18347211 -23649394
13562 -23649394 -28380336 -32242626 -34973880 -36072808 -35184413 -32655307 -29493360 -26594943
13554 -26594943 -24061685 -21393273 -18081696 -13927717 -9199870 -4545545 -668570 1847136
13546 1847136 2758198 2380662 1361106 255479 -594299 -966177 -666594 422324 2218893
13537 2218893 4382207 6299958 7316129 7138940 5958929 4317281 2727972 1100832
$$ packed form
13594D5324370m15870k624411m306536n347500n687663n329583m647158m079181
13586A2886468l714477l412631l071915k620809k039304j454736j089255j139974
13578e656633j581172k032261j953511r56645Q41785K586801L395549L135060
13570b221027K004458K56678j556493k919281l887884m725330n298332n302183
13562b3649394m730942l862290k731254j098928Q88395K529106L161947K898417
13554b6594943K533258K668412L311577M153979M727847M654325L876975K515706
13546A847136R11062l77536j019556j105627q49778l71878K99583J088918J796569
13537B218893K163314J917751J016171j77189j180011j641648j589309j627140
$$ plain form
13529 1100832 -1292878 -5099806 -10335976 -16505261 -22928845 -28860472 -33542853 -36529618
13521 -36529618 -37916727 -38093323 -37422610 -36137122 -34221254 -31470245 -27911176 -23976993
13513 -23976993 -20098560 -16486763 -13422151 -11375034 -10747917 -11654849 -13882451 -16773845
13505 -16773845 -19187440 -20065997 -19170071 -17116996 -14747605 -12455842 -10153281 -7588578
13497 -7588578 -4363576 -111656 4954657 9963834 13968089 16446591 17300998 16577642
13489 16577642 14339536 10747595 6396307 2390878 -453999 -2220011 -3527199 -5014563
13481 -5014563 -7223324 -10370210 -13954222 -16843059 -17947983 -16853068 -13887548 -9902475
13473 -9902475 -5879652 -2521997 -293270 401475 -516708 -2498690 -4655003 -6240888
$$ packed form
13529A100832k393710l806928n236170o169285o423584n931627m682381k986765
13521c6529618j387109j76596O70713J285488J915868K751009L559069L934183
13513b3976993L878433L611797L064612K047117O27117r06932k227602k891394
13505a6773845k413595q78557Q95926K053075K369391K291763K302561K564703
13497g588578L225002M251920N066313N009177M004255K478502Q54407p23356
13489A6577642k238106l591941m351288m005429k844877j766012j307188j487364
13481e014563k208761l146886l584012k888837j104924J094915K965520L985073
13473i902475M022823L357655K228727O94745r18183j981982k156313j585885
$$ plain form
13465 -6240888 -6982291 -7267539 -7806277 -9059511 -11170594 -14118260 -17741396 -21558897 -24470076
13456 -24470076 -25155156 -23191322 -19514343 -15617237 -12484915 -10279796 -8629171 -6935587
13448 -6935587 -4671162 -1643762 1900159 5277323 7611906 8357471 7512880 5311194
13440 5311194 1966984 -2132083 -6131107 -8970624 -10043449 -9430386 -7644453 -5313600
13432 -5313600 -2980312 -1025264 421165 1634830 3211684 5550163 8538831 11734737
13424 11734737 14596159 16836056 18634432 20216427 21309133 21377547 20477688 19489603 19248734
13415 19248734 19786371 20497899 20580521 19465317 17267133 14761083 12745016 11512320 10886865
13406 10886865 10549180 10447403 10928871 12309252 14277203 15841425 15958276 14059797 10086989
$$ packed form
13465f240888p41403k85248n38738j253234k111083k947666l623136l817501k911179
13456b4470076o85080J963834L676979L897106L132322K205119J650625J693584
13448f935587K264425L027400L543921L377164K334583P45565q44591k201686
13440E311194l344210m099067l999024k839517j072825O13063J785933K330853
13432e313600K333288J955048J446429J213665J576854K338479K988668L195906
13424A1734737K861422K239897J798376J581995J092706O8414q99859r88085k40869
13415A9248734N37637P11528Q2622j115204k198184k506050k016067j232696o25455
13406A0886865l37685j01777M81468J380381J967951J564222J16851j898479l972808
$$ plain form
13397 10086989 4468948 -1843028 -7634151 -11990202 -14687439 -16173759 -17114984 -17872735
13389 -17872735 -18512336 -18915728 -18674500 -17299747 -14662369 -11012014 -6771875 -2440640
13381 -2440640 1603872 5157842 8103251 10592498 12991358 15429572 17626419 19119290
13373 19119290 19557190 18882313 17460849 16068930 15593862 16603375 19049363 22223799
13365 22223799 25048725 26656386 26837674 26052655 25166139 25109633 26339483 28379185 30099125
13356 30099125 30558248 29532988 27284979 24049413 19904952 14857369 8953396 2566120
13348 2566120 -3619981 -8976827 -12992784 -15347267 -16318417 -16761566 -17306700 -17951493 -18627615
13339 -18627615 -19537586 -20875192 -22745632 -25075922 -27296518 -28503533 -28066904 -25968052
$$ packed form
13397A0086989n618041o311976n791123m356051k697237j486320r41225p57751
13389a7872735o39601m03392K41228J374753K637378L650355M240139M331235
13381b440640M044512L553970K945409K489247K398860K438214K196847J492871
13373A9119290M37900o74877j421464j391919m75068J009513K445988L174436
13365B2223799K824926J607661J81288p85019q86516n6506J229850K039702J719940
13356C0099125M59123j025260k248009l235566m144461n047583n903973o387276
13348B566120o186101n356846m015957k354483r71150m43149n45134o44793o76122
13339a8627615r09971j337606j870440k330290k220596j207015M36629K098852
$$ plain form
13331 -25968052 -22637415 -18584925 -14190008 -9804833 -5839490 -2621971 -231922 1369803
13323 1369803 1938549 958374 -1718327 -5467438 -9146840 -11738985 -12906876 -12942051 -12260818
13314 -12260818 -11105375 -9688412 -8366308 -7399805 -6536455 -5243874 -3479819 -1856558
13306 -1856558 -1025238 -1124459 -1704682 -2135957 -2270991 -2487039 -3036951 -3809013 -4681341 -5631000
13296 -5631000 -6543625 -7337330 -8197611 -9508091 -11580396 -14354976 -17444057 -20535278 -23643674
13287 -23643674 -26943174 -30455742 -34061100 -37592908 -40659748 -42587560 -42849196 -41491323
13279 -41491323 -38958777 -35804847 -32707347 -30353214 -29181536 -29321109 -30662300 -32987553
13271 -32987553 -36007638 -39284599 -42372024 -45033044 -47243661 -49040768 -50347364 -51031755
$$ packed form
13331b5968052L330637M052490M394917M385175L965343L217519K390049J601725
13323A369803N68746r80175k676701l749111l679402k592145j167891l5175O81233
13314a2260818J155443J416963J322104R66503Q63350J292581J764055J623261
13306a856558Q31320r9221n80223m31275j35034k16048n49912p72062q72328r49659
13296e631000r12625p93705q60281j310480k072305k774580l089081l091221l108396
13287b3643674l299500l512568l605358l531808l066840j927812k61636J357873
13279d1491323K532546L153930L097500K354133J171678j39573j341191k325253
13271c2987553l020085l276961l087425k661020k210617j797107j306596o84391
$$ plain form
13263 -51031755 -51093519 -50527451 -49070381 -46500399 -43263657 -40477952 -39098693 -39249924 -40410234
13254 -40410234 -41925801 -43420646 -44966357 -46638317 -47837765 -47511486 -45266990 -41848313
13246 -41848313 -38238055 -34721603 -30998848 -26746417 -21944938 -16899107 -12026430 -7571180
13238 -7571180 -3614811 -520656 933875 163753 -2730827 -7166142 -12393461 -17338588
13230 -17338588 -20579935 -20943071 -18245148 -13533635 -8350631 -3772018 -184622 2318026
13222 2318026 3527745 3188071 1439636 -1023714 -3328623 -4863317 -5581610 -6036498 -6872351
13213 -6872351 -8279528 -10066912 -12077948 -14363392 -17014652 -19837742 -22137657 -23056946
13205 -23056946 -22315127 -20584371 -18980388 -18223355 -18458220 -19479873 -20697075 -21158398 -19989659
$$ packed form
13263e1031755o1764N66068J457070K569982L236742K785705J379259j51231j160310
13254d0410234j515567j494845j545711j671960j199448L26279K244496L418677
13246d1848313L610258L516452L722755M252431M801479N045831M872677M455250
13238g571180L956369L094155J454531p70122k894580m435315n227319m945127
13230a7338588l241347l63136K697923M711513N183004M578613L587396K502648
13222B318026J209719l39674j748435k463350k304909j534694p18293m54888q35853
13213f872351j407177j787384k011036k285444k651260k823090k299915r19289
13205b3056946P41819J730756J603983P57033k34865j021653j217202m61323J168739
$$ plain form
13196 -19989659 -16830045 -11827515 -5490672 1307900 7512157 12372462 15687228 17542807
13188 17542807 18155272 18004477 17808894 18139189 18928602 19624149 19974627 20327735 21109499
13179 21109499 22257946 23120644 22891897 21371456 19194859 17153014 15600447 14632532
13171 14632532 14307317 14513466 14871165 14871903 14250078 13195439 12040055 10796418 9064411
13162 9064411 6455510 3130407 -162038 -2506070 -3301560 -2476402 -435365 2396856
13154 2396856 6083269 10690038 15574252 19745913 22577739 23941385 24008490 23077370 21514540
13145 21514540 19687314 17664799 15143032 11989802 8625531 5686314 3408108 1469800
13137 1469800 -602973 -3006399 -5436838 -7182792 -7712394 -7366103 -7141215 -7553902 -8131968
$$ packed form
13196a9989659L159614N002530O336843O798572O204257M860305L314766J855579
13188A7542807O12465j50795j95583L30295P89413O95547L50478L53108P81764
13179B1109499J148447Q62698k28747j520441k176597k041845j552567r67915
13171A4632532l25215K06149L57699P38o21825j054639j155384j243637j732007
13162I064411k608901l325103l292445k344032p95490Q25158K041037K832221
13154B396856L686413M606769M884214M171661K831826J363646O7105r31120j562830
13145B1514540j827226k022515k521767l153230l364271k939217k278206j938308
13137A469800k072773k403426k430439j745954n29602L46291K24888m12687n78066
$$ plain form
13128 -8131968 -7975079 -6479792 -3721551 -234100 3623759 7849035 12237428 16074722
13120 16074722 18655151 19725974 19430277 18310646 17271571 17012044 17369989 17514197 16832135
13111 16832135 15494109 14175906 13476060 13563117 14013654 13980100 12821842 10630177 8114590
13102 8114590 6278473 6046232 7842243 11440034 15874580 19701092 21885505 22396943
13094 22396943 22071323 22070035 23174805 25397413 28135030 30674809 32709421 34459303 36237096
13085 36237096 37921938 38911552 38593721 36965376 34725397 32735648 31573976 31446387
13077 31446387 32118763 32905977 33058192 32358376 31217923 30102017 29153390 28376063 27783347
13068 27783347 27268908 26500703 25225526 23705714 22627452 22537706 23548817 25500356 28000330
$$ packed form
13128h131968J56889J495287K758241L487451L857859M225276M388393L837294
13120A6074722K580429J070823k95697j119631j039075k59527L57945J44208o82062
13111A6832135j338026j318203o99846Q7057M50537l3554j158258k191665k515587
13102H114590j836117k32241J796011L597791M434546L826512K184413N11438
13094B2396943l25620j288J104770K222608K737617K539779K034612J749882J777793
13085C6237096J684842R89614l17831j628345k239979j989749j161672j27589
13077C1446387O72376P87214J52215o99816j140453j115906r48627p77327n92716
13068B7783347n14439p68205j275177j519812j078262q9746J011111J951539K499974
$$ plain form
13059 28000330 30317050 31583851 31339446 29861306 27822172 25697789 23571479 21284500
13051 21284500 18810211 16516869 14773572 13479072 12344437 11327942 10504705 9793972
13043 9793972 8840183 7220281 4903700 2351666 293602 -533802 326491 2874881 6676110
13034 6676110 11050551 15323696 18915538 21252903 21852491 20774614 18707251 16164703
13026 16164703 13185843 10068301 7654147 6638571 7015294 8319371 10010298 11640798
13018 11640798 12903676 13609803 13766372 13480621 12524343 10414168 7277760 4123521 1936216
13009 1936216 816726 95896 -985508 -2729676 -4663824 -5796412 -5568751 -4434454
13001 -4434454 -3286095 -2587288 -2351107 -2677037 -3869960 -6111607 -9276999 -13071441 -17206995
$$ packed form
13059B8000330K316720J266801k44405j478140k039134k124383k126310k286979
13051B1284500k474289k293342j743297j294500j134635j016495q23237p10733
13043I793972r53789j619902k316581k552034k058064q27404Q60293K548390L801229
13034F676110M374441M273145L591842K337365N99588j077877k067363k542548
13026A6164703k978860l117542k414154j015576L76723J304077J690927J630500
13018A1640798J262878P06127J56569k85751r56278k110175l136408l154239k187305
13009A936216j119490p20830j081404j744168j934148j132588K27661J134297
13001d434454J148359O98807K36181l25930j192923k241647l165392l794442m135554
$$ plain form
12992 -17206995 -21236337 -24398721 -26128064 -26620958 -26533356 -26200431 -25289084 -23272384 -20082572
12983 -20082572 -16153211 -12220854 -9142934 -7394879 -6750382 -6537316 -6142792 -5414154 -4543973
12974 -4543973 -3683413 -2823871 -2032990 -1617048 -1873244 -2681987 -3332770 -2971135 -1412636
12965 -1412636 611411 2122120 2753671 2925892 3321067 4389192 6277885 8896554 11869046
12956 11869046 14611713 16572893 17304164 16501651 14194388 10550104 5690469 171206
12948 171206 -4906813 -8524755 -10123012 -9549994 -7065509 -3265542 1245081 6105942
12940 6105942 11102178 15913523 20183890 23893135 27444631 31072669 34342052 36451408
12932 36451408 36872584 35751985 33749684 31593093 29823391 28755723 28483681 28888513
$$ packed form
12992a7206995m029342l162384j729343m92894Q7602L32925R11347K016700L189812
12983b0082572L929361L932357L077920J748055O44497K13066L94524P28638Q70181
12974d543973Q60560Q59542P90881M15942k56196q08743o50783L61635J558499
12965a412636K024047J510709O31551J72221L95175J068125J888693K618669K972492
12956A1869046K742667J961180P31271q02513k307263l644284m859635n519263
12948A71206n078019l617942j598257N73018K484485L799967M510623M860861
12940F105942M996236M811345M270367L709245L551496L628038L269383K109356
12932C6451408M21176j120599k002301k156591j769702j067668k72042M04832
$$ plain form
12924 28888513 29678502 30392848 30492147 29522234 27243346 23838209 19991641 16517782 13887768
12915 13887768 12175683 11151637 10367388 9625045 9304435 9849934 11165259 12598375 13320006
12906 13320006 12722242 10420800 6277807 668923 -5553436 -11355481 -15858548 -18732365
12898 -18732365 -20287966 -21020499 -21191260 -20909208 -20169501 -18756590 -16596115 -14165470 -12334941
12889 -12334941 -11698252 -12094851 -12913585 -13573777 -13596650 -12789980 -11573025 -10711917 -10590342
12880 -10590342 -10858872 -10795072 -9984964 -8550354 -6731586 -4476514 -1529504 2166090 6322833
12871 6322833 10386431 13703045 15898946 17093990 17662963 17822389 17506622 16583082 14989926
12862 14989926 12702658 9743012 6316507 2772957 -743367 -4371576 -8052543 -11321773
$$ packed form
12924B8888513P89989P14346R9299r69913k278888l405137l846568l473859k630014
12915A3887768j712085j024046p84249p42343l20610N45499J315325J433116P21631
12906A3320006n97764k301442m142993n608884o222359n802045m503067k873817
12898a8732365j555601p32533j70761K82052P39707J412911K160475K430645J830529
12889a2334941O36689l96599q18734o60192k2873Q06670J216955Q61108J21575
12880a0590342k68530O3800Q10108J434610J818768K255072K947010L695594M156743
12871F322833M063598L316614K195901J195044N68973J59426l15767r23540j593156
12862A4989926k287268k959646l426505l543550l516324l628209l680967l269230
$$ plain form
12854 -11321773 -13817318 -15589193 -16860951 -17795091 -18543494 -19386333 -20610693 -22228340
12846 -22228340 -23943179 -25452743 -26796249 -28312741 -30179401 -32082677 -33512298 -34159161
12838 -34159161 -33802673 -32130621 -28909836 -24333696 -19065820 -13650374 -8075128 -2353335
12830 -2353335 2752561 6064052 7040987 6128302 4138948 1757109 -630880 -2916561
$$ packed form
12854a1321773k495545j771875j271758r34140p48403q42839j224360j617647
12846b2228340j714839j509564j343506j516492j866660j903276j429621o46863
12838c4159161L56488J672052L220785M576140N267876N415446N575246N721793
12830b353335N105896L311491R76935r12685j989354k381839k387989k285681
$$ [...]
##END NTUPLES=NMR SPECTRUM
##END=
