##TITLE=31P ikalashn
DE-76k_TFA
20.11.2024
##JCAMPDX= 6.0         $$ Bruker NMR JCAMP-DX V2.0
##DATA TYPE= NMR SPECTRUM
##DATA CLASS= NTUPLES
##ORIGIN= UXNMR, Bruker Analytische Messtechnik GmbH
##OWNER= root
$$ TOPSPIN		Version 1.3
$$ 2024-11-20 14:58:11.421 +0400  Irina@DPX200
$$ Compression mode = diff/dup
##.OBSERVE FREQUENCY= 81.01967998063
##.OBSERVE NUCLEUS= ^31P
##.ACQUISITION MODE= SIMULTANEOUS
##.ACQUISITION SCHEME= undefined
##.AVERAGES= 64
##.DIGITISER RES= 17
##SPECTROMETER/DATA SYSTEM= spect
##.PULSE SEQUENCE= zgpg
##.SOLVENT NAME= CDCl3
##.SHIFT REFERENCE= INTERNAL, CDCl3, 1, 298.5841
##AUDIT TRAIL= $$ (NUMBER, WHEN, WHO, WHERE, WHAT)
$$ ##TITLE= Audit trail, TOPSPIN		Version 1.3
$$ ##JCAMPDX= 5.01
$$ ##ORIGIN= Bruker BioSpin GmbH
$$ ##OWNER= Irina
$$ $$ F:/spectra/data/iren/nmr/P31dec/1/pdata/1/auditp.txt
$$ ##AUDIT TRAIL=  $$ (NUMBER, WHEN, WHO, WHERE, VERSION, WHAT)
(   1,<2024-11-20 14:57:07.625 +0400>,<Irina>,<DPX200>,<TOPSPIN 1.3>,
      <created by zg
	started at 2024-11-20 14:55:24.312 +0400,
	POWCHK disabled, PULCHK disabled
       configuration hash MD5:
       BE 6D 3F 07 2A EA 11 49 91 17 2B D3 AF B3 58 0D
       data hash MD5: 32K
       EC 28 D3 D4 D3 C7 C6 E4 E1 49 01 71 08 6D FE F5>)
(   2,<2024-11-20 14:57:52.265 +0400>,<Irina>,<DPX200>,<TOPSPIN 1.3>,
      <Start of raw data processing
       efp BC_mod = 2 LB = 8 FT_mod = 6 PKNL = 1 PHC0 = 178.3767 PHC1 = 129.5168 SI = 32K 
       data hash MD5: 32K
       58 11 C2 F8 D2 2F 01 84 5C DA FB 05 EA EC A7 CB>)
$$ ##END=
$$ 
$$ $$ hash MD5
$$ $$ E0 61 33 EC C4 F3 85 46 00 8F 35 5B 1B 2A 5D C1
##$RELAX= 
##$RELAX= 
##$RELAX= 
##$RELAX= 
##$RELAX= 
##$RELAX= 
##$RELAX= 
##$RELAX= 
##$RELAX= 
##$RELAX= 
##$RELAX= 
$$ Bruker specific parameters
$$ --------------------------
##$DU= <F:/spectra>
##$EXPNO= 1
##$NAME= <P31dec>
##$PROCNO= 1
##$TYPE= <nmr>
##$USER= <iren>
##$AMP= (0..31)
100 100 100 100 100 100 100 100 100 100 100 100 100 100 100 100 100 100 
100 100 100 100 100 100 100 100 100 100 100 100 100 100 
##$ANAVPT= -1
##$AQSEQ= 0
##$AQ_mod= 1
##$AUNM= <au_zg>
##$AUTOPOS= <>
##$BF1= 81.014009
##$BF2= 200.13
##$BF3= 200.13
##$BF4= 200.13
##$BF5= 200.13
##$BF6= 200.13
##$BF7= 200.13
##$BF8= 200.13
##$BYTORDA= 1
##$CFDGTYP= 0
##$CFRGTYP= 5
##$CHEMSTR= <none>
##$CNST= (0..63)
1 1 145 1 1 1 1 1 1 1 1 1 1 1 1 1 1 1 1 1 1 1 1 1 1 1 1 1 1 1 1 1 1 1 
1 1 1 1 1 1 1 1 1 1 1 1 1 1 1 1 1 1 1 1 1 1 1 1 1 1 1 1 1 1 
##$CPDPRG= <waltz16>
##$CPDPRG1= <>
##$CPDPRG2= <waltz16>
##$CPDPRG3= <>
##$CPDPRG4= <mlev>
##$CPDPRG5= <mlev>
##$CPDPRG6= <mlev>
##$CPDPRG7= <mlev>
##$CPDPRG8= <mlev>
##$CPDPRGB= <>
##$CPDPRGT= <>
##$D= (0..63)
0 1 0 0 0 0 0 0 0 0.06 0 0.03 2e-005 3e-006 0 0 0.0002 0 0 0 0 0 0 0 0 
0 0 0 0 0 0 0 0 0 0 0 0 0 0 0 0 0 0 0 0 0 0 0 0 0 0 0 0 0 0 0 0 0 0 0 
0 0 0 0 
##$DATE= 1732100223
##$DBL= (0..7)
120 120 120 11 120 120 24 19 
##$DBP= (0..7)
150 150 150 150 150 150 150 150 
##$DBP07= 0
##$DBPNAM0= <>
##$DBPNAM1= <>
##$DBPNAM2= <>
##$DBPNAM3= <>
##$DBPNAM4= <>
$$ [...]
0 1 3 0 0 0 0 0 0 0 0 0 0 0 0 0 
##$SW_h= 37037.037037037
##$TD= 32768
##$TD0= 1
##$TE= 300
##$TE2= 300
##$TE3= 300
##$TEG= 300
##$TL= (0..7)
0 120 53 12 22 120 120 120 
##$TP= (0..7)
150 150 150 150 150 150 150 150 
##$TP07= 0
##$TPNAME0= <>
##$TPNAME1= <>
##$TPNAME2= <>
##$TPNAME3= <>
##$TPNAME4= <>
##$TPNAME5= <>
##$TPNAME6= <>
##$TPNAME7= <>
##$TPOAL= (0..7)
0.5 0.5 0.5 0.5 0.5 0.5 0.5 0.5 
##$TPOFFS= (0..7)
0 0 0 0 0 0 0 0 
##$TUNHIN= 0
##$TUNHOUT= 0
##$TUNXOUT= 0
##$USERA1= <user>
##$USERA2= <user>
##$USERA3= <user>
##$USERA4= <user>
##$USERA5= <user>
##$V9= 5
##$VALIST= <valist>
##$VCLIST= <CCCCCCCCCCCCCCC>
##$VD= 0
##$VDLIST= <DDDDDDDDDDDDDDD>
##$VPLIST= <PPPPPPPPPPPPPPP>
##$VTLIST= <TTTTTTTTTTTTTTT>
##$WBST= 1024
##$WBSW= 4
##$XGAIN= (0..3)
0 0 0 0 
##$XL= 0
##$YL= 0
##$YMAX_a= 3047
##$YMIN_a= -909
##$ZGOPTNS= <>
##$ZL1= 120
##$ZL2= 120
##$ZL3= 120
##$ZL4= 120
##$ABSF1= 0
##$ABSF2= 0
##$ABSG= 0
##$ABSL= 0
##$ALPHA= 0
##$AQORDER= 0
##$ASSFAC= 0
##$ASSFACI= 0
##$ASSFACX= 0
##$ASSWID= 0
##$AUNMP= <proc_1d>
##$AXLEFT= 0
##$AXRIGHT= 0
##$AXTYPE= 0
##$AXUNIT= <>
##$AZFE= 0.1
##$AZFW= 0.5
##$BCFW= 0
##$BC_mod= 2
##$BYTORDP= 0
##$COROFFS= 0
##$CY= 12.5935478210449
##$DATMOD= 1
##$DC= 0
##$DFILT= <>
##$DTYPP= 0
##$F1P= 47.1127640792319
##$F2P= -24.0371245302204
##$FCOR= 0.5
##$FTSIZE= 32768
##$FT_mod= 6
##$GAMMA= 0
##$GB= 0
##$INTBC= 1
##$INTSCL= 7.269226e-011
##$ISEN= 30
##$LB= 8
##$LEV0= 0
##$LPBIN= 0
##$MAXI= 12.09355
##$MC2= 0
##$MEAN= 0
##$ME_mod= 0
##$MI= 0.7550151
##$NCOEF= 0
##$NC_proc= -12
##$NLEV= 6
##$NOISF1= 298.5841
##$NOISF2= 270.0111
##$NSP= 0
##$NTH_PI= 0
##$NZP= 0
##$OFFSET= 298.5841
##$PC= 1.4
##$PHC0= 178.3767
##$PHC1= 129.5168
##$PH_mod= 1
##$PKNL= yes
##$PPARMOD= 0
##$PPDIAG= 0
##$PPIPTYP= 0
##$PPMPNUM= 100
##$PPRESOL= 1
##$PSCAL= 0
##$PSIGN= 0
##$REVERSE= no
##$SF= 81.014009
##$SI= 32768
##$SIGF1= 270.0111
##$SIGF2= -158.5842
##$SINO= 77.54984
##$SIOLD= 32768
##$SREGLST= <31P.CDCl3>
##$SSB= 0
##$STSI= 32768
##$STSR= 0
##$SW_p= 37037.037037037
##$SYMM= 0
##$S_DEV= 0
##$TDeff= 32768
##$TDoff= 0
##$TI= <>
##$TILT= no
##$TM1= 0
##$TM2= 0
##$TOPLEV= 0
##$USERP1= <user>
##$USERP2= <user>
##$USERP3= <user>
##$USERP4= <user>
##$USERP5= <user>
##$WDW= 1
##$XDIM= 32768
##$YMAX_p= 333935758
##$YMIN_p= -27118597
$$ End of Bruker specific parameters
$$ ---------------------------------
##NTUPLES= NMR SPECTRUM
##VAR_NAME=  FREQUENCY,     SPECTRUM/REAL,   SPECTRUM/IMAG
##SYMBOL=    X,             R,               I
##VAR_TYPE=  INDEPENDENT,   DEPENDENT,       DEPENDENT
##VAR_FORM=  AFFN,          ASDF,            ASDF
##VAR_DIM=   32768,         32768,           32768
##UNITS=     HZ,            ARBITRARY UNITS, ARBITRARY UNITS
##FACTOR=    1.13031516577767, 1,            1
##FIRST=     37037.037037037, -255397,       -8316836
##LAST=      0,             -488816,         -8152692
##MIN=       0,             -27118597,       0
##MAX=       37037.037037037, 333935758,     0
$$ Real data points
##PAGE= N=1
##DATA TABLE= (X++(R..R)), XYDATA
$$ [...]
20054 733395 1120665 1465070 1582834 1615059 1712619 1967398 2500690 3254492 4100382 4960388
20044 4960388 5688336 5998487 5730709 5080362 4412078 3880469 3365384 2877952 2712662
20035 2712662 3091780 3925503 4790677 5153505 4875695 4338115 3988500 3840776 3612157
20026 3612157 3144506 2469486 1693938 931702 405943 556848 1674677 3457066 5199952
20017 5199952 6326554 6743801 6768409 6659938 6311232 5600109 4737097 3867069 2912476
20008 2912476 1995490 1373898 1044284 759636 355559 -194620 -842475 -1475058 -2038664
19999 -2038664 -2446331 -2595127 -2551228 -2438042 -2285465 -2069237 -1838364 -1534776 -862397 393603
19989 393603 2075535 3777885 5125210 5860699 5801220 5023962 3923589 2771966 1607763
19980 1607763 440835 -795298 -2182508 -3468707 -4236081 -4436369 -4495813 -4918190 -5644048
19971 -5644048 -6063116 -5748105 -4892561 -3982522 -3307574 -2730206 -1838106 -529075 564787
19962 564787 672109 -302586 -1990893 -4164785 -6818369 -9737330 -12248828 -13734300 -14117231
19953 -14117231 -13771423 -13244782 -12798695 -12173612 -10984560 -9315072 -7740262 -6757499 -6362101
19944 -6362101 -6256792 -6258711 -6407281 -6709935 -7133689 -7754360 -8438807 -8845481 -8879177 -8692317
19934 -8692317 -8522859 -8726569 -9489910 -10611544 -11686408 -12375318 -12641156 -12555437 -11921335
19925 -11921335 -10364576 -7930404 -5356379 -3339692 -1991303 -1121752 -526082 -197447
19917 -197447 -284849 -705443 -1137499 -1418618 -1600684 -1692559 -1716465 -1788131 -1870141 -1823414 -1728211
19906 -1728211 -1776925 -2067466 -2646980 -3523942 -4527205 -5336249 -5773774 -5819271 -5347859 -4314706
19896 -4314706 -2994352 -1836671 -1152999 -870290 -831674 -1222503 -2179724 -3260583 -3815257
19887 -3815257 -3509788 -2571852 -1524517 -621038 98202 478374 432286 208348 133529 501231
19877 501231 1486538 2923729 4445152 5689303 6448359 6588069 6009732 4856695 3490655
19868 3490655 2336689 1511050 639460 -439533 -1397690 -1891621 -1729998 -883076 357131
19859 357131 1451144 2005259 2111455 2056243 1895744 1537804 963674 403771 117634 177601
19849 177601 549584 1117858 1691574 2117496 2359418 2349194 1968527 1232279 269715 -861157
19839 -861157 -2303198 -4024592 -5449169 -5988795 -5434990 -3978184 -2171016 -478185 915168
19830 915168 1868137 2237667 2076710 1559909 880473 212030 -433067 -1160299 -2017167 -2816542
19820 -2816542 -3332670 -3707559 -4304768 -5129114 -5843322 -6311713 -6637178 -6769947 -6521234
19811 -6521234 -5887798 -5180470 -4770578 -4782816 -5201781 -5814305 -6041892 -5399129 -4023197
19802 -4023197 -2462155 -1132340 -131108 623474 1148867 1294675 968264 463486 252515
19793 252515 447866 809109 1164599 1474982 1557661 1118485 127442 -1110168 -2150153
19784 -2150153 -2577068 -2447470 -2287298 -2513415 -3216245 -4369185 -5761133 -6915016 -7570604
19775 -7570604 -7841387 -7889891 -7685572 -6999450 -5847845 -4694543 -3950984 -3664948 -3801207
19766 -3801207 -4306658 -4937659 -5482639 -5940834 -6250252 -6233516 -6000591 -5922838 -6140330 -6423428
19756 -6423428 -6653300 -7035428 -7768770 -8792874 -9809717 -10514982 -10654777 -9944939 -8283626
19747 -8283626 -6122401 -4418668 -3801388 -4064714 -4521394 -4536151 -3978809 -3273590 -2900434
19738 -2900434 -3028386 -3610466 -4443551 -5118070 -5315416 -5160691 -5029079 -5072470 -5067757 -4814245
19728 -4814245 -4367549 -3880533 -3513316 -3310977 -3183657 -3078175 -3039663 -3178900 -3605238 -4273255
19718 -4273255 -5103023 -6132835 -7162892 -7776749 -7737493 -6998483 -5663122 -4092057 -2744243
19709 -2744243 -1955167 -1942191 -2635871 -3625291 -4569290 -5494583 -6492682 -7404636 -8030666 -8302702
19699 -8302702 -8183426 -7703784 -7001325 -6216540 -5516600 -5026277 -4631376 -3960385 -2649618
19690 -2649618 -852801 699276 1301568 700178 -917929 -2986043 -4695958 -5357991 -4763022
19681 -4763022 -3279780 -1488565 259225 1869463 3296083 4496513 5410786 6010500
19673 6010500 6359458 6537644 6519547 6095665 5138902 3648398 1717625 -282885 -1839263
19664 -1839263 -2565021 -2374728 -1592770 -720217 -123882 -77748 -735029 -1971013 -3402905
19655 -3402905 -4608833 -5364896 -5681290 -5689063 -5424866 -4886508 -4260864 -3801584 -3589683 -3640297
19645 -3640297 -3971115 -4463894 -4929361 -5257646 -5321562 -5091887 -4734361 -4446319 -4305944 -4179713
19635 -4179713 -3821984 -3175325 -2586562 -2382646 -2276222 -1722712 -635970 626023 1569486
19626 1569486 1950219 1927028 1665847 1071052 44047 -1387773 -3085860 -4639881 -5645226
19617 -5645226 -6173737 -6583956 -6899726 -6739366 -5863439 -4463864 -2920328 -1512780 -404609
19608 -404609 222625 285836 96952 221499 1043289 2472278 3934926 4721261 4435978
19599 4435978 3101445 1104629 -987959 -2663692 -3512498 -3442070 -2777269 -1944788 -1355668
19590 -1355668 -1463211 -2482433 -3962201 -4957258 -4923668 -4151961 -3101270 -1859888 -491095
19581 -491095 813527 2040089 3126266 3840135 4043234 3828946 3575978 3665224 4044971
19572 4044971 4343960 4307819 3862973 3114568 2414441 2066174 1951803 1787867 1487494 1034316
19562 1034316 553788 193783 -338208 -1487461 -3257725 -5310568 -7197382 -8532504 -9179368
19553 -9179368 -9230932 -8881423 -8464192 -8358601 -8624185 -8990828 -9217519 -9203214 -9044899 -9092900
19543 -9092900 -9594022 -10391440 -11170537 -11732088 -11953384 -11794303 -11390641 -10951156 -10481851
19534 -10481851 -9894864 -9260714 -8663991 -8107047 -7549666 -6989356 -6614413 -6579825 -6679256 -6564834
19524 -6564834 -6264817 -6191459 -6491843 -6844449 -6957623 -6750364 -6262354 -5704678 -5294319 -5144842
19514 -5144842 -5330265 -5889692 -6727076 -7542376 -8099745 -8305180 -8124632 -7565175 -6717559
19505 -6717559 -5886441 -5437233 -5403120 -5475156 -5418723 -5137073 -4646343 -4159297 -3823060 -3512339
19495 -3512339 -3110877 -2663393 -2273492 -2122180 -2303643 -2613915 -2696270 -2330364 -1542971 -569307
19485 -569307 178651 261711 -351961 -1132880 -1471791 -1178042 -630613 -564883 -1506539 -3221456
19475 -3221456 -4966847 -6216118 -6977239 -7598814 -8335609 -9172143 -9756144 -9615303 -8840162
19466 -8840162 -8149999 -8041638 -8400393 -8842618 -9055149 -8895599 -8328697 -7350855 -5894392
19457 -5894392 -3993603 -2058860 -696727 -395831 -1281007 -2928832 -4663251 -6121834
19449 -6121834 -7308534 -8258633 -8988058 -9499812 -9703096 -9504816 -8875670 -7979701 -7247845
19440 -7247845 -6988837 -7066912 -7261708 -7499111 -7558468 -7137510 -6187651 -4893525 -3566174
19431 -3566174 -2443612 -1574148 -815795 86386 1186635 2236664 2942910 3177549 2959965
19422 2959965 2562604 2504016 3006067 3638531 3914563 3851117 3612690 3157318 2311086 1057945
19412 1057945 -225972 -1029436 -1245456 -1090293 -654545 150344 1378015 2900379 4466536
19403 4466536 5809051 6728718 7148533 7137161 6849008 6449104 6161499 6283715 6991782
19394 6991782 8117573 9243877 9940526 10072111 9882633 9720234 9663316 9389959 8659213
19385 8659213 7760175 7067931 6596868 6210372 5777266 5111292 4070218 2757314 1523705
19376 1523705 738506 464850 658583 1257308 1928317 2346624 2502262 2516594 2394427 2165265
19366 2165265 2047134 2264527 2659368 2695234 2060665 1075061 316877 157538 696285 1563959
19356 1563959 2144227 2203219 2009626 2078158 2667288 3494944 3983945 3725922 2841135 1783322
19346 1783322 903831 394197 343588 579960 763148 663533 339983 74881 51920 233923
19336 233923 316783 -133895 -1027630 -1682996 -1644366 -955318 253023 1580639 2154752 1601131
19326 1601131 535029 -390687 -1077603 -1727487 -2504962 -3223485 -3581900 -3619083 -3628369 -3842079
19316 -3842079 -4242265 -4609528 -4766281 -4714218 -4560817 -4245266 -3508983 -2373654 -1284122
19307 -1284122 -618474 -338135 -280177 -401129 -581175 -675358 -676746 -616767 -578833 -679552
19297 -679552 -842334 -1004998 -1330569 -1841244 -2297100 -2500199 -2521800 -2689691 -3178550 -3638981
19287 -3638981 -3469015 -2459333 -986683 278156 785774 366625 -770960 -2193207 -3380539
19278 -3380539 -4009442 -4044456 -3625130 -3061255 -2604258 -2322072 -2178903 -2169298 -2413155 -2977161
19268 -2977161 -3659154 -4202783 -4554749 -4854552 -5244153 -5710658 -6185186 -6721652 -7317275
19259 -7317275 -7590221 -7142285 -5969257 -4288636 -2437841 -853443 163575 733108 1236395
19250 1236395 1908345 2810369 3871949 4743033 4972935 4389312 3116155 1464304 -124689
19241 -124689 -1163168 -1242019 -255883 1521908 3491205 4888501 5080541 3853983 1586043
19232 1586043 -991695 -3191543 -4730587 -5777941 -6444308 -6675655 -6685750 -6931652 -7543369
19223 -7543369 -8045075 -7863461 -7016281 -6127058 -5778104 -6019573 -6474773 -6811989 -6999088
19214 -6999088 -7080503 -6912899 -6266774 -5196332 -4195424 -3709704 -3803473 -4359899 -5199907
19205 -5199907 -6142883 -6969387 -7473333 -7691571 -7864172 -8155783 -8466444 -8461496 -7833496 -6426247
19195 -6426247 -4324295 -1882630 332326 1784222 2340464 2333162 2150132 1805657 1155530
19186 1155530 346045 -264612 -410380 -241731 -259061 -807792 -1781643 -2790123 -3578186
19177 -3578186 -3975242 -3733257 -2879526 -1859878 -1081614 -712748 -715996 -756631 -380259 544757
19167 544757 1603614 2270211 2552462 2844362 3309596 3705104 3675167 3274329 2937649 2956364
19157 2956364 3198264 3179572 2593785 1653627 866459 593538 937898 1697413 2222384 1909555
19147 1909555 808857 -590587 -1888655 -3007009 -4147553 -5446034 -6700703 -7591401
19139 -7591401 -7984447 -7798863 -7047757 -6052703 -5326690 -5177530 -5464430 -5801078 -5810683 -5350033
19129 -5350033 -4584300 -3722777 -3071190 -3047874 -3669888 -4489809 -5011627 -4934135 -4338120 -3624819
19119 -3624819 -3155526 -2801965 -2188930 -1275510 -379269 146308 341884 464140 373073 -210559
19109 -210559 -1123227 -1926826 -2234073 -1791992 -671293 587769 1305289 1187974 310312
19100 310312 -1089303 -2740229 -4515560 -6262696 -7741212 -8753864 -9141017 -8879976 -8297273
19091 -8297273 -7985152 -8206759 -8562279 -8524378 -7954062 -6961129 -5678868 -4291382 -3016475
19082 -3016475 -1987596 -1186846 -603687 -316820 -200202 61901 625697 1463151 2391001
19073 2391001 3276320 4140122 5004372 5846336 6596338 7008534 6732935 5675440 4206585
19064 4206585 2962737 2276537 1827914 1058828 -231740 -1756044 -3049794 -3905037 -4384642
19055 -4384642 -4621125 -4831606 -5242228 -5844194 -6437919 -6837773 -6937462 -6800442 -6553562 -6026142
19045 -6026142 -4890817 -3262588 -1669042 -402473 671548 1789545 2890402 3644231
19037 3644231 3897050 3846463 3825479 3990582 4456938 5506196 7027799 8179505 8188700 7156975
19027 7156975 5784970 4642701 3968450 3715890 3776837 4020786 4126587 3757181 2864249
19018 2864249 1617551 93224 -1688078 -3594267 -5331045 -6437469 -6661236 -6249394
19010 -6249394 -5563116 -4820842 -4302038 -4282398 -4773254 -5536099 -6316904 -6893325 -6968524 -6337237
19000 -6337237 -5130810 -3753816 -2574100 -1654141 -900656 -273205 223435 591847 915081
18991 915081 1245066 1599665 2162367 3038407 3870735 4131654 3600908 2431071 1029020
18982 1029020 -137079 -770702 -827902 -569655 -436987 -648125 -1036233 -1289040 -1310855 -1136550
18972 -1136550 -625134 413738 1935795 3522633 4635451 4887612 4109811 2574162 903623
18963 903623 -551264 -1927339 -3350332 -4703613 -5891143 -6833769 -7389378 -7611887 -7589540
18954 -7589540 -7209142 -6519961 -5780624 -5134440 -4606893 -4135933 -3414523 -2244432 -1017304
18945 -1017304 -277497 -122053 -201546 -17360 798533 2249163 3999308 5606697 6722118
18936 6722118 6983347 5996942 3760984 774627 -2284802 -4720292 -6008039 -6060677 -5209198
18927 -5209198 -3918717 -2591811 -1593930 -1122502 -1000157 -768814 -31920 1174924 2491179
18918 2491179 3605244 4418117 4884130 4992002 4860941 4394872 3380188 1994026 641520
18909 641520 -307934 -524686 -1880 840611 1458152 1603377 1455925 1335833 1365987 1557433
18899 1557433 1933596 2366243 2576109 2363297 1844493 1358451 1126942 1263403 1755223
18890 1755223 2249459 2331245 1859220 783087 -796568 -2415411 -3624261 -4357953 -4755929
18881 -4755929 -4939235 -4997318 -5135588 -5451359 -5720813 -5740408 -5663950 -5811977 -6286514 -6850322
18871 -6850322 -7109078 -6819974 -6169027 -5569645 -5214402 -5091189 -5353965 -6322439 -7901572
18862 -7901572 -9405175 -9975691 -9036772 -6747827 -3979582 -1771857 -739723 -823897 -1507848
18853 -1507848 -2308806 -3008204 -3539583 -3830936 -3784658 -3373807 -2823545 -2560886 -2676150 -2827707
18843 -2827707 -2739694 -2360230 -1805632 -1495316 -1872302 -2888037 -3979852 -4651200 -4868609
18834 -4868609 -4933371 -5211005 -5756539 -6212607 -6160126 -5461575 -4434745 -3575848 -2970341 -2335545
18824 -2335545 -1531087 -629857 276870 1058532 1666514 2209301 2688028 2865577 2380666
18815 2380666 1067376 -786666 -2499807 -3471006 -3544084 -2786321 -1424313 108049 1342853
18806 1342853 1836463 1420240 594134 289895 1153015 3068379 5376871 7452826 8866332
18797 8866332 9434513 9340058 8934456 8635504 8821729 9589525 10725804 11852204 12657704
18788 12657704 13007429 12871987 12194926 10767803 8435494 5495342 2641893 582853
18780 582853 -245150 56132 988633 2041156 2824465 3088582 2883651 2546615 2361615
18771 2361615 2367723 2477535 2598666 2568251 2164320 1243420 -55128 -1233421 -1846790 -2023715
18761 -2023715 -2032339 -1854180 -1464407 -938598 -279992 587139 1710781 3007415 4090359
18752 4090359 4523355 4313429 3794964 3296926 2995831 2830058 2685809 2590580 2582613 2554150
18742 2554150 2455770 2469150 2562133 2414244 1944580 1260003 501349 -23188 17115 632042
18732 632042 1335382 1562623 1103304 -60948 -1657216 -2960325 -3437672 -3261333 -2911339
18723 -2911339 -2537519 -1948037 -957139 412365 1939470 3277349 3971283 3670089 2531316
18714 2531316 1048557 -530823 -2146145 -3426237 -3772829 -3055242 -1900750 -1171105 -1399643
18705 -1399643 -2447063 -3670374 -4598851 -5041410 -4938816 -4540869 -4332943 -4602116 -5363787
18696 -5363787 -6555399 -7893048 -8883951 -9298393 -9257631 -8865650 -8198565 -7424852 -6694684
18687 -6694684 -6054039 -5567177 -5351586 -5501151 -6019155 -6710912 -7344970 -7790757 -8056776
18678 -8056776 -8345201 -8886115 -9768941 -10923900 -12050473 -12657541 -12376502 -11244733 -9579781
18669 -9579781 -7719504 -5775045 -3795042 -2201215 -1520266 -1930259 -3053477 -3994989 -4054968
18660 -4054968 -3356277 -2458857 -1673205 -1037776 -590135 -355776 -352069 -594814 -1068385 -1695112
18650 -1695112 -2181368 -2190360 -1594376 -435821 1097173 2671533 3864965 4616150 5184856
18641 5184856 5575270 5448918 4407405 2521996 474617 -1067079 -1898282 -2110525 -1823279
18632 -1823279 -1222358 -583054 -98738 130455 -10884 -496917 -1113520 -1601491 -1694945 -1344801
18622 -1344801 -867608 -570333 -490410 -525124 -595926 -786840 -1234741 -1929499 -2718990 -3430712
18612 -3430712 -4002981 -4468615 -4798799 -4968418 -5094777 -5186701 -5089657 -4818448 -4575373 -4399951
18602 -4399951 -3964526 -2973582 -1711024 -832556 -665849 -1077327 -1728271 -2312229 -2734346
18593 -2734346 -2975312 -3074532 -3246424 -3584262 -3849672 -3674851 -2845611 -1535317 -269355
18584 -269355 529082 768761 648062 412050 98632 -250558 -569715 -935009 -1264348 -1447079
18574 -1447079 -1662322 -2094587 -2618411 -3091082 -3590903 -3952549 -3828509 -3285043 -2621015
18565 -2621015 -1968900 -1428039 -1264152 -1721408 -2705766 -3857315 -4848844 -5434201 -5257563
18556 -5257563 -4013411 -1859722 542353 2417104 3478646 4069658 4684551 5604513 6828777
18547 6828777 8173909 9311699 9997817 10335840 10531808 10570065 10303262 9678148 8713880
18538 8713880 7542845 6491787 5817724 5478251 5312283 4983341 3970731 2089258 -207052
18529 -207052 -2258738 -3776811 -4887453 -5746988 -6261617 -6282371 -5936777 -5421256 -4541806
18520 -4541806 -3003105 -998681 899787 2049861 2086696 1332873 562411 300554 410179
18511 410179 306051 -410740 -1701791 -3333151 -5037562 -6398111 -7020661 -7071408 -6955083
18502 -6955083 -6619252 -5686950 -4103394 -2291464 -687946 654334 1910994 2978739
18494 2978739 3457886 3199592 2692878 2578499 2938470 3448012 3701808 3260042 1853528
18485 1853528 -320405 -2640154 -4455506 -5280042 -4928009 -3752865 -2425318 -1525459 -1500862
18476 -1500862 -2411677 -3697141 -4614426 -4813067 -4551877 -4233275 -3883445 -3437056 -3005516
18467 -3005516 -2656053 -2335482 -2045046 -1862995 -1850505 -1947386 -1836322 -1136272 64671 1145907
18457 1145907 1632807 1676968 1768292 2103654 2394643 2156918 1243260 -8198 -1085056
18448 -1085056 -1746771 -2254179 -2969994 -3910343 -4663515 -4708462 -4000816 -3066601 -2369303 -1662751
18438 -1662751 -416535 1224169 2522901 3063024 3153172 3205316 3140779 2686173 1885255
18429 1885255 1077036 374439 -537929 -1755253 -2850006 -3493241 -3810199 -4105800 -4471884
18420 -4471884 -4722151 -4507423 -3520334 -1885482 -92435 1368500 2185997 2280783 1765260
18411 1765260 751748 -589768 -1853374 -2590804 -2697911 -2586453 -2812855 -3603851 -4837719
18402 -4837719 -6145755 -7043711 -7244650 -6853938 -6197894 -5447144 -4619829 -3755357 -2872675
18393 -2872675 -1981926 -1256086 -1066218 -1698378 -3000283 -4455054 -5480617 -5766573 -5567960
18384 -5567960 -5402870 -5363228 -5007449 -4059229 -2816477 -1831822 -1442099 -1537197 -1755726 -1825428
18374 -1825428 -1690251 -1408719 -1141861 -993530 -775144 -109532 1121678 2463399 3168671
18365 3168671 2849348 1636403 -131601 -2037439 -3600938 -4428328 -4551045 -4570704 -5179358
18356 -5179358 -6596419 -8494383 -10267439 -11374572 -11500602 -10668108 -9168710 -7373964
18348 -7373964 -5581450 -4023479 -2910150 -2180559 -1578094 -1160991 -1234103 -1724208 -2144622
18339 -2144622 -2236942 -2207921 -2269768 -2315823 -2006734 -1145014 11107 955310 1306759 1093495
18329 1093495 675138 283675 -21412 -206777 -353812 -596970 -891400 -1098823 -1258811
18320 -1258811 -1450012 -1696842 -2112365 -2831060 -3817667 -4801117 -5409724 -5565600 -5616324 -5806513
18310 -5806513 -5996068 -5895248 -5234621 -3954773 -2326859 -810362 197514 484051 56389
18301 56389 -829719 -1792689 -2565598 -3102341 -3491440 -3791776 -4060507 -4321913 -4509512 -4588855
18291 -4588855 -4571338 -4514198 -4752188 -5643754 -7015150 -8146167 -8303649 -7255006 -5436535
18282 -5436535 -3483160 -1694348 -202612 915564 1874851 3055536 4482705 5650112
18274 5650112 6116980 5966320 5396933 4421214 3104164 1746700 750466 242386 -66750
18265 -66750 -493012 -1072989 -1731658 -2415926 -3026712 -3472651 -3660563 -3510547 -3147617 -2927823
18255 -2927823 -3246136 -4175321 -5351152 -6439720 -7370430 -8077932 -8393630 -8256030 -7832938
18246 -7832938 -7237411 -6311152 -4974410 -3509182 -2218610 -1256100 -708747 -447356 -221980
18237 -221980 3505 44710 -79405 -35688 299349 596471 496349 -6335 -619358 -1052577
18227 -1052577 -1129326 -887775 -620578 -551143 -602905 -543337 -289875 -9305 98712 -44393
18217 -44393 -371257 -641987 -551860 -39098 522688 653167 166622 -859395 -2152753 -3352165
18207 -3352165 -4310843 -5198800 -6277513 -7503007 -8509245 -9170759 -9660638 -9985810 -9869694
18198 -9869694 -9171217 -8351850 -8083689 -8486353 -8977843 -8850220 -7926549 -6701240 -5809399
18189 -5809399 -5455619 -5565356 -5936571 -6142036 -5841867 -5130984 -4230840 -3230156 -2246814
18180 -2246814 -1587168 -1612421 -2306538 -3205806 -3741705 -3698226 -3356875 -3104979 -3139777 -3410992
18170 -3410992 -3690855 -3759948 -3559602 -3167723 -2725068 -2492628 -2609007 -2763528 -2475053 -1519075
18160 -1519075 -154518 957281 1255792 661703 -483556 -1898728 -3560739 -5187587
18152 -5187587 -6239537 -6462985 -5958024 -5177966 -4728575 -4822508 -5301183 -5866170 -6158110
18143 -6158110 -5972658 -5404297 -4655192 -3720600 -2499182 -1150002 -27965 611762 757894
18134 757894 670665 565932 363793 -16775 -504732 -1000387 -1461749 -1932059 -2279163 -2243562
18124 -2243562 -1761611 -886200 187765 1077017 1494227 1331857 490137 -983242 -2626795
18115 -2626795 -3807054 -4289483 -4267705 -3928548 -3374092 -2693030 -2000570 -1365256 -721424
18106 -721424 17090 936636 2085472 3274799 4124576 4355515 3820159 2498883 615799
18097 615799 -1300785 -2639634 -3241645 -3559486 -3977737 -4356676 -4372040 -3675199 -1986330
18088 -1986330 449087 2840471 4450093 5145254 5207829 4750231 3749625 2215637 201087
18079 201087 -1963129 -3689566 -4575446 -4602283 -4017059 -3217943 -2433884 -1571740 -559405
18070 -559405 609980 2173933 4283011 6591247 8495549 9384889 8925355 7334487 5206142
18061 5206142 3144892 1605699 844798 796457 1140604 1596897 2129689 2745146 3257297
18052 3257297 3439590 3255038 2795609 2054678 978616 -305218 -1475491 -2222424 -2472314
18043 -2472314 -2417132 -2320406 -2210617 -1758159 -636566 993274 2639297 3902795 4510639
18034 4510639 4218875 2931951 915889 -1339527 -3344277 -4709273 -5333796 -5403934 -5073616
18025 -5073616 -4446325 -3722816 -3288332 -3383232 -3748605 -3940199 -3651330 -2776458 -1575412
18016 -1575412 -584643 -180573 -353557 -852899 -1501303 -2323092 -3209699 -3715835 -3494919
18007 -3494919 -2734682 -2080478 -1978370 -2230110 -2425000 -2472482 -2601387 -2979847 -3366940 -3394972
17997 -3394972 -3066123 -2618998 -2261654 -2201842 -2426568 -2469321 -1991925 -1270677 -788382 -681859
17987 -681859 -821903 -1227529 -1979572 -2862193 -3406151 -3287013 -2608838 -1792515 -1212018 -1018613
17977 -1018613 -1148355 -1330219 -1327020 -1185023 -984570 -683033 -296651 153356 584652 827832
17967 827832 852219 710874 366235 -163998 -767097 -1516743 -2418059 -3132012 -3284812 -2922284
17957 -2922284 -2380261 -1814721 -1410604 -1412679 -1718521 -1913663 -1688499 -1080087 -383587 6849
17947 6849 -164679 -681648 -1090756 -1230420 -1355876 -2026573 -3617547 -5894348 -8164153
17938 -8164153 -9826915 -10746240 -11015380 -10778049 -10423434 -10409119 -10734747 -10857914 -10177346
17929 -10177346 -8685849 -6922093 -5372424 -4191498 -3422347 -3168973 -3440569 -4138182 -5052584
17920 -5052584 -5832747 -6145341 -5780693 -4693290 -3122844 -1642554 -723738 -256931 53410
17911 53410 259664 448659 771957 1229889 1744472 2167909 2220301 1806947 1111515 312323
17901 312323 -447050 -1048923 -1249650 -628238 1083620 3624681 6287551 8462346 9968714
17892 9968714 10869801 11362457 11720726 12125312 12679724 13317929 13622286 13165695 12063263
17883 12063263 10766568 9474069 8019404 6358028 4813397 3617287 2616685 1505492
17875 1505492 173157 -1230784 -2332679 -2737103 -2511407 -2185810 -2109094 -2390497 -3160410
17866 -3160410 -4358815 -5543002 -6238624 -6325504 -5941981 -5269583 -4351857 -3108020 -1670136
17857 -1670136 -368231 571738 1135082 1617873 2350751 3195143 3617175 3259229 2230783
17848 2230783 972847 27223 -313913 -276254 -342700 -725420 -1327715 -2091227 -3051605 -4114975
17838 -4114975 -4933905 -5245204 -5204970 -5152319 -5297222 -5805482 -6688393 -7530424 -7736119 -7136272
17828 -7136272 -6001439 -4614800 -3229116 -2276931 -2111361 -2632596 -3388258 -3915540 -3954057
17819 -3954057 -3413632 -2441068 -1467830 -967493 -1122891 -1801227 -2794514 -3804957 -4462165
17810 -4462165 -4555401 -4157226 -3400118 -2272769 -758872 1045952 2940794 4594396 5606719
17801 5606719 5733173 5148166 4275064 3337185 2381432 1554124 961746 387326 -484698
17792 -484698 -1621359 -2621462 -3124680 -3120665 -2930636 -2831478 -2820253 -2694775 -2286235 -1583272
17782 -1583272 -865143 -522607 -510749 -610972 -924696 -1551247 -2234544 -2572167 -2314362 -1597123
17772 -1597123 -919171 -613460 -549579 -575946 -885344 -1595513 -2457736 -3155283 -3531800 -3547923
17762 -3547923 -3313136 -3041685 -3060414 -3728424 -5025494 -6417511 -7226145 -7192641 -6552134
17753 -6552134 -5570292 -4309293 -2887324 -1681551 -1008686 -930342 -1519380 -2822401 -4494547
17744 -4494547 -6072983 -7388947 -8204123 -8042107 -6837478 -5115936 -3381064 -1852809
17736 -1852809 -545440 691828 1948058 3190735 4520601 6038318 7519577 8682991
17728 8682991 9486594 9891118 9753981 9057406 7921341 6484009 5057314 4025676 3448449
17719 3448449 3015905 2525554 2120280 1928793 1935913 2113052 2463261 3064818 3922820 4796678
17709 4796678 5227623 4876993 3845560 2514534 1302838 562544 347210 231744 -219298
17700 -219298 -890154 -1501494 -2058651 -2635263 -3068791 -3053237 -2492988 -1627843 -914908 -773700
17690 -773700 -1229568 -1827164 -2059548 -1845465 -1509695 -1287138 -1090517 -813561 -490455 3576
17680 3576 967082 2319773 3422321 3641520 2972016 1959835 1167651 834162 838425 1047258
17670 1047258 1579040 2562502 3969613 5531002 6762453 7254658 6808512 5603915 4242920
17661 4242920 3327619 3076786 3102534 2866899 2288797 1364546 -82826 -1879413 -3349193
17652 -3349193 -3980219 -3745054 -2685275 -841668 1325925 3086127 4173553 4898146 5601455
17643 5601455 6258909 6587348 6387971 5792622 5232457 4862916 4367746 3558155 2795657
17634 2795657 2557278 2792519 3027850 2919479 2413136 1742297 1042236 180723 -868423
17625 -868423 -1995584 -3002252 -3655806 -3936046 -4021171 -4128495 -4384690 -4763527 -5274195
17616 -5274195 -5939517 -6458081 -6345468 -5545087 -4395430 -3346722 -2723787 -2507185 -2367285
17607 -2367285 -1967915 -1326060 -694718 -356857 -484642 -1006769 -1759151 -2710598 -3893569
17598 -3893569 -5086319 -5902887 -6370129 -6918944 -7840529 -9050242 -10324269 -11478053 -12294245
17589 -12294245 -12663894 -12742151 -12845096 -13106723 -13279647 -13077084 -12480689 -11498454 -10250837
17580 -10250837 -9230320 -8833024 -8841859 -8617924 -7800701 -6691148 -5871154 -5599135 -5666989
17571 -5666989 -5684587 -5302039 -4456195 -3446140 -2667812 -2434932 -2834196 -3590990 -4165729
17562 -4165729 -4066394 -3223823 -2063453 -1153032 -678771 -210112 819847 2499574 4525369
17553 4525369 6414698 7680782 8280077 8666195 9217500 9851932 10305533 10408764 10086648
17544 10086648 9404143 8584705 7807720 7082176 6331264 5492701 4591386 3634949 2540002
17535 2540002 1138310 -711764 -2874359 -4908056 -6347783 -6990493 -6795430 -5965744 -5091393
17526 -5091393 -4588334 -4378216 -4227289 -4140397 -4370408 -4965907 -5514618 -5647948 -5356980 -4663753
17516 -4663753 -3547923 -2397970 -1790530 -1859833 -2308091 -2711673 -2849986 -2778661 -2679337 -2617396
17506 -2617396 -2426486 -2039327 -1662773 -1468822 -1452031 -1466047 -1206668 -497202 363994 828772
17496 828772 743024 430155 138053 -133829 -307027 -121001 630734 1891064 3312394
17487 3312394 4376327 4622370 4026320 2891272 1592246 453701 -331789 -636904 -633217
17478 -633217 -703521 -949949 -1185500 -1271278 -1162202 -911653 -535587 60554 725938 1051329
17468 1051329 743314 -95294 -1041687 -1593488 -1561197 -1352433 -1517286 -2192710 -3063709 -3643777
17458 -3643777 -3566605 -2898390 -2123796 -1725147 -1729117 -1663105 -1223515 -607671 -22125 473474
17448 473474 697767 462002 -187231 -1017269 -1847123 -2447201 -2659802 -2586528 -2343380 -2071666
17438 -2071666 -2120127 -2918116 -4584450 -6709880 -8592394 -9645974 -9676809 -8777562 -7224269
17429 -7224269 -5608235 -4592182 -4437081 -4957653 -5778294 -6544158 -7016769 -7080999 -6734050
17420 -6734050 -6035120 -5062070 -4039060 -3374270 -3299698 -3666023 -4114983 -4365511 -4192188
17411 -4192188 -3334007 -1758240 176859 1850720 2714546 2684972 2181172 1631034 1096230
17402 1096230 462197 -240634 -713773 -578100 238067 1313844 2089734 2244375 1723110
17393 1723110 741979 -350419 -1278315 -1948921 -2558543 -3396870 -4519020 -5697313 -6688174
17384 -6688174 -7346850 -7482598 -7019343 -6146866 -5173517 -4368746 -3914578 -3804550 -3931236
17375 -3931236 -4256908 -4723087 -5193002 -5553936 -5812619 -6030525 -6269634 -6505644 -6566323 -6376023
17365 -6376023 -6083834 -5904771 -5898244 -5866623 -5677004 -5370056 -4807993 -3892783 -2866777 -1888802
17355 -1888802 -833920 184678 746839 671986 89372 -909163 -2073868 -2904458 -3209156
17346 -3209156 -3339201 -3467764 -3258366 -2471929 -1301663 -226272 436428 766554 990751
17337 990751 1097516 849407 187816 -509480 -913886 -1364287 -2313437 -3680386 -5202098
17328 -5202098 -6770670 -8308225 -9690303 -10711405 -10995848 -10443205 -9551403 -8883807 -8632720
17319 -8632720 -8677765 -8784518 -8716866 -8343309 -7795812 -7224767 -6523809 -5598753 -4618967 -3784014
17309 -3784014 -3116926 -2609623 -2447414 -2758897 -3294738 -3811458 -4223272 -4319535 -3872659 -2929747
17299 -2929747 -1876605 -1138280 -727625 -315138 110169 105908 -580331 -1611456 -2350520
17290 -2350520 -2299911 -1318344 378903 2232156 3661960 4606222 5253792 5524119 5244509
17281 5244509 4438016 3338180 2197670 1115077 196528 -371777 -494183 -358777 -196999
17272 -196999 44105 503812 1174211 1893587 2204794 1717044 514997 -950256 -2123579
17263 -2123579 -2712889 -2764685 -2507751 -2317964 -2520078 -3008901 -3227555 -2720662 -1629499
17254 -1629499 -469738 249520 385498 256946 284587 551697 725594 383567 -668108
17245 -668108 -2291670 -4051987 -5556438 -6591548 -6897690 -6482184 -5923548 -5748724 -5828772
17236 -5828772 -5778954 -5422537 -4833498 -4347529 -4356686 -4965265 -5880028 -6543903 -6386004 -5142016
17226 -5142016 -3113151 -833229 1397718 3386812 4752426 5228105 5030368 4486066 3802889
17217 3802889 3131635 2474674 1728645 914067 146811 -584144 -1363282 -2175586 -2891478
17208 -2891478 -3392536 -3615556 -3591443 -3500952 -3694688 -4560974 -6255551 -8642484 -11196669
17199 -11196669 -13088534 -13862186 -13867287 -13657275 -13323526 -12539036 -11037369 -9090479 -7272508
17190 -7272508 -5882064 -4846777 -3983014 -3211707 -2451894 -1615246 -769141 11879 836200
17181 836200 1718116 2413489 2752267 2838654 2735722 2310780 1608643 956131 662136 727337
17171 727337 883495 786259 252535 -539039 -1226343 -1583030 -1432542 -840870 -403612 -593189
17161 -593189 -1241144 -1842641 -2091819 -2107772 -2119697 -2111717 -1855721 -1173531 -267370 425541
17151 425541 766277 930615 1125780 1472979 2057056 3044963 4510304 6224767 7595739
17142 7595739 7896103 6897822 5081416 3228210 1813424 857426 247383 -189426 -540616
17133 -540616 -638767 -399806 -179554 -520690 -1567046 -2928761 -4116314 -4857245 -5046026
17124 -5046026 -4841290 -4629323 -4634097 -4778974 -4724667 -4267585 -3683783 -3282529 -3058200 -2933843
17114 -2933843 -2791031 -2574425 -2395951 -2206403 -1742395 -841315 220021 756016 307942
17105 307942 -954802 -2534149 -3969368 -5037083 -5673238 -5740134 -5235729 -4407075 -3386236
17096 -3386236 -2128543 -682989 827142 2224866 3349197 4235017 4942292 5366541 5157391
17087 5157391 4151946 2902753 2053582 1687847 1537678 1351804 1116884 957710 864508
17078 864508 779793 808548 923795 890773 696345 485499 275001 120829 124215 311333
17068 311333 718526 1300287 1811891 1930982 1470085 574612 -297535 -651905 -254412 792172
17058 792172 2097497 3076660 3392834 3127699 2577693 2090567 1813464 1650179 1485075
17049 1485075 1169707 442369 -782692 -2233910 -3575976 -4579752 -5019803 -4903799 -4513838
17040 -4513838 -4002871 -3294187 -2330270 -1327722 -570959 43928 759944 1343112 1282501
17031 1282501 463478 -769907 -1987058 -2770912 -2818856 -2121074 -839012 709077 2150154
17022 2150154 3344362 4386210 5345798 6194067 6984458 7812857 8654485 9360968 9714745
17013 9714745 9498825 8740215 7833753 7293895 7386200 7983789 8646774 8849934 8390406 7412644
17003 7412644 6069469 4462943 2876044 1674409 986492 484560 -298832 -1562902 -3225256
16994 -3225256 -4795742 -5803824 -6283517 -6347273 -5970711 -5247388 -4392937 -3566574 -2856064
16985 -2856064 -2256403 -1866546 -2093565 -3117685 -4388588 -5117884 -5026638 -4434907 -3860151
16976 -3860151 -3564369 -3494053 -3508133 -3447591 -3251123 -3096186 -3194569 -3602471 -4326497 -5324123
16966 -5324123 -6272623 -6719434 -6678296 -6532242 -6357047 -6108017 -6110486 -6587030 -7151494 -7249466
16956 -7249466 -6853456 -6265596 -5570513 -4665250 -3425656 -1730204 372919 2482001 3961641
16947 3961641 4307875 3516434 2184634 1118873 780234 968326 1055142 662545 19616
16938 19616 -391366 -397494 -101861 353388 953615 1741177 2492210 2769500 2515981 2205912
16928 2205912 2112984 2149788 2251794 2349097 2266796 1934295 1496374 1049157 542473 -63499
16918 -63499 -776359 -1627643 -2799354 -4428007 -6129637 -7218579 -7493582 -7366974 -7078947
16909 -7078947 -6466341 -5432745 -4212344 -3158218 -2500829 -2254998 -2100844 -1570906 -516666
16900 -516666 840269 2287258 3564880 4213637 3999479 3242276 2635084 2743812 3532792
16891 3532792 4457092 4877328 4465482 3347014 1874971 279529 -1362173 -2817246 -3787470
16882 -3787470 -4265007 -4502941 -4664747 -4752572 -4836155 -5000988 -5127193 -5027147 -4848289 -4853709
16872 -4853709 -4970200 -4912534 -4461397 -3637569 -2646367 -1759719 -1316513 -1440776 -1840374 -2012060
16862 -2012060 -1627207 -858813 -48527 644457 1151137 1393068 1249590 558360 -624521
16853 -624521 -1751277 -2274055 -2270774 -2291463 -2903783 -4319214 -6231016 -7950332 -9015416
16844 -9015416 -9498970 -9473278 -8854049 -7741617 -6485374 -5417445 -4564096 -3874155 -3479836
16835 -3479836 -3584056 -4335150 -5599817 -6844766 -7641712 -8147541 -8769366 -9552136 -10187089
16826 -10187089 -10478638 -10515076 -10514909 -10640788 -10852049 -10891418 -10248017 -8521042 -6063825 -3628300
16816 -3628300 -1535607 325050 1924925 2988652 3368063 3095684 2139677 509225 -1516698
16807 -1516698 -3495189 -5070682 -6011958 -6121984 -5378590 -4054260 -2652256 -1652870 -1173526
16798 -1173526 -887183 -419907 137306 458189 528074 456401 182729 -341161 -1001192 -1565133
16788 -1565133 -1873670 -2094129 -2577005 -3470215 -4703913 -6061613 -7237630 -7923510 -7888966
16779 -7888966 -6973032 -5229476 -3083590 -1044128 468387 1125096 1089842 1047909 1389067
16770 1389067 1893863 2190322 2144639 1862957 1330085 540264 -94740 -183650 126844 499653
16760 499653 829760 1195039 1686405 2192946 2569245 2997725 3755320 4702626 5454756 5860017
16750 5860017 6014240 6136007 6459305 7047637 7716994 8207810 8306962 7997126 7467916 6883187
16740 6883187 6275829 5515922 4402637 3059759 1931190 1325232 1235652 1619572 2617362
16731 2617362 4275850 6225192 7960421 9088976 9378260 8862704 7795245 6303883
16723 6303883 4362199 2320639 886472 470568 1009468 2062620 2936232 3124521 2618803
16714 2618803 1780443 1021009 526915 196843 -32912 -71807 83037 287568 373509 145727
16704 145727 -525503 -1413497 -2105626 -2449028 -2504070 -2374769 -2127660 -1750241 -1227683 -655975
16694 -655975 -178409 233371 666744 945679 733766 -59968 -906805 -972534 -29034 1372498
16684 1372498 2552849 3113955 2952933 2296160 1580527 1015324 496706 -29746 -357902
16675 -357902 -229678 284212 980853 1856543 2768828 3275247 3221366 2800102 2098542 1147545
16665 1147545 14484 -1114758 -1765900 -1534279 -616922 365143 932439 925954 498011
16656 498011 90045 156031 743973 1488604 2073517 2465834 2702268 2745158 2593084 2380774
16646 2380774 2217768 1958579 1495128 1101433 1048800 1224850 1452469 1655078 1855991 2291894
16636 2291894 3122679 4107455 4923071 5525401 5920826 6092950 6187333 6330338 6552217 6864959
16626 6864959 7201327 7419708 7225440 6279362 4709658 3137394 2059962 1525693 1467042
16617 1467042 1869609 2484765 2852717 2665160 1877012 679774 -589146 -1689609 -2673429
16608 -2673429 -3695352 -4741946 -5606665 -5909281 -5500679 -4623308 -3597787 -2775096 -2389045
16599 -2389045 -2173032 -1612569 -788280 -411550 -870236 -1818164 -2726138 -3286127 -3388842
16590 -3388842 -3155004 -2777456 -2262582 -1590919 -951769 -539196 -231767 213255 752792
16581 752792 1021007 662256 -289946 -1411849 -2247686 -2460546 -1964064 -1048678 -195125
16572 -195125 268227 277400 -43749 -326398 -253910 97001 459565 721652 1027828 1491749
16562 1491749 1988055 2274524 2165108 1699418 1221623 1053345 1105487 1102996 1012383 1111167
16552 1111167 1659871 2611809 3737482 4821819 5806819 6693796 7351729 7615439 7506475
16543 7506475 7193977 6766281 6313369 5827175 5150290 4207852 3067603 2006055 1493003
16534 1493003 1807504 2715350 3795150 4951939 6233954 7403210 7982893 7826202 7434851
16525 7434851 7424010 8088138 9241239 10270202 10615357 10153136 9197649 8220984 7423398
16516 7423398 6645730 5656148 4435769 3107750 1794981 701992 167479 402367 1104153
16507 1104153 1592306 1412769 651249 -413458 -1507977 -2243471 -2151727 -1000797 922610
16498 922610 3107092 5211815 7059970 8653878 10245644 12140176 14226448 15940117
16490 15940117 16650878 15914711 13683147 10380880 6881792 4063432 2263198 1364020
16482 1364020 1099482 1219579 1442323 1515077 1400109 1219690 1053842 667978 -201753 -1252048
16472 -1252048 -1786852 -1401809 -341759 776942 1655615 2603490 3858215 5105673 5854128
16463 5854128 5457099 2963879 -2270545 -9498923 -16341486 -20767269 -22363847 -21736603
16455 -21736603 -19795931 -17214903 -14363787 -11535970 -9071782 -7278776 -6376230 -6371655 -6915677
16446 -6915677 -7454875 -7645796 -7603514 -7741973 -8330305 -9216316 -10080520 -10735009 -10913897 -10289717
16436 -10289717 -8990502 -7620332 -6716098 -6500143 -6985627 -7857224 -8435948 -8147416 -6951979
16427 -6951979 -5344064 -3921013 -2949082 -2422061 -2166635 -1881443 -1496802 -1327019 -1576991
16418 -1576991 -2095324 -2685058 -3302390 -3924620 -4460492 -4900980 -5381922 -6072622 -7003748
16409 -7003748 -7929574 -8403747 -8210368 -7689507 -7314210 -7055791 -6534077 -5583687 -4320531
16400 -4320531 -2755348 -961943 603900 1491940 1604528 1164349 589632 356898 596720
16391 596720 931172 990225 581079 -641184 -2869152 -5473968 -7177753 -7141592 -5607492
16382 -5607492 -3427997 -1541390 -699006 -861849 -1157637 -802935 404864 2129226 3560720
16373 3560720 3926114 3114093 1752562 617672 141192 292512 794821 1346352 1476280
16364 1476280 855180 -294146 -1571908 -2806476 -3879778 -4768964 -5615337 -6417272 -6965507
16355 -6965507 -7115493 -6946292 -6638893 -6350715 -6073478 -5597401 -4877788 -4143784 -3677160
16346 -3677160 -3659966 -4036688 -4683078 -5510814 -6260729 -6632526 -6497987 -5945748 -5293073 -4888242
16336 -4888242 -4792507 -4780666 -4545343 -4012693 -3514799 -3547403 -4553842 -6628523 -9250083
16327 -9250083 -11481768 -12535316 -12410904 -11948041 -11858342 -12050454 -12253991 -12591464 -13157951
16318 -13157951 -13767522 -14330408 -15119105 -16515346 -18559450 -21036272 -23670960 -25993103
16310 -25993103 -27118597 -25637998 -20745836 -14152548 -8688027 -5433062 -3993821 -3720318
16302 -3720318 -3993104 -4230435 -4038003 -3259778 -1871120 -131623 1396902 2250388 2378210
16293 2378210 2031036 1445408 694772 -167077 -1007393 -1744428 -2399581 -2917368 -3176888
16284 -3176888 -3249030 -3414273 -3825774 -4308333 -4572409 -4548460 -4368864 -4018279 -3270726 -1999815
16274 -1999815 -530963 490812 703836 322306 -181037 -557237 -904390 -1463423 -2280918
16265 -2280918 -3021240 -3233136 -2661334 -1478672 -356897 107116 -44314 -417250 -726950
16256 -726950 -891245 -1040916 -1492128 -2506905 -3821036 -4592024 -4228532 -2881884 -1233899
16247 -1233899 -156972 37916 -184015 -303253 -95091 520976 1482753 2647775 3692688
16238 3692688 4132546 3796090 2945772 1993502 1280585 941791 780583 399907 -436317
16229 -436317 -1573292 -2567289 -3074894 -3091812 -2789874 -2421058 -2237627 -2107896 -1696122 -1148940
16219 -1148940 -897547 -973521 -1014615 -756703 -521713 -939514 -2050891 -3116299 -3346725
16210 -3346725 -2536622 -1046367 596171 2063103 3232070 3993231 4287053 4089082 3279992
16201 3279992 1833618 13814 -1784379 -3282143 -4297910 -4712219 -4595801 -4224732 -3928183
16192 -3928183 -3899071 -4146794 -4533391 -4798248 -4610457 -3849280 -2836106 -2021635 -1539705
16183 -1539705 -1203000 -708936 116642 1131816 1978721 2340096 2172935 1682788 1175722
16174 1175722 853300 600888 261948 27295 224493 887166 1574781 1617348 643955 -1169211
16164 -1169211 -3236036 -4776959 -5309214 -5167828 -4947235 -4759718 -4490360 -4087058 -3382038
16155 -3382038 -2287662 -1017409 307891 1753925 3186025 4265846 4930853 5535273
16147 5535273 6311590 7138333 7920838 8518479 8521510 7598580 5841463 3699771 1569177
16138 1569177 -416224 -2086010 -3189434 -3711472 -3950883 -4159297 -4226718 -3984198 -3519856
16129 -3519856 -3032315 -2644754 -2356242 -2233203 -2525394 -3297315 -4123441 -4541868 -4469275 -4136713
16119 -4136713 -3735661 -3115843 -2203233 -1249657 -512257 -105927 178346 747261 1578499
16110 1578499 2118042 1957153 1225542 329180 -394165 -813371 -980676 -1004911 -871914 -614406
16100 -614406 -555835 -837767 -1181844 -1416921 -1630849 -1837206 -1806456 -1371466 -586859 384172
16090 384172 1359215 2086825 2282438 1973040 1572918 1495118 1833470 2369746 2850012 3195193
16080 3195193 3413452 3472225 3330372 3092544 2942156 2876723 2753014 2564131 2483556 2585090
16070 2585090 2643115 2312006 1477747 379879 -524467 -793857 -349487 392188 775019
16061 775019 504316 -79590 -615144 -1206798 -1995152 -2784180 -3267202 -3261460 -2887454 -2553793
16051 -2553793 -2510731 -2628019 -2745717 -3022515 -3634223 -4364923 -4971066 -5489652 -5867527 -5959685
16041 -5959685 -5768524 -5225510 -4232681 -2832313 -1212496 336903 1624225 2605859 3274560
16032 3274560 3687722 4037194 4481264 4963208 5282779 5224138 4667713 3782559 2943905 2321671
16022 2321671 1691874 815352 -223981 -1136419 -1701146 -1927287 -2063360 -2333332 -2688692
16013 -2688692 -2922974 -3012013 -3033143 -2991339 -3018406 -3342981 -3935823 -4463829 -4591214 -4254041
16003 -4254041 -3646327 -2955713 -2254816 -1549134 -815432 -77551 503121 751906 583132
15994 583132 76342 -435897 -559084 -60429 1001347 2338472 3698219 4803039 5260455
15985 5260455 5018642 4474204 3882998 3125579 1917929 106412 -2134296 -4379731 -6249955
15976 -6249955 -7547623 -8195086 -8178625 -7599446 -6597086 -5305964 -4036617 -3269840 -3274822
15967 -3274822 -3730837 -4029543 -3960131 -3905631 -4399136 -5603477 -7181846 -8391044 -8568656
15958 -8568656 -7729037 -6643623 -6166013 -6518262 -7256127 -7702294 -7556906 -7016784 -6363869
15949 -6363869 -5715036 -5142367 -4746977 -4507146 -4263007 -3933035 -3536443 -2972792 -2290319
15940 -2290319 -1804251 -1690793 -1884591 -2205319 -2511259 -2785440 -3138059 -3825673 -5053135
15931 -5053135 -6823226 -8947964 -10931422 -12160636 -12387364 -11918714 -11306825 -10847801 -10431207
15922 -10431207 -9786421 -8812720 -7606180 -6284130 -4812757 -3042267 -1055956 887542
15914 887542 2570468 3857335 4792567 5451899 5896649 6321737 6977099 7850323 8741564
15905 8741564 9514694 9885383 9517398 8498766 7348303 6590429 6474873 6662599 6383285
15896 6383285 5452843 4401704 3536990 2674237 1661562 775285 474539 769035 1172254
15887 1172254 1404939 1675647 2335522 3510568 4915796 5985060 6174638 5294298 3561899
15878 3561899 1386684 -753445 -2345169 -3095560 -3142605 -2812829 -2354752 -1867443 -1298420
15869 -1298420 -558466 403538 1664064 3414225 5819467 8519695 10582267 11250201 10555744
15860 10555744 9126236 7602301 6243399 5056491 4173317 3731136 3700168 4044393 4633771
15851 4633771 5171002 5597255 6224004 7164484 8082458 8448369 8062511 7298982 6557926
15842 6557926 5861960 5051833 3993090 2810222 1916425 1711059 2259985 3202923 4064212
15833 4064212 4715453 5357904 6105493 6813709 7247234 7313248 7065755 6709309 6535137 6639870
15823 6639870 6825527 6805346 6542903 6086136 5337496 4249597 2911782 1650948 877878
15814 877878 548436 115445 -719456 -1785864 -2817712 -3481100 -3567821 -3221757 -2714482
15805 -2714482 -2230982 -1825027 -1470616 -1247312 -1292130 -1654812 -2419317 -3652082 -5096138
15796 -5096138 -6184140 -6530932 -6310080 -5851535 -5196760 -4370067 -3494129 -2673383 -2022623
15787 -2022623 -1480371 -791457 103323 1007964 1728444 2120452 2041431 1400484 410137 -500569
15777 -500569 -1049662 -1118607 -748370 -184224 262535 464096 552712 563567 267967 -470183
15767 -470183 -1475204 -2498041 -3434122 -4154125 -4420286 -4108083 -3502836 -2920217 -2108141
15758 -2108141 -730115 916140 2426092 3705454 4537411 4778362 4717612 4648758 4566159
15749 4566159 4364764 4003931 3619190 3484511 3642790 3887222 4019827 3912832 3466746
15740 3466746 2462206 715166 -1601755 -3893606 -5317183 -5191913 -3593837 -1485667
15732 -1485667 164004 1224903 2085902 2940551 3588108 3821296 3813973 3744489 3431666 2557582
15722 2557582 1117348 -408751 -1410451 -1630049 -1251287 -600107 52260 457738 501936
15713 501936 365851 279358 267475 293757 474380 919588 1516193 2197451 2992755 3683413
15703 3683413 3859979 3308841 2098243 482890 -1099355 -2088096 -2274468 -1962737 -1449255
15694 -1449255 -833463 -43025 1127096 2660856 4200868 5264035 5506970 4928634 3830073
15685 3830073 2585348 1535303 961805 856321 997969 1341599 1888485 2316919 2157799
15676 2157799 1226559 -80884 -1031503 -1400367 -1616684 -1996797 -2458796 -2998048 -3729354
15667 -3729354 -4357274 -4391816 -3635143 -2194340 -352011 1567096 3235733 4507263 5502223
15658 5502223 6377628 7110317 7612206 7930893 8018054 7539374 6282929 4684850 3503354
15649 3503354 3018822 2894869 2620135 1928614 1048569 491774 609155 1465352 2832139
15640 2832139 4193129 5067627 5382305 5299204 4997271 4700009 4526274 4443524 4513716 4878155
15630 4878155 5397408 5760709 5857419 5723943 5300843 4513347 3473658 2440669 1678811
15621 1678811 1310976 1196620 1105348 850385 366185 -136456 -351074 -273997 -138604 15273
15611 15273 276890 646020 1096599 1660595 2327635 2896225 3187296 3240087 3215216 3309138
15601 3309138 3592986 3859801 3751464 3091406 2149201 1538657 1693245 2396001 2847539
15592 2847539 2352199 1070877 -461243 -1935387 -3094342 -3764884 -3941041 -3603867 -2626569
15583 -2626569 -957040 1190260 3282735 4675545 5110905 5041081 5062012 5356902 5731129
15574 5731129 5832327 5538299 5191984 5185036 5458773 5572832 5209079 4698787 4662309 5284270
15564 5284270 6423697 7848484 9239445 10359987 11158213 11642955 11755097 11450444 10886384
15555 10886384 10275550 9623509 8854022 7971681 6856328 5273948 3340787 1594225 476750
15546 476750 -104072 -392436 -360912 -67738 227328 462010 810586 1444864 2316109 3325713
15536 3325713 4477830 5586080 6238479 6238786 5711640 4886295 4040923 3422489 3023426 2610300
15526 2610300 2085318 1507840 938430 367711 -270902 -957379 -1594781 -2190263 -2663731
15517 -2663731 -2693617 -2021525 -705321 894717 2388922 3592926 4460852 4971686 5227990
15508 5227990 5427199 5711703 6063431 6236857 5914730 5108467 4159862 3356985 2752334
15499 2752334 2363354 2341379 2746637 3412877 4152120 4905416 5559956 5850765 5600808 4848588
15489 4848588 3659693 2118464 653143 -239160 -495374 -140859 857360 2417203 4404123
15480 4404123 6655450 8874905 10611299 11479269 11393109 10587706 9291508 7591688 5669163
15471 5669163 3718863 1846616 340888 -476344 -638646 -353491 224723 934849 1687759
15462 1687759 2516335 3300965 3833799 4137568 4338760 4497969 4662721 4897005 5423084
15453 5423084 6511328 8111065 9843562 11171572 11779099 11857036 11723257 11527988 11412201
15444 11412201 11625000 12203479 12846009 13235792 13355071 13386667 13361834 13084652 12404480 11472680
15434 11472680 10613876 10019058 9662332 9458364 9348926 9181074 8876829 8725023 8983106
15425 8983106 9468110 9778927 9697075 9386300 9167820 9114097 8999791 8594499 8032840 7776256
15415 7776256 8190986 9178171 10149179 10635401 10820921 11241161 12188518 13571198 15115420
15406 15115420 16565540 17962267 19448981 20816671 21672113 21875225 21641458 21078085 20042392
15397 20042392 18601517 17210070 16233885 15608547 15261104 15417055 16361732 18210469 20745123
15388 20745123 23440407 26019139 28707314 31484354 33769356 35240200 36204145 37002491
15380 37002491 37723507 38462704 39265863 40042530 40842881 41823366 42813014 43554312 44265345
15371 44265345 45381153 47042437 49250968 52105960 55512969 58993003 62185732 65354438
15363 65354438 69010373 73299195 78020535 83092870 88750724 95350883 103191512 112565244
15355 112565244 123839874 137103232 151863684 167577252 184239891 202108056 221312861
15348 221312861 241695040 262668106 283163544 301651613 316523494 326722331 331870911
15341 331870911 332264550 328912537 323324480 317399459 313003652 311129802 311809747 314691493
15333 314691493 319268708 324771294 330027321 333579618 333935758 329943765 321178409 307924794
15325 307924794 290910824 271272585 250535774 230159812 210937839 192934596 175986042
15318 175986042 160286407 146286738 134136886 123595528 114385324 106449593 99936955
15311 99936955 94911803 91209427 88509098 86474579 84927535 83802955 83005931 82402088
15303 82402088 81951557 81731018 81764731 81880697 81821716 81374806 80417786 79049344 77558619
15294 77558619 76148920 74743926 73269614 71971410 71139004 70736587 70546123 70448149 70538966
15285 70538966 70991502 71748440 72518986 73151794 73884589 75144339 77054624 79301293 81656771
15276 81656771 84356740 87797276 92155497 97519588 103979759 111446313 119699785 128645226
15268 128645226 138414188 149266340 161193914 173716098 186129513 197838841 208466246
15261 208466246 217626785 224621608 228512164 228661803 225134704 218567664 209854871 199677453
15253 199677453 188428307 176535963 164394271 152041483 139439313 127146764 115977823
15246 115977823 106250765 97876934 90856825 85396854 81665236 79375988 77693125 75697822
15238 75697822 72779809 68780746 63908744 58665426 53778410 49856540 47049973 45030063
15230 45030063 43193798 40872579 37676560 33955495 30553523 28084918 26709486 26069106
15222 26069106 25563885 24913919 24164824 23423656 22850976 22534446 22276771 21805779 20883175
15213 20883175 19402100 17674658 16309394 15637755 15508225 15654655 15872613 15963447 15762417
15204 15762417 15097769 13859609 12187712 10427803 8886974 7772417 7273251 7576208
15196 7576208 8703106 10429311 12318947 13774233 14369020 14212969 13844140 13775667 14150275
15187 14150275 14727594 15262601 15912518 16974456 18346546 19589250 20302942 20409246 20193359
15178 20193359 20018912 20006851 19957676 19608701 19077043 18769992 18815289 18949103 18871929 18544416
15168 18544416 18191270 18005001 17987188 17958688 17524745 16484240 15140329 14067697 13705199
15159 13705199 14039113 14854908 16054668 17482154 18807364 19715565 20069006 19884288 19278994
15150 19278994 18409739 17373210 16206122 14902229 13494386 12040222 10561557 9069648
15142 9069648 7546106 6061581 5010456 4778093 5172997 5498036 5290260 4717676 4198034
15133 4198034 3996352 4021634 3946648 3546419 2773866 1815840 1008516 465530 206814 414364
15123 414364 1183423 2237989 3125835 3676807 4073746 4403642 4493564 4321886 4227934 4557949
15113 4557949 5244525 5799382 5949087 5926872 5993588 6225063 6498078 6583305 6415991 6125998
15103 6125998 5746872 5240735 4813509 4805795 5317792 6117490 7016409 7985364 8802960 9222135
15093 9222135 9350969 9427363 9425701 9175208 8750851 8490544 8613935 9049929 9566745 9969842
15083 9969842 10258856 10490258 10461287 9906185 8912027 7758263 6679549 5963624 5850754
15074 5850754 6313425 7217251 8473543 9829178 10774773 10889472 10190315 8919952 7388437
15065 7388437 6059438 5258889 4815627 4339014 3741077 3178038 2724919 2284121 1725835
15056 1725835 1298612 1324407 1639286 2052172 2651125 3464637 4402874 5343870 6090135 6594349
15046 6594349 6907956 6912574 6648742 6393435 6161854 5742928 5091309 4396688 3854257 3536870
15036 3536870 3368905 3182480 2963988 2831644 2862035 3099078 3490394 3888790 4072845 3788113
15026 3788113 2993035 2005428 1161747 538866 182099 78567 31262 -220650 -814427 -1816203
15016 -1816203 -3104662 -4184934 -4595629 -4330091 -3719169 -3072504 -2524887 -2040510 -1441320
15007 -1441320 -667291 62273 545375 733274 754278 779116 714832 468870 376594 756050
14997 756050 1340261 1728446 1871194 1902077 1931730 1924191 1880517 1999653 2344639 2707323
14987 2707323 2899948 3004090 3238558 3639251 4135925 4593111 4620405 3935252 2903715
14978 2903715 2257764 2282988 2726839 3303638 3939952 4560692 5147061 5866138 6746407 7615176
14968 7615176 8317646 8887086 9441371 9960116 10350159 10571196 10579297 10310084 9775249 9242619
14958 9242619 9015472 9022703 8920294 8526432 8113062 8282761 9363040 10989958 12502398
14949 12502398 13542767 14049920 14118650 14038535 14034486 14067747 14050967 13916116 13576945 13022497
14939 13022497 12396284 11850692 11305478 10642950 10035013 9602866 9118739 8368640 7403491
14930 7403491 6368650 5396211 4657532 4300063 4353248 4635570 4768610 4579492 4418027
14921 4418027 4777513 5658466 6538817 6913647 6572680 5659406 4538620 3530221 2766480
14912 2766480 2219432 1878407 1839438 2145147 2586803 2812306 2718565 2451350 2116098 1844945
14902 1844945 1900110 2449339 3388157 4427201 5249879 5778378 6152858 6372883 6358548 6310319
14892 6310319 6444547 6649843 6757987 6706584 6534407 6388481 6240934 5846780 5109546 4216931
14882 4216931 3418438 2710657 2082175 1802535 2105347 2893177 3897122 4815220 5284139
14873 5284139 5163948 4635508 3929854 3178091 2536688 2254499 2491314 3155801 3908168
14864 3908168 4339029 4312896 4066019 3817904 3513959 3117537 2774684 2658304 2732127 2718963
14854 2718963 2386091 1776862 1116262 461318 -223171 -761376 -936751 -921334 -1101220 -1575182
14844 -1575182 -2169396 -2522394 -2278858 -1511029 -718211 -317199 -355513 -707015 -1175911 -1319760
14834 -1319760 -733479 312480 1086277 1249511 1159307 1216930 1399045 1499579 1452136 1331985
14824 1331985 1344623 1896286 3221205 4901740 6331982 7462129 8569486 9678780 10560418
14815 10560418 11064932 11248664 11173810 10854618 10460618 10279540 10540610 11320049 12258084
14806 12258084 12571567 11708306 9869478 7851694 6372707 5589613 5283312 5278668 5466669
14797 5466669 5538550 5131731 4176495 2814374 1297449 17566 -771919 -1309802 -1995246
14788 -1995246 -2843030 -3612663 -4125025 -4267815 -3883965 -2806559 -1150922 753096 2712416
14779 2712416 4565854 6189882 7736566 9395902 11015468 12158621 12585007 12610249 12745858
14770 12745858 13080685 13405277 13675053 13960172 14067591 13567762 12248771 10287901 8120982
14761 8120982 6262838 5078907 4625774 4693250 4939078 4994642 4585474 3637329 2154412
14752 2154412 131507 -2131779 -4027654 -5150255 -5558394 -5577479 -5603594 -5785789 -5797099
14743 -5797099 -5256740 -4100560 -2539948 -897100 589035 1738497 2419960 2653881 2698260
14734 2698260 2707694 2540125 2112797 1497383 931960 810192 1360990 2264424 2883200 2832472
14724 2832472 2349405 2130075 2703866 4149131 6114084 7838674 8567436 8175821 7076237
14715 7076237 5650792 4267457 3359330 3220153 3773734 4591342 5293213 5761434 6016792
14706 6016792 6078244 6021400 5989318 5986328 5849011 5515822 5082337 4650430 4286765 4061768
14696 4061768 3869520 3455374 2750441 1856325 875992 -57667 -742358 -1146465 -1411769
14687 -1411769 -1434041 -888724 257470 1653878 2993722 4161905 5049542 5599864 5831864
14678 5831864 5666115 5067909 4172840 3194471 2324340 1521356 578669 -555837 -1693610
14669 -1693610 -2624684 -3166995 -3178277 -2659533 -1616477 -12597 2020582 4088509 5770736
14660 5770736 6835468 7335072 7633622 8147603 9029094 10177026 11477620 12907930 14472611
14651 14472611 15998410 17210994 18190030 19278570 20514076 21563614 22144543 22260706
14643 22260706 22181441 22209281 22396754 22535460 22385908 21918592 21322338 20553031 19310837
14634 19310837 17593847 15786670 14112277 12468502 10899632 9836670 9678882 10356399
14626 10356399 11650861 13450129 15423847 16864004 17201216 16553957 15541718 14574021
14618 14574021 13451667 11696452 9321491 7016543 5341298 4322605 3832122 3952170
14610 3952170 4777051 5959175 6850356 7039593 6627991 5968330 5365036 5003500 5132733
14601 5132733 5912784 6965869 7734937 8138525 8476447 8961951 9594192 10257392 10927194
14592 10927194 11614474 12188822 12499312 12436000 12025618 11546652 11349561 11543995 11960102
14583 11960102 12338111 12491811 12407143 12265232 12382751 12981690 14076949 15383931 16283758
14574 16283758 16238038 15069368 12980860 10556439 8453788 7061041 6474584 6464124 6538553
14565 6538553 6301908 5678972 4749419 3525484 2242103 1491013 1544024 2032598 2315090
14556 2315090 2063007 1630533 1475228 1466662 1242938 753092 213271 39389 661055 2013237
14546 2013237 3584638 5052684 6426519 7643386 8501505 8914385 8967533 8881752 8717344
14537 8717344 8339633 7645767 6631335 5511820 4674874 4349916 4358770 4244993 3886628
14528 3886628 3441916 2816703 1913153 989682 397715 280783 530923 772618 573838
14519 573838 -144852 -957242 -1401156 -1416238 -1156930 -768239 -446687 -479571 -968153 -1559330
14509 -1559330 -1645866 -826864 766246 2707051 4631183 6175384 7034573 7216627 6842325
14500 6842325 5997197 4872677 3712348 2708507 1978541 1480983 1059962 748101 828726
14491 828726 1543885 2880523 4569704 6137917 7117326 7255417 6617836 5526945 4339087
14482 4339087 3351068 2680330 2127706 1562777 1192988 1174326 1394709 1635576 1662784 1200419
14472 1200419 62165 -1722391 -3782318 -5651099 -7233581 -8682812 -9925417 -10684618
14464 -10684618 -10807155 -10316700 -9261742 -7844010 -6438919 -5298363 -4367859 -3346648
14456 -3346648 -1918063 -248556 1065997 1759755 2118643 2536254 3056354 3325969 3038507
14447 3038507 2339127 1682945 1498861 1871613 2336080 2271085 1514800 431448 -431727
14438 -431727 -690158 -416952 68906 654675 1384585 2092637 2381743 2067539 1317871 260698
14428 260698 -1125147 -2570956 -3484629 -3615794 -3390179 -3421978 -3968152 -4985851 -6320153
14419 -6320153 -7594706 -8307596 -8233141 -7527541 -6571472 -5728607 -5096811 -4587129 -4184528
14410 -4184528 -4105263 -4542544 -5112784 -5195437 -4670122 -3784579 -2734659 -1619188 -516428
14401 -516428 556391 1457315 1990896 2226537 2365725 2591526 3028499 3454760 3251444
14392 3251444 2010215 -165803 -2794886 -5159920 -6625947 -7156338 -7264023 -7406174 -7772324
14383 -7772324 -8206118 -8302751 -7769729 -6668756 -5260849 -3704724 -2060659 -441291 980614
14374 980614 2058088 2772313 3285852 3935060 4831463 5458430 5227546 4205352 2891838
14365 2891838 1662484 731581 328685 614561 1425175 2148606 2078934 1045287 -510589
14356 -510589 -2075959 -3330979 -4106599 -4317381 -3923232 -3062442 -2046741 -1113666 -405220
14347 -405220 80327 512199 958318 1328047 1611838 1897700 2151705 2229651 2053820 1574327
14337 1574327 851195 100549 -469243 -735106 -540252 144150 1170738 2452956 3619279
14328 3619279 4030246 3467943 2273111 1004460 140988 -69096 409908 1435704 2567342
14319 2567342 3390550 3801860 3795702 3444779 3109675 3088702 3153379 2864542 2199255 1606076
14309 1606076 1486518 1893844 2721720 3841644 4931708 5653660 6009881 6238628 6468020
14300 6468020 6612793 6594649 6399727 5864984 4807732 3321663 1831437 788892 447728
14291 447728 888467 1924107 3094521 4031156 4695979 5029191 4852507 4137540 2936867
14282 2936867 1416889 -153373 -1705998 -3196400 -4182903 -4157687 -3394719 -2829229 -3082637
14273 -3082637 -3962986 -4761817 -5002910 -4691164 -4077292 -3606405 -3732092 -4523811 -5606944
14264 -5606944 -6489161 -6965003 -7224638 -7530976 -7934823 -8248419 -8164675 -7520268 -6568212 -5740412
14254 -5740412 -5281206 -5149024 -5064957 -4667573 -3700255 -2236754 -674548 522801 1124945
14245 1124945 1346959 1523286 1633528 1476970 1157875 1060938 1279132 1447779 1138100 329833
14235 329833 -476468 -777802 -510108 123449 951213 1836013 2590194 3014723 3037172 2735927
14225 2735927 2248601 1782552 1488798 1421912 1574809 2088015 3118611 4497829 5845458
14216 5845458 6981484 8010417 9031356 10026127 10775474 10963477 10498781 9583524 8487462
14207 8487462 7363373 6282576 5235914 4193324 3273649 2625452 2234352 2151155 2630626
14198 2630626 3643475 4787311 5658669 6013159 5941217 5821652 5976951 6422395 6844585
14189 6844585 6828978 6329318 5782897 5582980 5710400 6032622 6495462 6966459 7352791 7842118
14179 7842118 8726662 10003052 11133898 11407587 10669965 9219159 7280957 5197267 3497460
14170 3497460 2487173 2114618 2180868 2451527 2753719 2976452 2984782 2746078 2313915 1647079
14160 1647079 804308 148445 41469 605936 1795772 3332423 4621258 5085298 4615444
14151 4615444 3628651 2626808 1847721 1227349 622259 43909 -508122 -1105686 -1712142
14142 -1712142 -2261956 -2645195 -2517986 -1629905 -304751 799215 1302506 1143373 551587
14133 551587 47921 -90869 66807 441788 879747 1206840 1416769 1747102 2539821 3759267
14123 3759267 4863109 5466484 5644261 5442342 5016306 4802645 4992429 5389508 5898958
14114 5898958 6550532 7080591 7114776 6729422 6417315 6437341 6558899 6585840 6549389 6525802
14104 6525802 6683189 7136266 7866094 8707215 9359005 9609564 9337591 8538114 7436437
14095 7436437 6472999 5972219 5809555 5667663 5297354 4599728 3916648 3757048 4074315
14086 4074315 4381712 4424679 4391543 4606241 5108980 5530610 5503205 4912150 3698129 2057478
14076 2057478 572453 -401935 -1043353 -1614830 -2188385 -2607255 -2587537 -2085581 -1441360
14067 -1441360 -1013801 -825577 -655741 -413716 -309490 -554315 -1057180 -1575090 -1918972
14058 -1918972 -1986275 -1866229 -1747254 -1626822 -1380197 -1097935 -990172 -1082165 -1188131 -1042575
14048 -1042575 -479410 329732 969325 1254717 1293518 1292032 1607338 2490585 3647678 4295759
14038 4295759 3935931 2910223 1932696 1436616 1335613 1342640 1321954 1333099 1446454 1506884
14028 1506884 1260761 753645 367498 455333 970168 1466567 1378343 394423 -1251429 -3078772
14018 -3078772 -4743938 -6098845 -7106438 -7739772 -7860664 -7268520 -6005993 -4521770 -3303611
14009 -3303611 -2466544 -1999061 -1989035 -2353188 -2819523 -3198246 -3423142 -3501515 -3599868 -4057295
13999 -4057295 -4986155 -6090051 -7155620 -8112273 -8715027 -8802875 -8549673 -8157599 -7668883
13990 -7668883 -6916700 -5575475 -3472985 -843140 1777997 3854617 4963453 4940336 4052685
13981 4052685 2792262 1614217 816904 502513 566346 878628 1419895 2098243 2600592
13972 2600592 2576634 1974272 1078947 29044 -1313659 -2919341 -4383351 -5226459 -5379532
13963 -5379532 -5220703 -5177406 -5400770 -5658398 -5454333 -4402031 -2490272 -178858 1914990
13954 1914990 3371179 4149063 4374531 3986758 2956512 1617282 466218 -112366 119843
13945 119843 1091213 2470684 3988473 5309011 5984991 5834274 4975810 3806828 2804600
13936 2804600 2206279 2012569 2166650 2547999 2819495 2753299 2560662 2517977 2623148 2671174
13926 2671174 2540611 2358257 2314536 2376174 2404254 2544504 3022365 3673301 4164833 4381555
13916 4381555 4505957 4780851 5241425 5667380 5933699 6389046 7521792 9345697 11221139
13907 11221139 12301707 12212767 11325133 10385767 9801945 9360530 8626873 7375456 5771685
13898 5771685 4229838 3068792 2354262 2077871 2187302 2527810 2951454 3305946 3373954
13889 3373954 3068323 2615504 2355961 2431037 2784223 3303147 3854425 4393086 4974601 5559485
13879 5559485 6038720 6233731 5884620 4950206 3758241 2740686 2001264 1362808 833239
13870 833239 582198 674579 1026553 1408789 1477586 1033415 282685 -395256 -740584 -664705
13860 -664705 -331435 -98308 -143760 -352306 -530249 -638730 -793871 -894648 -652466 -53099
13850 -53099 610232 1013559 1009564 826191 795988 807595 480718 -335230 -1499276 -2691058
13840 -2691058 -3607234 -4079105 -4024344 -3429433 -2367609 -930994 668952 1991422 2690683
13831 2690683 2778854 2409727 1668564 670806 -242668 -767917 -1098427 -1715941 -2887643
13822 -2887643 -4514020 -6222271 -7499730 -7937474 -7391932 -6026490 -4236244 -2318431
13814 -2318431 -506507 716626 931382 216754 -1020427 -2478439 -3987329 -5271922
13806 -5271922 -6139010 -6728008 -7417472 -8340281 -9002009 -8891573 -8145595 -7294881 -6736386
13797 -6736386 -6663725 -7161743 -7959065 -8546831 -8629961 -8292375 -7811344 -7359967 -7082631 -7015104
13787 -7015104 -6827319 -6060016 -4639681 -3104278 -2142354 -1954215 -2068161 -1843642 -1094268
13778 -1094268 -144542 606308 1154018 1814158 2850267 4305940 5870581 7192516 8274719
13769 8274719 9208561 9796873 9699789 8746645 6954651 4623566 2338143 560916 -433198
13760 -433198 -361456 847864 2812949 4966088 6920532 8402013 9169639 9182852 8641590
13751 8641590 7827884 6907325 5958668 5050567 4138364 2983357 1379077 -392594 -1622763
13742 -1622763 -1889912 -1466824 -860812 -231365 443512 937297 937728 471048 -217997 -1044694
13732 -1044694 -1935985 -2597338 -2848963 -2817657 -2759733 -2992250 -3680380 -4621935 -5387683 -5703410
13722 -5703410 -5653943 -5420903 -4943803 -4198895 -3462728 -2930513 -2571423 -2396706 -2509383 -2901407
13712 -2901407 -3407520 -3903433 -4440836 -5139471 -5917222 -6495261 -6538636 -5817317 -4380416
13703 -4380416 -2527492 -789720 220076 200607 -620999 -1759599 -2877743 -3834943 -4659376
13694 -4659376 -5611905 -6849516 -8090379 -8919501 -9230173 -9150809 -8669101 -7662552 -6275445
13685 -6275445 -4924382 -3957753 -3401384 -2978950 -2395554 -1676373 -1073561 -734909 -633677
13676 -633677 -760182 -1072437 -1340018 -1314466 -868678 -22742 971786 1762182 2199234 2401722
13666 2401722 2410002 2118784 1631968 1336502 1470847 1770671 1916230 1746072 1063130 -199666
13656 -199666 -1718531 -3136204 -4371231 -5312962 -5845703 -6117985 -6399594 -6978983 -7973362
13647 -7973362 -9036071 -9604375 -9291400 -7984427 -5975857 -3908221 -2363818 -1515763 -1268698
13638 -1268698 -1403027 -1414849 -801417 358887 1552939 2481954 3317648 4298948 5406182
13629 5406182 6573627 7811925 9033336 9866154 9994623 9812153 10013807 10738580 11681963
13620 11681963 12522204 12939010 12696922 11871067 10902365 10392037 10655046 11498656 12492238
13611 12492238 13404911 14273782 15112828 15699357 15886083 15823429 15651650 15339851 14650101
13602 14650101 13412507 11787402 9982108 8130695 6494953 5389573 4878461 4790697
13594 4790697 4960828 5148145 5164327 5161138 5490034 6260897 7239556 8223035 9148816 9839124
13584 9839124 10066955 9839198 9391358 8952994 8663234 8575595 8845921 9758764 11254741
13575 11254741 12816664 13957125 14559060 14602134 13956337 12615496 10725509 8721936 7333762
13566 7333762 7012796 7416283 7714081 7401622 6556247 5566569 4829160 4420331 4061381
13557 4061381 3604797 3208022 2946781 2805758 2854886 2917392 2744450 2475377 2344978 2528101
13547 2528101 3133177 3888340 4323871 4365780 4367048 4602901 5181224 6015704 6752953 6998200
13537 6998200 6690962 6279627 6339577 6974316 7793935 8375097 8530577 8231644 7470716 6232290
13527 6232290 4591323 2763253 1045069 -239710 -897139 -974956 -668463 -161223 542395
13518 542395 1628169 3096919 4511191 5400458 5581493 5144705 4366152 3647024 3373974
13509 3373974 3574940 3941568 4123674 3935257 3490321 2999314 2463049 1843699 1275064
13500 1275064 890072 601655 79469 -1001845 -2453588 -3544148 -3731651 -3188089 -2461989
13491 -2461989 -1908097 -1496771 -917479 -31339 840993 1386551 1678918 1973678 2370427
13482 2370427 2847023 3489985 4435451 5814710 7490650 8947634 9720491 9665450 9116913
13473 9116913 8742459 8918436 9471413 9905318 9785452 9058031 8102844 7418553 7017052
13464 7017052 6416494 5389588 4193738 3228959 2874796 3158216 3581944 3740056 3712310
13455 3712310 3720242 3769683 3701349 3322986 2575945 1702180 880824 -24664 -1063722 -1937046
13445 -1937046 -2400187 -2741111 -3412457 -4302278 -4838517 -4684318 -3931170 -2838654 -1713804
13436 -1713804 -942214 -700341 -920282 -1488695 -2138963 -2565051 -2500939 -1652023 -938
13427 -938 1970485 3664731 4772211 5228659 5130451 4713250 4243188 3900149 3724694 3708090
13417 3708090 3876974 4213794 4577767 4713815 4491727 4032550 3601106 3481814 3830951
13408 3830951 4481902 5064069 5235154 4751472 3666717 2461366 1621876 1254534 1348930
13399 1348930 1896350 2610323 3045658 3036997 2903926 3120412 3859272 5007668 6270708
13390 6270708 7168572 7353753 6827599 5751840 4499058 3588613 3219706 3204364 3316994
13381 3316994 3401930 3131514 2271653 1119342 109301 -541056 -709409 -553657 -402955
13372 -402955 -368776 -461968 -702638 -1015861 -1455196 -2275178 -3478345 -4590776 -4945564 -4202093
13362 -4202093 -2789843 -1490949 -919593 -1462661 -2946740 -4454010 -5028835 -4504999 -3368902
13353 -3368902 -2033970 -661268 587019 1538561 2081539 2260338 2285100 2386887 2528801
13344 2528801 2605610 2622210 2574783 2494260 2311005 1710278 498098 -1112089 -2694318 -3823372
13334 -3823372 -4240748 -3989626 -3294785 -2378615 -1494358 -967582 -1033136 -1599732 -2229622 -2572982
13324 -2572982 -2734956 -2862962 -2854020 -2689388 -2457617 -2189980 -1990094 -2045519 -2396300 -2933783
13314 -2933783 -3584081 -4374940 -5233208 -5823185 -5772659 -4986327 -3552636 -1600850 638969
13305 638969 2821574 4733662 6481168 8128599 9356047 9764420 9323293 8391099 7277429
13296 7277429 5936396 4221655 2267492 402694 -1140615 -2270669 -2853749 -2697152
13288 -2697152 -1785219 -347744 1357107 3065224 4311831 4681972 4251970 3508989 2697100
13279 2697100 1695102 595232 -267637 -597104 -170621 973584 2302999 3267589 3740728
13270 3740728 3721742 3151598 2180909 1111873 160526 -481351 -686596 -694758 -1016887 -1876808
13260 -1876808 -3010464 -4002664 -4701142 -5297941 -5927459 -6480955 -6784501 -6798116 -6524719
13251 -6524719 -5891819 -4785466 -3053695 -742274 1678821 3578588 4638568 4986387
13243 4986387 4958328 4953181 5259836 5892935 6733800 7573638 8096596 8159329 7967960 7779475
13233 7779475 7616181 7309565 6765782 6137673 5720546 5702618 5901257 5944761 5612106 4914275
13223 4914275 4075036 3294717 2697637 2377966 2326221 2563210 3102072 3710072 4085365 4125912
13213 4125912 3853244 3307348 2752539 2686396 3374919 4568599 5810022 6817452 7537783
13204 7537783 7983667 8109691 7867079 7216454 5999229 4086327 1661944 -889701 -3224401
13195 -3224401 -5052314 -6057295 -5991930 -4992459 -3622048 -2354812 -1230104 -5795 1516274
13186 1516274 3229253 4674714 5349407 5268886 4786444 4088829 3267728 2395384 1348851
13177 1348851 51128 -1174832 -1723235 -1058188 860409 3296635 5211317 6079902 5928321
13168 5928321 4896655 3174019 1121490 -958894 -2912207 -4497782 -5566478 -6188834
13160 -6188834 -6315632 -5805842 -4920658 -4259892 -4004978 -3904508 -3826359 -3718438 -3471229 -3071577
13150 -3071577 -2586653 -2104556 -1851467 -2140612 -2891805 -3600533 -3906877 -3778652 -3423389
13141 -3423389 -3151024 -3143717 -3404312 -3829664 -4148448 -4081886 -3716298 -3360190 -3156254 -2994645
13131 -2994645 -2550366 -1687181 -737991 -145103 37166 96160 335827 858274 1445878 1729586
13121 1729586 1468776 700813 -413664 -1696708 -2892763 -3807783 -4335133 -4295170 -3572295
13112 -3572295 -2335784 -996171 193696 1400513 2842512 4464361 5971128 6989221
13104 6989221 7234538 6707661 5669291 4373446 2939307 1450163 -193747 -2148681
13096 -2148681 -4114133 -5463744 -5966769 -5978993 -6144566 -6845824 -7735910 -8320872 -8646442
13087 -8646442 -9090149 -9742935 -10244290 -10227892 -9727931 -9127659 -8793092 -8761216 -8744184 -8457246
13077 -8457246 -7832041 -7105934 -6621561 -6338567 -5935124 -5330235 -4710512 -4194663 -3767945
13068 -3767945 -3407118 -3058436 -2632432 -2222602 -2057336 -2300948 -2936012 -3546239 -3621972 -3081711
13058 -3081711 -2275251 -1579604 -1104250 -833441 -843190 -1269907 -2104030 -3236280 -4400115
13049 -4400115 -5145479 -5230012 -4750183 -3907086 -2943184 -2097062 -1512213 -1267307 -1489516 -2247381
13039 -2247381 -3369740 -4622810 -5727659 -6333251 -6270173 -5876320 -5786920 -6239207 -6906288
13030 -6906288 -7331536 -7363186 -7139278 -6788957 -6141599 -4849033 -2980432 -1035785 729053
13021 729053 2378873 3836615 4907608 5439490 5378025 4819255 4003200 3274961 2807209
13012 2807209 2400434 1747745 818701 -153561 -802759 -826228 -401582 -143201 -357180 -847582
13002 -847582 -1397581 -1871595 -2084280 -1912236 -1505150 -1313964 -1647620 -2296687 -2897066 -3497276
12992 -3497276 -4304489 -5045639 -5298569 -5160501 -5005004 -4949170 -4992564 -5037912 -4755752 -4047860
12982 -4047860 -3333584 -2972003 -2740853 -2294494 -1753446 -1513730 -1745047 -2094128 -1921879
12973 -1921879 -877959 821328 2607538 4075839 5325662 6741058 8482610 10275353
12965 10275353 11619463 12215857 12255460 12128873 11904097 11289237 10152179 8802173 7578993
12956 7578993 6514266 5435015 4145846 2729006 1524917 640352 -172016 -978562 -1502379
12947 -1502379 -1644476 -1619950 -1623754 -1624760 -1405758 -665875 786288 2812327 5104458 7252100
12937 7252100 8801353 9662116 10254386 11103410 12324182 13568867 14373455 14432027 13712910
12928 13712910 12502224 11184496 10025371 9148851 8444367 7616033 6528076 5503208
12920 5503208 4939232 4787995 4812015 4899931 5114041 5449835 5533190 5017121 4126773 3272636
12910 3272636 2480178 1594387 542014 -722965 -2115461 -3278731 -3765052 -3608201 -3397244
12901 -3397244 -3543010 -3822695 -3740856 -3177961 -2435138 -1731091 -1136918 -925226 -1307092 -2056073
12891 -2056073 -2898312 -3837178 -4863350 -5818026 -6732778 -7675373 -8322663 -8377774 -8131444
12882 -8131444 -8101515 -8446596 -8937983 -9131181 -8647889 -7528435 -6167304 -4860529 -3557652
12873 -3557652 -2250466 -1143246 -241616 674649 1674753 2644886 3363333 3585215 3348823
12864 3348823 2973682 2689356 2561697 2716119 3228077 3710185 3635651 3154025 2811913 2736711
12854 2736711 2840467 3228084 3941008 4845226 5835886 6729180 7204644 7021720 6233174
12845 6233174 5061485 3749043 2689621 2293889 2530602 2870905 2756568 2072041 1152423
12836 1152423 335158 -481726 -1574940 -2705649 -3320631 -3303476 -2900213 -2237362 -1261482
12827 -1261482 -97230 716731 583119 -614832 -2426855 -4181525 -5424470 -6209205 -6868950
12818 -6868950 -7551324 -8385300 -9645614 -11254144 -12622337 -13109008 -12367753 -10557078 -8378312
12809 -8378312 -6716797 -6117712 -6578425 -7736383 -8898308 -9546621 -9799019 -9981640 -9981516
12800 -9981516 -9383287 -7967908 -5815522 -3333534 -1090848 562778 1563638 1951587
12792 1951587 1696151 766437 -656063 -2224407 -3525911 -4166375 -4020811 -3364744 -2668902
12783 -2668902 -2372560 -2606326 -3066233 -3375787 -3407493 -3122842 -2404416 -1250110 74180
12774 74180 1269921 2219342 2884686 3219906 3307608 3269423 3042662 2574330 2058705 1699248
12764 1699248 1463895 1299024 1192208 1143167 1216383 1572062 2353025 3414059 4401992 5069544
12754 5069544 5395120 5483346 5375700 5098193 4749592 4517120 4462877 4482454 4421698 4147843
12744 4147843 3674396 3195674 2875706 2677124 2528429 2318987 1800559 781577 -588354
12735 -588354 -1896460 -2756393 -3062899 -3045706 -2943825 -2844964 -2794833 -2705853 -2210144 -958402
12725 -958402 887412 2875512 4790143 6617216 8198455 9114313 9089233 8304646 7087246
12716 7087246 5635419 4060155 2489496 973750 -521120 -1816033 -2612978 -2793396
12708 -2793396 -2478638 -1935361 -1476340 -1303151 -1314150 -1254497 -875707 -148763 547167 864025
12698 864025 983436 1339518 2017322 2822384 3565851 4094452 4365837 4434347 4243000 3738099
12688 3738099 3065192 2412966 1968817 1928813 2381958 3132662 3789195 4090339 3969952 3345924
12678 3345924 2161827 721019 -388687 -603014 370189 2188307 3982393 4986899
12670 4986899 5013451 4288630 3078396 1670322 411428 -530047 -1133008 -1464962 -1664704
12661 -1664704 -1708619 -1510601 -1209382 -1001422 -804943 -514330 -305474 -274013 -122150 463170
12651 463170 1302823 1986225 2390141 2566896 2597612 2632201 2585534 2076055 964081 -435460
12641 -435460 -1796605 -3136936 -4634184 -6167716 -7276385 -7616541 -7208022 -6398585 -5696253
12632 -5696253 -5318345 -5220173 -5453878 -5885319 -6041809 -5614900 -4635394 -3266774 -1868255
12623 -1868255 -967933 -879796 -1515175 -2495451 -3377195 -3913376 -4094257 -4152455 -4491814 -5286278
12613 -5286278 -6294180 -7083882 -7360259 -7202846 -6851843 -6210909 -4794256 -2363816 669048
12604 669048 3632894 5910848 7074513 7071177 6278184 5231217 4310953 3687258 3405526
12595 3405526 3477323 3813687 4324660 4949402 5479085 5675097 5353659 4299621 2483997
12586 2483997 282561 -1567191 -2439186 -2289799 -1587601 -846392 -175227 486400 861545
12577 861545 616778 -15435 -462554 -426143 -128146 -139542 -786378 -1806337 -2785194 -3563779
12567 -3563779 -4200714 -4887863 -5588132 -5957446 -5682053 -4560097 -2621881 -337127 1683573
12558 1683573 3234041 4411475 5346772 6200573 6914214 7204549 7097573 7005696 7004324 6715925
12548 6715925 6021471 5246151 4611343 4028411 3377396 2696653 1992681 1070632 -76822
12539 -76822 -1026039 -1319195 -936639 -375720 -80780 50594 198489 252802 249147 581067
12529 581067 1548872 2843441 3736646 3886662 3559569 3037413 2449775 2151404 2491626
12520 2491626 3396363 4563106 5590156 6103555 6006305 5483597 4854852 4553983 4822715
12511 4822715 5405069 5777178 5481858 4382027 2723008 927879 -763914 -2285124 -3593763
12502 -3593763 -4792948 -5922265 -6679934 -6809068 -6511375 -6208468 -6136060 -6219106 -6361470
12493 -6361470 -6699182 -7287826 -7979409 -8647369 -9155316 -9382083 -9514354 -9866559 -10312132
12484 -10312132 -10440944 -10119325 -9525607 -8772832 -7934131 -7150335 -6411310 -5664692 -4917740
12475 -4917740 -4164501 -3473041 -3017077 -2894586 -3122621 -3678752 -4373708 -4958616 -5276824
12466 -5276824 -5298828 -5094502 -4636028 -3797936 -2566213 -951971 1044914 3038870 4366255
12457 4366255 4708184 4363713 3904034 3457696 2638087 1248811 -484970 -2251583 -3818744
12448 -3818744 -5064716 -5944833 -6402962 -6391725 -5972402 -5410048 -4947796 -4507087 -3966390
12439 -3966390 -3437573 -3049287 -2832831 -2737636 -2588123 -2105594 -1133047 167471 1476069
12430 1476069 2672370 3705949 4286224 4323604 4166567 4007896 3677340 3153942 2800703
12421 2800703 2912185 3389446 4053530 4868037 5686085 6173298 6200426 6012326 5928271 6055015
12411 6055015 6224534 6322805 6365496 6166065 5455578 4346292 3220351 2311962 1706117
12402 1706117 1509675 1811755 2534816 3453860 4313138 4770867 4477069 3343731 1591444
12393 1591444 -384272 -2120948 -3171376 -3347488 -2845138 -2020534 -1246574 -757971 -513362
12384 -513362 -411033 -681344 -1713860 -3557588 -5806088 -7841076 -9323545 -10294943 -10846729
12375 -10846729 -10994190 -10695574 -9911617 -8811658 -7672724 -6648601 -5812800 -5211679 -4943703
12366 -4943703 -5160110 -5706382 -6146596 -6315203 -6453175 -6600446 -6342435 -5468039 -4341979
12357 -4341979 -3438011 -2768197 -2023113 -1013192 321242 1934041 3543978 4744373 5337407
12348 5337407 5452644 5373892 5455712 5852126 6279059 6262355 5509061 4068223 2344424 745146
12338 745146 -618971 -1644427 -2103488 -1944068 -1392387 -753899 -338640 -508673 -1509779
12329 -1509779 -3174461 -4976696 -6468223 -7676287 -8778959 -9629970 -9998471 -9826565 -9196773
12320 -9196773 -8366797 -7706064 -7329358 -6941042 -6209935 -5085541 -3792569 -2589271 -1582606
12311 -1582606 -876111 -583849 -639287 -906851 -1478961 -2595125 -4283888 -6353189 -8507958
12302 -8507958 -10416352 -11908283 -12996283 -13561174 -13351142 -12453629 -11317367 -10272470 -9270580
12293 -9270580 -8019132 -6367773 -4689182 -3612458 -3247038 -3071946 -2555755 -1568719 -360415
12284 -360415 610460 1023158 894296 362319 -340912 -659942 -278312 478288 1104543 1238803
12274 1238803 735342 -279004 -1369219 -1948876 -1659077 -570166 892477 2324199 3700936
12265 3700936 5172749 6529209 7274107 7236592 6607589 5640721 4478330 3064305 1404930
12256 1404930 -356840 -2099840 -3442701 -3719342 -2720238 -1013089 592190 1645778
12248 1645778 2085744 1974331 1396707 363786 -992597 -2204399 -2736211 -2351481 -1299580
12239 -1299580 -148135 808995 1595914 2173267 2534272 2772763 3036321 3461852 3985229
12230 3985229 4432571 4678500 4703210 4712389 4883559 4980176 4763538 4395927 4097362 3952687
12220 3952687 3926624 3772834 3183723 2062281 605618 -887419 -2252592 -3250241 -3523239
12211 -3523239 -3144088 -2629018 -2267707 -1930142 -1459111 -774988 262825 1667399 3046902
12202 3046902 3908856 4202388 4096312 3722168 3368389 3216085 3027334 2395174 1235686
12193 1235686 -71711 -1142941 -1958568 -2613828 -3234063 -4027087 -4952218 -5750903 -6201894
12184 -6201894 -6244804 -6055741 -5968992 -6269094 -6971539 -7812413 -8491820 -8877273 -8979142 -8791039
12174 -8791039 -8220177 -7289130 -6127110 -4836417 -3563165 -2468342 -1630680 -936193 -168470
12165 -168470 649142 1299028 1691252 1919040 1890904 1237444 -165816 -1932618 -3466436
12156 -3466436 -4352914 -4505486 -4008829 -3207787 -2594432 -2408417 -2636662 -3065091 -3297275
12147 -3297275 -2997669 -2339999 -1963149 -2241504 -2939871 -3470792 -3322463 -2375653 -928076
12138 -928076 530151 1705184 2722854 4013307 5800013 7778804 9514416 10755405
12130 10755405 11158834 10381218 8483092 5911895 3384299 1545478 523408 -97510
12122 -97510 -871742 -1934449 -2882504 -3318353 -3363711 -3461146 -3879471 -4567167 -5307417 -5911131
12112 -5911131 -6158471 -5747872 -4642338 -3414127 -2692232 -2477658 -2315471 -1779185 -772767
12103 -772767 452629 1457465 1862978 1670644 1171635 510944 -345246 -1220980 -1672653
12094 -1672653 -1506264 -983614 -529790 -421639 -648323 -938070 -927083 -487384 187196 851309
12084 851309 1270910 1267442 942048 611084 404763 77407 -636193 -1560436 -2194595 -2263238
12074 -2263238 -2144348 -2482818 -3588316 -5216419 -6680608 -7280185 -6716853 -5166215 -2932874
12065 -2932874 -231938 2597618 5079293 7047083 8629412 9774227 10392144 10698736
12057 10698736 11047922 11548908 12008846 12243741 12196799 11781675 10952060 9770978 8469059
12048 8469059 7360722 6590122 6049118 5425313 4597556 3723302 2914120 2109828 1203794
12039 1203794 232324 -688422 -1510335 -2154759 -2485969 -2507520 -2464293 -2731335 -3373103 -3873556
12029 -3873556 -3512798 -1994116 161328 1975475 2893365 3126225 3244418 3577473 4017651
12020 4017651 4213147 3979063 3564228 3194497 2790636 2332116 2005163 1920823 2091083 2475470
12010 2475470 2910467 3273738 3455294 3230031 2446965 1280351 111231 -849060 -1621379
12001 -1621379 -2296474 -2933207 -3500541 -3856741 -3928372 -3862910 -3876919 -3909719 -3603883 -2673532
11991 -2673532 -1235007 161982 1033071 1262493 865588 11167 -966388 -1932516 -2879940
11982 -2879940 -3517906 -3721883 -3883510 -4359068 -5142770 -5966498 -6533770 -6705350 -6540263
11973 -6540263 -6232033 -5934758 -5651708 -5360874 -5168327 -5140224 -5063123 -4737210 -4232559 -3729647
11963 -3729647 -3403034 -3119474 -2498901 -1675509 -1151129 -993771 -1039803 -1218502 -1322151 -1097742
11953 -1097742 -706271 -592055 -796852 -1044264 -1334459 -1862710 -2655816 -3503043 -4084922
11944 -4084922 -4244874 -3990935 -3299985 -2313056 -1402947 -785670 -344719 -28444 888 -180466
11934 -180466 -154723 111595 105023 -449251 -1357665 -2226482 -2688846 -2644536 -2201796 -1518361
11924 -1518361 -693252 206949 1022400 1534467 1620407 1418182 1318366 1577582 2061592 2516783
11914 2516783 2816616 2884644 2528065 1566193 135830 -1496040 -3223061 -4767194 -5614744
11905 -5614744 -5728901 -5790019 -6456715 -7796284 -9304901 -10206630 -10133254 -9351661 -8265861
11896 -8265861 -7091798 -5860003 -4693680 -3844262 -3480005 -3549538 -3719041 -3790002 -3693627
11887 -3693627 -3072850 -1807344 -503126 101472 -151054 -919487 -1835710 -2694655 -3412318
11878 -3412318 -3977316 -4283296 -4104162 -3374450 -2322052 -1274231 -412777 149774 266973
11869 266973 16948 -373392 -797620 -1085543 -1032324 -783345 -772268 -1285112 -1969249 -1984898
11859 -1984898 -786357 1520562 4375335 7059517 9073479 10384682 11145097 11455137
11851 11455137 11417094 11061640 10421157 9701445 9160239 8847757 8624292 8247050 7466806
11842 7466806 6272845 4973815 3903396 3321638 3406567 4073481 4920238 5502639 5648160
11833 5648160 5410694 4885086 4144599 3424996 3060952 3069685 3158031 3127509 3063152 3161470
11823 3161470 3462462 3918510 4521300 5163804 5636028 5772640 5498661 4976573 4523793
11814 4523793 4270740 4046924 3495375 2321653 727964 -659686 -1550206 -2175413 -2745189
11805 -2745189 -3065618 -2782937 -1932545 -1008766 -454189 -200758 309318 1567300 3337533
11796 3337533 4696522 4917906 4042761 2580111 1145946 351974 442707 905688 924511
11787 924511 285311 -516278 -827934 -431277 274946 806103 1066260 1237674 1401934 1423357
11777 1423357 1207162 748100 91955 -500791 -679186 -321775 318401 815087 962562
11768 962562 819988 491984 -33552 -795223 -1777956 -2995318 -4350896 -5480680 -6161434
11759 -6161434 -6542279 -6672726 -6458154 -6048631 -5772018 -5826761 -6214868 -6794064 -7247477 -7274224
11749 -7274224 -7011110 -6861917 -6828146 -6498789 -5590977 -4245659 -2959548 -2126461 -1827667
11740 -1827667 -2079647 -2960754 -4456878 -6238598 -7717192 -8380533 -8053900 -6937631 -5477838
11731 -5477838 -4095096 -3031354 -2458124 -2443521 -2861262 -3431024 -3733174 -3452603 -2770205
11722 -2770205 -2162917 -1928188 -2218550 -3087222 -4245912 -5156169 -5346378 -4821244 -4122642
11713 -4122642 -3675582 -3475382 -3494835 -3773954 -4139640 -4243268 -3809628 -2818122 -1616164
11704 -1616164 -876633 -1132154 -2298966 -3997207 -5908913 -7695173 -8810890 -8797155 -7912131
11695 -7912131 -6895784 -6042651 -5132882 -4139261 -3408523 -3199172 -3271029 -3151899 -2651579
11686 -2651579 -1798601 -680847 486878 1470079 2200731 2741676 3080265 3106242 2786424
11677 2786424 2386375 2206073 2149108 2019035 1852894 1745523 1689606 1704906 1862425 2039007
11667 2039007 2034708 1928255 2127968 2937516 4022518 4646483 4379092 3340530 1916518
11658 1916518 456094 -798151 -1758119 -2500347 -3047829 -3248355 -2951548 -2164757 -1023655
11649 -1023655 231875 1323949 2129350 2549080 2376152 1651085 788509 197547 -83109
11640 -83109 -492531 -1576141 -3399260 -5481095 -7286376 -8621243 -9531436 -10031299 -10148584
11631 -10148584 -9893904 -9045067 -7396027 -5201246 -3034554 -1168269 407171 1528629
11623 1528629 2083506 2210360 2096747 2095758 2694054 3912383 5255424 6282077 6885360
11614 6885360 7197351 7345465 7176154 6488823 5449547 4351920 3317856 2295341 1235373
11605 1235373 120631 -1056430 -2121527 -2753398 -2858701 -2715728 -2630493 -2547771 -2253317
11596 -2253317 -1797112 -1546480 -1897224 -2870330 -4065344 -4813494 -4550441 -3178637 -1158188
11587 -1158188 862051 2506944 3485624 3465526 2429968 792347 -900022 -2157560 -2740960
11578 -2740960 -2821955 -2676185 -2408647 -2022099 -1413974 -491245 543405 1376638 2024744
11569 2024744 2685983 3271755 3659410 4130359 5055872 6324543 7451591 8086661 8057676
11560 8057676 7325825 6066419 4666829 3488272 2627324 1995706 1602520 1579489 1921993
11551 1921993 2444602 2944350 3327270 3639169 3871759 3821962 3260621 2041628 314203
11542 314203 -1498950 -2868536 -3355010 -3058074 -2585953 -2420677 -2582713 -2977813 -3642279
11533 -3642279 -4644392 -6031481 -7816391 -9958697 -12317278 -14572332 -16442527 -17757014
11525 -17757014 -18345033 -18150131 -17208533 -15611165 -13619245 -11629804 -9997088 -8978028
11517 -8978028 -8664684 -8872783 -9439671 -10358486 -11495944 -12535167 -13114180 -13056387 -12504170
11508 -12504170 -11707888 -10703309 -9457525 -8167493 -7241044 -6985777 -7274596 -7605797 -7599476
11499 -7599476 -7378933 -7165741 -6787282 -6022441 -4893919 -3576129 -2340787 -1518442 -1209591
11490 -1209591 -1196008 -1278874 -1307551 -1050831 -528601 -156108 -181302 -366662 -440504 -493614
11480 -493614 -858270 -1552991 -2030321 -1812777 -1138336 -675326 -806413 -1232376 -1389680 -1162059
11470 -1162059 -810062 -573199 -555675 -723292 -984390 -1269400 -1554531 -1895727 -2309049 -2492230
11460 -2492230 -2126150 -1437290 -981608 -959494 -1096024 -1076216 -680048 -12076 482292 583780
11450 583780 515922 606932 1083656 1842856 2510872 2877579 2878478 2450099 1719597 958644
11440 958644 307565 -292977 -863128 -1294026 -1587649 -1936423 -2500059 -3248266 -3961419 -4368544
11430 -4368544 -4350009 -3896898 -3038947 -1928381 -779962 236974 968981 1382303 1623194
11421 1623194 1691214 1494512 1168823 1058947 1524677 2603239 3905949 4955828 5405238
11412 5405238 5021370 3870373 2309994 849973 -105081 -562377 -792757 -1011720 -1277297
11403 -1277297 -1522567 -1514839 -995944 35926 1232068 2071549 2406547 2546170 2725270
11394 2725270 2968338 3244526 3371675 3107034 2521939 1966787 1628274 1332377 902008
11385 902008 476824 202647 -107141 -797662 -2001446 -3424170 -4626228 -5322957 -5304383
11376 -5304383 -4588679 -3621435 -2974486 -2819981 -2695944 -2021445 -799528 481093 1426441
11367 1426441 2064119 2710169 3512924 4330065 5054659 5765048 6420200 6789801 6818021 6604412
11357 6604412 6121842 5295108 4192604 3008445 2004162 1337797 983934 850507 869946
11348 869946 1006338 1197151 1277312 1093617 922730 1251557 2079515 2818007 3053337 2967119
11338 2967119 2744255 2120133 772816 -1103868 -2999709 -4456551 -5188560 -5104161 -4213716
11329 -4213716 -2656189 -721732 1051874 1987052 1918014 1284323 543947 -79718 -563150
11320 -563150 -975000 -1405078 -1927272 -2473717 -2783431 -2723621 -2553694 -2577183 -2820916 -3308978
11310 -3308978 -4172517 -5219906 -6043839 -6450141 -6334873 -5691134 -4880326 -4189049 -3520471
11301 -3520471 -2784554 -1939041 -940869 109629 1109881 2002302 2512820 2210086 891457
11292 891457 -1216813 -3536735 -5362483 -6360871 -6896788 -7474242 -8085918 -8358602 -7981037
11283 -7981037 -7089429 -6313373 -6033517 -5974327 -5798153 -5530899 -5299958 -5132852 -5037601 -4948124
11273 -4948124 -4681520 -4091639 -3261211 -2474380 -1870905 -1371729 -1087644 -1213173 -1672625
11264 -1672625 -2254905 -2734311 -2941354 -2728559 -2020869 -1065024 -241256 483738 1328093
11255 1328093 2106188 2353764 1910416 1136521 530212 364686 712152 1307589 1600114
11246 1600114 1252688 442108 -400084 -1106776 -1939645 -3007029 -3957310 -4452795 -4541510
11237 -4541510 -4494655 -4332917 -3893104 -3236868 -2740215 -2834476 -3483924 -4089768 -4374480 -4577382
11227 -4577382 -4897159 -5419946 -6131950 -6788227 -7159955 -7345123 -7603320 -8038559 -8462949
11218 -8462949 -8765663 -9190629 -9825339 -10330077 -10252679 -9389914 -7964668 -6513094 -5516697
11209 -5516697 -5124649 -5242018 -5702886 -6354153 -7028997 -7524087 -7685802 -7584998 -7486307 -7508802
11199 -7508802 -7544905 -7575039 -7777117 -8270211 -8794232 -8860685 -8218841 -6939298 -5372874 -4027974
11189 -4027974 -3302450 -3259354 -3476935 -3404372 -3055500 -2896763 -2994163 -2881222 -2263510 -1405366
11179 -1405366 -963231 -1432640 -2706844 -4269767 -5674358 -6728333 -7402677 -7644074 -7281765
11170 -7281765 -6311168 -5164024 -4288664 -3669823 -3131388 -2698402 -2458243 -2371339 -2395269 -2612579
11160 -2612579 -3014696 -3396928 -3651866 -3916755 -4195251 -4276826 -4043926 -3681498 -3616491 -4096582
11150 -4096582 -4934240 -5554668 -5382037 -4375495 -2932117 -1336254 362926 1989580 3195847
11141 3195847 3777310 3724257 3158356 2276681 1327569 611485 400877 644916 903861 724774
11131 724774 -221123 -2084329 -4482070 -6648178 -8019004 -8520428 -8520248 -8603648 -9092589 -9686454
11121 -9686454 -9777451 -8985217 -7297024 -5116121 -2980935 -1216846 69992 968176 1601996
11112 1601996 1986678 2245054 2683429 3336497 3871699 3989962 3668938 3106263 2416006
11103 2416006 1505314 385950 -624875 -1282770 -1588627 -1424884 -671020 416828 1295867
11094 1295867 1543368 1089173 96560 -1205993 -2594912 -3822074 -4527174 -4432289 -3635265
11085 -3635265 -2509642 -1332315 -310986 368994 804366 1241874 1720377 2215509 2763747
11076 2763747 3336201 3835320 4079940 3827347 2984988 1793182 716783 172437 290445
11067 290445 821523 1273708 1282696 809930 74008 -455769 -426374 -2811 504242 1004486
11057 1004486 1400003 1413643 878271 -3872 -911347 -1616362 -1964906 -1836872 -1214012 -407585
11047 -407585 14311 -321216 -1308099 -2481819 -3428149 -3901702 -3569647 -2279470 -521782
11038 -521782 955648 1752005 1827084 1306858 303156 -1076930 -2436645 -3245325 -3496899
11029 -3496899 -3679660 -4150447 -4924517 -5856715 -6812807 -7758866 -8645792 -9237196 -9176644 -8285747
11019 -8285747 -6740856 -4993045 -3406004 -1844795 54707 2272637 4413431 6264685
11011 6264685 7879300 9199226 10060127 10334672 9930296 8862885 7409477 6046420 5133562
11002 5133562 4667245 4207214 3352726 2321925 1494886 726856 -328226 -1541685 -2428416
10993 -2428416 -2760702 -2773804 -2831077 -3124099 -3657826 -4241496 -4452109 -3929628 -2799231 -1604143
10983 -1604143 -796616 -343145 64982 632019 1371184 2099292 2655512 3118717 3594405
10974 3594405 3960271 3999076 3578509 2697976 1584364 694602 195477 -154626 -363870
10965 -363870 -105592 728988 1790048 2676318 3366506 4065701 4815294 5334827 5384343 5042181
10955 5042181 4523807 4140288 4270239 5107873 6353573 7466027 8079119 8025152 7304411
10946 7304411 6131510 4845422 3715762 2998656 2886006 3236777 3672412 3836015 3463409
10937 3463409 2525578 1306048 206494 -518362 -1055152 -1854223 -2937055 -3852886 -4168163
10928 -4168163 -3776452 -3018650 -2438218 -2406865 -2878028 -3497189 -3852817 -3565783 -2571032 -1372463
10918 -1372463 -776452 -1195823 -2132301 -2789480 -2996390 -3057646 -3074711 -2907363 -2686368 -2744808
10908 -2744808 -3141528 -3696331 -4153162 -4274417 -4060537 -3577111 -2808454 -1726824 -430072
10899 -430072 728139 1533814 2185871 2926973 3630917 3985365 3952906 3631644 3053092 2323166
10889 2323166 1543530 728746 -46222 -571436 -815845 -1069061 -1429842 -1651134 -1695109 -1799210
10879 -1799210 -2136453 -2598068 -2916108 -3151443 -3576546 -4140539 -4619281 -5030755 -5451275
10870 -5451275 -5820616 -6005025 -5852841 -5450423 -5169349 -5108623 -4900341 -4201281 -3003804
10861 -3003804 -1615943 -475238 180362 339302 102538 -330307 -688113 -693810 -241253
10852 -241253 497785 1162559 1436498 1178815 531857 43208 227286 1019425 1894154 2358275
10842 2358275 2285676 1785160 1009975 95172 -939719 -1864693 -2321397 -2492410 -2806219
10833 -2806219 -3212407 -3588242 -4278177 -5562818 -7263964 -8934807 -10132340 -10661117 -10587881
10824 -10587881 -9981098 -8770378 -7017704 -5268861 -4252022 -4149933 -4464014 -4600817 -4466712
10815 -4466712 -4394079 -4657950 -5183171 -5608536 -5686800 -5589564 -5676761 -6038053 -6490296 -7024791
10805 -7024791 -7752873 -8555685 -9109594 -9136195 -8678052 -8056756 -7474726 -6868722 -6081493 -5088361
10795 -5088361 -4236568 -4015550 -4451636 -5011344 -5256369 -5316598 -5405083 -5360946 -4980868 -4375009
10785 -4375009 -3808229 -3588237 -3945226 -4834964 -6000922 -7163465 -8157857 -8913044 -9397598
10776 -9397598 -9664134 -9847670 -10074935 -10303921 -10167638 -8926736 -5975799 -1623437 2801450
10767 2801450 5876524 7238243 7496789 7358128 7089307 6671562 6107870 5437348 4711536
10758 4711536 4071428 3638757 3418858 3351738 3342268 3418107 3895862 4983239 6292478 7078577
10748 7078577 6917344 5994220 4878693 4024159 3375005 2639800 1791894 984669 324876
10739 324876 -147869 -540931 -957184 -1357730 -1799193 -2431266 -3215546 -3869903 -4208834 -4234105
10729 -4234105 -3950883 -3411804 -2768789 -2167053 -1642605 -1238044 -1094885 -1238133 -1476582
10720 -1476582 -1481146 -1038613 -196207 925514 2236521 3720095 5230033 6149832 5901742
10711 5901742 4631273 2954052 1441396 351550 -326841 -686199 -891580 -1246704 -1941219
10702 -1941219 -2870294 -3792736 -4419242 -4578946 -4358336 -3993223 -3747558 -3805107 -4195492 -4671578
10692 -4671578 -4761869 -4210420 -3302829 -2568639 -2190122 -1909776 -1513710 -1117130 -978493 -1229744
10682 -1229744 -1685685 -2060412 -2283010 -2332284 -2108528 -1551182 -681962 396511 1507516
10673 1507516 2457937 3128708 3460047 3327470 2650846 1701453 955521 515072 -92021
10664 -92021 -1480547 -3702301 -6058917 -7601151 -7756944 -6697921 -5172937 -3948894 -3398765
10655 -3398765 -3452931 -3790013 -4279355 -4993465 -5793583 -6425189 -6790679 -6875559 -6638275 -6069393
10645 -6069393 -5307552 -4625231 -4207015 -3961299 -3685263 -3380441 -3091710 -2715834 -2264599
$$ [...]
##END NTUPLES=NMR SPECTRUM
##END=
