##TITLE=31P ikalashn
DE-76k_NaOH
22.11.2024
##JCAMPDX= 6.0         $$ Bruker NMR JCAMP-DX V2.0
##DATA TYPE= NMR SPECTRUM
##DATA CLASS= NTUPLES
##ORIGIN= UXNMR, Bruker Analytische Messtechnik GmbH
##OWNER= root
$$ TOPSPIN		Version 1.3
$$ 2024-11-22 15:36:45.828 +0400  Irina@DPX200
$$ Compression mode = diff/dup
##.OBSERVE FREQUENCY= 81.01967998063
##.OBSERVE NUCLEUS= ^31P
##.ACQUISITION MODE= SIMULTANEOUS
##.ACQUISITION SCHEME= undefined
##.AVERAGES= 64
##.DIGITISER RES= 17
##SPECTROMETER/DATA SYSTEM= spect
##.PULSE SEQUENCE= zgpg
##.SOLVENT NAME= DMSO
##.SHIFT REFERENCE= INTERNAL, DMSO, 1, 298.5841
##AUDIT TRAIL= $$ (NUMBER, WHEN, WHO, WHERE, WHAT)
$$ ##TITLE= Audit trail, TOPSPIN		Version 1.3
$$ ##JCAMPDX= 5.01
$$ ##ORIGIN= Bruker BioSpin GmbH
$$ ##OWNER= Irina
$$ $$ F:/spectra/data/iren/nmr/P31dec/1/pdata/1/auditp.txt
$$ ##AUDIT TRAIL=  $$ (NUMBER, WHEN, WHO, WHERE, VERSION, WHAT)
(   1,<2024-11-22 15:34:32.859 +0400>,<Irina>,<DPX200>,<TOPSPIN 1.3>,
      <acquisition in progress>)
(   2,<2024-11-22 15:36:14.578 +0400>,<Irina>,<DPX200>,<TOPSPIN 1.3>,
      <Start of raw data processing
       efp BC_mod = 2 LB = 10 FT_mod = 6 PKNL = 1 PHC0 = 231.749 PHC1 = 40.07378 SI = 32K 
       data hash MD5: 32K
       DD EB 00 6F F0 CF E8 0D C5 7E 4C 2F 59 C2 B7 E9>)
(   3,<2024-11-22 15:36:17.328 +0400>,<Irina>,<DPX200>,<TOPSPIN 1.3>,
      <apk 
       data hash MD5: 32K
       4C E6 5B 2F 67 66 9D FC 39 05 58 F7 00 82 E3 CF>)
(   4,<2024-11-22 15:36:19.421 +0400>,<Irina>,<DPX200>,<TOPSPIN 1.3>,
      <abs n ABSG = 5 
       data hash MD5: 32K
       EB 26 DE FD EF 8F C5 F7 B9 07 D8 9E 6E 14 EB 46>)
$$ ##END=
$$ 
$$ $$ hash MD5
$$ $$ 7E 24 8D 25 D7 FB 29 E1 A8 DA 49 9D D1 9A 47 B7
##$RELAX= 
##$RELAX= 
##$RELAX= 
##$RELAX= 
##$RELAX= 
##$RELAX= 
##$RELAX= 
##$RELAX= 
##$RELAX= 
##$RELAX= 
##$RELAX= 
$$ Bruker specific parameters
$$ --------------------------
##$DU= <F:/spectra>
##$EXPNO= 1
##$NAME= <P31dec>
##$PROCNO= 1
##$TYPE= <nmr>
##$USER= <iren>
##$AMP= (0..31)
100 100 100 100 100 100 100 100 100 100 100 100 100 100 100 100 100 100 
100 100 100 100 100 100 100 100 100 100 100 100 100 100 
##$ANAVPT= -1
##$AQSEQ= 0
##$AQ_mod= 1
##$AUNM= <au_zg>
##$AUTOPOS= <>
##$BF1= 81.014009
##$BF2= 200.13
##$BF3= 200.13
##$BF4= 200.13
##$BF5= 200.13
##$BF6= 200.13
##$BF7= 200.13
##$BF8= 200.13
##$BYTORDA= 1
##$CFDGTYP= 0
##$CFRGTYP= 5
##$CHEMSTR= <none>
##$CNST= (0..63)
1 1 145 1 1 1 1 1 1 1 1 1 1 1 1 1 1 1 1 1 1 1 1 1 1 1 1 1 1 1 1 1 1 1 
1 1 1 1 1 1 1 1 1 1 1 1 1 1 1 1 1 1 1 1 1 1 1 1 1 1 1 1 1 1 
##$CPDPRG= <waltz16>
##$CPDPRG1= <>
##$CPDPRG2= <waltz16>
##$CPDPRG3= <>
##$CPDPRG4= <mlev>
##$CPDPRG5= <mlev>
##$CPDPRG6= <mlev>
##$CPDPRG7= <mlev>
##$CPDPRG8= <mlev>
##$CPDPRGB= <>
##$CPDPRGT= <>
##$D= (0..63)
0 1 0 0 0 0 0 0 0 0.06 0 0.03 2e-005 3e-006 0 0 0.0002 0 0 0 0 0 0 0 0 
0 0 0 0 0 0 0 0 0 0 0 0 0 0 0 0 0 0 0 0 0 0 0 0 0 0 0 0 0 0 0 0 0 0 0 
0 0 0 0 
##$DATE= 1732275371
##$DBL= (0..7)
120 120 120 11 120 120 24 19 
##$DBP= (0..7)
$$ [...]
##$SW_h= 37037.037037037
##$TD= 32768
##$TD0= 1
##$TE= 300
##$TE2= 300
##$TE3= 300
##$TEG= 300
##$TL= (0..7)
0 120 53 12 22 120 120 120 
##$TP= (0..7)
150 150 150 150 150 150 150 150 
##$TP07= 0
##$TPNAME0= <>
##$TPNAME1= <>
##$TPNAME2= <>
##$TPNAME3= <>
##$TPNAME4= <>
##$TPNAME5= <>
##$TPNAME6= <>
##$TPNAME7= <>
##$TPOAL= (0..7)
0.5 0.5 0.5 0.5 0.5 0.5 0.5 0.5 
##$TPOFFS= (0..7)
0 0 0 0 0 0 0 0 
##$TUNHIN= 0
##$TUNHOUT= 0
##$TUNXOUT= 0
##$USERA1= <user>
##$USERA2= <user>
##$USERA3= <user>
##$USERA4= <user>
##$USERA5= <user>
##$V9= 5
##$VALIST= <valist>
##$VCLIST= <CCCCCCCCCCCCCCC>
##$VD= 0
##$VDLIST= <DDDDDDDDDDDDDDD>
##$VPLIST= <PPPPPPPPPPPPPPP>
##$VTLIST= <TTTTTTTTTTTTTTT>
##$WBST= 1024
##$WBSW= 4
##$XGAIN= (0..3)
0 0 0 0 
##$XL= 0
##$YL= 0
##$YMAX_a= 5982
##$YMIN_a= -731
##$ZGOPTNS= <>
##$ZL1= 120
##$ZL2= 120
##$ZL3= 120
##$ZL4= 120
##$ABSF1= 298.5841
##$ABSF2= -158.5842
##$ABSG= 5
##$ABSL= 5
##$ALPHA= 0
##$AQORDER= 0
##$ASSFAC= 0
##$ASSFACI= 0
##$ASSFACX= 0
##$ASSWID= 0
##$AUNMP= <proc_1d>
##$AXLEFT= 0
##$AXRIGHT= 0
##$AXTYPE= 0
##$AXUNIT= <>
##$AZFE= 0.1
##$AZFW= 0.5
##$BCFW= 0
##$BC_mod= 2
##$BYTORDP= 0
##$COROFFS= 0
##$CY= 12.5935478210449
##$DATMOD= 1
##$DC= 0
##$DFILT= <>
##$DTYPP= 0
##$F1P= 47.1127640792319
##$F2P= -24.0371245302204
##$FCOR= 0.5
##$FTSIZE= 32768
##$FT_mod= 6
##$GAMMA= 0
##$GB= 0
##$INTBC= 1
##$INTSCL= 7.269226e-011
##$ISEN= 30
##$LB= 10
##$LEV0= 0
##$LPBIN= 0
##$MAXI= 12.09355
##$MC2= 0
##$MEAN= 0
##$ME_mod= 0
##$MI= 0.7550151
##$NCOEF= 0
##$NC_proc= -12
##$NLEV= 6
##$NOISF1= 298.5841
##$NOISF2= 270.0111
##$NSP= 0
##$NTH_PI= 0
##$NZP= 0
##$OFFSET= 298.5841
##$PC= 1.4
##$PHC0= 232.4765
##$PHC1= 45.10144
##$PH_mod= 1
##$PKNL= yes
##$PPARMOD= 0
##$PPDIAG= 0
##$PPIPTYP= 0
##$PPMPNUM= 100
##$PPRESOL= 1
##$PSCAL= 0
##$PSIGN= 0
##$REVERSE= no
##$SF= 81.014009
##$SI= 32768
##$SIGF1= 270.0111
##$SIGF2= -158.5842
##$SINO= 77.54984
##$SIOLD= 32768
##$SREGLST= <31P.CDCl3>
##$SSB= 0
##$STSI= 32768
##$STSR= 0
##$SW_p= 37037.037037037
##$SYMM= 0
##$S_DEV= 0
##$TDeff= 32768
##$TDoff= 0
##$TI= <>
##$TILT= no
##$TM1= 0
##$TM2= 0
##$TOPLEV= 0
##$USERP1= <user>
##$USERP2= <user>
##$USERP3= <user>
##$USERP4= <user>
##$USERP5= <user>
##$WDW= 1
##$XDIM= 32768
##$YMAX_p= 351670448
##$YMIN_p= -25181776
$$ End of Bruker specific parameters
$$ ---------------------------------
##NTUPLES= NMR SPECTRUM
##VAR_NAME=  FREQUENCY,     SPECTRUM/REAL,   SPECTRUM/IMAG
##SYMBOL=    X,             R,               I
##VAR_TYPE=  INDEPENDENT,   DEPENDENT,       DEPENDENT
##VAR_FORM=  AFFN,          ASDF,            ASDF
##VAR_DIM=   32768,         32768,           32768
##UNITS=     HZ,            ARBITRARY UNITS, ARBITRARY UNITS
##FACTOR=    1.13031516577767, 1,            1
##FIRST=     37037.037037037, -9159848,      -4043146
##LAST=      0,             4076533,         -8856597
##MIN=       0,             -25181776,       0
##MAX=       37037.037037037, 351670448,     0
$$ Real data points
##PAGE= N=1
##DATA TABLE= (X++(R..R)), XYDATA
$$ [...]
16871b214049Q28472R40946P81445M24781Q1822j41763k45676k02839l6159J19009
$$ -2214049 -1385577 -444631 336814 761595 843417 701654 455978 253139 216980 335989
16861C35989J78912K34559M21603P74810J238421J662631J806138J537093R73274
$$ 335989 514901 749460 1171063 1945873 3184294 4846925 6653063 8190156 9163430
16852I163430L35651j77308m17927m11737l55061l76157m42989n02229n62869
$$ 9163430 9499081 9321773 8903846 8492109 8137048 7760891 7317902 6815673 6252804
16843F252804o47684p25893p57814p71602q23595q75688p83790m92574j41797
$$ 6252804 5605120 4879227 4121413 3349811 2526216 1650528 866738 374164 232367
16834B32367O5631P2066n849m2364J7767J71588L40348M23323M01677L39397K75524
$$ 232367 297998 370064 364215 321851 339618 511206 851554 1274877 1676554 2015951 2291475
16823B291475J67681l6920l09625n42474o37928n37221k25688J88419N07899O27960
$$ 2291475 2459156 2422236 2112611 1570137 932209 394988 169300 357719 865618 1493578
16813A493578N85663M52347K77833J13381k1132k18688n42371q50406r34993p38318
$$ 1493578 2079241 2531588 2809421 2922802 2901670 2682982 2140611 1290205 355212 -383106
16803c83106l86539r8832m1295j86141l44971l82628l31649k87060l12212m09035
$$ -383106 -769645 -868477 -909772 -1095913 -1440884 -1823512 -2155161 -2442221 -2754433 -3163468
16793c163468m89550m73370m23538m32324m15879k08091J95903O02696P74704
$$ -3163468 -3653018 -4126388 -4549926 -4982250 -5398129 -5606220 -5410317 -4807621 -4032917
16784d032917O16928K58412l2248k7648K57287N82325P29542O42038M11246K25948
$$ -4032917 -3415989 -3157577 -3189825 -3217473 -2960186 -2377861 -1648319 -1006281 -595035 -369087
16774c69087K37379M14674N96735O47330N29154K46686j82323o23141q54406p40902
$$ -369087 -131708 282966 879701 1527031 2056185 2302871 2120548 1497407 643001 -97901
16764i7901k79875M16361J114839J505978J387657Q49293J51350n22475j085851
$$ -97901 -377776 38585 1153424 2659402 4047059 4896352 5047702 4525227 3439376
16755C439376j450356j508470j224328p08066j68427J79340K41255J21421j9326
$$ 3439376 1989020 480550 -743778 -1451844 -1620271 -1440931 -1199676 -1078255 -1097581
16746a097581j45703k93825l83067k63631O5324M19121N30063K23302l99949j007388
$$ -1097581 -1243284 -1537109 -1920176 -2183807 -2118483 -1699362 -1169299 -945997 -1345946 -2353334
16736b353334j300816j217082q91660n12150k04282K4859K14518L48306M01230
$$ -2353334 -3654150 -4871232 -5762892 -6275042 -6479324 -6454465 -6239947 -5891641 -5490411
16727e490411M01554L98191M19848M60717M89707M48763L27084K31174K30170
$$ -5490411 -5088857 -4690666 -4270818 -3810101 -3320394 -2871631 -2544547 -2313373 -2083203
16718b083203K71122K99983L12218L14188L32670M23173N75729P00665P27010
$$ -2083203 -1812081 -1512098 -1199880 -885692 -553022 -129849 445880 1146545 1873555
16709A873555O36199M78655L36670J93897m1812l28046n09474n30418m45528l27466
$$ 1873555 2509754 2988409 3325079 3518976 3477164 3149118 2639644 2109226 1663698 1336232
16699A336232k21130j28427l2414J02541L19043N85143P81526P79831N57975K49986
$$ 1336232 1115102 986675 954261 1056802 1375845 1960988 2742514 3522345 4080320 4330306
16689D330306q623k38746n42804r00473j165778j244668j118969p56324j59461
$$ 4330306 4321683 4082937 3540133 2639660 1473882 229214 -889755 -1646079 -1805540
16680a805540M95828R26779R68580O71731K67202O467n5603l3047o6047k44404
$$ -1805540 -1309712 -382933 585647 1257378 1524580 1531047 1475444 1442397 1376350 1131946
16670A131946n21952p36139p43516m96639n5106M21991P58786Q45287O64175K98397
$$ 1131946 609994 -126145 -869661 -1366300 -1421406 -999415 -240629 604658 1268833 1567230
16660A567230j24092m81464o67354o73097n88972m74752l74666l70018m55402
$$ 1567230 1443138 961674 294320 -378777 -967749 -1442501 -1817167 -2187185 -2642587
16651b642587n04861m39702l02281j67080n7971N1789J88812L22925M06990M41871
$$ -2642587 -3147448 -3587150 -3889431 -4056511 -4114482 -4062693 -3873881 -3550956 -3143966 -2702095
16641b702095M28939L19612P6449k37656m84355n66132m64125k01132J65228N47709
$$ -2702095 -2273156 -1953544 -1877095 -2114751 -2599106 -3165238 -3629363 -3830495 -3665267 -3117558
16631c117558Q41270R50296Q38632N71975L04239J76611J64047R6202j35032n05330
$$ -3117558 -2276288 -1325992 -487360 84615 388854 565465 729512 825714 690682 185352
16621A85352r20742j261432j423517j380485j166079p94668k91979K45982P12267
$$ 185352 -735390 -1996822 -3420339 -4800824 -5966903 -6761571 -7053550 -6807568 -6095301
16612f095301J020110J085350R13713O81838N98129O67515P33721P15363O46132
$$ -6095301 -5075191 -3989841 -3076128 -2394290 -1796161 -1128646 -394925 320438 966570
16603I66570N59439M51944L30935K21334J39370Q8668O3292P2943J55159K93955
$$ 966570 1526009 1977953 2308888 2530222 2669592 2758260 2821552 2894495 3049654 3343609
16593C343609L75217K70153o8683n61229j033845j301646j279337j037789p33375
$$ 3343609 3718826 3988979 3920296 3359067 2325222 1023576 -255761 -1293550 -2026925
16584b026925n05567m03276l65250k88390j41098M1923K48718M48397N15518L28308
$$ -2026925 -2532492 -2935768 -3301018 -3589408 -3730506 -3688583 -3439865 -2991468 -2475950 -2147642
16574b147642m9371l84205m79461l53724k14197j95804k23486j91155j48321k33430
$$ -2147642 -2197013 -2581218 -3060679 -3414403 -3628600 -3824404 -4047890 -4239045 -4387366 -4620796
16564d620796m40023n44421l59756N220K93155M28639N45527P06573Q06679P90308
$$ -4620796 -5060819 -5605240 -5964996 -5959776 -5666621 -5237982 -4692455 -3985882 -3179203 -2388895
16554b388895P17494O34592N66060N51023N49695M23134J17122k35008m64381
$$ -2388895 -1671401 -1036809 -470749 80274 629969 1053103 1170225 935217 470836
16545D70836n28588m87028m17410l52692k53077p2757J80620M28326N63482N73989
$$ 470836 -57752 -544780 -962190 -1314882 -1567959 -1640716 -1460096 -1031770 -468288 105701
16535A05701N34739M67523L21494P5642j95433l76914m16326l49153k55756j72708
$$ 105701 640440 1107963 1429457 1505099 1309666 932752 516426 167273 -88483 -261191
16525b61191m0345K05053N18576P98805J003913J115324J078512Q51963M24272
$$ -261191 -301536 -96483 422093 1220898 2224811 3340135 4418647 5270610 5694882
16516E694882j28031n85650p71898p21060n62016l67466j79782o4807r0675k39926
$$ 5694882 5566851 4981201 4209303 3488243 2926227 2558761 2378979 2314172 2223497 1983571
16506A983571l70715k93989P4174N76017R33702J028072R34862P29077M30813
$$ 1983571 1612856 1318867 1393041 1969058 2902760 3930832 4865694 5594771 6025584
16497F025584Q5169k53973n47701p47981q05774p13661n41628l86932k99036k93451
$$ 6025584 6110753 5856780 5309079 4561098 3755324 3041663 2500035 2113103 1814067 1520616
16487A520616l86908n62108p19826p57526o65803n20823m34525m87385o32708
$$ 1520616 1133708 571600 -148226 -905752 -1571555 -2092378 -2526903 -3014288 -3646996
16478c646996p11307o15702m05419k07935o8706K2298O1768J6429j62862m60774
$$ -3646996 -4358303 -4974005 -5379424 -5587359 -5656065 -5633767 -5571999 -5555570 -5718432 -6179206
16468f179206p29162p81847n92061l44533k86604n31845r39892j186108r92244
$$ -6179206 -6908368 -7690215 -8282276 -8626809 -8913413 -9445258 -10385150 -11571258 -12563502
16459a2563502l93351K53310O54287P74214O94383N19354L27851J59192N3938
$$ -12563502 -12956853 -12703543 -12049256 -11275042 -10580659 -10061305 -9733454 -9574262 -9520324
16450i520324O8491J99610L24649L40484K80641K08560J55270J48459J85660K42501
$$ -9520324 -9451833 -9252223 -8927574 -8587090 -8306449 -8097889 -7942619 -7794160 -7608500 -7365999
16440g365999L13166L71298L53696K41124J05845M7033R0702J71408J81404M1799
$$ -7365999 -7052833 -6681535 -6327839 -6086715 -5980870 -5933837 -5843135 -5671727 -5490323 -5448524
16430e448524j81132k85157j01046L68029R70054J528627J885691J941274J697541
$$ -5448524 -5629656 -5914813 -6015859 -5647830 -4677776 -3149149 -1263458 677816 2375357
16421B375357J235619O90683J97619j65964l73221m08762l01077j64761j03327
$$ 2375357 3610976 4301659 4499278 4333314 3960093 3551331 3250254 3085493 2982166
16412B982166j33023k44441m15338n66721o37342o53214o76917o93686n33464
$$ 2982166 2849143 2604702 2189364 1622643 985301 332087 -344830 -1038516 -1571980
16403a571980o8563N16573Q92290R29288P37364N00867L57486L33466L34338K60717
$$ -1571980 -1640543 -1123970 -231680 697608 1434972 1935839 2293325 2626791 2961129 3221846
16393C221846J05334r7546l22863n41542p26624q44141q08382n00570P7757P06679
$$ 3221846 3327180 3229634 2906771 2365229 1638605 794464 -13918 -514488 -436731 269948
16383B69948J115089J228003J172591J075803R59711Q03166N93364L17806p399
$$ 269948 1385037 2613040 3785631 4861434 5821145 6624311 7217675 7535481 7528082
16374G528082k77612l45153j78742P9767K68033L39500L21131K59793K02814J44545
$$ 7528082 7250470 6905317 6726575 6806342 7074375 7413875 7735006 7994799 8197613 8342158
16364H342158M9413p2814j67815k02627k17936k99994n12789q29101j092602j149062
$$ 8342158 8391571 8318757 8150942 7948315 7730379 7430385 6917596 6088495 4995893 3846831
16354C846831j003558p87028o26326n44303m79642l75606j86024J35505N59479
$$ 3846831 2843273 2056245 1429919 885616 405974 30368 -155656 -20151 539328
16345E39328R09219R82241P77558M72811J96425q3878m66717r13401j259433j421614
$$ 539328 1448547 2430788 3208346 3681157 3877582 3793704 3326987 2413586 1154153 -267461
16335b67461j405228j229569r81604p84832o88880o68425o85548o88330o01706
$$ -267461 -1672689 -2902258 -3883862 -4668694 -5357574 -6025999 -6711547 -7399877 -8001583
16326h001583l87213j04446J16326K21049K66418K51622Q4957k83964p85573j272914
$$ -8001583 -8388796 -8493242 -8376916 -8155867 -7889449 -7637827 -7552870 -7836834 -8622407 -9895321
16316i895321j623521j796769j850398j934871k165502k411151k259792j244451
$$ -9895321 -11518842 -13315611 -15166009 -17100880 -19266382 -21677533 -23937325 -25181776
16308b5181776P17660K880756M116787M077884L309694K418503J636094R69893
$$ -25181776 -24464116 -21583360 -17466573 -13388689 -10078995 -7660492 -6024398 -5054505
16300e054505M16382k7554l68267n65012n52887l23829M2686M39231P67606Q84524
$$ -5054505 -4638123 -4665677 -5033944 -5598956 -6151843 -6475672 -6432986 -5993755 -5226149 -4341625
16290d341625O51863J47792l55479o81627q14405p24968l92074O3572M94497Q75297
$$ -4341625 -3689762 -3541970 -3897449 -4579076 -5393481 -6118449 -6510523 -6446951 -5952454 -5077157
16280e077157J173882J250643J033749O48243K91759O2132q3478k44853m25482
$$ -5077157 -3903275 -2652632 -1618883 -970640 -678881 -616749 -700227 -945080 -1370562
16271a370562m99612l80175j20479K00330N43911Q09347Q78942P74537O14168
$$ -1370562 -1870174 -2250349 -2370828 -2170498 -1626587 -817240 61702 836239 1450407
16262A450407M90238M45033M55587M17409K16675j59875n99643r50868j110164
$$ 1450407 1940645 2385678 2841265 3258674 3475349 3315474 2715831 1764963 654799
16253F54799j010567n96151M1604N79403P11836M17311q9596n79653r32180j119184
$$ 654799 -355768 -951919 -910315 -330912 380924 798235 708639 128986 -803194 -1922378
16243a922378j165420j122840j051881r54545p39660l48806J48327O31538J010885
$$ -1922378 -3087798 -4210638 -5262519 -6217064 -6956724 -7305530 -7157203 -6525665 -5514780
16234e514780J263368J401870J399873J213693Q92785N78238L78788L30982M11019
$$ -5514780 -4251412 -2849542 -1449669 -235976 656809 1235047 1613835 1944817 2355836
16225B355836N10698M73595K35650j17706m15298n06172m02178k29469l7526J66814
$$ 2355836 2866534 3340129 3575779 3458073 3042775 2536603 2134425 1904956 1867430 2034244
16215B034244L04541K70479N0157k59039n47206p54355q66785q87008p97943n89037
$$ 2034244 2338785 2609264 2659421 2400382 1853176 1098821 232036 -654972 -1452915 -2041952
16205b041952l32497j79466k31528m20267n68686n55537l61316l7237L05866N49934
$$ -2041952 -2374449 -2553915 -2785443 -3205710 -3774396 -4329933 -4691249 -4728486 -4422620 -3872686
16195c872686O41697O01817N13793N10484O83728R73443J207303J255679J072902
$$ -3872686 -3230989 -2629172 -2115379 -1604895 -921167 52276 1259579 2515258 3588160
16186C588160O35234L8417m35810n51524l28378N3927M09829N76758M98383K92330
$$ 3588160 4223394 4261811 3826001 3274477 2946099 3000026 3409855 3986613 4484996 4777326
16176D777326J34576J23778J84341J35072n8136k53071l70553m63264n63516o63693
$$ 4777326 4911902 5035680 5220021 5355093 5296957 5043886 4673333 4210069 3646553 2982860
16166B982860p82521r02740q85447n32079J46217Q11840J122443J002596O04374
$$ 2982860 2200339 1297599 412152 -119927 26290 838130 1960573 2963169 3567543
16157C567543J62485j53064l02658l25209k87590k67895l03268l53322l45816
$$ 3567543 3730028 3576964 3274306 2949097 2661507 2393612 2090344 1737022 1391206
16148A391206k31046J148L09279N67255O25303M62312J58429k04705n02720o18705
$$ 1391206 1160160 1161308 1470587 2037842 2663145 3125457 3283886 3079181 2576461 1957756
16138A957756n87147n21727m32441k45217O2325M29132P74843R95992R54373O14600
$$ 1957756 1370609 848882 416441 171224 233549 662681 1437524 2433516 3387889 4002489
16128D002489J55603j92841l82315n18636o86677q53522q90305p26350m80850
$$ 4002489 4158092 3965251 3582936 3064300 2377623 1524101 633796 -92554 -573404
16119e73404l48295m09772n85045o93750n99655l45221o8121J66686L82280N85866
$$ -573404 -921699 -1331471 -1916516 -2610266 -3209921 -3555142 -3623263 -3456577 -3074297 -2488431
16109b488431P20000P43002O59030M51257J01118l40378q03898j241682j571099
$$ -2488431 -1768431 -1025429 -366399 84858 185976 -154402 -958300 -2199982 -3771081
16100c771081j722574j712060j568954j286434q87135m71240j73851l7435O2488
$$ -3771081 -5493655 -7205715 -8774669 -10061103 -10948238 -11419478 -11593329 -11630764 -11568276
16091a1568276K78833O27823R91068J200112J165720R82629Q15064P47840Q21687
$$ -11568276 -11289443 -10661620 -9670552 -8470440 -7304720 -6322091 -5507027 -4759187 -3937500
16082c937500J045241J324645J483295J358642R34501L99822l075j59365j12001
$$ -3937500 -2892259 -1567614 -84319 1274323 2208824 2608646 2605571 2446206 2334205
16073B334205J6187J02967M9545k00596o01968r85761j156752r93189n07472J19002
$$ 2334205 2350392 2453359 2502904 2302308 1700340 714579 -442173 -1435362 -1942834 -1823832
16063a823832N77832O11124K35901k45698m92155m11989j81991k4522m9629k24915
$$ -1823832 -1246000 -634876 -398975 -644673 -1136828 -1548817 -1730808 -1755330 -1804959 -2029874
16053b029874m43488n91214n62845l37175k343L06274M91463N95727P36192R23889
$$ -2029874 -2473362 -3064576 -3627421 -3964596 -3966939 -3660665 -3169202 -2573475 -1837283 -913394
16043i13394J037993R67892P65351N56909L61885J50029m3807j65068j67912k4133
$$ -913394 124599 1092491 1857842 2414751 2776636 2926665 2882858 2717790 2549878 2525745
16033B525745K05676L85242M05233K49716j7679l11453n82637q13206r38909q57905
$$ 2525745 2731421 3116663 3521896 3771612 3753933 3442480 2859843 2046637 1107728 249823
16023B49823n48116j00048L12795N09618M45285K32925Q655j93893m00321n81598
$$ 249823 -298293 -398341 -85546 424072 869357 1102282 1110937 917044 516723 -64875
16013f4875o71752o52218n30160l06434j8217K90018N99247Q64284J010881J003008
$$ -64875 -736627 -1388845 -1919005 -2225439 -2243656 -1953638 -1354391 -490107 520774 1523782
16003A523782Q75699P10942N24699K09383k69176p27390r48618q77105o05622
$$ 1523782 2399481 3110423 3635122 3844505 3575329 2847939 1899321 1022216 416594
15994D16594l11121j45819j05585j09400j32183j37821o6722P4351K21858L15833
$$ 416594 105473 -40346 -145931 -255331 -387514 -525335 -592057 -517706 -295848 19985
15984A9985L51505L59626L30123K25797L2844k08195l96663m51346l87115k91446
$$ 19985 371490 731116 1061239 1287036 1319880 1111685 715022 263676 -123439 -414885
15974d14885k38303k30586j94493l9417K50817N74609P72714P55899N83163L89542
$$ -414885 -653188 -883774 -1078267 -1117684 -866867 -292258 480456 1236355 1819518 2209060
15964B209060K13250k3127l49254o84256r05450r48471q46199o56214m17727j57110
$$ 2209060 2422310 2399183 2049929 1365673 460223 -488248 -1334447 -1990661 -2408388 -2565498
15954b565498J13082L33047L81747J90866j78823n46759p31393p01699n60749
$$ -2565498 -2452416 -2119369 -1737622 -1546756 -1725579 -2272338 -3003731 -3705430 -4266179
15945d266179m35855m36498o12073r16580j220318j362565j242109q24566j38365
$$ -4266179 -4702034 -5138532 -5750605 -6667185 -7887503 -9250068 -10492177 -11316743 -11455108
15936a1455108O31966J173591J288355J047312O60433L04976R0379K9699M9792
$$ -11455108 -10823142 -9649551 -8361196 -7313884 -6653451 -6348475 -6258096 -6228397 -6178605
15927f178605J12136K62827N11528P55438Q76065Q36085O59992M05158J56155
$$ -6178605 -6066469 -5803642 -5292114 -4536676 -3660611 -2824526 -2164534 -1759376 -1603221
15918a603221M884K1203J90889L82795M30076K45911j03033m27450n76139n58376
$$ -1603221 -1598337 -1577134 -1386245 -1003450 -573374 -327463 -430496 -857946 -1434085 -1992461
15908a992461n11619n56661o69298p32125p02417o04868m08544p0218L47277P02371
$$ -1992461 -2504080 -3060741 -3730039 -4462164 -5164581 -5769449 -6177993 -6248211 -5900934 -5198563
15898e198563R00306R05181P01113L57344r431l43228o07161p12165n99053l20348
$$ -5198563 -4298257 -3393076 -2691963 -2334619 -2344050 -2687278 -3294439 -4006604 -4605657 -4926005
15888d926005K0343L39418O26185R44937J305933J556396J523203J224926Q29655
$$ -4926005 -4905662 -4566244 -3940059 -2995122 -1689189 -132793 1390410 2615336 3444991
15879C444991N23897M16394M41245L88813J20961k41001m54922m47534l20679
$$ 3444991 3968888 4385282 4826527 5215340 5336301 5095300 4640378 4192844 3872165
15870C872165j77019p4543k2580O5290K53314M30962M34010K12877j91537o77189
$$ 3872165 3695146 3620603 3598023 3663313 3916627 4347589 4781599 4994476 4802939 4125750
15860D125750j068498j202262j050842p21118l85147j98163j78314k11220j83804
$$ 4125750 3057252 1854990 804148 83030 -302117 -500280 -678594 -889814 -1073618
15851a073618l7596K26139N38322Q16885R88956J000095Q86087P63235O98571
$$ -1073618 -1111214 -885075 -346753 470132 1459088 2459183 3345270 4108505 4807076
15842D807076O54371N62506M01349K11605O6353j8540j19446k78028m64468o28123
$$ 4807076 5461447 6023953 6425302 6636907 6703260 6684720 6565274 6287246 5822778 5194655
15832E194655o83221n83393m05804k62965j83033j54133k14302l78250n53061
$$ 5194655 4511434 3928041 3522237 3259272 3076239 2922106 2707804 2329554 1776493
15823A776493o46020o50211n50028l24020m1194J91641L21643L39889K48626O6400
$$ 1776493 1130473 480262 -69766 -393786 -434980 -243339 78304 418193 666819 733219
15813G33219j47091l21264m16397m16135l12421j34350L2132R6226O0217L7344
$$ 733219 586128 264864 -151533 -567668 -880089 -1014439 -982307 -886081 -825864 -788520
15803g88520J10804K31087K89137K41294J58788J86221M21445Q19732J179070
$$ -788520 -677716 -446629 -157492 83802 242590 428811 850256 1669988 2849058
15794B849058J263010J035610O91876M13839K14649L576k96083o46377r03372
$$ 2849058 4112068 5147678 5839554 6253393 6468042 6471618 6175535 5529158 4625786
15785D625786r92292j024168j154998j342387j352466j016008l68963L78812R51230
$$ 4625786 3633494 2609326 1454328 111941 -1240525 -2256533 -2625496 -2246684 -1295454
15776a295454J200638J185903J048115Q99383P90646P00257N54726K80885q9912
$$ -1295454 -94816 1091087 2139202 3038585 3829231 4529488 5084214 5365099 5275187
15767E275187m22608o65615q57578r60097r23063q14254p35787p08495o87424
$$ 5275187 4852579 4186964 3329386 2369289 1446226 631972 -103815 -812310 -1499734
15758a499734o43879n87731m95475k69274J09141M68491N74069L01739k49349
$$ -1499734 -2143613 -2731344 -3226819 -3496093 -3386952 -2918461 -2344392 -2042653 -2292002
15749b292002p78601r89937p97049l16556K39942O90710R51832J023621J004951
$$ -2292002 -3070603 -4060540 -4857589 -5174145 -4934203 -4243493 -3291661 -2268040 -1263089
15740a263089J002201R79963Q46318O10182L29165L2719k03046k75344j70651
$$ -1263089 -260888 719075 1565393 2175575 2504740 2537459 2334413 2059069 1888418
15731A888418L4497K28587K93220J65288j01664l89095o28377q03894q42379o07684
$$ 1888418 1922915 2151502 2444722 2610010 2508346 2119251 1490874 686980 -155399 -763083
15721g63083r9391M70482Q75317J033711J009524R43891R25239Q59693N35830
$$ -763083 -862474 -391992 483325 1517036 2526560 3470451 4395690 5255383 5791213
15712E791213j07994q38523j307896j327824r80007n31882k56800k56298m38169
$$ 5791213 5683219 4844696 3536800 2208976 1228969 697087 440287 183989 -254180
15703b54180o44885p16500n58426k32778J31100M53019O91705Q33183Q82381Q39001
$$ -254180 -899065 -1615565 -2173991 -2406769 -2275669 -1822650 -1130945 -297762 584619 1423620
15693A423620O77669L67580o4767n37113r64431j256950j311304j090193p28650
$$ 1423620 2101289 2468869 2404102 1866989 902558 -354392 -1665696 -2755889 -3484539
15684c484539m23884k05362K9106K87674M38141L72808J30556j47305l25029l16654
$$ -3484539 -3908423 -4113785 -4084679 -3797005 -3358864 -2986056 -2855500 -3002805 -3327834 -3644488
15674c644488j62208l5477m1197r1231l8018J51389M04233O75541R87288J317141
$$ -3644488 -3806696 -3842173 -3883370 -3974601 -4012619 -3861230 -3456997 -2781456 -1794168 -477027
15664d77027J523120J451907J113462O58928J85505k96502p18271r40692r18034
$$ -477027 1046093 2498000 3611462 4270390 4455895 4159393 3441122 2500430 1582396
15655A582396p77596o73001o28494n71096m73517l86278l26816k36854q3878J02899
$$ 1582396 804800 131799 -496695 -1067791 -1541308 -1927586 -2254402 -2491256 -2575134 -2472235
15645b472235L11484N32966O77627O33065M00431J02170j20989k08896j64398
$$ -2472235 -2160751 -1627785 -950158 -317093 83338 185508 64519 -144377 -308775
15636c08775l8993L1617o8532l01029n25333o39167o17488m96229l72998l23236
$$ -308775 -347768 -316151 -384683 -685712 -1211045 -1850212 -2467700 -2963929 -3336927 -3660163
15626c660163l23562k96990j99466q7589l8804l7680N826J86464N27608R26704
$$ -3660163 -3983725 -4280715 -4480181 -4567770 -4606574 -4644254 -4638428 -4451964 -3924356 -2997652
15616b997652J225681J357500J383910J353705J196977Q51925L85237l7267k66322
$$ -2997652 -1771971 -414471 969439 2323144 3520121 4372046 4757283 4720016 4453694
15607D453694k76137j32637N9482J44106J1452k73750n65766p92779q97113q04188
$$ 4453694 4177557 4044920 4104402 4248508 4259960 3986210 3420444 2627665 1730552 926364
15597I26364n71236l66712k80398k49131j27021J59191N11072P44926P43461M97416
$$ 926364 355128 -11584 -291982 -541113 -668134 -508943 2129 747055 1490516 1987932
15587A987932R7084l05898o20011q22170q66455p08203l69582P3861N37473R16826
$$ 1987932 2085016 1779118 1159107 336937 -529518 -1237721 -1607303 -1533442 -995969 -79143
15577g9143J050183Q32341L58918j35577m42526n02367m08388l03997k54732j94900
$$ -79143 971040 1803381 2162299 2026722 1584196 1081829 673441 369444 114712 -80188
15567h0188k5141K32814M40913N01283M02700J51818j92734m91789o20839n56483
$$ -80188 -105329 127485 568398 1069681 1472381 1624199 1431465 939676 318837 -237646
15557b37646l69428j53526K5303J58292L26413O02569R01603J039560R03159N15262
$$ -237646 -607074 -760600 -735297 -577005 -250592 351977 1253580 2293140 3196299 3711561
15547C711561l862m86926p99792q54851n73284k0855N84690J057627J270815J167133
$$ 3711561 3707699 3220773 2420981 1566130 992846 971991 1556681 2614308 3885123 5052256
15537E052256Q03032L09297j99936o76118j082725j377434j530143j514415j295927
$$ 5052256 5855288 6164585 5964649 5288531 4205806 2828372 1298229 -216186 -1512113
15528a512113q64839k91209K78998O65991P88292P54606P24789P33891P13194
$$ -1512113 -2376952 -2668161 -2389163 -1723172 -934880 -180274 544515 1278406 1991600
15519A991600O11596M71580M07659M62012N50145N83554N23966L65351K15959
$$ 1991600 2603196 3074776 3482435 3944447 4494592 5078146 5602112 5967463 6183422
15510F183422K65290N47834Q40008Q57243N33884M3717l86537o09654o34402o01444
$$ 6183422 6448712 6996546 7836554 8693797 9227681 9271398 8884861 8275207 7640805 7039361
15500G039361o05371n90824m57656k04541R5567L77101N64307N79835L89751L5623
$$ 7039361 6433990 5843166 5385510 5180969 5276536 5653637 6217944 6797779 7187530 7223153
15490G223153l93322q11911j111703j194077j067566q49720o77584n57534l68839
$$ 7223153 6829831 6017920 4906217 3712140 2644574 1794854 1117270 559736 190897
15481A90897r2711J23342J74205J15297M0248k9682o4775m4J44342K61993K74481
$$ 190897 98186 221528 395733 511030 551278 521596 456821 456777 601119 863112 1137593
15470A137593J77274L6368k9875P3398L39646O46771Q22712P73541N71873L61373
$$ 1137593 1314867 1351235 1321360 1394758 1734404 2381175 3203887 3977428 4549301 4910674
15460D910674K23195J97102L01956M94788O51467O52504M95464K69519Q4917j6683
$$ 4910674 5133869 5330971 5632927 6127715 6779182 7431686 7927150 8196669 8281586 8264903
15450H264903j12816k89947m94896n82530n40895n50849p47256j018737j134689
$$ 8264903 8152087 7862140 7367244 6784714 6243819 5692970 4945714 3926977 2792288
15441B792288j031637q49151o77241m82828k91046k20578l32877n42976o48682
$$ 2792288 1760651 911500 234259 -248569 -539615 -760193 -1093070 -1636046 -2284728
15432b284728m79394q0001L33970O16982P60018P62721O15499L67389Q9420j67876
$$ -2284728 -2764122 -2844123 -2510153 -1893171 -1133153 -370432 245067 612456 701876 534000
15422E34000l50371m31497m16916k89144n6066J90161L29196L11025J16490k81132
$$ 534000 183629 -247868 -664784 -953928 -1009994 -819833 -490637 -179612 -63122 -344254
15412c44254p50623j024406r39425n02546J46741P77674J215914J412784J375530
$$ -344254 -1094877 -2119283 -3058708 -3561254 -3414513 -2636839 -1420925 -8141 1367389
15403A367389J141340P55517K85562j19465k99963k44616r6923j2916o7509k35269
$$ 1367389 2508729 3264246 3549808 3430343 3130380 2885764 2788841 2775925 2708416 2473147
15393B473147m05655m86811m94423n05281n76079o71202o79526n32397k54490
$$ 2473147 2067492 1580681 1086258 580977 4898 -666304 -1345830 -1878227 -2132717
15384b132717Q3202M27639P36097R19767R16194P79098N87074L31971j0246l40856
$$ -2132717 -2049515 -1621876 -885779 33988 950182 1729280 2316354 2648325 2638079 2297223
15374B297223m90417l97670j44347J71560M79191O95868P64403O92573N08902
$$ 2297223 1806806 1409136 1264789 1436349 1915540 2611408 3375811 4068384 4577286
15365D577286K14440j76003n66770q34949r31254q68771o35319k33654J86525
$$ 4577286 4791726 4615723 4048953 3214004 2282750 1413979 778660 545006 731531
15356G31531L97181L05828N4741j08127o8224R3883J99975J06614j69126m97188
$$ 731531 1128712 1434540 1489281 1381154 1312930 1406813 1606788 1713402 1544276 1047088
15346A047088p25436p33465n63038m05211l84903m61506n46061n95684o04982
$$ 1047088 321652 -411813 -974851 -1380062 -1764965 -2226471 -2772532 -3368216 -3973198
15337c973198n96451n70800m70926k30430J16885L99175M51631K53971k1470j18885
$$ -3973198 -4569649 -5140449 -5611375 -5841805 -5724920 -5325745 -4874114 -4620143 -4641613 -4760498
15327d760498P5839M72586Q58038J041704J015145R55545J028913J192471J257606
$$ -4760498 -4684659 -4212073 -3354035 -2312331 -1297186 -341641 687272 1879743 3137349
15318C137349J100651P39175K99274n7035k32924k33845j25698r38L2617o9873
$$ 3137349 4238000 4977175 5276449 5219414 4986490 4752645 4626947 4626009 4658626 4588753
15308D588753k10356k49256j76469q6741k6924k051k5547o4919q5331j28888k53110
$$ 4588753 4378397 4129141 3952672 3865931 3839007 3836956 3811409 3746490 3661159 3532271 3279161
15297C279161m42467o11805o23674l58496J31895O25824Q96661Q32237M71807
$$ 3279161 2836694 2224889 1601215 1242719 1374614 2000438 2897099 3729336 4201143
15288D201143k0341m70357p89166r80045j089171j135930j130752j080829r39789
$$ 4201143 4180802 3710445 2921279 1941234 852063 -283867 -1414619 -2495448 -3435237
15279c435237o84023l87339j29124M7310J17216J33884K31011M91997Q21655J007118
$$ -3435237 -4119260 -4506599 -4635723 -4588413 -4471197 -4337313 -4106302 -3614305 -2792650 -1785532
15269a785532R18490O02160K31682O282J9189J71294K24900L1751k69652m17526
$$ -1785532 -867042 -264882 -33200 -26918 -7729 163565 388465 420216 150564 -266962
15259b66962l69331l13743l96044n82506p63870q72304r23291r86710j090592
$$ -266962 -636293 -950036 -1346080 -1928586 -2692456 -3564760 -4488051 -5474761 -6565353
15250f565353j133658r10447l38256L58130Q35978R57556Q61324P92439Q73683
$$ -6565353 -7699011 -8609458 -8947714 -8589584 -7753606 -6796050 -5934726 -5142287 -4268604
15241d268604J055714J214520J230041J091638Q95251O79666M02257O2597k72107
$$ -4268604 -3212890 -1998370 -768329 323309 1218560 1898226 2300483 2363080 2090973
15232B090973n32549o86819p50876p67219p70714p69233o95639m74581j55959
$$ 2090973 1558424 871605 120729 -646490 -1417204 -2186437 -2882076 -3356657 -3512616
15223c512616J31883L19468M16217M73389N76103P54614Q94010Q35963N70730
$$ -3512616 -3380733 -3061265 -2645048 -2171659 -1595556 -840942 53068 889031 1459761
15214A459761K45865K724j20238j39496m9635J24908K48862K06630O8006m899
$$ 1459761 1705626 1708350 1588112 1448616 1398981 1523889 1772751 1979381 2047387 2042488
15204B042488M8791J66199K56644K67828K12416J28277K8073o9938j54428k69207
$$ 2042488 2091279 2257478 2514122 2781950 2994366 3122643 3150716 3080778 2926350 2657143
15194B657143m31750n72349o32905o36092o19759n79471m84654l01270m5576J79229
$$ 2657143 2225393 1653044 1020139 384047 -235712 -815183 -1299837 -1601107 -1646683 -1467454
15184a467454K76854K43022J56695J17478J54978K08720J85095M9067j24419k39323
$$ -1467454 -1190600 -947578 -790883 -673405 -518427 -309707 -124612 -75545 -199964 -439287
15174d39287k66250k06221o4162J10861K31606K52979K27692K01157Q8681j53223
$$ -439287 -705537 -911758 -975920 -865059 -633453 -380474 -152782 48375 137056 -16167
15164a6167l43871k71862N1984M29657O39833N55789J91635l33220q70569j244490
$$ -16167 -360038 -631900 -579916 -150259 489574 1045363 1236998 903778 33209 -1211281
15154a211281j292122j008305n39935q1115K24613L83167M96299O01119O34697
$$ -1211281 -2503403 -3511708 -4051643 -4132758 -3908145 -3524978 -3028679 -2427560 -1792863
15145a792863N49515L93830K44168J33543Q7109J36893K82777N07627P86830J008134
$$ -1792863 -1243348 -849518 -605350 -471807 -384698 -247805 34972 542599 1329429 2337563
15135B337563R51844N26164m0773m34547n77084o19714o97282p88003q05889p51188
$$ 2337563 3289407 3815571 3774798 3340251 2763167 2143453 1446171 658168 -147721 -898909
15125h98909p17947o75947m12134J67295Q59135J348515J526888J551311J556398
$$ -898909 -1616856 -2292803 -2704937 -2537642 -1678507 -329992 1196896 2748207 4304605
15116D304605J477231J216734P90329K59958l23250q98624j387615j718800j858326
$$ 4304605 5781836 6998570 7788899 8048857 7725607 6826983 5439368 3720568 1862242
15107A862242j808184j600704j340991j152389r90266o86623k22862K26312M92222
$$ 1862242 54058 -1546646 -2887637 -4040026 -5030292 -5716915 -5939777 -5713465 -5221243
15098e221243M98655K87459O1281N6084L26647P57737J231447J617458J725600
$$ -5221243 -4722588 -4435129 -4373848 -4317764 -3991117 -3233380 -2001933 -384475 1341125
15089A341125J449688R02831L20280j37384m12202m67440k73714J36317O53695
$$ 1341125 2790813 3693644 4013924 3876540 3464338 2996898 2723184 2859501 3513196
15080C513196J104455J260331R64207K86549m84403j040216j253355j196848r98283
$$ 3513196 4617651 5877982 6842189 7128738 6644335 5604119 4350764 3153916 2155633
15071B155633p35710m53880k05255n3771n0140j96971m07310n48017n58483m72696
$$ 2155633 1419923 966043 760788 707017 656877 459906 52596 -495421 -1053904 -1526600
15061a526600l59352l04400l67399n19601o41353o04985l80508m0266K73436M12965
$$ -1526600 -1885952 -2190352 -2557751 -3077352 -3718705 -4323690 -4704198 -4744464 -4471028 -4058063
15051d058063L35608J19105r5638j70666l4658K79993O20761Q14992Q08613O63344
$$ -4058063 -3722455 -3603350 -3698988 -3869654 -3904312 -3624319 -3003558 -2188566 -1379953 -716609
15041g16609M83540L32718J91942L9616q0617j33204j73012k86966m42133n23519
$$ -716609 -233069 99649 291591 331207 250590 117386 -55626 -342592 -784725 -1308244
15031a308244n23922n08272m52323l09922j74162j90178l01126k82775m8778K61346
$$ -1308244 -1832166 -2340438 -2792761 -3102683 -3276845 -3467023 -3768149 -4050924 -4099702 -3838356
15021c838356M57496M56675K87330K9038j71531j41868J71754O38061R89178R82877
$$ -3838356 -3380860 -2924185 -2636855 -2607817 -2779348 -2921216 -2749462 -2111401 -1122223 -139346
15011a39346N91855K0293m74721p37354p20403m88633k57055k60164n13587p98896
$$ -139346 452509 472802 -1919 -739273 -1459676 -1948309 -2205364 -2465528 -2979115 -3778011
15001c778011r28151r12761q59598q05057o50734k71055L10812Q90978J215502
$$ -3778011 -4706162 -5618923 -6478521 -7283578 -7934312 -8205367 -7894555 -7003577 -5788075
14992e788075J205893J020289Q34530O88050N09508J86436k79607o87747q06465
$$ -5788075 -4582182 -3561893 -2727363 -2039313 -1529805 -1343369 -1622976 -2310723 -3117188
14983c117188n96863k48462k604O1635L2241O713j4429j07078l02474m92401m90554
$$ -3117188 -3714051 -3962513 -3965117 -3903482 -3871241 -3864528 -3878957 -3986035 -4288509 -4780910 -5271464
14972e271464k12014J83148L85392K21201k02550o20766q34206p64269l93553
$$ -5271464 -5483478 -5300330 -4914938 -4693737 -4896287 -5517053 -6351259 -7115528 -7509081
14963g509081J88830P65235J152148J292649J219461J010915O82263J96633l74574
$$ -7509081 -7320251 -6555016 -5402868 -4110219 -2890758 -1879843 -1197580 -1000947 -1375521
14954a375521q26824r79500p76105k92130K46237N58823N56520M07781L14912
$$ -1375521 -2202345 -3181845 -3957950 -4250080 -4003843 -3445020 -2888500 -2480719 -2165807
14945b165807L29657L70798L08869N4999l45733p09082q76335q38770o79578m95320
$$ -2165807 -1836150 -1465352 -1156483 -1101484 -1447217 -2156299 -3032634 -3871404 -4550982 -5046302
14935e046302l34907j69165M4919K79831M56327N17122M35557K26298p774j35634
$$ -5046302 -5381209 -5550374 -5505455 -5225624 -4769297 -4252175 -3816618 -3590320 -3598094 -3733728
14925c733728j24901m3561M0604P9574J6525j33167k58655k88357k31092j31451
$$ -3733728 -3858629 -3902190 -3861586 -3782012 -3765487 -3898654 -4157309 -4445666 -4676758 -4808209
14915d808209n9684q2213j80785k40957j62199L0819K17560L26792L61149L13868
$$ -4808209 -4867893 -4950106 -5130891 -5371848 -5534047 -5503228 -5285668 -4958876 -4597727 -4283859
14905d283859J94919P5186M6906J83917M34852N88533M98827K38305k9322k03046
$$ -4283859 -4088940 -4013754 -3966848 -3782931 -3348079 -2759546 -2260719 -2022414 -2051736 -2254782
14895b254782k57427k13780j33070k6159K01337N90974J004928J227525J132947
$$ -2254782 -2512209 -2725989 -2859059 -2885218 -2683881 -2092907 -1087979 139546 1272493
14886A272493P73739L68853J39434J77107M81130R51975J354150J461468J243230
$$ 1272493 2046232 2415085 2554519 2731626 3212756 4164731 5518881 6980349 8223579
14877H223579Q05398K57189k80658o79613r21804j134656j387415j528433j377034
$$ 8223579 9028977 9286166 9005508 8325895 7404091 6269435 4882020 3353587 1976553
14868A976553r79227n37758k07983j1980J40086L38366N69833P16279O81267N05364
$$ 1976553 997326 459568 251585 239605 379691 718057 1287890 2004169 2685436 3190800
14858C190800L45139L31041M35142M92382L20208q3862m96654p21671p62267p26558
$$ 3190800 3535939 3866980 4302122 4794504 5114712 5030850 4534196 3812525 3050258 2323700
14848B323700o85983o33258n02335k25081J60024M87070O16014N47338L73775
$$ 2323700 1637717 1004459 502124 277043 437067 924137 1540151 2087489 2461264
14839B461264K30023K36210L80640M94755M09429J09667l08383p23631r96544
$$ 2461264 2691287 2927497 3308137 3802892 4212321 4321988 4013605 3289974 2293430
14830B293430j022735q15373m78323j11429K04525L99798M94191N83153P13524
$$ 2293430 1270695 455322 -23001 -134430 70095 469893 964084 1547237 2260761
14821B260761Q62104R68288R48201P38236L59787o8166m22979o58034p64384p51555
$$ 2260761 3122865 4091153 5039354 5777590 6137377 6069211 5646232 4988198 4223814 3472259
14811C472259o86208o23909n71530n77419o85859q51103r93063j034749q95396
$$ 3472259 2786051 2162142 1590612 1013193 327334 -523769 -1516832 -2551581 -3446977
14802c446977n66729j76215J24211K85906L14109K12934K4740j86325l94180n92423
$$ -3446977 -4013706 -4189921 -4065710 -3779804 -3465695 -3252761 -3228021 -3414346 -3808526 -4400949
14792d400949o93433n19889L0384Q35392J552719J842756J646930J220116Q99991
$$ -4400949 -5094382 -5614271 -5583887 -4748495 -3195776 -1353020 293910 1514026 2414017
14783B414017Q25738Q69371Q27526O22801K85823r8824l96314n46604o32327p17777
$$ 2414017 3239755 4109126 4936652 5559453 5845276 5746452 5350138 4803534 4171207 3453430
14773C453430p80731q19005q42033q17467p40263o52607n74821n07045m29754
$$ 3453430 2672699 1853694 1011661 194194 -546069 -1198676 -1773497 -2280542 -2710296
14764b710296l17281k06424j71967k39780l89286n80675p44254q16773q05822
$$ -2710296 -3027577 -3234001 -3405968 -3645748 -4035034 -4615709 -5359963 -6176736 -6982558
14755f982558p62373p03945o19746n12513l78634j78846J07546M21262O37253
$$ -6982558 -7744931 -8448876 -9068622 -9581135 -9959769 -10138615 -10031069 -9609807 -8972554
14746h972554O88824O69208O87956O71761M66307J12578j42477j25367J01654
$$ -8972554 -8283730 -7614522 -6926566 -6254805 -5788498 -5675920 -5818397 -5943764 -5842110
14737e842110L12110L10405J06532j48198l25486l44562k22943j39999k45743
$$ -5842110 -5530000 -5219595 -5113063 -5261261 -5586747 -5931309 -6154252 -6294251 -6539994
14728f539994m43243m67293j53807L69395P62073P77423M71293O6302k67317m30866
$$ -6539994 -6983237 -7450530 -7604337 -7234942 -6472869 -5695446 -5224153 -5157851 -5425168 -5856034
14718e856034l68871j09639K38222N75249Q73108J113976J237865J208076J065281
$$ -5856034 -6224905 -6334544 -6096322 -5521073 -4647965 -3533989 -2296124 -1088048 -22767
14709b2767Q75952O86714N50832N38103O90387R35864J030916P52551K06551k77371
$$ -22767 853185 1539899 2090731 2628834 3319221 4255085 5286001 6038552 6245103 5967732
14699E967732n57643p39692r06975r99744q99938o32388l93114k91310k68532
$$ 5967732 5410089 4670397 3763422 2763678 1863740 1231352 838238 546928 278396
14690B78396k42700j74891m0900J69344L77641M30074K26569j58001n05768o32901
$$ 278396 35696 -139195 -180095 -10751 366890 796964 1023533 865532 359764 -273137
14680b73137m82042j32202K34216M67207N11145L84204J90673M9734l3588j50081
$$ -273137 -755179 -887381 -653165 -185958 325187 709391 900064 949798 916210 766129
14670G66129l48521n74663o90255n63146j89988K84814O55427P74510O55415M32193
$$ 766129 417608 -157055 -847310 -1410456 -1600444 -1315630 -660203 114307 769722 1201915
14660A201915K06764J6746j16658j99587k35489j98575r1672j2063r6520l49594
$$ 1201915 1408679 1425425 1308767 1109180 873691 675116 583444 571381 474861 125267
14650A25267o36927q47311r48150r14075p42300n03657k68816o8330R3155K33519
$$ 125267 -511660 -1358971 -2307121 -3221196 -3963496 -4467153 -4735969 -4804299 -4711144 -4477625
14640d477625L57124M42602N30160P16176R87642J194334J246303J193320J085895
$$ -4477625 -4120501 -3677899 -3147739 -2431563 -1443921 -249587 996716 2190036 3275931
14631C275931R00056O06359K61921j4828j31562j02119q4041k30228m75968o02947
$$ 3275931 4175987 4782346 5044267 5029439 4897877 4795758 4711717 4481489 4005521 3402574
14621C402574m67301j14158K61773N13065O37294O43878N05627K63242M7272n1718
$$ 3402574 2935273 2821115 3082888 3595953 4233247 4877125 5382752 5645994 5693266 5641548
14611E641548r2168k14730m71472p65882j001870j186000j333607j383083j238913
$$ 5641548 5549380 5334650 4863178 4097296 3095426 1909426 575819 -807264 -2046177
14602b046177q90836m44394m2622K19746L37249L63548L66345L60780K88079J16049
$$ -2046177 -2937013 -3381407 -3424029 -3204283 -2867034 -2503486 -2137141 -1776361 -1488282 -1372233
14592a372233j01582k76269l34094k56202q8042J09595K76913L68692L99977M09108
$$ -1372233 -1473815 -1750084 -2084178 -2340380 -2428422 -2318827 -2041914 -1673222 -1273245 -864137
14582h64137L91141L54515L64060M62525O00950O75683O29745N07256L77183K50657
$$ -864137 -472996 -118481 245579 708104 1309054 1984737 2614482 3121738 3498921 3749578
14572C749578R3064j23153l61589n40240o36482o71088n96685l34752N9864M11386
$$ 3749578 3842642 3719489 3357900 2817660 2181178 1510090 913405 578653 638517 1049903
14562A049903O01963O02624M37402K03145K59j70476m00272p40114j100781j312532
$$ 1049903 1651866 2254490 2691892 2895037 2895296 2724820 2324548 1584434 483653 -828879
14552h28879j282512j064559p39742l08710K20762P31260J089868J303586J462344
$$ -828879 -2111391 -3175950 -3915692 -4224402 -4003640 -3272380 -2182512 -878926 583418
14543E83418J543606J423176J080623O72136L75555K24954J54789J31268J47725
$$ 583418 2127024 3550200 4630823 5302959 5678514 5903468 6058257 6189525 6337250
14534F337250J61077J31349J05347J51621K37042K47232R4351j89892m27823m40436
$$ 6337250 6498327 6629676 6735023 6886644 7123686 7370918 7465269 7275377 6847554 6407118
14524F407118j95198J84960M92223N69823L85520K6862l77047q27853j353256
$$ 6407118 6211920 6396880 6889103 7458926 7844446 7871308 7494261 6666408 5313152
14515E313152j748463j739689j320879p56378l00013j1028J72151L25369M87967
$$ 5313152 3564689 1825000 504121 -252257 -552270 -563298 -391147 -65778 422189
14506D22189O55709Q23080R75748J049993R86050P82440M51249K8977l25731m02828
$$ 422189 1077898 1900978 2876726 3926719 4912769 5695209 6146458 6175435 5849704 5446876
14496E446876j91412P4346J68659O6978j49785m26628p24354r86220j154987j188152
$$ 5446876 5255464 5329810 5498469 5565447 5415662 4989034 4264680 3278460 2123473 935321
14486I35321j038524o38736J9968P84115J414036J754865J761995J447795R11921
$$ 935321 -103203 -741939 -721971 62144 1476180 3231045 4993040 6440835 7352756
14477G352756L30284j76216n66645p74023p26782m55849q4407K77257O02560R22815
$$ 7352756 7683040 7506824 6940179 6166156 5439374 4983525 4899118 5176375 5778935 6701750
14467F701750J262674J570446J737547J698415J470695J101798O46379K34401
$$ 6701750 7964424 9534870 11272417 12970832 14441527 15543325 16189704 16424105
14459A6424105Q480l0661l9870j79741m83818q55868j114895j125266q54775l23739
$$ 16424105 16432585 16401924 16362054 16182313 15698495 14842627 13727732 12602466 11747691 11423952
14449A1423952L21521Q18670R98843Q85001O32003M07372K37272M8349j47381
$$ 11423952 11745473 12564143 13562986 14447987 15079990 15487362 15724634 15772983 15625602
14440A5625602k64405k74444k58929l39225n19244o88346p80912q10273p93715
$$ 15625602 15361197 15086753 14827824 14488599 13969355 13281009 12500097 11689824 10896109
14431A0896109p17789n71884m11181k91734k04183j39615j29374j94371k94872
$$ 10896109 10178320 9606436 9195255 8903521 8699338 8559723 8430349 8235978 7941106
14422G941106l65844l92261l85688l27042j97962l4870P3059O9459J022n0934
$$ 7941106 7575262 7183001 6797313 6470271 6272309 6237439 6310498 6379957 6380979 6330045
14412F330045p7164j12685j49980j67789j98899k97297m39531n46290o13658p12461
$$ 6330045 6252881 6140196 5990216 5822427 5623528 5326231 4886700 4340410 3726752 3014291
14402C014291q27047q02477n19990m9756L89479N99314N37913K81637o4908l97813
$$ 3014291 2187244 1384767 864777 815021 1204500 1803814 2341727 2623364 2558456 2160643
14392B160643o64920q77397j055679j189076j204815r94648n52436l0606L96184
$$ 2160643 1495723 618326 -437353 -1626429 -2831244 -3825892 -4378328 -4408934 -4012750
14383d012750O92832R75715J356649J802968K165012K282543K074587J580695
$$ -4012750 -3319918 -2344203 -987554 815414 2980426 5262969 7337556 8918251
14375H918251R28595K47575l93633r00802j104748r16839m55121L026J93824O2214
$$ 8918251 9846846 10094421 9700788 8799986 7695238 6778399 6323278 6326304 6520128 6582342
14365F582342k22837m72629n67995m00645N5566O33208J071232J233795J173611
$$ 6582342 6359505 5886876 5318881 4918236 4973802 5607010 6678242 7912037 9085648
14356I085648J017815Q50175O41464K96439j87979o74117r90594j028786p89989
$$ 9085648 10103463 10953638 11595102 11891541 11703562 11029445 10038851 9010065 8220076
14347H220076l91300L5401M19287O71039O66777L90289l4032m33475o59542o78609
$$ 8220076 7828776 7864177 8283464 8954503 9621280 10011569 9977537 9544062 8884520 8205911
14337H205911n86472m86944m42295m88055n93248o69132o49787n29988l53255
$$ 8205911 7619439 7132495 6690200 6202145 5608897 4939765 4289978 3759990 3406735
14328C406735j53387R8628M47403Q44790J150304J284753J327594J391044J473421
$$ 3406735 3253348 3351976 3799379 4644169 5794473 7079226 8406820 9797864 11271285
14319A1271285J494159J391773J181755R32846P36887P36910J070841J775702
$$ 11271285 12765444 14157217 15338972 16271818 17008705 17745615 18816456 20592158
14311B0592158K788032L926707M858182N242189M938029M003143K566846Q12221
$$ 20592158 23380190 27306897 32165079 37407268 42345297 46348440 48915286 49727507
14303D9727507r26247k239115k907552l006818k765526k370907j937739j594926
$$ 49727507 48801260 46562145 43654593 40647775 37882249 35511342 33573603 31978677
14295C1978677j422902j358629j318994j266907j075222o01649M2750N19562O27844
$$ 31978677 30555775 29197146 27878152 26611245 25536023 24934374 24977124 25496686 26124530
14286B6124530N39273O00827R89549J609058K287442K930237L465964L825926
$$ 26124530 26663803 27264630 28254179 29863237 32150679 35080916 38546880 42372806
14278D2372806L991284L954142L627613K851654J526925k18965k006431l392327
$$ 42372806 46364090 50318232 53945845 56797499 58324424 58105459 56099028 52706701
14270E2706701m128513m243054l929516l401621k773452k067058j362166q35030
$$ 52706701 48578188 44335134 40405618 37003997 34230545 32163487 30801321 29966291
14262B9966291n75868m53915k69411L4944L80075O19812N76142K02159l10087
$$ 29966291 29390423 28936508 28667097 28702041 29082116 29701928 30278070 30480229 30170142
14253C0170142p44149j045940j212147j209487j072740r15948p96563o91050n97425
$$ 30170142 29425993 28380053 27167906 25958419 24885679 23969731 23173168 22482118 21884693
14244B1884693n29107m85685m77394m78278m14625k54615p5389J814m3450p7598
$$ 21884693 21355586 20869901 20392507 19914229 19499604 19244989 19169600 19171414 19127964 19050366
14234A9050366J5665J62936K47206L01345M20316O35361R18267J167484J268555
$$ 19050366 19066031 19228967 19476173 19777518 20197834 20833195 21751462 22918946 24187501
14225B4187501J229773J176928J226192J325047J243388Q50308L01817j32030
$$ 24187501 25417274 26594202 27820394 29145441 30388829 31239137 31540954 31408924
14217C1408924k88992k06329r1512j17595k44660l16995k74897j56911K5576K83317
$$ 31408924 31119932 30913603 30822091 30704496 30459836 30142841 29867944 29711033 29736609 30019926
14207C0019926N76070Q18775R58415J006342J018978J056649J149967J336199
$$ 30019926 30595996 31414771 32373186 33379528 34398506 35455155 36605122 37941321
14199C7941321J632027J990680K387259K878024L467350M007291M358157M510896
$$ 37941321 39573348 41564028 43951287 46829311 50296661 54303952 58662109 63173005
14191F3173005M557451M651405M951827N605992O761938Q506205J0783709J3453719
$$ 63173005 67730456 72381861 77333688 82939680 89701618 98207823 108991532 122445251
14183A22445251J6423956J9686879K3266780K7052224L0495920L2365137L0779921
$$ 122445251 138869207 158556086 181822866 208875090 239371010 271736147 302516068
14176C02516068K3915113J1577188l443583j6492864k4277727k6507053k4846357
$$ 302516068 326431181 338008369 334564786 318071922 293794195 267287142 242440785
14169B42440785k1281285j7157088j3026513r004773n088619j278114K410159
$$ 242440785 221159500 204002412 190975899 181971126 176882507 175604393 178014552
14162A78014552O043930R798147J3844208J8241066K2719633K6399543K7804386
$$ 178014552 184058482 193856629 207700837 225941903 248661536 275061079 302865465
14155C02865465K5246233J7658131N900619o829661j6862611k2443785k4047122
$$ 302865465 328111698 345769829 351670448 344840787 327978176 305534391 281487269
14148B81487269k3156036k1248213j9306688j7687161j6326290j5017202j3609968
$$ 281487269 258331233 237083020 217776332 200089171 183762881 168745679 155135711
14141A55135711j2141679j0747886r502532q392071p384889o521385n921457n633409
$$ 155135711 142994032 132246146 122743614 114351543 106966654 100445269 94523812 88890403
14133H8890403n529417n406231n145154m782170m422447m075858l699746l353013
$$ 88890403 83360986 77954755 72809601 68027431 63604984 59529126 55829380 52476367
14125E2476367l117830k941117k722645k462742k229147k104234k121583k155139
$$ 52476367 49358537 46417420 43694775 41232033 39002886 36898652 34777069 32621930
14117C2621930k007783j642624j183707p66789n00139m24177m36486m04999l40059
$$ 32621930 30614147 28971523 27787816 27021027 26520888 26096711 25660225 25255226 24915167
14108B4915167l55638m99584o79179p47680o38113l91087p3150K58098N22696
$$ 24915167 24559529 24059945 23380766 22633086 21994973 21603886 21530736 21788834 22311530
14099B2311530O60019O81614O11811M73806L23653J95938N5098j33338l07312
$$ 22311530 22971549 23653163 24264974 24738780 25062433 25258371 25313469 25180131 24872819
14090B4872819l45663j96809P2340L13057L86155L08939K52886L55380O06613
$$ 24872819 24527156 24330347 24402687 24715744 25101899 25410838 25663724 26019104 26625717
14081B6625717R02937J166600J409516J690414K029844K310547K306690J898273
$$ 26625717 27528654 28695254 30104770 31795184 33825028 36135575 38442265 40340538
14073D0340538J169628K86422o01969j356287j851948k055367k056699j944867
$$ 40340538 41510166 41796588 41194619 39838332 37986384 35931017 33874318 31929451
14065C1929451j732023j411461j044095p68752o61464o38244n51932l57398j36292
$$ 31929451 30197428 28785967 27741872 26973120 26311656 25673412 25121480 24764082 24627790
14056B4627790K5416Q1229k8661l70409r07588j440204j754096j822504j782691
$$ 24627790 24653206 24734435 24705774 24335365 23427777 21987573 20233477 18410973 16628282
14047A6628282j751807j733607j651802j446737j133602p53232l65641j22590
$$ 16628282 14876475 13142868 11491066 10044329 8910727 8157495 7791854 7669264
14039G669264j72526m50020p50559r55763j056241j082284j052487r40550p15933
$$ 7669264 7496738 7046718 6296159 5340396 4284155 3201871 2149384 1208834 492901
14030D92901m18485j28876J07989K84217M35706O01625P23222O95435N04166K28103
$$ 492901 74416 -54460 53529 337746 773452 1375077 2098299 2793734 3297900 3526003
14020C526003q794p2515J39406O57689J382953K113759K657826K920327K953957
$$ 3526003 3517209 3444694 3584100 4241789 5624742 7738501 10396327 13316654 16270611
14011A6270611K851775K587735K133359J601419J110573O96886L99895K49734
$$ 16270611 19122386 21710121 23843480 25444899 26555472 27252358 27652253 27901987
14003B7901987J57631n3217n02758j174863j876195k302181k268466j855933j303019
$$ 27901987 28059618 28006401 27503643 26328780 24452585 22150404 19881938 18026005 16722986
13994A6722986q20221m92807k67070k8351K78946O12513R29791J249099J529331
$$ 16722986 15902765 15409958 15142888 15114537 15393483 16005996 16935787 18184886 19714217
13985A9714217J637462J507049J219596R40864P66248N83978J68444n54347j368843
$$ 19714217 21351679 22858728 24078324 25019188 25785436 26369414 26537858 25983511 24614668
13976B4614668j906024j961192j672579j332490j126288j094915j184854j285766
$$ 24614668 22708644 20747452 19074873 17742383 16616095 15521180 14336326 13050560
13968A3050560j290726j132233p88841l48563o087R4952P261q1899q2914o4568
$$ 13050560 11759834 10627601 9838760 9490197 9484110 9579062 9586323 9504424 9421510 9356942
13958I356942r1621j53738k01868j86042j26309j18172k01576l06423l70030l96944
$$ 9356942 9265321 9111583 8909715 8723673 8597364 8479192 8277616 7971193 7601163 7204219
13948G204219m27825n10259o30966o83041n51288k02602K74845O43814O22703
$$ 7204219 6776394 6266135 5635169 4952128 4400840 4198238 4473083 5116897 5739600
13939E739600J40621n79604j237440j647926j748441j590886j280425q54095l29395
$$ 5739600 5880221 5300617 4063177 2415251 666810 -924076 -2204501 -3058596 -3387991
13930c387991J97109O00656Q17982Q51315P35261N04147K26684O5206J76403N61417
$$ -3387991 -3190882 -2590226 -1772244 -920929 -185668 318479 545163 610369 786772 1348189
13920A348189J030820J324627J341847J186538R91234P98886N85056L21485L6009
$$ 1348189 2379009 3703636 5045483 6232021 7223255 8022141 8607197 8928682 8964691
13911H964691j81068k51881j39501J53225N53602R16053J110361J145120J080895
$$ 8964691 8783623 8531742 8392241 8545466 9099068 10015121 11125482 12270602 13351497
13902A3351497Q72857M90171P4717j85709k60587k64684l17722m56076o88020
$$ 13351497 14224354 14714525 14789242 14603533 14342946 14078262 13760540 13304464 12616444
13893A2616444j044826j477336j785446j754882j371618q47993m23734k21188
$$ 12616444 11571618 10094282 8308836 6553954 5182336 4334343 3910609 3689421
13885C689421k53397m10095n18250m92481l79614k99743l24751l84761l20449
$$ 3689421 3436024 3025929 2507679 2015198 1635584 1335841 1011090 626329 305880
13876C05880m3686L64941P34043R52498R99172Q84467O10127J85310k72844n92944
$$ 305880 262194 627135 1361178 2313676 3312848 4197315 4807442 4992752 4719908 4126964
13866D126964p46205p75121o46233l74167j29037p0714j84007l84437o33958q58514
$$ 4126964 3380759 2605638 1959405 1585238 1456201 1385487 1201480 817043 183085 -675429
13856f75429r26323p40683l24007J59879N21357O92182P74004R02507J051924
$$ -675429 -1601752 -2342435 -2666442 -2506563 -1985206 -1293024 -519020 383487 1435411
13847A435411J084996R29235O28089K56547j54268n93840j017673j296925j268295
$$ 1435411 2520407 3449642 4077731 4334278 4180010 3586170 2568497 1271572 3277
13838C277q94673l23411K34141O85028J046615J304768J420776J382877J200873
$$ 3277 -891396 -1214807 -980666 -295638 750977 2055745 3476521 4859398 6060271
13829F060271R17553N70666J56862l16806p98275j182210j352241j260423r55352
$$ 6060271 6977824 7548490 7705352 7388546 6590271 5408061 4055820 2795397 1840045
13820A840045n90277l54370l10071l46740k98892r3969J92743M27668N42850N77115
$$ 1840045 1249768 895398 585327 238587 -60305 -154274 38469 466137 1008987 1586102
13810A586102N80464M91897K22287j79407n52991p66425p83969o71512n55515
$$ 1586102 2166566 2658463 2880750 2701343 2148352 1381927 597958 -73554 -629069
13801f29069m73344l12866k802L96053Q21191J188748J311059J062206N70242
$$ -629069 -1102413 -1415279 -1418081 -1022028 -200837 987911 2298970 3361176 3931418
13792C931418P8421k40364k80832n2828K79330M93976N01062L90398K45841P6460
$$ 3931418 4009839 3769475 3488643 3435815 3715145 4209121 4710183 5100581 5346422 5422882
13782E422882r3739k08887k31062k14787k28742j99143j144L43575O65141P81882
$$ 5422882 5329143 5120256 4889194 4674407 4445665 4246522 4245378 4588953 5254094 6035976
13772F035976O43933L74535J12398j40494m43747p79172j044292j131271r89270
$$ 6035976 6679909 7054444 7166842 7026348 6582601 5803429 4759137 3627866 2638596
13763B638596o55991k61267K1908J17646J47540K73800M54835M97803L10177l3750
$$ 2638596 1982605 1721338 1743246 1860892 2008432 2282232 2737067 3234870 3545047 3511297
13753C511297m29818q18684j154146j381149j413760j147780n78182J33137P56977
$$ 3511297 3081479 2262795 1108649 -272500 -1686260 -2834040 -3412222 -3279085 -2522108
13744b522108J144296J261548J120556P34304J34935n74831j214925j611800j715185
$$ -2522108 -1377812 -116264 1004292 1738596 1873531 1298700 83775 -1528025 -3243210
13735c243210j617640j390855j021312n69401j68757J43797M22045O82651Q91190
$$ -3243210 -4860850 -6251705 -7273017 -7842418 -8011175 -7867378 -7445333 -6762682 -5871492
13726e871492R90682R22965O64349K76424q0182k75851k92782j54437J18514M68774
$$ -5871492 -4880810 -3957845 -3293496 -3017072 -3097254 -3373105 -3665887 -3820324 -3701810 -3233036
13716c233036P93334R98621J035170R02477O38246L28709J17463Q4625J65152
$$ -3233036 -2439702 -1441081 -405911 496566 1134812 1463521 1580984 1665609 1830761
13707A830761K81973M11320M91454M00851P5784l91836p83133q95738p39384n14013
$$ 1830761 2112734 2524054 3015508 3416359 3492143 3100307 2317174 1421436 682052 168039
13697A68039l59490k47280j38685r6344j24493j06126j4209L1325m2318j56119
$$ 168039 -191451 -438731 -577416 -673760 -798253 -904379 -918588 -887263 -929581 -1085700
13687a085700j91012j43061j08142j21044j38439j44778j44662q4920R3415L21315
$$ -1085700 -1276712 -1419773 -1527915 -1648959 -1787398 -1932176 -2076838 -2161758 -2068343 -1747028
13677a747028M59822M46312L47631L23491M69553P03310Q94709J039437J205818
$$ -1747028 -1287206 -840894 -493263 -169772 299781 1003091 1897800 2937237 4143055
13668D143055J384343J453404J255564P43057O2829n53601r54418j103124j043693
$$ 4143055 5527398 6980802 8236366 8979423 9042252 8488651 7534233 6431109 5387416
13659E387416q89475p28291n13720j49208K98460N81503N50675L54652K99328
$$ 5387416 4497941 3769650 3255930 3106722 3405182 3986685 4537360 4892012 5191340
13650E191340M99728P26883O71737K80075k58080p24087r90248j009601p97864
$$ 5191340 5691068 6417951 7089688 7369763 7111683 6387596 5397348 4387747 3589883
13641C589883m57384j48792L0053J30605K66206M48405N73089N68018M44657K44053
$$ 3589883 3132499 2983707 3013760 3144365 3410571 3858976 4432065 5000083 5444740 5688793
13631E688793J698k59241m90506o01255n37041l86380k92472k85418l11396k94195
$$ 5688793 5690491 5431250 4940744 4339489 3802448 3416068 3123596 2838178 2526782 2232587
13621B232587j95116r6774j32970l03176m05145k06525K74992P66206J050005
$$ 2232587 2037471 1940697 1807727 1504551 1099406 892881 1167873 1934079 2984084
13612B984084J093955R24524N62428N2469m95951r35940j147569j099311q79852
$$ 2984084 4078039 5002563 5564991 5617460 5121509 4185569 3038000 1938689 1058837
13603A058837o26881m41965l66276l69447m06025m63668m71848l08036J2363K96788
$$ 1058837 431956 -10009 -376285 -745732 -1151757 -1615425 -2087273 -2395309 -2382946 -2086158
13593b086158L85268K97386J32757n8187k26236k73729j53023L8546J25667N6342
$$ -2086158 -1700890 -1403504 -1270747 -1328934 -1555170 -1828899 -1981922 -1943376 -1817709 -1761367
13583a761367k7231J9293K03679M75551P70761R46230Q43226M52316o7447n23349
$$ -1761367 -1788598 -1769305 -1565626 -1090075 -319314 626916 1470142 1922458 1855011 1331662
13573A331662p97635q61219p75336o51927n59360n02143m80108m99313n31050
$$ 1331662 534027 -327192 -1102528 -1754455 -2313815 -2815958 -3296066 -3795379 -4326429
13564d326429n49125n49275m88700l20861p3241K08452N11052Q02340J043659
$$ -4326429 -4875554 -5424829 -5913529 -6234390 -6307631 -6099179 -5588127 -4785787 -3742128
13555c742128J196903J201540J078574R71524R76554J034112J009753Q22538N47807
$$ -3742128 -2545225 -1343685 -265111 706413 1682967 2717079 3726832 4549370 5097177
13546E097177L68901L70096M51033M72671M43059M82763N95563O27416M67573
$$ 5097177 5466078 5836174 6287207 6759878 7202937 7685700 8281263 8908679 9376252
13537I376252J16728l79702r31114j440429j831680j983289j787958j322242q37977
$$ 9376252 9492980 9113278 8182164 6741735 4910055 2926766 1138808 -183434 -1021411
13528a021411n53592m61768l80919j96792K7001K02820L56683N75944R07143J256776
$$ -1021411 -1575003 -2036771 -2417690 -2614482 -2587481 -2384661 -2027978 -1452034 -544891 711885
13518G11885J403539J249053R38944O38134L73379J12097j82481n32138q72519
$$ 711885 2115424 3364477 4303421 4941555 5314934 5427031 5244550 4712412 3839893
13509C839893j073059j070805r23464p00193m40386k18017j12741j37503k67830
$$ 3839893 2766834 1696029 772565 72372 -368014 -586031 -698772 -836275 -1104105
13500a104105m23451m32532k14142J12735L82660N14383M96323L44921R1288k14618
$$ -1104105 -1527556 -1960088 -2174230 -2061495 -1678835 -1164452 -668129 -323208 -231920 -446538
13490d46538m86202n96916m32800q907M53082O95998O90652N90927N00384L95797
$$ -446538 -932740 -1529656 -1962456 -1971363 -1518281 -822283 -131631 459296 959680 1355477
13480A355477K34071M0408j04010j50610j34703j34115k14466l92941n86150o52631
$$ 1355477 1589548 1629956 1525946 1375336 1240633 1106518 892052 499111 -87039 -739670
13470g39670n67344m44902m11015n13110o68268p01356m68006L67M49462O14009
$$ -739670 -1307014 -1751916 -2162931 -2676041 -3344309 -4045665 -4513671 -4513304 -4063842 -3449833
13460c449833M75024K21834M0139O301J40162M61879Q92206J209400J234330R57886
$$ -3449833 -2974809 -2752975 -2712836 -2706535 -2566373 -2104494 -1212288 -2888 1231442 2189328
13450B189328M79078p0150n54846q52064q59439n92242k51545m1239L310r1398
$$ 2189328 2668406 2598256 2043410 1191346 331907 -260335 -511880 -553119 -549809 -641207
13440f41207l28589o18960p57415o42696l80270j48314n7821m1750P1410L25906
$$ -641207 -969796 -1588756 -2346171 -2988867 -3369137 -3517451 -3575272 -3617022 -3545612 -3219706
13430c219706N80668O48680M66618J29060k39381n48852p15354o72248m31201
$$ -3219706 -2639038 -1990358 -1523740 -1394680 -1634061 -2182913 -2898267 -3570515 -4001716
13421d001716j08323J61256K67187J36041j65957m25681m51259k47836J9546K41875
$$ -4001716 -4110039 -3948783 -3681596 -3545555 -3711512 -4137193 -4588452 -4836288 -4816742 -4574867
13411d574867M17922N54692O53582O94053N85590K73954r0528k19709R647L88928
$$ -4574867 -4156945 -3602253 -2948671 -2254618 -1669028 -1395074 -1485602 -1705311 -1695664 -1306736
13401a306736N85019M57782J05936l00833o13014p25550o14016l30316K7637L49676
$$ -1306736 -721717 -263935 -157999 -458832 -1071846 -1797396 -2411412 -2741728 -2714091 -2364415
13391b364415N66135O71865O86298O12044M48878K38900P0255J4l5054j53233
$$ -2364415 -1798280 -1126415 -440117 171927 620805 859705 929960 929974 894920 741687
13381G41687l67573o07021q13109r44229r57799q46265o86433n48373m21320l16756
$$ 741687 374114 -232907 -1046016 -1990245 -2948044 -3794309 -4480742 -5029115 -5450435 -5767191
13371e767191k72177k16317n6021J32938K28907K68673L66037N47125P55603Q97586
$$ -5767191 -6039368 -6255685 -6311706 -6178768 -5949861 -5681188 -5315151 -4768026 -4012423 -3114837
13361c114837Q57125O10532L20056K11357L29897N15781O14739N96268M89214
$$ -3114837 -2257712 -1647180 -1327124 -1115767 -785870 -270089 344650 940918 1430132
13352A430132K98415J7686k72458m02878k79501J5029K73680L00186Q6230j65335
$$ 1430132 1728547 1746233 1473775 1070897 791396 806425 1080105 1380291 1466521 1301186
13342A301186k40052r4480J52473L24722K86324N4112j64692j79734m3448Q5761
$$ 1301186 1061134 966654 1119127 1443849 1730173 1784285 1619593 1439859 1396411 1482172
13332A482172J73566K30661J98161P8145j9748l2733P827O4690J18478J16838
$$ 1482172 1655738 1886399 2084560 2162705 2142957 2110224 2118051 2182741 2301219 2418057
13322B418057P6k27270m94164o90255p11845n24271j90159J44434L37276L66984
$$ 2418057 2418133 2190863 1696699 1006444 294599 -229672 -419831 -275397 61879 428863
13312D28863L26854K98292K62805J53342l5254k29747l22305k30733J4623K90274
$$ 428863 755717 1054009 1316814 1470156 1434902 1205155 882850 652117 666740 957014
13302I57014M74770N02890M01095K87255K51397K15855M6351k38064m95419n91095
$$ 957014 1431784 1934674 2335769 2623024 2874421 3090276 3136627 2898563 2403144 1812049
13292A812049m73259k26550k6215o459j94060m84575o88463o76254m43416m6433
$$ 1812049 1338790 1112240 1086025 1079566 885506 400931 -287532 -963786 -1407202 -1453635
13282a453635M12296P45104P87587N58767K62288J24016K29802N12136Q33670
$$ -1453635 -1041339 -296235 491352 1050119 1312407 1436423 1666225 2178361 3012031
13273C012031J074555J148707R91726O46334K63262q4050m40385p98239j076347
$$ 3012031 4086586 5235293 6227019 6873353 7136615 7052565 6612180 5813941 4737594
13264D737594j207375j148232r21818o11298k74263O1514L59231N62221O30189
$$ 4737594 3530219 2381987 1460169 848871 574608 636122 995353 1557574 2187763
13255B187763O30572O85913Q02502Q71961Q33255P18104N68870M18619L03169
$$ 2187763 2818335 3504248 4306750 5178711 6011966 6730070 7298940 7717559 8020728
13246H020728K35743J42311q1071m09190p06340q87348r65536r73268r44237r34496
$$ 8020728 8256471 8398782 8317711 7908521 7202181 6314833 5349297 4376029 3431792 2497296
13236B497296r37093q33153m99521M9621O29263J019058J147872J108903R95243
$$ 2497296 1560203 727050 227529 277150 906413 1925471 3073343 4182246 5177489
13227E177489Q13277N57959K83512P8010j683K2625K1690j36208m18327o84047
$$ 5177489 5990766 6548725 6832237 6910247 6908564 6931189 6952879 6816671 6398344 5714297
13217E714297q34070q55517p86222o45875m45149k28652n4979N4762J12764J12090
$$ 5714297 4880227 4024710 3238488 2592613 2147464 1918812 1863833 1918595 2031359 2143449
13207B143449N1368j6581n6449r0519q1714R0640M32095P29089P63644N42602
$$ 2143449 2194817 2178236 2121787 2031268 1949554 2040194 2472289 3201378 3965022 4507624
13197D507624K10959j27224l99681n19132m61238l16904k15910k00903j93354
$$ 4507624 4718583 4591359 4191678 3672546 3211308 2894404 2678494 2477591 2284237
13188B284237r8145R5517L23465M88982M94464L02703J584k13599k19846j33619
$$ 2284237 2186092 2281609 2605074 3094056 3588520 3891223 3892807 3679208 3459362 3325743
13178C325743j82098l75218m97348m74001m65733n96095q18374r96297j024688
$$ 3325743 3143645 2768427 2271079 1797078 1331345 735250 -83124 -1079421 -2104109
13169b104109q89102o48621l87603j37432J37119M31102O62535P47778O69139
$$ -2104109 -2993211 -3641832 -4029435 -4166867 -4029748 -3598646 -2936111 -2188333 -1519194
13160a519194M74777J93176k06853p21352j217699j507439j501095j257977r42607
$$ -1519194 -1044417 -851241 -1058094 -1779446 -2997145 -4504584 -6005679 -7263656 -8206263
13151h206263o84200m66280k19996J3211J13917N8033m2647q7680p5757J477J82328
$$ -8206263 -8890463 -9356743 -9576739 -9563528 -9449611 -9391578 -9434225 -9521905 -9597662 -9596185 -9413857
13140i413857M09512N55624N82768N70178O22048P86890R87527J072902R35280
$$ -9413857 -9004345 -8448721 -7865953 -7295775 -6673727 -5886837 -4899310 -3826408 -2891128
13131b891128N50213j362n62274j004662j300599j469231j441557j081570m38224
$$ -2891128 -2340915 -2342277 -2904551 -3909213 -5209812 -6679043 -8120600 -9202170 -9640394
13122i640394K21519P02895J017113J264283J497900J638985J556541J275189
$$ -9640394 -9418875 -8715980 -7698867 -6434584 -4936684 -3297699 -1741158 -465969
13114d65969R88810Q67087Q98587R18907Q38411P19839N86059M02755K26366J60235
$$ -465969 522841 1389928 2288515 3207422 4045833 4765672 5351731 5754486 5980852 6141087
13104F141087K29738L83345N27122N31436K65164k88208r37025j407311j570885
$$ 6141087 6370825 6754170 7281292 7812728 8077892 7789684 6852659 5445348 3874463
13095C874463j494410j280304r73639o00093j98209J57700L66831L81290K57259
$$ 3874463 2380053 1099749 126110 -473983 -672192 -514492 -147661 233629 490888
13086D90888J00187l8967j59646k23716j82552n9955P4550J70451K01032J51271
$$ 490888 591075 552108 392462 168746 -13806 -73761 789 171240 372272 523543
13076E23543L0368j18248k54996l20965j93521J78925O66900J032010J052029
$$ 523543 553911 435663 180667 -140298 -333819 -154894 512006 1544016 2596045
13067B596045O74074R2176m25421p66134r74379j125727j247037j297980j200133
$$ 2596045 3270119 3362295 2936874 2170740 1196361 70634 -1176403 -2474383 -3674516
13058c674516r36746n94888k67392K7235L09532N55348P10565P83958Q16688P80599
$$ -3674516 -4611262 -5206150 -5473542 -5446307 -5136775 -4581427 -3870862 -3086904 -2270216 -1489617
13048a489617O65605O07444P26137R38722J060219J007363Q29210O07752M29319
$$ -1489617 -824012 -216568 509569 1448291 2508510 3515873 4345083 4952835 5382154
13039E382154L52344K84909O1892l18501p17660j022673j171242j116639q66064
$$ 5382154 5734498 6019407 6081299 5762798 5045138 4022465 2851223 1734584 868520
13030H68520n45531l63933m47019p13594r53996r85531p16957k08787L39856P44186
$$ 868520 322989 -40944 -487963 -1201557 -2155553 -3141084 -3858041 -4066828 -3726972 -2982786
13020b982786R26705R39268R46892J082020J271335J292115R91851M05939k48334
$$ -2982786 -2056081 -1116813 -169921 912099 2183434 3475549 4467400 4873339 4625005
13011D625005o83078p36304m80572j26487J55971K90270K74932J85289J04108
$$ 4625005 3941927 3205623 2725051 2598564 2754535 3044805 3319737 3505026 3609134
13002C609134O5470K8888j33339m93642r49444j271895j234514q26037l09957
$$ 3609134 3674604 3703492 3570153 3076511 2127067 855172 -379342 -1205379 -1515336
12993a515336L2732J24222N9274m1660j38613k59863l99054m76707m25817k52563
$$ -1515336 -1482604 -1358382 -1299108 -1340768 -1479381 -1739244 -2138298 -2615005 -3040822 -3293385
12983c293385m4206P5131P8547J16537L56970P65493J128277J247266J043068
$$ -3293385 -3337591 -3262460 -3183913 -3067376 -2710406 -1944913 -816636 430630 1473698
12974A473698N63457m3687o26206j085442j365601j429134j249323q37977k93424
$$ 1473698 2037155 1993468 1367262 281820 -1083781 -2512915 -3762238 -4600215 -4893639
12965d893639K03398N01945N84522N05218K97905J8516k27074l75314m31966m11699
$$ -4893639 -4690241 -4188296 -3603774 -3098556 -2800651 -2782135 -3009209 -3384523 -3816489 -4228188
12955d228188k98848j07806M4069P8895J03005K34691L66312L06105Q8689q4447
$$ -4228188 -4527036 -4634842 -4590773 -4511878 -4408873 -4174182 -3807870 -3501765 -3413076 -3497523
12945c497523j46164j88554k63516l47046l88007k92104j5115L67038P71346J164318
$$ -3497523 -3643687 -3832241 -4095757 -4442803 -4830810 -5122914 -5138029 -4770991 -3999645 -2835327
12935b835327J471028J578654J413900R91987M69527N4315j88352l16707l38664
$$ -2835327 -1364299 214355 1628255 2620242 3089769 3144084 2955732 2639025 2300361
12926B300361k26965n2885M5494Q320q6558j13419n7510m9112k02558m56954o40579
$$ 2300361 2073396 2020511 2066005 2074325 1987767 1874348 1816838 1767726 1565168 1108214 467635
12915D67635o68010o03346n43928n05874m30764l17566k93146m51378o73223p03198
$$ 467635 -200375 -803721 -1347649 -1853523 -2284287 -2601853 -2894999 -3346377 -4019600 -4722798
12905d722798m21324K8359M20388O57454P62161P91584P97021P84430P04824N19310
$$ -4722798 -5144122 -5115763 -4695375 -4037921 -3275760 -2484176 -1687155 -902725 -197901 321409
12895C21409K94521J44468O1543p2388l35783o63459q47557p06970k74719J84431
$$ 321409 615930 760398 821941 749553 413770 -249689 -1097246 -1804216 -2078935 -1894504
12885a894504L57511J42040k94047o84974q32262o84026l57796k3915J95305K61050
$$ -1894504 -1536993 -1394953 -1689000 -2373974 -3206236 -3890262 -4248058 -4271973 -4076668 -3815618
12875c815618K22712J28196J6306m9089j7669J05663K46605L22234L14601K55087
$$ -3815618 -3592906 -3464710 -3448404 -3497493 -3515162 -3409499 -3162894 -2840660 -2526059 -2270972
12865b270972J78002J39859J88936K50099J94625L0715j01971j25405j26023j88375
$$ -2270972 -2092970 -1953111 -1764175 -1514076 -1319451 -1288736 -1390707 -1516112 -1642135 -1830510
12855a830510k42613j82756j3570J62366K52332K50261K03251J14118p6522l47514
$$ -1830510 -2073123 -2255879 -2269449 -2107083 -1854751 -1604490 -1401239 -1287121 -1363643 -1711157
12845a711157n52353n76322m21051j47526J56327M04233N52032O01711O07194
$$ -1711157 -2263510 -2839832 -3260883 -3408409 -3252082 -2847849 -2295817 -1694106 -1086912
12836a086912O16752O52396P53096R00041R81613R35490P84785N21153J14286
$$ -1086912 -470160 182236 935332 1835373 2816986 3752476 4537261 5058414 5172700
12827E172700l78486q00742r88047q48487m04759J90357P21323J000925R35957
$$ 5172700 4794214 3993472 3005425 2156938 1752179 1942536 2663859 3664784 4600741
12818D600741N74805J11714k10229l01551k68470k13857j33752k3178Q8427J84884
$$ 4600741 5175546 5287260 5077031 4775480 4507010 4293153 4159401 4136223 4224650 4409534
12808D409534K05035N6676k69001o51353q82005q43621o19611l73937k23377k10107
$$ 4409534 4614569 4671245 4402244 3750891 2868886 2025265 1405654 1031717 808340 598233
12798E98233l13793m66893n71560n77765n38095n06171m56709l30858r7444K21388
$$ 598233 284440 -182453 -754013 -1331778 -1869873 -2376044 -2832753 -3163611 -3261055 -3039667
12788c039667N68879Q78522J067523J046882P93153M11921N1756k29810m55272
$$ -3039667 -2470788 -1592266 -524743 522139 1315292 1727213 1778969 1549159 1093887
12779A093887o67802q97752j102316j213996j199574r98663n83246r5571K31115
$$ 1093887 426085 -471667 -1573983 -2787979 -3987553 -4986216 -5569462 -5665033 -5433918
12770e433918L08962K47959J78385J35318J10698J33585K20754L32037M26177
$$ -5433918 -5124956 -4876997 -4698612 -4563294 -4452596 -4319011 -4098257 -3766220 -3340043
12761c340043M29560K52462o5598l74384n67096o11403n00223k63285K0401K86081
$$ -3340043 -2910483 -2658021 -2723619 -3098003 -3665099 -4276502 -4776725 -5040010 -5019609 -4733528
12751d733528N13241P08269Q60297R10183Q16047O18398L74511R2694k16029n09566
$$ -4733528 -4220287 -3512018 -2651721 -1741538 -925491 -307093 67418 160112 -55917 -565483
12741e65483p44488r07344j001792j010730r45711q74561q21787p37509n78003
$$ -565483 -1309971 -2217315 -3219107 -4229837 -5175548 -6050109 -6871896 -7609405 -8187408
12732h187408l59779j41365L5759J83245L54865N70277P68913Q92138R15460P87512
$$ -8187408 -8547187 -8688552 -8652793 -8469548 -8114683 -7544406 -6775493 -5883355 -4967895 -4180383
12722d180383M80675J01536j37377q5088K21611N91917Q39464R22677Q88012P66251
$$ -4180383 -3699708 -3598172 -3735549 -3820637 -3599026 -3007109 -2167645 -1244968 -356956 409295
12712D09295N95090M10930K22609O8985O935K4743N9322J21001K98446N65609
$$ 409295 1004385 1415315 1637924 1706909 1713844 1738587 1797909 1918910 2217356 2782965
12702B782965P33403O84253N26786M33661M07532L61775L32351L96093N02894
$$ 2782965 3516368 4200621 4727407 5161068 5568600 5930375 6262726 6658819 7161713
12693G161713N66888N93318O13521N83105L87701l3020n64680j011840j287404
$$ 7161713 7728601 8321919 8935440 9518545 9906246 9873226 9308546 8296706 7009302
12684G009302j399102j371532j240963j027778p32582m04408j73835j17266j55338
$$ 7009302 5610200 4238668 2997705 1969927 1237345 832937 659102 541836 386498
12675C86498j67763j13300k7268J8844k4772j02880j02212N2547M11037R66291
$$ 386498 218735 105435 78167 97011 72239 -30641 -132853 -80306 330731 1297022
12665A297022J570357J990699K063978J828723J522894J363272J348061J341185
$$ 1297022 2867379 4858078 6922056 8750779 10273673 11636945 12985006 14326191
12657A4326191J196564P82372R6449o65752j273465j580290j557092j358688j188794
$$ 14326191 15522755 16305127 16401576 15735824 14462359 12882069 11324977 9966289 8777495
12648H777495j079741r83068r05038q44313p55908o08692m08277j50819J34265
$$ 8777495 7697754 6714686 5809648 4965335 4209427 3600735 3192458 3041639 3175904
12639C175904L42500L92841L25137K59218K57834K63798K05179J09883K5599q8594
$$ 3175904 3518404 3911245 4236382 4495600 4753434 5017232 5222411 5332294 5357893 5269299
12629E269299k64045m32685n38184n99357o36471o35569o16800o09337n23004
$$ 5269299 5005254 4572569 4034385 3435028 2798557 2162988 1546188 936851 413847
12620D13847k58315Q8902L63322N31653O02932N87929N13960M02574K75653J38815
$$ 413847 155532 244434 607756 1139409 1742341 2330270 2844230 3246804 3522457 3661272
12610C661272k9240k42507m82460o67862p07532o09774m48423k78859j39017n8333
$$ 3661272 3632032 3389525 2907065 2239203 1531671 921897 473474 194615 55598 -2735
12600b735m1083o3059j03642j74445k52139k27963m0232K29848M71681O23528
$$ -2735 -43818 -106877 -210519 -384964 -637103 -865066 -905298 -675450 -203769 419759
12590D19759O58498N95618N05423M38492L91836L95290M73169N40454M65213J55227
$$ 419759 1078257 1673875 2179298 2617790 3009626 3404916 3878085 4418539 4883752 5038979
12580E038979l87519r92396j375372j346127r64148m82025j36907J4184O0633
$$ 5038979 4651460 3659064 2283692 937565 -26583 -508608 -645515 -631331 -570698
12571e70698P3511L6653n5978j58467k79179m51242n95135o04374n14899m42685
$$ -570698 -497187 -460534 -516512 -674979 -954158 -1405400 -2000535 -2604909 -3119808 -3562493
12561c562493m36539m55638m38796l57685k17147n7424O3838J70658L55544N97867
$$ -3562493 -3999032 -4454670 -4893466 -5251151 -5468298 -5525722 -5461884 -5291226 -4935682 -4337815
12551d337815P68506P98114P06231N23652K85381M9388j42861k97146m10612m62443
$$ -4337815 -3569309 -2771195 -2064964 -1541312 -1255931 -1206543 -1349404 -1646550 -2057162 -2519605
12541b519605m49152l39518r2919K19820M52748N62268O05191O21566O04732N71600
$$ -2519605 -2968757 -3308275 -3401194 -3181374 -2728626 -2166358 -1561167 -939601 -334869 236731
12531B36731N91016O59891O63264N15259K91189J63946J74012J96421J36272K4310
$$ 236731 827747 1487638 2150902 2666161 2957350 3121296 3295308 3491729 3628001 3652311
12521C652311n3715p7179j22007k81692n49872p57234o66697k16938L37758O48159
$$ 3652311 3598596 3521417 3399410 3117718 2567846 1810612 1143915 926977 1264735 1912894
12511A912894O00001L45237O5241j77759l46673l75225k58040r5016J7154J01480
$$ 1912894 2512895 2858132 2923373 2745614 2398941 2023716 1765676 1670660 1687814 1789294
12501A789294K22557L71610M61065M05659K22287P003j62304k57906k91876k88814
$$ 1789294 2011851 2383461 2844526 3250185 3472472 3479475 3317171 3059265 2767389 2478575
12491B478575k14231p415K88882N34301O43809O39589N45559L47257Q5481j07695
$$ 2478575 2264344 2256929 2545811 3080112 3723921 4363510 4909069 5256326 5341807 5234112
12481E234112j28849J129J88593L09645K21798j23806n97024r48058r74861o83087
$$ 5234112 5105263 5106392 5294985 5604630 5826428 5702622 5105598 4157540 3182679 2499592
12471B499592k64978N3966J28868j8832k27364l67395m35605m93799o03000p59725
$$ 2499592 2234614 2288580 2417448 2398616 2171252 1803857 1368252 874453 271453 -488272
12461d88272q53854p53656m23475L7217M75385P86712R33610R11267P47491N24355
$$ -488272 -1342126 -2095782 -2519257 -2482040 -2006655 -1219943 -286333 624934 1372425 1896780
12451A896780L26556J91134J20655R2844P5860N4367m206j58765m12987o88736
$$ 1896780 2223336 2414470 2535125 2627969 2703829 2758196 2753990 2595225 2182238 1493502
12441A493502q70907q41652n78390k30343j0377r47r2498j53069j82152k07643
$$ 1493502 622595 -219057 -797447 -1027790 -1038167 -1039114 -1131612 -1284681 -1466833 -1674476
12431a674476k00632j77066k25144l69261n10303n78810o07918n68738l51280
$$ -1674476 -1875108 -2052174 -2277318 -2646579 -3156882 -3735692 -4343610 -4912348 -5263628
12422e263628O9879N85044J016748J177349R90836N96391K33547L5160m9855j22310
$$ -5263628 -5193749 -4608705 -3591957 -2414608 -1423772 -827381 -593834 -558674 -608529 -730839
12412g30839j93197k25477k34548k48864k48299k23060j80758j01936L0504K11350
$$ -730839 -924036 -1149513 -1384061 -1632925 -1881224 -2104284 -2285042 -2386978 -2356474 -2145124
12402b145124L84398M39540L45471J89771M9460m7833o6227K1424J59711K51237
$$ -2145124 -1760726 -1321186 -975715 -785944 -736484 -784317 -850544 -829120 -669409 -418172
12392d18172K61396K17039J57383J15039P8985j6643j90201l86784n71483p10045
$$ -418172 -156776 60263 217646 332685 411670 395027 204826 -181958 -753441 -1463486
12382a463486p47570o80297n47689l83478k14533n2218J27938L58612N83447O65237
$$ -1463486 -2211056 -2891353 -3439042 -3822520 -4037053 -4089271 -3961333 -3602721 -3019274 -2354037
12372b354037N77758M32914K93374J53299N6306L3730j1525j98241m94232p30264
$$ -2354037 -1776279 -1343365 -1049991 -896692 -840386 -806656 -818181 -1016422 -1510654 -2240918
12362b240918p52952n16171q4126M33910R16886J212918J232981J017621O20297
$$ -2240918 -2993870 -3510041 -3594167 -3160257 -2243371 -1030453 202528 1220149 1840446
12353A840446R0729l81647n37659l20150P6067M13923N71164N79398N44530N23283
$$ 1840446 1931175 1549528 1011869 691719 767786 1181709 1752873 2332271 2876801 3400084
12343C400084M92219L96989K01260r7749m78838q91712j203400j213894q54511
$$ 3400084 3892303 4289292 4490552 4392803 3913965 3022253 1818853 604959 -249552
12334b49552l26693O5120J91534J17257q4963l78543o61573p46734n10831m2074
$$ -249552 -576245 -511125 -319591 -202334 -287297 -665840 -1327413 -2074147 -2584978 -2627052
12324b627052M09277O32039N56417K40386j62980n04758p21025p96942p29764
$$ -2627052 -2217775 -1585736 -1029319 -788933 -951913 -1456671 -2177696 -2974638 -3704402
12315c704402n84609m58598l52417j85843P3220L89150P17410R79457J070346
$$ -3704402 -4289011 -4747609 -5100026 -5285869 -5212649 -4823499 -4106089 -3126632 -2056286
12306b056286R65345P28998M23877J18355j02811k39640l87119n93609p89068
$$ -2056286 -1090941 -361943 61934 180289 77478 -162162 -549281 -1142890 -1931958
12297a931958q58074p83446o61285n60453m53817k66947K5766L49270N77836O49389
$$ -1931958 -2790032 -3573478 -4234763 -4795216 -5249033 -5515980 -5490214 -5140944 -4563108 -3913719
12287c913719O10042N41731M78820L69110J59986p9372k18198j89496k1617J98750
$$ -3913719 -3303677 -2761946 -2283126 -1914016 -1754030 -1833402 -2051600 -2241096 -2262713 -2063963
12277b063963L82121M79976M90349M49707M12909L86238L32571K65898K41683
$$ -2063963 -1681842 -1201866 -711517 -261810 151099 537337 869908 1135806 1377489
12268A377489K63163K81417K85192L03720L02598K08569M3897j05556k57434n23716
$$ 1377489 1640652 1922069 2207261 2510981 2813579 3022148 3066045 2960489 2703055 2179339
12258B179339q95496j183312j199220r21347m90434j06504J18909K53245M32508
$$ 2179339 1283843 100531 -1098689 -2020036 -2510470 -2616974 -2498065 -2244820 -1812312
12249a812312O84240R17000J013748R31394P58388O07564M86579L21249Q4267
$$ -1812312 -1128072 -211072 802676 1734070 2492458 3100022 3586601 3907850 3992117
12240C992117j46227k88496l50175l89353m08932l53768k41800j87726k57502
$$ 3992117 3845890 3557394 3207219 2817866 2408934 2055166 1813366 1625640 1368138
12231A368138m01803n60878p45609r81630j225903j369711j313432j055734o75456
$$ 1368138 966335 405457 -340152 -1321782 -2547685 -3917396 -5230828 -6286562 -6962018
12222f962018k34136K29399O37033R17065J081284J162294J160216J090573R89736
$$ -6962018 -7196154 -6966755 -6329722 -5412657 -4331373 -3169079 -2008863 -918290 71446
12213G1446Q50837O35810L50314N9606j48047k42715k73427k65161j95204q3752
$$ 71446 922283 1558093 1908407 1968013 1819966 1577251 1303824 1038663 843459 759707
12203G59707J4449O9944R6886J20605R0114r3265m50604q68740j145919j152515
$$ 759707 774156 844100 940986 1061591 1151705 1058440 607836 -260904 -1406823 -2559338
12193b559338r48312o74238l94311j09340J05697J21823p2668l38098n19782n48347
$$ -2559338 -3507650 -4181888 -4576199 -4685539 -4579842 -4458019 -4530687 -4868785 -5388567 -5936914
12183e936914m34914k37707M375K90868N71692P03363O16375M66971M85565P27424
$$ -5936914 -6371828 -6609535 -6605160 -6314292 -5742600 -5039237 -4422862 -3955891 -3470326 -2742902
12173b742902J054832J332134J549381J722996J751573J500460R82248L32998
$$ -2742902 -1688070 -355936 1193445 2916441 4668014 6168474 7150722 7483720
12165G483720l04804q41637j260758j562440j720597j712061j514160j092949
$$ 7483720 7178916 6337279 5076521 3514081 1793484 81423 -1432737 -2525686
12157b525686n07161J8160K63632K60037K68697M72096P94545J031863J035770
$$ -2525686 -3032847 -3014687 -2751055 -2491018 -2222321 -1750225 -955680 76183 1111953
12148A111953Q32056N78786L51438O8004l49587q50530j302689j585522j681767
$$ 1111953 1944009 2522795 2874233 2942237 2592650 1742120 439431 -1146091 -2827858
12139b827858j659468j526753j256494r00902n52407k39246M5208K66398M24438
$$ -2827858 -4487326 -6014079 -7270573 -8171475 -8723882 -8963128 -8917920 -8651522 -8227084
12130h227084N62245O60413O64117N76249M38808K84781J43346K3666p0558j33630
$$ -8227084 -7664839 -7004426 -6340309 -5764060 -5325252 -5040471 -4897125 -4873459 -4944017 -5077647
12120e077647j99153k90423l75218l86438k40008N1913L44665N68788Q30676J200048
$$ -5077647 -5276800 -5567223 -5942441 -6328879 -6568887 -6516974 -6172309 -5603521 -4772845 -3572797
12110c572797J554308J679310J446837R01273K23393l68447o85095o24302k73990
$$ -3572797 -2018489 -339179 1107658 2008931 2232324 1863877 1178782 554480 280490
12101B80490R5868K36689J38387J7225P7497L04741N10404M89714J18399n30711
$$ 280490 376358 613047 751434 768659 846156 1150897 1661301 2151015 2269414 1738703
12091A738703j158558j457998j339200r22824m25597l5888J56432J57328N7593
$$ 1738703 580145 -877853 -2217053 -3139877 -3565474 -3601362 -3444930 -3287602 -3230009
12082c230009m6438j09521j15582p7654k9426K6725J42072L70567O69268Q90093
$$ -3230009 -3276447 -3385968 -3501550 -3579204 -3608630 -3581905 -3439833 -3069266 -2399998 -1509905
12072a509905R05807P21574M50026J70838j26306m23739n97400n50746l56434
$$ -1509905 -604098 117476 567502 738340 612034 188295 -409105 -959851 -1316285
12063a316285k05951k31155l81859m87782m01684j00281K70744M96430N03429
$$ -1316285 -1522236 -1753391 -2135250 -2623032 -3024716 -3124997 -2854253 -2357823 -1854394
12054a854394M03096L28149L27930L62343L03131M4899l79049q08055j026808
$$ -1854394 -1451298 -1123149 -795219 -432876 -129745 -84846 -463895 -1271950 -2298758
12045b298758q80731l78406K53485O80901P18690M48903Q3484k40738n04774o92002
$$ -2298758 -3179489 -3557895 -3304410 -2623509 -1904819 -1455916 -1372432 -1613170 -2117944 -2809946
12035b809946p45779o54513m86474l24866j84909l0682J20035J95481J66548Q9940
$$ -2809946 -3555725 -4210238 -4696712 -5021578 -5206487 -5237169 -5117134 -4921653 -4755105 -4665165
12025d665165L4569k780n4425q3884j814K17556M78585O30921O00170M27151J99820
$$ -4665165 -4630596 -4633376 -4687801 -4771685 -4773499 -4555943 -4077358 -3446437 -2846267 -2419116 -2219296
12014b219296k7256k40014l84922l40773m7196L69799O79712P31210N13459J52487
$$ -2219296 -2246552 -2486566 -2871488 -3212261 -3259457 -2889658 -2209946 -1478736 -965277 -812790
12004h12790j14878j21628J14157M68906P76901Q90885P85682N74116L99912L16580
$$ -812790 -927668 -1049296 -935139 -466233 310668 1201553 1987235 2561351 2961263 3277843
11994C277843K80069K24009J14548j1409o9448L566K19361N00085P11497P96559
$$ 3277843 3557912 3781921 3896469 3885060 3815612 3819178 4038539 4538624 5250121 6046680
11984F046680P87463P11493N51894K83140m4085k85951l44345k77783k11154j69834
$$ 6046680 6834143 7545636 8097530 8380670 8336585 8050634 7706289 7428506 7217352 7047518
11974G047518q3283O8781K14878K66138J69893j05398n41267r73881j157588r90127
$$ 7047518 6964235 7033016 7247894 7514032 7683925 7578527 7037260 6063379 4905791 3915664
11964C915664o21554k97807j26042k0686J32657L13746L88757K30909k02944q20067
$$ 3915664 3294110 2996303 2870261 2849575 2982232 3295978 3684735 3915644 3712700 2892633
11954B892633j343642j482359j221854q04982m47077j63767J00446L04340L88321
$$ 2892633 1548991 66632 -1155222 -1960204 -2407281 -2571048 -2470602 -2166262 -1777941
11945a777941L89368L70053K90815R0956j44450k63900k38899j70887j68498k45142
$$ -1777941 -1388573 -1018520 -727705 -636749 -781199 -1045099 -1283998 -1454885 -1623383 -1868525
11935a868525l05678k58954j26486l4225j20266l91926o80689q29211q28062p17091
$$ -1868525 -2174203 -2433157 -2559643 -2593868 -2714134 -3106060 -3786749 -4615960 -5444022 -6161113
11925f161113n60037m54230l77018j98299J05799M21352O28357O73043N77971
$$ -6161113 -6721150 -7175380 -7552398 -7750697 -7644898 -7223546 -6595189 -5922146 -5344175
11916e344175M28013L36235L92468N83359P67274P62774M95910J15832j02010
$$ -5344175 -4916162 -4579927 -4187459 -3604100 -2836826 -2074052 -1578142 -1462310 -1564320
11907a564320o6154J7241p5553l22243n35156n73606m39946k35892n4141R4803
$$ -1564320 -1630474 -1613233 -1688786 -2011029 -2546185 -3119791 -3559737 -3795629 -3849770 -3754967
11897c754967K54915M50442O61078Q44174R55357R49036Q39442O80423M33027
$$ -3754967 -3500052 -3049610 -2388532 -1544358 -589001 360035 1199477 1879900 2312927
11888B312927O9518k64325m31718m61157m03613k58423o1320J19111K49287L06794
$$ 2312927 2382445 2118120 1686402 1225245 821632 563209 501889 621000 870287 1177081
11878A177081K41696M2152k34247n01476o45720n65326k71872J02565M19925N74791
$$ 1177081 1418777 1460929 1226682 725206 79486 -485840 -757712 -655147 -235222 339569
11868C39569N12693L41146K87505M42515O24449O12563M23328K04581j1049k33372
$$ 339569 852262 1193408 1480913 1923428 2547877 3160440 3583768 3788349 3777300 3543928
11858C543928l69981l47267k12217p1425r665n1677j44732j99910k03025k29422
$$ 3543928 3173947 2826680 2614463 2543038 2533373 2481696 2336964 2137054 1934029 1704607
11848A704607l27208m29833m22767l18973k75841m05991o71392r34054j065920
$$ 1704607 1377399 947566 524799 205826 -70015 -476006 -1147398 -2081452 -3147372
11839c147372j011640p77062m27993o0063K59206M68717N20350M43183K96362
$$ -3147372 -4159012 -4936074 -5364067 -5424130 -5164924 -4696207 -4175857 -3732674 -3436312
11830c436312J28746K437n3877o5736m6375P431R1645K12691L58484N11520O82263
$$ -3436312 -3307566 -3305129 -3359006 -3424742 -3471117 -3463686 -3372041 -3159350 -2800866 -2289346 -1607083
11819a607083Q08240P48316M57236M0433l62517o25889o48474m20653m8586L20549
$$ -1607083 -798843 -50527 406709 447142 84625 -541264 -1189738 -1610391 -1658977 -1338428
11809a338428N59842N69325L28734o1728m21482n89296n33307l45267j22747J07821
$$ -1338428 -778586 -209261 119473 57745 -363737 -953033 -1486340 -1831607 -1954354 -1846533
11799a846533L59197N84398O27492L85528k1632l41951l86974j51317K00964M70992
$$ -1846533 -1487336 -902938 -275446 110082 88450 -253501 -640475 -791792 -590828 -119836
11789a19836N85359O17054O77784Q12814R66989J021702Q41038L88748j31257
$$ -119836 465523 1082577 1760361 2573175 3540164 4561866 5402904 5791652 5660395
11780E660395m04175l25409o8254J77039L86104O01331Q02101R29917R48347Q45064
$$ 5660395 5256220 4930811 4862557 5039596 5425700 6027031 6829132 7759049 8707396 9552460
11770I552460O25882L32919N9256j15153k26795l92994o47780r01809j036403
$$ 9552460 10178342 10511261 10570517 10455364 10228569 9835575 9187795 8285986 7249583
11761G249583r76799p18402l12896J65928N82321P28925N04751P8601k52119l55257
$$ 7249583 6272784 5554382 5241486 5407414 5989735 6718660 7223411 7302012 7049893 6694636
11751F694636l26590l10762l47607l73583l19227j89773n1772J6622l5209j79348
$$ 6694636 6368046 6057284 5709677 5336094 5016867 4827094 4775322 4791944 4756735 4577387
11741D577387l35604m32509l84510j32075K49928O25017Q73264Q43107M74966
$$ 4577387 4241783 3809274 3424764 3292689 3542617 4167634 5040898 5884005 6358971
11732F358971o7592n49687q69176j041555j083945r82696p46802m67546k70272
$$ 6358971 6291379 5741692 4872516 3830961 2747016 1764320 1017518 549972 279700
11723B79700k52982m56703p86127j035966j086155j006306r16466q62144q20072
$$ 279700 26718 -429985 -1216112 -2252078 -3338233 -4344539 -5261005 -6123149 -6943221
11714f943221p28032n55743l20051m2445K30919M13133M23393K49698r145j73194
$$ -6943221 -7671253 -8226996 -8547047 -8589492 -8358573 -7945440 -7522047 -7272349 -7281494 -7454688
11704g454688j29378P1367K62264L02108K19470J75004K97311O12922J047049
$$ -7454688 -7584066 -7512699 -7250435 -6948327 -6728857 -6553853 -6256542 -5643620 -4596571
11695d596571J450928J676371J625305J305355Q39593L24197k27384p71042j151352
$$ -4596571 -3145643 -1469272 156033 1461388 2300981 2625178 2397794 1626752 475400
11686D75400j216097j000913o92864m41038k35083N8604N03258R45900J161838
$$ 475400 -740697 -1741610 -2434474 -2875512 -3110595 -3051991 -2548733 -1602833 -440995
11677d40995J104440Q92334O39849M34393L30612K52776P3857k11166n13621p28612
$$ -440995 663445 1555779 2195628 2630021 2960633 3213409 3287266 3076100 2562479 1833867
11667A833867p93910p62704p44718p40063o62220n66528o00291p50320q36692
$$ 1833867 1039957 277253 -467465 -1207528 -1869748 -2436276 -3036567 -3786887 -4623579
11658d623579o99576l63604o423K43563M03945N43629O60306O88042O42274O00780
$$ -4623579 -5323155 -5686759 -5693182 -5449619 -5045674 -4502045 -3841739 -3153697 -2511423 -1910643
11648a910643N58231M77387L94412L61481L66662L64797K90707O6378k90270o15589
$$ -1910643 -1352412 -875025 -480613 -119132 247530 612327 903034 969412 679142 63553
11638F3553p19593n59688k49125P1347K83340L16267J91692n365j52738j49934
$$ 63553 -656040 -1215728 -1464853 -1393506 -1110166 -793899 -602207 -607572 -760310 -910244
11628i10244j9218R9576P5680p2682k06469k11531j15643n1317q0091j47110j71251
$$ -910244 -929462 -829886 -754206 -826888 -1033357 -1244888 -1360531 -1411848 -1491939 -1639049 -1810300
11617a810300j11444r641O1258J24931K49549M37419O69671R05026J017451Q88096
$$ -1810300 -1921744 -1931385 -1870127 -1745196 -1495647 -1058228 -388557 516469 1533920 2422016
11607B422016N52048J28259k98356o18821p35658o97323o38676o03902n12996
$$ 2422016 2974064 3102323 2803967 2185146 1449488 752165 113489 -490413 -1003409
11598a003409k91275M2840L76907N52405N00745L30906K09875K09222K79067K66907
$$ -1003409 -1294684 -1251844 -874937 -322532 178213 509119 718994 928216 1207283 1474190
11588A474190M1577l11461n46130n48185m34861l82862m68694o08842o44157m77407
$$ 1474190 1515767 1204306 658176 109991 -324870 -707732 -1176426 -1785268 -2429425 -2906832
11578b906832j41838J61884J82532j11159m60038n55661l11995Q6644L83686M44159
$$ -2906832 -3048670 -2886786 -2704254 -2815413 -3275451 -3831112 -4143107 -4056463 -3672777 -3228618
11568c228618K60269q5884m33321o19668n58230k80456N5953L07765M41930M68572
$$ -3228618 -2968349 -3054233 -3487554 -4107222 -4665452 -4945908 -4889955 -4582190 -4140260 -3671688
11558c671688M12380L46180L29489L60610M43167O03939Q05384R03169P98916
$$ -3671688 -3259308 -2913128 -2583639 -2223029 -1779862 -1175923 -370539 532630 1331546
11549A331546N85474L99886K27601P121k18433l40526l10926k07668j27164n7554
$$ 1331546 1917020 2316906 2544507 2551628 2333195 1992669 1681743 1474075 1346911 1289357
11539A289357Q7485L06427M41201L76361J84767J7294m0229k5850m3449j44899
$$ 1289357 1376842 1683269 2124470 2500831 2685598 2702892 2662663 2636813 2593364 2448465
11529B448465l08533m68628n43602m95623l95526l39226k79407r4441K10733N01497
$$ 2448465 2139932 1671304 1127702 632079 236553 -102673 -382080 -476521 -265788 235709
11519B35709O21665M70782J03526k83132n31640o46200o76631n80548l18332J5862
$$ 235709 857374 1328156 1431682 1148550 616910 -29290 -705921 -1286469 -1604801 -1588939
11509a588939L06725N18452O03374N14540L12953J21720R645k3050J818O5963
$$ -1588939 -1282214 -763762 -160388 354152 667105 788825 798470 775420 777238 843201
11499H43201J17568J01093N7949P1351J43448K18043K69310L09191L26835K83173
$$ 843201 960769 1061862 1119811 1191162 1334610 1552653 1821963 2131154 2457989 2741162
11489B741162K12975K45629M02504N09448M30938K56945J38148Q0098M566j29108
$$ 2741162 2954137 3199766 3602270 4111718 4542656 4799601 4937749 5017847 5022413 4893305
11479D893305k84872l81171l88787l61115l60080l65319k60986J0165K83546L41914
$$ 4893305 4608433 4227262 3838475 3477360 3117280 2751961 2490975 2501140 2784686 3126600
11469C126600K18494J26512K00521M04283N83881O04663M58733K29135Q008j60234
$$ 3126600 3345094 3471606 3672127 4076410 4660291 5264954 5723687 5952822 5960830 5800596
11459E800596k80338l31425k60833j20751o1462j51346l24404m43325l69638q3048
$$ 5800596 5520258 5188833 4928000 4807249 4745787 4594441 4270037 3826712 3457074 3374026
11449C374026K42414M02765L34728P8609k92879o90855r81482j019193q11975
$$ 3374026 3616440 4019205 4353933 4432542 4139663 3448808 2467326 1448133 636158
11440F36158n15244j78393K42093O55374Q99579R16138P62816N16422J99252j66396
$$ 636158 120914 -57479 184614 839988 1739567 2655705 3418521 3934943 4134195 3967799
11430C967799m63940n15320k49440J98784O15387Q54531Q82375P88582O86338
$$ 3967799 3503859 2988539 2739099 2937883 3553270 4407801 5290176 6078758 6765096
11421F765096O09521N21507L82346K05670J7793k14941n33348q48098j007694
$$ 6765096 7374617 7896124 8278470 8484140 8501933 8286992 7753644 6905546 5897852
11412E897852r88021q67146o95449m73830j93740J04794L10466L55873K93527
$$ 5897852 4909831 4042685 3347236 2873406 2679666 2784460 3094926 3450799 3744326
$$ [...]
##END NTUPLES=NMR SPECTRUM
##END=
