##TITLE=31P ikalashn
DE-76k2_TFA2
19.12.2024
##JCAMPDX= 6.0         $$ Bruker NMR JCAMP-DX V2.0
##DATA TYPE= NMR SPECTRUM
##DATA CLASS= NTUPLES
##ORIGIN= UXNMR, Bruker Analytische Messtechnik GmbH
##OWNER= root
$$ TOPSPIN		Version 1.3
$$ 2024-12-19 14:54:23.593 +0400  Irina@DPX200
$$ Compression mode = diff/dup
##.OBSERVE FREQUENCY= 81.01967998063
##.OBSERVE NUCLEUS= ^31P
##.ACQUISITION MODE= SIMULTANEOUS
##.ACQUISITION SCHEME= undefined
##.AVERAGES= 64
##.DIGITISER RES= 17
##SPECTROMETER/DATA SYSTEM= spect
##.PULSE SEQUENCE= zgpg
##.SOLVENT NAME= DMSO
##.SHIFT REFERENCE= INTERNAL, DMSO, 1, 298.5841
##AUDIT TRAIL= $$ (NUMBER, WHEN, WHO, WHERE, WHAT)
$$ ##TITLE= Audit trail, TOPSPIN		Version 1.3
$$ ##JCAMPDX= 5.01
$$ ##ORIGIN= Bruker BioSpin GmbH
$$ ##OWNER= Irina
$$ $$ F:/spectra/data/iren/nmr/P31dec/1/pdata/1/auditp.txt
$$ ##AUDIT TRAIL=  $$ (NUMBER, WHEN, WHO, WHERE, VERSION, WHAT)
(   1,<2024-12-19 14:52:13.703 +0400>,<Irina>,<DPX200>,<TOPSPIN 1.3>,
      <acquisition in progress>)
(   2,<2024-12-19 14:53:56.109 +0400>,<Irina>,<DPX200>,<TOPSPIN 1.3>,
      <Start of raw data processing
       efp BC_mod = 2 LB = 15 FT_mod = 6 PKNL = 1 PHC0 = 85.29808 PHC1 = -44.88805 SI = 32K 
       data hash MD5: 32K
       44 1C E8 F2 E1 6B B6 37 50 16 C0 96 06 DE FA A1>)
(   3,<2024-12-19 14:53:58.500 +0400>,<Irina>,<DPX200>,<TOPSPIN 1.3>,
      <apk 
       data hash MD5: 32K
       1C C6 50 1D 03 D2 91 15 09 A3 93 B6 82 F4 54 F0>)
(   4,<2024-12-19 14:54:11.656 +0400>,<Irina>,<DPX200>,<TOPSPIN 1.3>,
      <abs n ABSG = 5 
       data hash MD5: 32K
       56 CE A1 8E F8 C4 AA 41 5C FA 40 CA F7 9A 9D 9E>)
$$ ##END=
$$ 
$$ $$ hash MD5
$$ $$ EE FA 15 D0 02 C2 87 20 1A 46 92 39 C5 F3 80 B2
##$RELAX= 
##$RELAX= 
##$RELAX= 
##$RELAX= 
##$RELAX= 
##$RELAX= 
##$RELAX= 
##$RELAX= 
##$RELAX= 
##$RELAX= 
##$RELAX= 
$$ Bruker specific parameters
$$ --------------------------
##$DU= <F:/spectra>
##$EXPNO= 1
##$NAME= <P31dec>
##$PROCNO= 1
##$TYPE= <nmr>
##$USER= <iren>
##$AMP= (0..31)
100 100 100 100 100 100 100 100 100 100 100 100 100 100 100 100 100 100 
100 100 100 100 100 100 100 100 100 100 100 100 100 100 
##$ANAVPT= -1
##$AQSEQ= 0
##$AQ_mod= 1
##$AUNM= <au_zg>
##$AUTOPOS= <>
##$BF1= 81.014009
##$BF2= 200.13
##$BF3= 200.13
##$BF4= 200.13
##$BF5= 200.13
##$BF6= 200.13
##$BF7= 200.13
##$BF8= 200.13
##$BYTORDA= 1
##$CFDGTYP= 0
##$CFRGTYP= 5
##$CHEMSTR= <none>
##$CNST= (0..63)
1 1 145 1 1 1 1 1 1 1 1 1 1 1 1 1 1 1 1 1 1 1 1 1 1 1 1 1 1 1 1 1 1 1 
1 1 1 1 1 1 1 1 1 1 1 1 1 1 1 1 1 1 1 1 1 1 1 1 1 1 1 1 1 1 
##$CPDPRG= <waltz16>
##$CPDPRG1= <>
##$CPDPRG2= <waltz16>
##$CPDPRG3= <>
##$CPDPRG4= <mlev>
##$CPDPRG5= <mlev>
##$CPDPRG6= <mlev>
##$CPDPRG7= <mlev>
##$CPDPRG8= <mlev>
##$CPDPRGB= <>
##$CPDPRGT= <>
##$D= (0..63)
0 1 0 0 0 0 0 0 0 0.06 0 0.03 2e-005 3e-006 0 0 0.0002 0 0 0 0 0 0 0 0 
0 0 0 0 0 0 0 0 0 0 0 0 0 0 0 0 0 0 0 0 0 0 0 0 0 0 0 0 0 0 0 0 0 0 0 
0 0 0 0 
##$DATE= 1734605632
##$DBL= (0..7)
120 120 120 11 120 120 24 19 
##$DBP= (0..7)
$$ [...]
##$SW_h= 37037.037037037
##$TD= 32768
##$TD0= 1
##$TE= 300
##$TE2= 300
##$TE3= 300
##$TEG= 300
##$TL= (0..7)
0 120 53 12 22 120 120 120 
##$TP= (0..7)
150 150 150 150 150 150 150 150 
##$TP07= 0
##$TPNAME0= <>
##$TPNAME1= <>
##$TPNAME2= <>
##$TPNAME3= <>
##$TPNAME4= <>
##$TPNAME5= <>
##$TPNAME6= <>
##$TPNAME7= <>
##$TPOAL= (0..7)
0.5 0.5 0.5 0.5 0.5 0.5 0.5 0.5 
##$TPOFFS= (0..7)
0 0 0 0 0 0 0 0 
##$TUNHIN= 0
##$TUNHOUT= 0
##$TUNXOUT= 0
##$USERA1= <user>
##$USERA2= <user>
##$USERA3= <user>
##$USERA4= <user>
##$USERA5= <user>
##$V9= 5
##$VALIST= <valist>
##$VCLIST= <CCCCCCCCCCCCCCC>
##$VD= 0
##$VDLIST= <DDDDDDDDDDDDDDD>
##$VPLIST= <PPPPPPPPPPPPPPP>
##$VTLIST= <TTTTTTTTTTTTTTT>
##$WBST= 1024
##$WBSW= 4
##$XGAIN= (0..3)
0 0 0 0 
##$XL= 0
##$YL= 0
##$YMAX_a= 2939
##$YMIN_a= -6332
##$ZGOPTNS= <>
##$ZL1= 120
##$ZL2= 120
##$ZL3= 120
##$ZL4= 120
##$ABSF1= 298.5841
##$ABSF2= -158.5842
##$ABSG= 5
##$ABSL= 5
##$ALPHA= 0
##$AQORDER= 0
##$ASSFAC= 0
##$ASSFACI= 0
##$ASSFACX= 0
##$ASSWID= 0
##$AUNMP= <proc_1d>
##$AXLEFT= 0
##$AXRIGHT= 0
##$AXTYPE= 0
##$AXUNIT= <>
##$AZFE= 0.1
##$AZFW= 0.5
##$BCFW= 0
##$BC_mod= 2
##$BYTORDP= 0
##$COROFFS= 0
##$CY= 12.5935478210449
##$DATMOD= 1
##$DC= 0
##$DFILT= <>
##$DTYPP= 0
##$F1P= 47.1127640792319
##$F2P= -24.0371245302204
##$FCOR= 0.5
##$FTSIZE= 32768
##$FT_mod= 6
##$GAMMA= 0
##$GB= 0
##$INTBC= 1
##$INTSCL= 7.269226e-011
##$ISEN= 30
##$LB= 15
##$LEV0= 0
##$LPBIN= 0
##$MAXI= 12.09355
##$MC2= 0
##$MEAN= 0
##$ME_mod= 0
##$MI= 0.7550151
##$NCOEF= 0
##$NC_proc= -13
##$NLEV= 6
##$NOISF1= 298.5841
##$NOISF2= 270.0111
##$NSP= 0
##$NTH_PI= 0
##$NZP= 0
##$OFFSET= 298.5841
##$PC= 1.4
##$PHC0= 89.78606
##$PHC1= -18.0231
##$PH_mod= 1
##$PKNL= yes
##$PPARMOD= 0
##$PPDIAG= 0
##$PPIPTYP= 0
##$PPMPNUM= 100
##$PPRESOL= 1
##$PSCAL= 0
##$PSIGN= 0
##$REVERSE= no
##$SF= 81.014009
##$SI= 32768
##$SIGF1= 270.0111
##$SIGF2= -158.5842
##$SINO= 77.54984
##$SIOLD= 32768
##$SREGLST= <31P.CDCl3>
##$SSB= 0
##$STSI= 32768
##$STSR= 0
##$SW_p= 37037.037037037
##$SYMM= 0
##$S_DEV= 0
##$TDeff= 32768
##$TDoff= 0
##$TI= <>
##$TILT= no
##$TM1= 0
##$TM2= 0
##$TOPLEV= 0
##$USERP1= <user>
##$USERP2= <user>
##$USERP3= <user>
##$USERP4= <user>
##$USERP5= <user>
##$WDW= 1
##$XDIM= 32768
##$YMAX_p= 253360447
##$YMIN_p= -20667757
$$ End of Bruker specific parameters
$$ ---------------------------------
##NTUPLES= NMR SPECTRUM
##VAR_NAME=  FREQUENCY,     SPECTRUM/REAL,   SPECTRUM/IMAG
##SYMBOL=    X,             R,               I
##VAR_TYPE=  INDEPENDENT,   DEPENDENT,       DEPENDENT
##VAR_FORM=  AFFN,          ASDF,            ASDF
##VAR_DIM=   32768,         32768,           32768
##UNITS=     HZ,            ARBITRARY UNITS, ARBITRARY UNITS
##FACTOR=    1.13031516577767, 1,            1
##FIRST=     37037.037037037, 2958906,       19965730
##LAST=      0,             -12497982,       -13073467
##MIN=       0,             -20667757,       0
##MAX=       37037.037037037, 253360447,     0
$$ Real data points
##PAGE= N=1
##DATA TABLE= (X++(R..R)), XYDATA
$$ [...]
17982b775958m71252n12449m67479l38011j38772J10865L94634O90184R52074
$$ -2775958 -3247210 -3759659 -4227138 -4565149 -4703921 -4593056 -4198422 -3508238 -2556164
17973b556164J117161J137875J011184P78278N02888K46276M8541p8156j43778
$$ -2556164 -1439003 -301128 710056 1488334 1991222 2237498 2286039 2207883 2064105
17964B064105j68359j71908j70331j72428j74114j60593j23284p5082m3552m5771
$$ 2064105 1895746 1723838 1553507 1381079 1206965 1046372 923088 848006 804454 758683
17954G58683p1291r1667q4504m7455O019O0510J08333J47918J78380J97548J98817
$$ 758683 687392 595725 511221 463766 469785 530295 638628 786546 964926 1162474 1361291
17943A361291J67851Q9075l9611j99112l55538m72331n20112m82451l59152j69725
$$ 1361291 1529142 1618217 1578606 1379494 1023956 551625 31513 -450938 -810090 -979815
17933i79815M7585K48883M06746N26103O38675P77454R50655J131352J263734
$$ -979815 -932230 -683347 -276601 249502 888177 1665631 2616286 3747638 5011372
17924E011372J281793J138584Q35660M29301L60l88298p06365r39933j080085
$$ 5011372 6293165 7431749 8267409 8696710 8697070 8308772 7602407 6662474 5582389
17915E582389j131502j118839j072922j009347r24577q15236o99615o16472n98029
$$ 5582389 4450887 3332048 2259126 1249779 325202 -490034 -1189649 -1806121 -2404150
17906b404150o41765p09140p50187p33384o64257n78861n11322m65025m16450
$$ -2404150 -3045915 -3755055 -4505242 -5238626 -5902883 -6481744 -6993066 -7458091 -7874541
17897g874541l40722k29713r3235M8388J73784K71728L49293M25993N14725O08700
$$ -7874541 -8215263 -8444976 -8538211 -8489823 -8316039 -8044311 -7695018 -7269025 -6754300 -6145600
17887f145600O89391P46724P88558Q30320Q77642R17806R25748Q80312P76822
$$ -6145600 -5456209 -4709485 -3920927 -3090607 -2212965 -1295159 -369411 510901 1287723
17878A287723O25631M44740K58702R9348l406l8085k0272J5234L1504L771p4708
$$ 1287723 1913354 2358094 2616796 2716144 2712738 2674653 2654381 2669615 2701119 2704890 2630182
17867B630182j94979l38450m82540o05860o91329p23391o83869n58318l53565
$$ 2630182 2435203 2096753 1614213 1008353 317024 -406367 -1090236 -1648554 -2002119
17858b002119j07914J22984K93587L82369L87320L16932J80970j6723k73877n72238
$$ -2002119 -2110033 -1987049 -1693462 -1311093 -923773 -606841 -425871 -442594 -716471 -1288709
17848a288709q60860j059520j090328r21660n91111j88018J89101M68640O18747
$$ -1288709 -2149569 -3209089 -4299417 -5221077 -5812188 -6000206 -5811105 -5342465 -4723718
17839d723718O41539N62297M21088K64682J37788P6440J02831K20394M11017O35391
$$ -4723718 -4082179 -3519882 -3098794 -2834112 -2696324 -2619884 -2517053 -2296659 -1885642 -1250251
17829a250251Q38967R68240R91301R07079P39594N26760L08721J16202l5987j45120
$$ -1250251 -411284 556956 1548257 2455336 3194930 3721690 4030411 4146613 4110626 3965506
17819C965506k09008k20054j74894q8908K211N8187N6367M219o8658j33909j84401
$$ 3965506 3756498 3536444 3361550 3272642 3274853 3333040 3389407 3393626 3324968 3191059 3006658
17808C006658k34060k98270l75767m51177n10810n50410n71955n82739n97153
$$ 3006658 2772598 2474328 2098561 1647384 1136574 586164 14209 -568530 -1165683
17799a165683o29327o78836p23725p28012o61224n20649l41821j84490r7206q6418
$$ -1165683 -1795010 -2473846 -3197571 -3925583 -4586807 -5107456 -5449277 -5633767 -5730973 -5817391
17789e817391j14637j24231o9021N9780K27746L78340M62955M57549L66244K21338
$$ -5817391 -5932028 -6056259 -6125280 -6065500 -5837754 -5459414 -4996459 -4538910 -4172666 -3951328
17779c951328P6978r960n821Q4257K22452L59698M56685M93626M67893L85513
$$ -3951328 -3874350 -3884310 -3890131 -3805874 -3583422 -3223724 -2767039 -2273413 -1805520 -1420007
17769a420007K54041Q0929j23770l43348n51340p13838p99087p87871o78142m84791
$$ -1420007 -1165966 -1085037 -1208807 -1552155 -2103495 -2817333 -3616420 -4404291 -5082433 -5567224
17759e567224k37646K2808K57507M47971O04304P46855Q76488R66372R86985R38510
$$ -5567224 -5804870 -5782062 -5524555 -5076584 -4472280 -3725425 -2848937 -1882565 -895580 42930
17749D2930Q57733P94825P79571Q02721Q29454Q34143Q21519Q14216Q23216Q30147
$$ 42930 900663 1695488 2475059 3277780 4107234 4941377 5762896 6577112 7400328 8230475
17739H230475P95413O85160M95425K56069J5381j82954l18282l99019m54230n16324
$$ 8230475 9025888 9711048 10206473 10462542 10477923 10294969 9976687 9577668 9123438 8607114
17729H607114o05246p21332q47124r55139j018645j022431r67483q65166p27459
$$ 8607114 8001868 7280536 6433412 5478273 4459628 3437197 2469714 1604548 877089
17720H77089n63776l84375k02320l2067J11613K15442K73650K92326K83218K52734
$$ 877089 313313 -71062 -273382 -305449 -193836 21606 295256 587582 870800 1123534
17710A123534K03048J47124J15975J40416K19788L09953L49555L05994K00151
$$ 1123534 1326582 1473706 1589681 1730097 1949885 2259838 2609393 2915387 3115538
17701C115538Q9323K6276K7252O7119R8429Q0544K057j15686k32249l10085l35688
$$ 3115538 3204861 3231137 3258389 3325508 3423937 3504481 3506538 3390852 3158603 2848518 2512830
17690B512830l25723l10522l12995l46756m23747n46348o92953q22800q98102
$$ 2512830 2187107 1876585 1563590 1216834 793087 246739 -446214 -1269014 -2167116
17681b167116r01100q34510p13142n57355l90995k42576j44926j26141j94407
$$ -2167116 -3068216 -3902726 -4615868 -5173223 -5564218 -5806794 -5951720 -6077861 -6272268
17672f272268l29820m90236o25591o93024o68279n49814l58599j38349N4054J76228
$$ -6272268 -6602088 -7092324 -7717915 -8410939 -9079218 -9629032 -9987631 -10125980 -10071926 -9895698
17662i895698K25172K33000K37362K56247K88572L30156L83323M57263N64022
$$ -9895698 -9670526 -9437526 -9200164 -8943917 -8655345 -8325189 -7941866 -7484603 -6920581
17653f920581P08109Q74754J030860J141868J188015J164044J069222R05408O83437
$$ -6920581 -6212472 -5337718 -4306858 -3164990 -1976975 -812931 256291 1161699 1845136
17644A845136M23825J50190j13778l43737n19977o37992p14072p77379q47804
$$ 1845136 2268961 2419151 2305373 1961636 1441659 803667 89595 -687784 -1535588
17635a535588r13943r32720q57993o81073m49756k44731j28998j10113j41049
$$ -1535588 -2449531 -3382251 -4240244 -4921317 -5371073 -5615804 -5744802 -5854915 -5995964
17626e995964j52259r0915N1653K35332L92741M67496M45886L57226K43004J28897
$$ -5995964 -6148223 -6239138 -6187485 -5952153 -5559412 -5091916 -4646030 -4288804 -4045800 -3916903
17616c916903K7965m3228o5923l1287N5552J76330L00484L94732M42653M56023
$$ -3916903 -3888938 -3932166 -3998089 -4029376 -3973824 -3797494 -3497010 -3102278 -2659625 -2203602
17606b203602M63086M84858N23584N69652O11175O34720O24803N70708M71994
$$ -2203602 -1740516 -1255658 -732074 -162422 448753 1083473 1708276 2278984 2750978
17597B750978L33627J59863m0950k46569m20832n28432n56574n25513m75163m39677
$$ 2750978 3084605 3244468 3203518 2956949 2536117 2007685 1451111 925598 450435 10758
17587A0758m34711m59559m96066n03609m32156k56502k33K74328M98367O24930
$$ 10758 -423953 -883512 -1379578 -1883187 -2315343 -2571845 -2572078 -2297750 -1799383 -1174453
17577a174453O38989N54443M08173K50581J29767P0511N7802M5977n795j06787
$$ -1174453 -535464 18979 427152 677733 807500 878011 935813 981790 975995 869208
17567H69208k39542l78261m97918n74858n86104n10223l35709p4911K34667N46852
$$ 869208 629666 251405 -246513 -821371 -1407475 -1917698 -2253407 -2328318 -2093651 -1546799
17557a546799Q19883J014326J092234J030916Q38878N52488K14178j42240m83568
$$ -1546799 -726916 287410 1379644 2410560 3249438 3801926 4016104 3873864 3390296
17548C390296p64864r41939j002412r74695q99111p96307o67230n14707l56698
$$ 3390296 2625432 1683493 681081 -293614 -1192725 -1989032 -2656262 -3170969 -3527667
17539c527667k16868j01669J1651J59797L64495O16455Q80413J111134J268157
$$ -3527667 -3744535 -3846204 -3834553 -3674756 -3310261 -2693806 -1813393 -702259 565898
17530E65898J322639J258855J075473P87236M27418M8794k85860n26744o56760
$$ 565898 1888537 3147392 4222865 5010101 5437519 5486313 5200453 4673709 4016949
17521D016949o88851o49117n67723m76972m02614l49420k98310k26249j32831
$$ 4016949 3328098 2678981 2111258 1634286 1231672 882252 583942 357693 224862
17512B24862m6664o978l5618j18569k10764k58958k23643r1189J19594L58901
$$ 224862 178198 171220 135602 17033 -193731 -452689 -676332 -767521 -647927 -289026
17502b89026N66521P05159P77814Q10253Q14931P70973O38389L95142O5294k86993
$$ -289026 277495 982654 1760468 2570721 3385652 4156625 4795014 5190156 5255450 4968457
17492D968457n91111q02316r09969r22365q50722p11891n38760l74319k51349
$$ 4968457 4377346 3575030 2665061 1742696 891974 180083 -358677 -732996 -984345
17483i84345j79941j51338j48878j56742j62574j53905j15246l6635P1337J74921
$$ -984345 -1164286 -1315624 -1464502 -1621244 -1783818 -1937723 -2052969 -2089604 -2018267 -1843346
17473a843346K30079J97863N6254j90824n09438q39209j106390j247081j230943
$$ -1843346 -1613267 -1415404 -1359150 -1549974 -2059412 -2898621 -4005011 -5252092 -6483035
17464f483035j068746q00052m76831j57947R3026K21745K03993N4539j81681m43806
$$ -6483035 -7551781 -8351833 -8828664 -8986611 -8893585 -8671840 -8467847 -8413308 -8594989 -9038795
17454i038795o67400p99038q11016p06301n12875k73277l2321J72510L13965L75301
$$ -9038795 -9706195 -10505233 -11316249 -12022550 -12535425 -12808702 -12841023 -12668513 -12354548 -11979247
17444a1979247L52728K57150J11647n3324k03349l02892l20523k36699n4356J90586
$$ -11979247 -11626519 -11369369 -11257722 -11311046 -11514395 -11817287 -12137810 -12374509 -12428865 -12238279
17434a2238279M31430N93178O24763N22066L30702J30420J0269L9046K34216N46716
$$ -12238279 -11806849 -11213671 -10588908 -10066842 -9736140 -9605720 -9595451 -9556405 -9322189 -8775473
17424h775473Q82834J152791J308092J346821J298999J208700J113898J025533
$$ -8775473 -7892639 -6739848 -5431756 -4084935 -2785936 -1577236 -463338 562195
17416E62195R23405P78426N79913L45600J18062m8735j17304r2876k2343L1399
$$ 562195 1485600 2264026 2843939 3189539 3307601 3258866 3141562 3048686 3026343 3057742
17406C057742J5242r9452l07143n62139p87400r03630q64127o75753l97793j16857
$$ 3057742 3072984 2973532 2666389 2104250 1316850 413220 -450907 -1126660 -1524453 -1641310
17396a641310R6240K22803K95937L64061M53180N58895O63930P52936Q11843Q27140
$$ -1641310 -1545070 -1322267 -1026330 -662269 -209089 349806 1013736 1766672 2578515 3405655
17386C405655P97115P42440O99208O95821P30824P67073P44249O04965L27963
$$ 3405655 4202770 4945210 5644418 6340239 7071063 7838136 8582385 9187350 9515313
17377I515313m8721m33847p19608q31476p62599n69654l35219j26986J8694Q7898
$$ 9515313 9466592 9032745 8313137 7481661 6719062 6149408 5814189 5687203 5705897 5793795
17367E793795P6993o632j38568k80034l90750m45959m49599m33792m39396m87758
$$ 5793795 5870788 5864156 5725588 5445554 5054804 4608845 4159246 3725454 3286058 2798300
17357B798300n69275o61338p52727q46931r47965j048100j124929j144242j069701
$$ 2798300 2229025 1567687 814960 -31971 -979936 -2028036 -3152965 -4297207 -5366908
17348e366908q82609n99857k69971N1474L26873N45299P10986Q22716Q63255Q10142
$$ -5366908 -6249517 -6849374 -7119345 -7067871 -6740998 -6195699 -5484713 -4661997 -3798742 -2988600
17338b988600O59396M41354K13116L1403p5725j20687j44442j87223k61893l49560
$$ -2988600 -2329204 -1887850 -1674734 -1643331 -1719056 -1839743 -1984185 -2171408 -2433301 -2782861
17328b782861m15767m32827l98967l43184l06012l10948l52908m05047m29045
$$ -2782861 -3198628 -3631455 -4030422 -4373606 -4679618 -4990566 -5343474 -5748521 -6177566
17319f177566l86666k54017l0256K64994O00491R39866J242052J461134J555879
$$ -6177566 -6564232 -6818249 -6848505 -6583511 -5983020 -5043154 -3801102 -2339968 -784089
17310g84089J509213J340988J099012Q34627N80489L40713R7007j69347m52720
$$ -784089 725124 2066112 3165124 3999751 4580240 4920953 5017960 4848613 4395893
17301D395893p16312r09073r91640r52934q10012n96020l49011j09116Q4410K03289
$$ 4395893 3679581 2770508 1778868 825934 15922 -580098 -929109 -1038225 -953815 -750526
17291g50526K36490J83483M5069j76444m65609p74107j010920j067102q71904
$$ -750526 -514036 -330553 -285484 -461928 -927537 -1701644 -2712564 -3779666 -4651570
17282d651570m40135J29002P02480J173377J487718J634622J627368J494207J276777
$$ -4651570 -5091705 -4962703 -4260223 -3086846 -1599128 35494 1662862 3157069 4433846
17273D433846J024651P77598N46513L17154P8744j49585l19278l78966l05744
$$ 4433846 5458497 6236095 6782608 7099762 7178506 7028921 6709643 6330677 6024933
17264F024933j19707J24046L55566N13467N67863N28525M25731K80437R5141j28656
$$ 6024933 5905226 6029272 6384838 6898305 7466168 7994693 8420424 8700861 8796002 8667346
17254H667346l71757n98686p73646q74903q98622q52359p45539n86136l85603
$$ 8667346 8295589 7696903 6923257 6048354 5149732 4297373 3551834 2965698 2580095
17245B580095j65206M2926K03047K91437L09253K77639K18434J39644L6603r7929
$$ 2580095 2414889 2457815 2660862 2952299 3261552 3539191 3757625 3897269 3933872 3835943
17235C835943k63634m43684o03100p02761p19403o52824n17905l33870j20136
$$ 3835943 3572309 3128625 2525525 1822764 1103361 450537 -67368 -401238 -521374
17226e21374J00448K96622M31981M79546M35507L19801J66472J5869q7282j00308
$$ -521374 -420926 -124304 307677 787223 1222730 1542531 1709003 1724872 1637590 1537282
17216A537282k012J87149M04172N67397O14268N31155L56129J55661q453j05813
$$ 1537282 1535270 1722419 2126591 2693988 3308256 3839411 4195540 4351201 4342748 4236935
17206D236935j44750j54454j56947j56353j50886j44526j43230j46770j50155
$$ 4236935 4092185 3937731 3780784 3624431 3473545 3329019 3185789 3039019 2888864
17197B888864j51401j54258j62653j74419j80746j69497j28051m7707O7978K00108
$$ 2888864 2737463 2583205 2420552 2246133 2065387 1895890 1767839 1720132 1788110 1988218
17187A988218L24309M25689N07952N93664P15866R01356J149570J418822J633358
$$ 1988218 2312527 2738216 3246168 3839832 4555698 5457054 6606624 8025446 9658804
17178I658804J710611J591339J254996P21171M9978o59249j286505j730422j947353
$$ 9658804 11369415 12960754 14215750 14936921 14986899 14327650 13041145 11310723 9363370
17169I363370j964132j856987j709090j569589j439957j297993j137305r81042
$$ 9363370 7399238 5542251 3833161 2263572 823615 -474378 -1611683 -2592725
17161b592725q53047p40488n98390l95514j48573R0419K74479L90438M57945N05107
$$ -2592725 -3445772 -4186260 -4784650 -5180164 -5328737 -5238318 -4963839 -4573401 -4115456 -3610349
17151c610349N40542N47578N10197M41593L77882L45217L42056L49419L44425
$$ -3610349 -3069807 -2522229 -2012032 -1570439 -1192557 -847340 -505284 -155865 188560
17142A88560L03696K08359N6035j33557l31134n18496o93685q55537r90423j077984
$$ 188560 492256 700615 756650 623093 291959 -226537 -920222 -1775759 -2766182 -3844166
17132c844166j104237j067155r78683q68063p75501p33044p50935q18456r08700
$$ -3844166 -4948403 -6015558 -6994241 -7862304 -8637805 -9370849 -10121784 -10940240 -11848940
17123a1848940r82757r99804r33091p80796n62988l08505m4525K03589M08200
$$ -11848940 -12831697 -13831501 -14764592 -15545388 -16108376 -16416881 -16461406 -16257817 -15849617
17114a5849617N41445N87769N60254N02237M65315M81880N54760O64218P78086
$$ -15849617 -15308172 -14720403 -14160149 -13657912 -13192597 -12710717 -12155957 -11491739 -10713653
17105a0713653Q59426Q77631Q22990P15434N99093N17964M82241M55921L84482
$$ -10713653 -9854227 -8976596 -8153606 -7438172 -6839079 -6321115 -5838874 -5382953 -4998471
17096d998471K36579J8367k42004n08676p37433q77692q93432p91518o26457m69197
$$ -4998471 -4761892 -4743525 -4985529 -5494205 -6231638 -7109330 -8002762 -8794280 -9420737 -9889934
17086i889934l63004k99923k36186j35957n780J09550J60862J28073L0481q7862
$$ -9889934 -10252938 -10552861 -10789047 -10925004 -10930784 -10821234 -10660372 -10532299 -10501818 -10589680
17076a0589680j80440k14133j77996q4050M3218J82921L25723M67292N95648O85443
$$ -10589680 -10770120 -10984253 -11162249 -11246299 -11203081 -11020160 -10694437 -10227145 -9631497 -8946054
17066h946054P07070O46775N20997L71642K46700J81384J89234K61357L70511
$$ -8946054 -8238984 -7592209 -7071212 -6699570 -6452870 -6271486 -6082252 -5820895 -5450384
17057e450384M81457N63155N89528N31383L63370R0488k36144n39970p61816q87108
$$ -5450384 -4968927 -4405772 -3816244 -3284861 -2921491 -2831003 -3067147 -3607117 -4368933 -5256041
17047e256041r39440r52054r39290q90658p93519o56639n05865l64191k40778
$$ -5256041 -6195481 -7147535 -8086825 -8977483 -9771002 -10427641 -10933506 -11297697 -11538475
17038a1538475j26818L780J76158L88932O13747Q22052R99915J132932J194134
$$ -11538475 -11665293 -11661513 -11485355 -11096423 -10482676 -9660624 -8660709 -7527777 -6333643
17029f333643J161061J043604Q91839P71716P23855P36869P54148P08342N63317
$$ -6333643 -5172582 -4128978 -3237139 -2465423 -1741568 -1004699 -250551 457791 1021108
17020A021108L39357J04907o0128j04097k4133J36458L07925M23118M41798L57102
$$ 1021108 1360465 1465372 1405244 1301147 1277014 1413472 1721397 2144515 2586313 2943415
17010B943415J86544m0640k91366n30892p25024q48049q94173q80659q36283p84623
$$ 2943415 3129959 3089319 2797953 2267061 1542037 693988 -200185 -1080844 -1917127 -2701750
17000b701750p34032o77223n97675m78878l13128j08150J11171L09862M57809
$$ -2701750 -3435782 -4113005 -4710680 -5189558 -5502686 -5610836 -5499665 -5189803 -4731994
16991d731994N45174N87673O12575O31702O25920N57048L97184J53072j30773
$$ -4731994 -4186820 -3599147 -2986572 -2354870 -1728950 -1171902 -774718 -621646 -752419
16982g52419l93206n87248o95896p23237o78273n69664m06762j98359M4980L01979
$$ -752419 -1145625 -1732873 -2428769 -3152006 -3830279 -4399943 -4806705 -5005064 -4960084 -4658105
16972d658105N35236O99975P65340P31703O28180M92042L46130J94146M0559q7278
$$ -4658105 -4122869 -3422894 -2657554 -1925851 -1297671 -805629 -459499 -265353 -224794 -312072
16962c12072j44985j02924K8995K06636L77508N03829N71002N82725N52257N01713
$$ -312072 -457057 -559981 -530986 -324350 53158 556987 1127989 1710714 2262971 2764684
16952B764684M66240M84859N72822O99823Q02327Q26277P65821O67757N95561
$$ 2764684 3230924 3715783 4288605 4988428 5790755 6617032 7382853 8050610 8646171
16943H646171N75539N71343N16334L72593J56412q7658l28427n61443p85684r74852
$$ 8646171 9221710 9793053 10309387 10681980 10838392 10750734 10422307 9860864 9075180 8100328
16933H100328j076867j044264q67662n82540k50708O2864L11194M80224N82816
$$ 8100328 7023461 5979197 5111535 4528995 4278287 4341151 4652345 5132569 5715385
16924E715385O33978O32406N63824M18836K09948k6554k47951m24827n46415o17276
$$ 5715385 6349363 6981769 7545593 7964429 8174377 8147823 7899872 7475045 6928630 6311354
16914F311354o55236o85518p26113p71574p85151p08642m95567j50231K60509
$$ 6311354 5656118 4970600 4244487 3472913 2687762 1979120 1483553 1333322 1593831
16905A593831O34886Q79827R38976P98687M85762O3916l75415p31346r20326r05203
$$ 1593831 2228717 3108544 4047520 4846207 5331969 5395885 5020470 4289124 3368798 2463595
16895B463595p09222l99869n3753K69916N33707P12620P88211P53908O22334M23127
$$ 2463595 1754373 1354504 1300751 1570667 2104374 2816994 3605205 4359113 4981447 5404574
16885E404574J93275l3475k35295m04327n41044o50959p47758q51318r76234j119782
$$ 5404574 5597849 5564374 5329079 4924752 4383708 3732749 2984991 2133673 1157439 37657
16875C7657j257336j350050j365031j297970j179553j054934r51028q60150p54344
$$ 37657 -1219679 -2569729 -3934760 -5232730 -6412283 -7467217 -8418245 -9278395 -10032739
16866a0032739o17087m62222l22356k21527j61689j32819j29326j52207j96584
$$ -10032739 -10649826 -11112048 -11434404 -11655931 -11817620 -11950439 -12079765 -12231972 -12428556
16857a2428556k42002k58770k24328j35527j0297J21440K31706L01489L18559
$$ -12428556 -12670558 -12929328 -13153656 -13289183 -13299480 -13178040 -12946334 -12644845 -12326286
16848a2326286K77339J85439O6095n1042j40945j85667j75008j15120l5320K4943
$$ -12326286 -12048947 -11863508 -11797413 -11848455 -11989400 -12175067 -12350075 -12465195 -12500515 -12475572
16838a2475572M2550K5211M062J4108P4820J80815L08437M31720N34391O11358
$$ -12475572 -12433022 -12407811 -12403749 -12389641 -12314821 -12134006 -11825569 -11393849 -10859458 -10248100
16828a0248100O61239O79957O68486O48142O56735P18086Q15128Q97832R21774
$$ -10248100 -9586861 -8906904 -8238418 -7590276 -6933541 -6215455 -5400327 -4502495 -3580721
16819c580721Q84167Q26775Q04181Q43091R20428R73338R36652P84603N44825
$$ -3580721 -2696554 -1869779 -1065598 -222507 697921 1671259 2607911 3392514 3937339
16810C937339K74418K3097j85139l46655m64880n42681n84359o03008o18675o41434
$$ 3937339 4211757 4234854 4049715 3703060 3238180 2695499 2111140 1508132 889457 248023
16800B48023o60857o59409o32575n88853n31719m49760l27950j64021K8413K27189
$$ 248023 -412834 -1072243 -1704818 -2293671 -2825390 -3275150 -3603100 -3767121 -3738708 -3511519
16790c511519M08978N53688O43587O59807N88462M37269K41520M4693j27468k68929
$$ -3511519 -3102541 -2548853 -1905266 -1245459 -656997 -219728 21792 66485 -60983 -329912
16780c29912l73073m20913l95598l08503k05977j43265j47568k03103k66914k94666
$$ -329912 -702985 -1123898 -1519496 -1827999 -2033976 -2177241 -2324809 -2527912 -2794826 -3089492
16770c089492k53770j27380P7315L26236N75769P95733R74745J110880J200749
$$ -3089492 -3343262 -3470642 -3393327 -3067091 -2491322 -1695589 -720844 390036 1590785
16761A590785J232180J186706J053681Q42692N81419L03057L6136j96867l76875
$$ 1590785 2822965 4009671 5063352 5906044 6487463 6790520 6826656 6629789 6252914
16752F252914m89514n30862n08971m36208l22764j81166l3948Q8764J62671J82534
$$ 6252914 5763400 5232538 4723567 4287359 3964595 3783429 3749481 3838245 4000916 4183450
16742D183450J62871J26940R6086Q1714P6822N8202N208q3090j88621k86404l53227
$$ 4183450 4346321 4473261 4569347 4651061 4727883 4786085 4791293 4708203 4519582 4233178 3879951
16731C879951l71006l32486k48481j47573o6090l3558n8634j21172j78647j89394
$$ 3879951 3508945 3176459 2927978 2780405 2714315 2680757 2622123 2500951 2322304 2132910
16721B132910j38206m3614N6017J23237J37768J02799L7485m1410j34363k54619
$$ 2132910 1994704 1951090 2007107 2130344 2268112 2370911 2408396 2366986 2232623 1978004
16711A978004m09698n91655p81996r56573j085162j133866j073558q92282o08469
$$ 1978004 1568306 976651 194655 -761918 -1847080 -2980946 -4054504 -4946786 -5555255
16702e555255k75715L1539K49682L56336L77610L65944L63514L79050L97515M10461
$$ -5555255 -5830970 -5799431 -5549749 -5193413 -4815803 -4449859 -4086345 -3707295 -3309780 -2899319
16692b899319M32502M86730N77929O84743P78766Q45828Q86221R03875R03626
$$ -2899319 -2466817 -1980087 -1402158 -717415 61351 907179 1793400 2697275 3600901
16683C600901Q92235Q71134Q28392P46740O23903M80386L43263K24810J19483
$$ 3600901 4493136 5364270 6192662 6939402 7563305 8043691 8386954 8611764 8731247
16674H731247J9182p3894j51039k08190k48689k78052l00795l20741l39388l55299
$$ 8731247 8750429 8676535 8525496 8317306 8068617 7790565 7489770 7169029 6829641 6474342
16664F474342l72234m07877m84308o02926p32192q25101q47841p91890o70044
$$ 6474342 6102108 5694231 5209923 4606997 3874805 3049704 2201863 1409973 739929
16655G39929n12852l61491k47246j73085j18295o2538o995K6860K2528o005j8572
$$ 739929 227077 -134414 -381660 -554745 -673040 -735578 -742573 -715713 -693185 -699190 -717762
16644g17762K0644J20886K67616M33930N86062O90406P27539P02288O41365N82738
$$ -717762 -697118 -576232 -308616 125314 711376 1401782 2129321 2831609 3472974 4055712
16634D055712N60155N84026O29295O47081N98276M79440L15310J28632p9465l19712
$$ 4055712 4615867 5199893 5829188 6476269 7074545 7553985 7869295 7997927 7918462 7598750
16624G598750n87933q51211j061886j180826j185980j071657q55185n83374l18757
$$ 7598750 7010817 6159606 5097720 3916894 2730914 1659257 804072 220698 -98059
16615i8059j11548J4236N0270r690j65242l93837o46003q56884r65304r31697
$$ -98059 -209607 -195371 -145101 -154791 -320033 -713870 -1359873 -2216757 -3182061 -4113758
16605d113758p49943m50032q6541K84493O24123R13718J145453J308874J385420
$$ -4113758 -4863701 -5313733 -5400274 -5115781 -4491658 -3577940 -2432487 -1123613 261807
16596B61807J357247J221542R96952P19806M34854J83563r046j44058k44879l39023
$$ 261807 1619054 2840596 3837548 4557354 4992208 5175771 5166725 5022667 4777788 4438765
16586D438765m40945n47313o40272o94556o90064o26679n32001m53909m38203
$$ 4438765 3997820 3450507 2810235 2115679 1425615 798936 266935 -186974 -625177
16577f25177n02266o20205p30135p61174o66537m52414j87932K5083J13586P8987
$$ -625177 -1127443 -1747648 -2477783 -3238957 -3905494 -4357908 -4545840 -4520757 -4407171 -4328184
16567d328184r141o4445l8611O1911K00649L45043M80393O02150P03354P71057
$$ -4328184 -4337325 -4401770 -4440381 -4378470 -4177821 -3832778 -3352385 -2750235 -2046881 -1275824
16557a275824P92371P60920O76769N43426L69722J74095k0404j97238l46643m56942
$$ -1275824 -483453 277467 954236 1497662 1867384 2041479 2021075 1823837 1477194 1020252
16547A020252n15470n19964m84477m30199l65323k74894j40431L1173K10107L71724
$$ 1020252 504782 -15182 -499659 -929858 -1295181 -1570075 -1710506 -1679333 -1469226 -1097502
16537a097502N08822O20216O99649P34470P09833O19187M77901L25085K06526
$$ -1097502 -588680 31536 731185 1465655 2175488 2794675 3272576 3597661 3804187
16528C804187J52469J67714K36426L33750M37591N35434O22964P00658P74729
$$ 3804187 3956656 4124370 4360796 4694546 5132137 5667571 6290535 6991193 7765922
16519G765922Q49133Q97629Q50418O40376K74643j55729n38949q03224r29622
$$ 7765922 8615055 9512684 10363102 11003478 11278121 11122392 10583443 9780219 8850597
16510H850597r35360q51999p07422n19034k99850o7464J52483L30162M42244M81887
$$ 8850597 7915237 7063238 6355816 5836782 5536932 5469468 5621951 5952113 6394357 6876244
16500F876244M59557L95481L10259K19302J32525N4989j4459q2911j56737k32405
$$ 6876244 7335801 7731282 8041541 8260843 8393368 8448357 8433898 8350987 8194250 7961845
16490G961845k95196l28336l20953k67009j64782k6718J10233J94026J87602R3023
$$ 7961845 7666649 7338313 7017360 6750351 6585569 6558851 6669084 6863110 7050712 7143735
16480G143735n1494j95653l03962l70554m15286m66234n44509o62588q25331j021937
$$ 7143735 7092241 6896588 6592626 6222072 5806786 5340552 4796043 4133455 3308124 2286187
16470B286187j223038j395760j518370j575740j552249j446420j290634j135888
$$ 2286187 1063149 -332611 -1850981 -3426721 -4978970 -6425390 -7716024 -8851912
16462h851912j005354q70411o79718m11373r8027J93742M05498N11406N11438
$$ -8851912 -9857266 -10727677 -11407395 -11818768 -11916795 -11723053 -11317555 -10806149 -10294711
16453a0294711M15114K40897K8410j60078k61382k43999j28884J6745J10916R4966
$$ -10294711 -9879597 -9638700 -9610290 -9770368 -10031750 -10275749 -10404633 -10387888 -10276972 -10182006
16443a0182006m4487k75918n34607p38876q12244p06602m19075O182N01834J013339
$$ -10182006 -10226493 -10502411 -11037018 -11775894 -12588138 -13294740 -13713815 -13707633 -13205799 -12192460
16433a2192460J512215J979182K380158K653921K723255K536859K117064J563450
$$ -12192460 -10680245 -8701063 -6320905 -3666984 -943729 1593130 3710194 5273644
16425E273644J001584N26504J86388l321n5570k6838j4657j12976l55363o92179
$$ 5273644 6275228 6801732 6988120 6984799 6929229 6902391 6887734 6774758 6419395 5727216
16415E727216j018251j232605j291254j220298j089841r75480r28917r64289j059418
$$ 5727216 4708965 3476360 2185106 964808 -125033 -1100513 -2029430 -2993719 -4053137
16406d053137j166451j228087j198942j062174q31582n41663k28692Q8361M06777
$$ -4053137 -5219588 -6447675 -7646617 -8708791 -9540373 -10082036 -10310728 -10222367 -9815590
16397i815590P18931R97282J199538J281544J205365R49349N30290K5504m32452
$$ -9815590 -9096659 -8099377 -6899839 -5618295 -4412930 -3463581 -2933291 -2907787 -3340239
16388c340239o98369o73005l45747J95917P95101J286223J552703J543341J257248
$$ -3340239 -4038608 -4711613 -5057360 -4861443 -4066342 -2780119 -1227416 315925 1573173
16379A573173P34816N9538o53887j290316j763129k027207k074688j917062j571150
$$ 1573173 2307989 2367527 1713640 423324 -1339805 -3367012 -5441700 -7358762 -8929912
16370h929912j066246m58347J72899P40651J168409J410480J467784J375697J170563
$$ -8929912 -9996158 -10454505 -10281606 -9540955 -8372546 -6962066 -5494282 -4118585 -2948022
16361b948022Q77686N35493K17376J3515j8359J06057K97527M39705M51647L19471
$$ -2948022 -2070336 -1534843 -1317467 -1303952 -1322311 -1216254 -918727 -479022 -27375 292096
16351B92096P9957k16513n26520q10075j024354j133038j121737r96403p64978
$$ 292096 372053 155540 -370980 -1181055 -2205409 -3338447 -4460184 -5456587 -6221565
16342f221565m30005r338M38519Q20895J052153J094824R64904P05997L69732
$$ -6221565 -6651570 -6660908 -6222389 -5401494 -4349341 -3254517 -2289613 -1583616 -1213884
16333a213884J9188k67614m19451m11500k88673j46800q1138j36862k90776m71637
$$ -1213884 -1194696 -1462310 -1881761 -2293261 -2581934 -2728734 -2809872 -2946734 -3237510 -3709147
16323c709147o04071o47051o04171n07977l99689l15601k71974k49889j99688
$$ -3709147 -4313218 -4960269 -5564440 -6072417 -6472106 -6787707 -7059681 -7309570 -7509258
16314g509258o6738J86980N80059J109566J729775K330369K758949K896830K727917
$$ -7509258 -7575996 -7389016 -6808957 -5699391 -3969616 -1639247 1119702 4016532 6744449
16305F744449K337501J853662J388693J008922P25829N06298L04617R6930j07562
$$ 6744449 9081950 10935612 12324305 13333227 14059056 14565354 14869971 14966901 14859339
16296A4859339k80840m00319m69146n20221n93983p02230q13427q77897q69244
$$ 14859339 14578499 14178180 13709034 13188813 12594830 11892600 11079173 10201276 9332032
16287I332032q02601p14470o27869n37521m20905k54984k5347K66177N90318Q89462
$$ 9332032 8529431 7814961 7187092 6649571 6228666 5973682 5948335 6214512 6804830 7694292
16277G694292J098235J168903J083622Q59488N50209K33281j8536j65198k09235
$$ 7694292 8792527 9961430 11045052 11904540 12454749 12688030 12669494 12504296 12295061
16268A2295061j82882j24043n8739J407N2279R0035J03383O6188n8310k98505
$$ 12295061 12112179 11988136 11929397 11930804 11983083 12073118 12176501 12242689 12184379 11885874
16258A1885874o53501j078787j482070j741262j749976j472106r72551l96274
$$ 11885874 11232373 10153586 8671516 6930254 5180278 3708172 2735621 2339347
16250B339347J02089M30187N74260N61832M24891J95568p7153l15335m25217l36856
$$ 2339347 2441436 2871623 3445883 4007715 4432606 4628174 4551021 4235686 3810469 3473613
16240C473613m6498L70846P97279J136879J354234J454040J437847J295632J034987
$$ 3473613 3427115 3797961 4595240 5732119 7086353 8540393 9978240 11273872 12308859
16231A2308859P01554L60631N8149k00177m37194o77007r23035j151379j319908
$$ 12308859 13010413 13371044 13429193 13229016 12791822 12114815 11191780 10040401 8720493
16222H720493j386414j327345j149552q85904n76389k54942M8906L10159N18359
$$ 8720493 7334079 6006734 4857182 3971278 3394889 3139947 3188853 3499012 4017371
16213D017371O77133P84131Q16146P42344N53556K76959l7432l45206o28526q93469
$$ 4017371 4694504 5478635 6294781 7037125 7590681 7867640 7830208 7485002 6856476 5963007
16203E963007j144201j358332j490916j502507j382732j155617q72256n95792
$$ 5963007 4818806 3460474 1969558 467051 -915681 -2071298 -2943554 -3539346
16195c539346l81322k56144k06406j77767r7203Q9036L82440P27165J036695J233302
$$ -3539346 -3920668 -4176812 -4383218 -4560985 -4658188 -4569152 -4186712 -3459547 -2422852 -1189550
16185a189550J277114J175494R76710P52900N75015M89114N07592O16445P87230
$$ -1189550 87564 1263058 2239768 2992668 3567683 4056797 4564389 5180834 5968064
16176E968064R86601J183745J354605J481365J549255J545351J464538J319237
$$ 5968064 6954665 8138410 9493015 10974380 12523635 14068986 15533524 16852761
16168A6852761J139014R55035P81156O03839L88616J08673k19988n37121p81835
$$ 16852761 17991775 18946810 19727966 20331805 20720421 20829094 20609106 20071985 19290150
16159A9290150r35680j022969j078441j117895j133264j108899j039718r36552
$$ 19290150 18354470 17331501 16253060 15135165 14001901 12893002 11853284 10916732
16151A0916732q21166p20074o57580o46183o81923p51914q45078r52640j062772
$$ 10916732 10095566 9375492 8717912 8071729 7389806 6637892 5792814 4840174 3777402
16142C777402j161904j240939j297334j330600j333267j284115j155020r31609
$$ 3777402 2615498 1374559 77225 -1253375 -2586642 -3870757 -5025777 -5957386
16134e957386o31878l07153k0711J86075L13349L87954M29239M31338L77701K70554
$$ -5957386 -6589264 -6896417 -6917128 -6731053 -6417704 -6029750 -5600511 -5169173 -4791472 -4520918
16124d520918J46117O0129N4463J33084K63607L94556M73788M67351L76985K38734
$$ -4520918 -4374801 -4314672 -4260209 -4127125 -3863518 -3468962 -2995174 -2527823 -2150838 -1912104
16114a912104R8057j2624p6029q4878m3884K5472Q7547J06522O4543l0484j53110
$$ -1912104 -1814047 -1826671 -1902700 -1987578 -2031462 -2005990 -1918443 -1811921 -1747378 -1777862 -1930972
16103a930972k74932l75473m49315n06996n65211o35428p22531q26492r36240
$$ -1930972 -2205904 -2581377 -3030692 -3537688 -4102899 -4738327 -5460858 -6287350 -7223590
16094g223590j026433j071220j063291j018019r63362r24450r04233q69443p61860
$$ -7223590 -8250023 -9321243 -10384534 -11402553 -12365915 -13290365 -14194598 -15064041 -15825901
16085a5825901n34413j82252K55986P20676J158137J540436J867348K144731K359572
$$ -15825901 -16360314 -16542566 -16286580 -15565904 -14407767 -12867331 -10999983 -8855252 -6495680
16076f495680K481390K488371K387596K209158J984635J732431J457926J162472
$$ -6495680 -4014290 -1525919 861677 3070835 5055470 6787901 8245827 9408299
16068I408299Q52939N45505K64114L6739j13484j82639j93755j84713j80962j78786
$$ 9408299 10261238 10806743 11070857 11107596 10994112 10811473 10617718 10433005 10252043 10073257
16058A0073257j58957j17666q1634r2963j81720l49573n69802p97587r82942j082570
$$ 10073257 9914300 9796634 9715000 9622037 9440317 9090744 8520942 7723355 6740413 5657843
16048E657843j073404r63862p88984n88274l87386k00931m5791N7974J01220R8370
$$ 5657843 4584439 3620577 2831593 2243319 1855933 1655002 1609211 1667185 1768405 1866775
16038A866775Q6212J06240J80137K99510M34423N44035N85766N32486L88392J83785
$$ 1866775 1952987 2059227 2239364 2538874 2973297 3517332 4103098 4635584 5023976 5207761
16028E207761m6248k75401m81905o37769p07780o63181n00158k49836K7799K65772
$$ 5207761 5161513 4886112 4404207 3766438 3058658 2395477 1895319 1645483 1673282 1939054
16018A939054M18665M82125M89991M89495N12234N61882O21532O66227O71435
$$ 1939054 2357719 2839844 3329835 3819330 4331564 4893446 5514978 6181205 6852640
16009F852640O23115N31937M36898L84554L97359M61943N44937O12324O34153
$$ 6852640 7475755 8007692 8444590 8829144 9226503 9688446 10233383 10845707 11479860
16000A1479860N82911M38168J97404j13330m37362p01485q43670q40400p18120
$$ 11479860 12062771 12500939 12698343 12585013 12147651 11446166 10602496 9762096 9043976
15991I043976n41057l79078k72856k22143k06770k14931k43951k75910k67884
$$ 9043976 8502919 8123841 7850985 7628842 7422072 7207141 6963190 6687280 6419396
15982F419396j76710P807K52379M95427O73016P41074O87625N32504L13014O2660
$$ 6419396 6242686 6250493 6502872 6998299 7671315 8412389 9100014 9632518 9945532 10008192
15972A0008192k01390m71861p33314r52085j088423j124930j084679j018655r74801
$$ 10008192 9806802 9334941 8601627 7649542 6561119 5436189 4351510 3332855 2358054
15963B358054r76977j022943j089017j132819j101738r53160o77460l07818R1687
$$ 2358054 1381077 358134 -730883 -1863702 -2965440 -3918600 -4596060 -4903878 -4812191
15954d812191M52562P26314Q94388R63415R54584Q93276Q00825O93727N89791
$$ -4812191 -4359629 -3633315 -2738927 -1775512 -820928 72348 873173 1566900 2156691
15945B156691N07006M49930M02812L45021K75396K22957K33096L33164N00964
$$ 2156691 2663697 3113627 3516439 3861460 4136856 4359813 4592909 4926073 5427037
15936E427037O65794P43517O76504M54974J19642k49531n61528p54379q21823
$$ 5427037 6092831 6836348 7512852 7967826 8087468 7837937 7276409 6522030 5700207
15927E700207q01114p32985o34429n03875l41381j59420K4879K06333L95922O01536
$$ 5700207 4899093 4166108 3531679 3027804 2686423 2527003 2551882 2758215 3154137 3755673
15917C755673Q01088R37048R42756P81773M70180O6341l56733p31096j004024
$$ 3755673 4556761 5493809 6436565 7218338 7688518 7754859 7398126 6667030 5663006
15908E663006j150980j187957j165246j137366j130094j130562j103072j012742
$$ 5663006 4512026 3324069 2158823 1021457 -108637 -1239199 -2342271 -3355013
15900c355013q40080n83769k61230Q8557M11282O60866Q24617R24708R96069J066349
$$ -3355013 -4195093 -4778862 -5040092 -4951535 -4540253 -3879387 -3054770 -2130062 -1133993 -67644
15890f7644J149239J237756J297427J279282J151900R21564O22802K99919P9k31583
$$ -67644 1081595 2319351 3616778 4896060 6047960 6969524 7592326 7892245 7892324 7660741
15880G660741l65422l99133l53167k50940j05619O9077K40009L58145L84329L09617
$$ 7660741 7295319 6896186 6543019 6292079 6186460 6255537 6495546 6853691 7238020 7547637
15870G547637J54253m6097k51959m26260n39278n72356n22182m09081k79520j88904
$$ 7547637 7701890 7655793 7403834 6977574 6438296 5865940 5343758 4934677 4655157 4466253
15860D466253j71639k22290k99478l45582l12631j84176J8793K50060M56214N87832
$$ 4466253 4294614 4072324 3772846 3427264 3114633 2930457 2949250 3199310 3655524 4243356
15850D243356O07076N03963L14251J12243k5701n6719J6027J50283K85479L75390
$$ 4243356 4850432 5354395 5668646 5780889 5755188 5698469 5714496 5864779 6150258 6525648
15840F525648M12552M19762M20665M22283M17136L92527L40521K63140J67688
$$ 6525648 6938200 7357962 7778627 8200910 8618046 9010573 9351094 9614234 9781922
15831I781922O0281n2563j59599k44735k89421k77151k01134o8095J07587L10342
$$ 9781922 9842203 9789640 9630041 9385306 9095885 8818734 8617600 8549505 8657092 8967434
15821H967434N21421P15269Q63385R40891R29300Q19767O19400L51758M8149k59459
$$ 8967434 9488855 10204124 11067509 12008400 12937700 13757467 14376867 14728625 14776774 14517315
15811A4517315n40391p70238r38280j049150j115893j147641j138557j067017
$$ 14517315 13976924 13206686 12268406 11219256 10103363 8955722 7817165 6750148
15803F750148r10431o69087l79460j02956J01030J96337J76216O2932r4416k35888
$$ 6750148 5839717 5170630 4791170 4688214 4789244 4985581 5161797 5224729 5130313 4894425
15793D894425l20651l42009l09105k20889o5577J58154M23731O77763Q58578R24605
$$ 4894425 4573774 4231765 3922660 3701771 3636194 3794348 4218079 4895842 5754420 6679025
15783F679025Q77888P62295O32456N17336M06680K67176P2644j72849m31085o44530
$$ 6679025 7556913 8319208 8951664 9469000 9875680 10142856 10215500 10042651 9611566 8967036
15773H967036p59965p47470o06265l62057o5021K16360M15353M92741M50478L24965
$$ 8967036 8207071 7459601 6853336 6491279 6426258 6642618 7057971 7550712 8001190 8326155
15763H326155J61927j3082k06133m39506p21267j020387j267925j392188j364635
$$ 8326155 8488082 8475000 8268867 7829361 7108094 6087707 4819782 3427594 2062959
15754B062959j215113j003871p82821n78770l98541k41210j06891K866Q9871J61725
$$ 2062959 847846 -156025 -938846 -1517616 -1916157 -2157367 -2264258 -2261392 -2171521 -2009796
15744b009796K29268L02647L88580M86777N84843O60878P02276P23034P53744
$$ -2009796 -1780528 -1477881 -1089301 -602524 -17681 643197 1345473 2068507 2822251
15735B822251Q14150Q97785R74319J001161R44660Q03924O14917M29021K88165
$$ 2822251 3636401 4534186 5508505 6509666 7454326 8258250 8873167 9302188 9590353
15726I590353K14058K06742K44548K89909L06421K77495K12729J39432Q5702O6329
$$ 9590353 9804411 10011153 10255701 10545610 10852031 11129526 11342255 11481687 11567389 11633718
15716A1633718P8648J05137J21440J09720O7565P644m5075n9266j3505Q4422J91928
$$ 11633718 11712366 11817503 11938943 12048663 12116228 12123872 12078797 12019531 12006026 12090448 12282376
15705A2282376K46581J98304M2206j77742m00808n83762p09038p76418p97397
$$ 12282376 12528957 12727261 12769467 12591725 12190917 11607155 10898117 10121699 9324302
15696I324302p90411p69692p35859o78385n87221m64177l24613j86568n6667P4891
$$ 9324302 8533891 7764199 7028340 6349955 5762734 5298557 4973944 4787376 4730709 4805600
15686D805600K24575L94927N61749O86993P44976P31503O50453N02911K97403
$$ 4805600 5030175 5425102 5986851 6673844 7418820 8150323 8800776 9303687 9601090
15677I601090O6581j36862k69970l28146l41328l43448l51153l65723l80179l79902
$$ 9601090 9667671 9530809 9260839 8932693 8591365 8247917 7896764 7531041 7150862 6770960
15667F770960l47569k80410k02564j50656j41292j51828j32134l7369J43176L80259
$$ 6770960 6423391 6142981 5940417 5789761 5648469 5496641 5364507 5327138 5470314 5850573
15657E850573O19237P97460Q60290P85167O04505L99832K60005K33605L13802
$$ 5850573 6469810 7267270 8127560 8912727 9517232 9917064 10177069 10410674 10724476
15648A0724476M58252O13387P24115P40708O39126M40884K02448k2895k10914
$$ 10724476 11182728 11796115 12520230 13260938 13900064 14340948 14543396 14520501 14309587
15639A4309587l57337m55441m92530m69613m18955l93838m33806n33562o39886
$$ 14309587 13952250 13496809 13004279 12534666 12115711 11721873 11288067 10754505 10114619
15630A0114619o81054o11733m41836k25994k3308J36762K58020L58971M54090
$$ 10114619 9433565 8821832 8379996 8154002 8130694 8267456 8525476 8884447 9338537
15621I338537N43802O11041O26824N65970M19991J94150j00462m40608p78213
$$ 9338537 9882339 10493380 11120204 11686174 12106165 12300315 12199853 11759245 10981032
15612A0981032j048481j203456j238699j183494j070185r20143p55544o12617
$$ 10981032 9932551 8729095 7490396 6306902 5236717 4316574 3561030 2948413
15604B948413n33385n40455o16748p07001p46059p00824n92838m77797l99590
$$ 2948413 2415028 1874573 1257825 550824 -195235 -896059 -1488897 -1966694 -2366284
15595b366284l60832l30532k73699j74722m1407J04996K44431L67666M72361N50859
$$ -2366284 -2727116 -3057648 -3331347 -3506069 -3547476 -3442480 -3198049 -2830383 -2358022 -1807163
15585a807163N88139N76496N28053M68230M18782L86459L62566L32701K89489
$$ -1807163 -1219024 -642528 -114475 353755 772537 1158996 1521562 1854263 2143752
15576B143752K36929J84046J35996Q9834L6477l2784j17845k06156k81696l39126
$$ 2143752 2380681 2564727 2700723 2790557 2827034 2794250 2676405 2470249 2188553 1849427
15566A849427l81819m01502l69296k58788p7737J29822L15140M60065N86218P32566
$$ 1849427 1467608 1066106 696810 438022 360285 490107 805247 1265312 1851530 2584096
15556B584096R21044J134579J320598J420405J406041J294793J130885R53123
$$ 2584096 3505140 4639719 5960317 7380722 8786763 10081556 11212441 12165564
15548A2165564P75589N93515M01275J99262j5266k55734n34017q35203j109425
$$ 12165564 12941153 13534668 13935943 14135205 14119939 13864205 13330188 12494985 11385560
15539A1385560j295214j351787j274612j094373q66868o52454m89805l80484k94776
$$ 11385560 10090346 8738559 7463947 6369574 5502706 4850252 4360447 3979963 3685187
15530C685187j94693n8625J07565K73016L91732M18969L32281J51279n6593j99405
$$ 3685187 3490494 3431869 3539434 3812450 4204182 4623151 4955432 5106711 5050118 4850713
15520D850713k08397p9783J17694K74883K97733J57127r5719l56255n15875n05342
$$ 4850713 4642316 4562533 4680227 4955110 5252843 5409970 5314251 4957996 4442121 3936779
15510C936779l17636p533L30859O03770P58026P97723P70633P39695P54011Q25675
$$ 3936779 3619143 3611610 3942469 4546239 5304265 6101988 6872621 7612316 8366327 9192002
15500I192002R21324R77392R35629P80681N53339L26247J61619Q2526P0738Q6297
$$ 9192002 10113326 11090718 12026347 12807028 13360367 13686614 13848233 13930759 14001497 14087794
15490A4087794R5437Q8532P8964Q8701J28977J83827K12250J74738O1020j05630
$$ 14087794 14183231 14271763 14350727 14439428 14568405 14752232 14964482 15139220 15200240 15094610
15480A5094610k83885m33754n32787n83147o01701n98779n66420m88482l57881
$$ 15094610 14810725 14376971 13844184 13261037 12659336 12060557 11494137 11005655 10647774
15471A0647774j77895M8173L15907O04417Q70555J070022J188973J251370J294189
$$ 10647774 10469879 10518052 10833959 11438376 12308931 13378953 14567926 15819296 17113485
15462A7113485J339190J384620J410934J389640J296737J128136R05716O70312
$$ 17113485 18452675 19837295 21248229 22637869 23934606 25062742 25968458 26638770
15454B6638770M66908L28491K63674K51022K45892K05111J17692J3399o3131q8818
$$ 26638770 27105678 27434169 27697843 27948865 28194757 28399868 28517560 28530959 28467828 28379010
15444B8379010p4002m3053r935K4620N7734P5727O2292J1878o2930j34167j70536
$$ 28379010 28305008 28261955 28252020 28276640 28334374 28410101 28472393 28484271 28421341 28287174 28116638
15433B8116638j50754p0114N9235K09936L45974M36762M69366M48512L86589K93957
$$ 28116638 27965884 27895770 27955005 28164941 28510915 28947677 29417043 29865555 30252144 30546101
15423C0546101J78602N4552n0932j00074n6294R9369L52078O50055R22996J111573
$$ 30546101 30724703 30779255 30728323 30628249 30571955 30671324 31023402 31673457 32596453 33708026
15413C3708026J188485J159918J051152Q91177P07609N26753L66611K28321J01104
$$ 33708026 34896511 36056429 37107581 37998758 38706367 39233120 39599731 39828052 39929156
15404C9929156k3149j42550k47718l23640l49800l10025k11639r2331K230N7464
$$ 39929156 39906007 39763457 39515739 39192099 38842299 38532274 38320635 38228304 38230534 38287998
15394C8287998J11294K34063M76407Q24102J199635J511178J708313J803180J845891
$$ 38287998 38399292 38633355 39109762 39933864 41133499 42644677 44352990 46156170 48002061
15385D8002061J877035J897371J876942J788087J631755J443663J283550J210086
$$ 48002061 49879096 51776467 53653409 55441496 57073251 58516914 59800464 61010550
15377F1010550J249239J379000J545787J697580J805059J860987J870032J838094
$$ 61010550 62259789 63638789 65184576 66882156 68687215 70548202 72418234 74256328
15369G4256328J762831J632627J440065J198992R46476P26260N69853M92914N05923
$$ 74256328 76019159 77651786 79091851 80290843 81237319 81963579 82533432 83026346 83532269
15360H3532269O22515Q53268J188401J586526J985448K329133K589417K771678
$$ 83532269 84154784 85008052 86196453 87782979 89768427 92097560 94686977 97458655
15352I7458655K907126L034796L177262L323914L439225L494009L491972L466476
$$ 97458655 100365781 103400577 106577839 109901753 113340978 116834987 120326959 123793435
15344A23793435L452128L459280L474847L484667L492745L520231L587412L694070
$$ 123793435 127245563 130704843 134179690 137664357 141157102 144677333 148264745 151958815
15336A51958815L812583L899177L916661L851940L715831L530655L320381L109288
$$ 151958815 155771398 159670575 163587236 167439176 171155007 174685662 178006043 181115331
15328A81115331K923063K783855K701043K669236K676491K710978K760203K812914
$$ 181115331 184038394 186822249 189523292 192192528 194869019 197579997 200340200 203153114
15320B03153114K869821K950192L077840L251185L424691L525956L499305L337352
$$ 203153114 206022935 208973127 212050967 215302152 218726843 222252799 225752104 229089456
15312B29089456L077141K773943K475183K205511J968972J766437J609042J508193
$$ 229089456 232166597 234940540 237415723 239621234 241590206 243356643 244965685 246473878
15304B46473878J451823J397679J295031J113212Q53577N44769K30478m8621k74901
$$ 246473878 247925701 249323380 250618411 251731623 252585200 253129969 253360447 253311826 253036925
15295B53036925m61259o34088q06828r74199j129787j281954j451146j652351
$$ 253036925 252575666 251941578 251134750 250160551 249030764 247748810 246297664 244645313
15287B44645313j875822k081744k218698k254377k192133k062484j903792j749539
$$ 244645313 242769491 240687747 238469049 236214672 234022539 231960055 230056263 228306724
15279B28306724j623139j534360j482322j465760j488093j552961j655759j778128
$$ 228306724 226683585 225149225 223666903 222201143 220713050 219160089 217504330 215726202
15271B15726202j895192j992442k070430k131165k169738k184069k183173k179430
$$ 215726202 213831010 211838568 209768138 207636973 205467235 203283166 201099993 198920563
15263A98920563k178403k178087k169930k135734k047818j876486j601130j224966
$$ 198920563 196742160 194564073 192394143 190258409 188210591 186334105 184732975 183508009
15255A83508009p89781l74692o5859R0518J15164P6640M3126M5869P7083J12904
$$ 183508009 182718228 182343536 182277677 182368195 182483359 182559999 182603125 182648994 182726077 182838981
15245A82838981J33557J22965N9884p6118k83734n29092p61619r42712j061019
$$ 182838981 182972538 183095503 183155387 183079269 182795535 182266443 181504824 180562112 179501093
15236A79501093j124082j139813j110037j040086r46919q53429p72436o94545
$$ 179501093 178377011 177237198 176127161 175087075 174140156 173286727 172514291 171819746
15228A71819746n94898m56026k85982j18186L327M1327k2803j83673m13764o76019
$$ 171819746 171224848 170768822 170482840 170364654 170367981 170409308 170386505 170202832 169789068 169113049
15218A69113049r43618j210131j478192j740260j975961k169153k320992k439933
$$ 169113049 168169431 166959300 165481108 163740848 161764887 159595734 157274742 154834809
15210A54834809k522363k553423k529164k468492k398200k332364k268631k197868
$$ 154834809 152312446 149759023 147229859 144761367 142363167 140030803 137762172 135564304
15202A35564304k113301k013720j902734j787779j680198j597149j564605j613047
$$ 135564304 133451003 131437283 129534549 127746770 126066572 124469423 122904818 121291771
15194A21291771j760336j995333k281023k574537k845352l079041l266350l388493
$$ 121291771 119531435 117536102 115255079 112680542 109835190 106756149 103489799 100101306
15186A00101306l414002l313381l082217k755127k398062k081682j849294j696514
$$ 100101306 96687304 93373923 90291706 87536579 85138517 83056835 81207541 79511027
15178G9511027j579528j451569j299245j149025j044452j016305j062738j146105
$$ 79511027 77931499 76479930 75180685 74031660 72987208 71970903 70908165 69762060
15170F9762060j208791j200013j096188r06403o68131m35423k59036j67575j59518
$$ 69762060 68553269 67353256 66257068 65350665 64682534 64247111 63988075 63820500 63660982
15161F3660982k04766k56553k77939k67514k58776k92217l84013n14043o39002
$$ 63660982 63456216 63199663 62921724 62654210 62395434 62103217 61719204 61205161 60566159
15152F0566159p20170p48235p47991p60412q17002r19331j030690j087158j027341
$$ 60566159 59845989 59097754 58349763 57589351 56772349 55853018 54822328 53735170 52707829
15143E2707829q26088n13823j71480R9912K24796J88425L7597j52307l19299m41157
$$ 52707829 51881741 51367918 51196438 51296350 51521146 51709571 51747168 51594861 51275562 50834405
15133E0834405n32585o15876o91496p36223p25715o56155n48303m34411l39526
$$ 50834405 50301820 49685944 48994448 48258225 47532510 46876355 46328052 45893641 45554115
15124D5554115k70853k21214j81378j49194j28658j25643j48557k08833l12394
$$ 45554115 45283262 45062048 44880670 44731476 44602818 44477175 44328618 44119785 43807391
15115D3807391m49529n96923p29370q31597r07493r80926j079243j208889j347493
$$ 43807391 43357862 42760939 42031569 41199972 40292479 39311553 38232310 37023421 35675928
15106C5675928j458471j509336j478505j354499j139789q60751n69589l29497
$$ 35675928 34217457 32708121 31229616 29875117 28735328 27874577 27304988 26975491
15098B6975491j90366j66734k31293l33408m31374n12379n84841o52350o96323
$$ 26975491 26785125 26618391 26387098 26053690 25622316 25109937 24525096 23872746 23176423
15089B3176423o87507o16942n14506m32937m10727m47255n04629n28125m74677
$$ 23176423 22488916 21871974 21357468 20924531 20513804 20066549 19561920 19033795 18559118
15080A8559118l36756j47724L1377J32114J01861o9035l29593n85095p51325q08694
$$ 18559118 18222362 18074638 18106015 18238129 18339990 18270955 17941362 17356267 16604942 15796248
15070A5796248q10795q41879r59001j158049j380542j549485j602015j498078
$$ 15796248 14985453 14143574 13184573 12026524 10645982 9096497 7494482 5996404
15062E996404j219047p79556k45363K72984O61395Q52408Q50117P19773N54023
$$ 5996404 4777357 3997801 3752438 4025422 4686817 5539225 6389342 7109115 7663138
15053G663138M33624L99915M46616N29151N90534N93511N35817M42112L51506
$$ 7663138 8096762 8496677 8943293 9472444 10062978 10656489 11192306 11634418 11985924
15044A1985924L07618L37216M24109N10823N37500M85236L82861K73751J81970
$$ 11985924 12293542 12630758 13054867 13565690 14103190 14588426 14971287 15245038 15427008
15035A5427008J07559M1187k0537o6479p3393j9932R6676K55409M20595N51800
$$ 15427008 15534567 15575754 15555217 15488738 15415345 15395413 15492089 15747498 16168093 16719893
15025A6719893O10172N71321M37598K32812j2141k63531m84345o44988p38651
$$ 16719893 17330065 17901386 18338984 18571796 18559655 18296124 17811779 17166791 16428140
15016A6428140p81479p95328p91055p67572p22842o60817n84965m85401l39169
$$ 16428140 15646661 14851333 14060278 13292706 12569864 11909047 11324082 10838681 10499512
15007A0499512j35637R5019K88508L88695L85236L16349K41819K11557K50108
$$ 10499512 10363875 10458894 10747402 11136097 11521333 11837682 12079501 12291058 12541166
14998A2541166L59087N23321P11572Q80817R90668J019785R77457R04940Q56483
$$ 12541166 12900253 13423574 14135146 15015963 16006631 17026416 18003873 18908813 19765296
14989A9765296Q65986R27353J006582J068076J086571J043286R23561P20480M40346
$$ 19765296 20631282 21558635 22565217 23633293 24719864 25763150 26686711 27407191 27847537
14980B7847537J08874k30378n35133p87792r96028j168903j295929j351694j321275
$$ 27847537 27956411 27726033 27190900 26403108 25407080 24238177 22942248 21590554 20269279
14971B0269279j220195j089783r75902r07436q80987q59702p96312o68055m90579
$$ 20269279 19049084 17959301 16983399 16075963 15194976 14335274 13538962 12870907 12380328
14962A2380328k98112j12962O5058K40624L95810M84893M64084L32436J43124
$$ 12380328 12082216 11969254 12034312 12274936 12670746 13155639 13619723 13952159 14095283
14953A4095283k7279j22481j27714o0865M8411J70825K74531L18612K58852O8576
$$ 14095283 14068004 13945523 13817809 13756944 13805355 13976180 14250711 14569323 14828175 14896751
14943A4896751k38857o03937r36570j143137j155739r56002n80289j00484M06589
$$ 14896751 14657894 14053957 13117387 11974250 10818511 9862509 9282220 9181736 9588325
14934I588325Q80845J280604J572100J723816J713570J543391J249383Q95341
$$ 9588325 10469170 11749774 13321874 15045690 16759260 18302651 19552034 20447375
14926B0447375N53185K84737J31442J08687K03731L78668N79116P50511Q57515
$$ 20447375 21000560 21285297 21416739 21525426 21729157 22107825 22686941 23437452 24294967
14917B4294967Q89905Q45639P10450M61684R3748l61572q36691j248261j523417
$$ 24294967 25184872 26030511 26740961 27202645 27296393 26934821 26098130 24849869 23326452
14908B3326452j621979j549811j356214j110370q69842o62057m86846l32578j91218
$$ 23326452 21704473 20154662 18798448 17688078 16818236 16156179 15669333 15336755 15145537
14899A5145537o3993L8930R9093R2010j113j70456l64038n08822n54851m97666
$$ 15145537 15081544 15120474 15219567 15311577 15310464 15140008 14775970 14267148 13712297 13214631
14889A3214631l61128j72663L8804K30440L44750L31708J81944n3539k78817m01499
$$ 13214631 12853503 12680840 12719644 12950084 13294834 13626542 13808486 13754947 13476130 13074631
14879A3074631l83398k55489q5710O9257J87126K71524L33380L76710L90513L51889
$$ 13074631 12691233 12435744 12350034 12419291 12606417 12877941 13211321 13588031 13978544 14330433
14869A4330433K43549P2024j30675l21343m63804n44052n77264o00079o49402
$$ 14330433 14573982 14646006 14515331 14193988 13730184 13186132 12608868 12008789 11359387
14860A1359387p40409q59193r75868j068468j137736j200039j266036j323211
$$ 11359387 10618978 9759785 8783917 7715449 6577713 5377674 4111638 2788427
14852B788427j333092j243442j009841o20488j15850M16416Q82584J229993J459142
$$ 2788427 1455335 211893 -797948 -1418436 -1534286 -1117870 -235286 994707 2453849
14843B453849J600024J682392J721891J721608J680765J603933J502459J384717
$$ 2453849 4053873 5736265 7458156 9179764 10860529 12464462 13966921 15351638
14835A5351638J246259J072165Q50397N84336K93171j106k88373n69065q32625
$$ 15351638 16597897 17670062 18520459 19104795 19397966 19396860 19108487 18539422 17706797
14826A7706797j038246j124578j045591q03089m52395q2274K17039L84472M03542
$$ 17706797 16668551 15543973 14498382 13695293 13242898 13160624 13377663 13762135 14165677
14817A4165677K95894J01056j44257m15406o92348r45498j133759j223400j212372
$$ 14165677 14461571 14562627 14418370 14002964 13310616 12365118 11231359 10007959 8795587
14808H795587j131335j015554q78700p17880n39265l68456k30033j19135J867
$$ 8795587 7664252 6648698 5769998 5052118 4512853 4144397 3914364 3795229 3797096
14799C797096J73133L99655O44715Q60582J020910J125505J184380J202236J173436
$$ 3797096 3970229 4369884 5014599 5875181 6896091 8021596 9205976 10408212 11581648
14790A1581648J086208R31567P11863M44822J61219j03108l16570m56541n08478
$$ 11581648 12667856 13599423 14311286 14756108 14917327 14814219 14497649 14041108 13532630
14781A3532630m66252l39424j58023L7742K16834L66414M79863N37278N04185
$$ 13532630 13066378 12726954 12568931 12606673 12823507 13189921 13669784 14207062 14711247
14772A4711247L56081J06780j87752m54758o38257p19237p17073o77839o56522
$$ 14711247 15067328 15174108 14986356 14531598 13893341 13174104 12457031 11779192 11122670
14763A1122670o98113q21566j010424j212498j350437j349285j177303q70108
$$ 11122670 10424557 9602991 8592567 7380069 6029632 4680347 3503044 2632936
14755B632936n12336j92588L3022J54032J98214K08563K18663K43247K82828L27496
$$ 2632936 2120600 1928012 1961034 2115066 2313280 2521843 2740506 2983753 3266581 3594077
14745C594077L52950L22740K13532M7385j10536j97081j94636j33545o3599k5593
$$ 3594077 3947027 4269767 4483299 4530684 4420148 4223067 4028431 3894886 3831287 3805694
14735C805694l7176r1422j62734k17550k29422j91349j14172j1290J15099K73697
$$ 3805694 3768518 3677096 3514362 3296812 3067390 2876041 2761869 2750579 2865678 3139375
14725C139375M74446P17702R81611J216113J360137J376767J278824J122246R73066
$$ 3139375 3613821 4331523 5313134 6529247 7889384 9266151 10544975 11667221 12640287
14716A2640287Q78271Q57099R00721R71861J015348R84972Q71369P09179N54397
$$ 12640287 13518558 14375657 15276378 16248239 17263587 18248559 19119928 19829107 20383504
14707B0383504M48350L99400L90837L94955L81367L24920K13996N1118j52112
$$ 20383504 20831854 21231254 21622091 22017046 22398413 22723333 22937329 22988447 22836335
14698B2836335l71210n58625o53519o16867m58596k30290L609J90487L03604L49653
$$ 22836335 22465125 21906500 21252981 20636114 20177518 19947228 19950837 20141324 20444928 20794581
14688B0794581L64566L88987M35138M75876M70060L99284K80225J47842L3942
$$ 20794581 21159147 21548134 21983272 22459148 22929208 23328492 23608717 23756559 23790501
14679B3790501m0071o0119j9591P2670J85650K72453K90786K26326J00261m9476
$$ 23790501 23750430 23690311 23670720 23743390 23929040 24201493 24492279 24718605 24818866 24769390
14669B4769390j96088l32676m59153n67554o41503o67706o45115n84552n06414
$$ 24769390 24573302 24240626 23781473 23213919 22572416 21904710 21259595 20675043 20168629
14660B0168629m39498m12373m39497n15937o20125p14515p49330o81737n03859
$$ 20168629 19729131 19316758 18877261 18361324 17741199 17026684 16277354 15595617 15091758
14651A5091758k54892l102J90605L03649L57524L92334M29452M57936M57318M25042
$$ 15091758 14836866 14833764 15024369 15328018 15685542 16077876 16507328 16965264 17422582 17847624
14641A7847624L71200K89869J51603o4710l37693o11571q33958r73858j010791
$$ 17847624 18218824 18508693 18660296 18595586 18257893 17646322 16812364 15838506 14827715
14632A4827715r28269p25019m28100r3932K05462M04726M67537M02089K59323
$$ 14827715 13899446 13174427 12746327 12652395 12857857 13262583 13730120 14132209 14391532
14623A4391532J09933J3285l257N1599J38963K01334J86070P6396r5282k66942
$$ 14391532 14501465 14514750 14511493 14563092 14702055 14903389 15089459 15165855 15070573 14803631
14613A4803631l83019m18754l80019k88549j71318n9918J2699K5046k2042j05007
$$ 14803631 14420612 14001858 13621839 13333290 13161972 13102054 13114753 13139799 13117757 13012750
14603A3012750j84975k22138j95629j19373m0125j1169n6108j52386k50500l12864
$$ 13012750 12827775 12605637 12410008 12290635 12250510 12239341 12183233 12030847 11780347 11467483
14593A1467483l37390l44748l44748l21841k59413j75673j27257j68867l03485
$$ 11467483 11130093 10785345 10440597 10118756 9859343 9683670 9556413 9387546 9084061
14584I084061m70647n84573n88350m81488l08623j29552P275Q0782J01128R8989
$$ 9084061 8613414 8028841 7440491 6959003 6650380 6520828 6528103 6608885 6710013 6809002
14574F809002J05341J36524J93016K66640L49512M39710N39514O49372P61185
$$ 6809002 6914343 7050867 7243883 7510523 7860035 8299745 8839259 9488631 10249816
14565A0249816Q53038Q91704Q44422O96225M67495K16786J6358q5869q7593k2863
$$ 10249816 11102854 11994558 12838980 13535205 14002700 14219486 14235844 14149975 14062382 14039519
14555A4039519O3611J37270J82144J98869J93152J59974P4795r5918l64043o92416
$$ 14039519 14103130 14240400 14422544 14621413 14814565 14974539 15049334 14953416 14589373 13896957
14545A3896957j000066j200809j244856j135580r19894o66661m44086k99134k43163
$$ 13896957 12896891 11696082 10451226 9315646 8395752 7729091 7285005 6985871 6742708
14536F742708k54321k96977l40381l65549l64227l35895k88127k37681k02448
$$ 6742708 6488387 6191410 5851029 5485480 5121253 4785358 4497231 4259550 4057102
14527D057102j90021j99219k28767k72090l03793k84436j83345M292K55740N28357
$$ 4057102 3867081 3667862 3439095 3167005 2863212 2578776 2395431 2399723 2655463 3183820
14517C183820P69627R26491R56500Q42671O04495K94633j9708k82695m71516o01816
$$ 3183820 3953447 4879938 5836438 6679109 7283604 7578237 7558529 7275834 6804318 6202502
14507F202502p09148q13769q99590r32052q91852p85087o31995m59878l01461
$$ 6202502 5493354 4679585 3779995 2847943 1956091 1171004 539009 79131 -222330
14498b22330j84804j18524q8888p0528l6837L3555J44010K64553L36433L05828
$$ -222330 -407134 -525658 -614546 -685074 -721911 -688356 -544346 -279793 56640 362468
14488C62468J64466l6073k10448k89834k59944j58639l8808P0364J72444K80909
$$ 362468 526934 490861 280413 -9421 -269365 -428004 -466812 -396448 -224004 56905
14478E6905L94707N01517N98748O98652Q08000R06057R44826Q71857O60884L33158
$$ 56905 451612 953129 1551877 2250529 3058529 3964586 4909412 5781269 6442153 6775311
14468F775311m6716m02399o79956q56786r27588q92088p56231n36480k56981N4662
$$ 6775311 6728595 6326196 5646240 4789454 3861866 2969778 2213547 1677067 1420086 1474748
14458A474748L62802O16435P57252P44672N77554K96230l2880l42223n87279p55439
$$ 1474748 1837550 2453985 3211237 3955909 4533463 4829693 4796813 4454590 3867311 3111872
14448C111872q55901r02353r02258q57920p72716o53520n11300l65044k42368
$$ 3111872 2255971 1353618 451360 -406560 -1179276 -1832796 -2344096 -2709140 -2951508
14439b951508j68808j53694j86467k43797k98532l28455l26933l06194k83001
$$ -2951508 -3120316 -3274010 -3460477 -3704274 -4002806 -4331261 -4658194 -4964388 -5247389
14430e247389k59000k18444j44591l5511R4365K24406L38684M27682M81208M86902
$$ -5247389 -5506389 -5724833 -5869424 -5904935 -5810570 -5586164 -5247480 -4819798 -4338590 -3851688
14420c851688M39890L48972K28054Q2881q8192k77905m58058n83970o08756n02053
$$ -3851688 -3411798 -3062826 -2834772 -2751891 -2840083 -3117988 -3576046 -4160016 -4768772 -5270825
14410e270825k69854L9265L50110N87105O99429O80781N69543M19472K64302J12337
$$ -5270825 -5540679 -5501414 -5151304 -4564199 -3864770 -3183989 -2614446 -2194974 -1930672 -1818335
14400a818335k9092j37057j84123j55657n3422J07906L01088M89697O41875P42874
$$ -1818335 -1847427 -1984484 -2168607 -2324264 -2377686 -2269780 -1968692 -1478995 -837120 -94246
14390i4246P90676P81762P09243N77644M13039K51625J15546j554j24564k68052
$$ -94246 696430 1478192 2187435 2765079 3178118 3429743 3545289 3543735 3419171 3151119
14380C151119m12043n04918m94951l66324j50425R0522K90360M07792M47063M47890
$$ 3151119 2739076 2234158 1739207 1372883 1222458 1312980 1603340 2011132 2458195 2906085
14370B906085M44098M29672L66772K25713J7291k07861l85269m68426m52725l79055
$$ 2906085 3350183 3779855 4146627 4372340 4389631 4181770 3796501 3328075 2875350 2496295
14360B496295l10821k96335l41138m12033m71269n08730n39663n73664n93078
$$ 2496295 2185474 1889139 1548001 1135968 664699 155969 -383694 -957358 -1550436
14351a550436n65468m75096l38252j87691m9845O0232J35319J81014K20721K83848
$$ -1550436 -2115904 -2591000 -2929252 -3116943 -3166788 -3106556 -2971237 -2790223 -2569502 -2285654
14341b285654L84684N14286O49932P65619Q31488Q13610O91036M81313K44789
$$ -2285654 -1900970 -1386684 -736752 28867 860355 1673965 2365001 2846314 3091103
14332C091103N4523m4015m9566N803P4931J12746R8412N1613J9111L7963J14438
$$ 3091103 3145626 3101611 3052045 3057848 3132779 3245525 3343937 3395550 3414661 3452624 3567062
14321C567062K33166L69166M87606N50605N40240M75617M00130L44445L00470
$$ 3567062 3800228 4169394 4657000 5207605 5747845 6223462 6623592 6968037 7268507
14312G268507K33814J20190l0062j74559k59874k47999j35809M5042K49382M43231
$$ 7268507 7502321 7622511 7592449 7417890 7158016 6910017 6774208 6819250 7068632 7511863
14302G511863O10763P41837Q19026Q22243P47273O16194M65718L23719J94944
$$ 7511863 8122626 8864463 9683489 10505732 11253005 11869199 12334917 12658636 12853580
14293A2853580O6416p2230k08896l08371l35028k77809j53510Q488J79624L37205
$$ 12853580 12919996 12847766 12638870 12330499 11995471 11717662 11564152 11572640 11752264 12089469
14283A2089469M68786N75830O67430P45083P91927P76289O70542M77188K41281
$$ 12089469 12558255 13134085 13801515 14546598 15338525 16114814 16785356 17262544 17503825
14274A7503825L0711j02036j45127j30005j18118j71553l15874n22894p31159
$$ 17503825 17534536 17432500 17287373 17157368 17039250 16867697 16551823 16028929 15297770
14265A5297770q87018r70624r91101r69234r29428r00281r12119r85199j112154
$$ 15297770 14410752 13440128 12449027 11479793 10550365 9650084 8737965 7752766 6640612
14256F640612j249605j333347j312619j175460r42375o43208l09000J7521K79179
$$ 6640612 5391007 4057660 2745041 1569581 627206 -16002 -325002 -307481 -28302
14247b8302M27274M52153L87759K85516J83932R6211J6801o3710j45476k12532
$$ -28302 398972 851125 1238884 1524400 1708332 1804543 1821344 1757634 1612158 1399626
14237A399626k35614j89247p5639O8812J97235K83501L28720L43866L34987L03144
$$ 1399626 1164012 974765 899126 967938 1165173 1448674 1777394 2121260 2456247 2759391
14227B759391K48626J69802O0705q5490k68996m74211o62625p83116q00816p16081
$$ 2759391 3008017 3177819 3238524 3153034 2884038 2409827 1747202 964086 163270 -552811
14217e52811n54582l46719j19375J04243L10611N03216O97370R03782J112798
$$ -552811 -1107393 -1454112 -1573487 -1469244 -1158633 -655417 41953 945735 2058533
14208B058533J287161J371719J321263J124442Q02777L95105m9054m65428p82713
$$ 2058533 3345694 4717413 6038676 7163118 7965895 8361000 8311946 7846518 7063805
14199G063805r53139r81963r24051q48248q02215q01664q37026q84721r21064
$$ 7063805 6110666 5128703 4204652 3356404 2554189 1752525 915499 30778 -890286
14190h90286r32758r14200q57946p54695o03781m18769k20027k3060J64628L36966
$$ -890286 -1823044 -2737244 -3595190 -4349885 -4953666 -5372435 -5592462 -5615522 -5450894 -5113928
14180e113928M85927O08439P08357P81112Q00221P31959N70157L55631J57461
$$ -5113928 -4628001 -4019562 -3311205 -2530093 -1729872 -997913 -427756 -72125 85336
14171H5336K8569k9685o6903j47525l03561n07883o88199p73011p32741n86143
$$ 85336 113905 84220 17317 -130208 -433769 -941652 -1629851 -2402862 -3135603 -3721746
14161c721746l78661j59796K2735J16309O8110j44296m82316q56493j178499j407227
$$ -3721746 -4100407 -4260203 -4237468 -4121159 -4053049 -4197345 -4679661 -5536154 -6714653 -8121880
14151h121880j547190j612845j603380j504729j300955r82056n55656o4452M11088
$$ -8121880 -9669070 -11281915 -12885295 -14390024 -15690979 -16673035 -17228691 -17293143 -16882055
14142a6882055P80994R86839J020520R13277P16948M90226K87182J49435J03633
$$ -16882055 -16101061 -15114222 -14093702 -13180425 -12463477 -11973251 -11686069 -11536634 -11433001
14133a1433001J58784L00705M91333O83963Q48522R81904J090820J166622J178494
$$ -11433001 -11274217 -10973512 -10482179 -9798216 -8949694 -7967790 -6876970 -5710348 -4531854
14124d531854J089801Q82707N72735K01734j84600n50915q66922j101340j229673
$$ -4531854 -3442053 -2559346 -1986611 -1784877 -1969477 -2520392 -3387314 -4488654 -5718327
14115e718327j243139j148679r66945p28653m64162j95714N6984K69365M19302
$$ -5718327 -6961466 -8110145 -9077090 -9805743 -10269905 -10465619 -10408635 -10139270 -9719968
14106i719968N01616N29440N20136M84920M34806L91681L85735M38635N49149
$$ -9719968 -9218352 -8688912 -8168776 -7683856 -7249050 -6857369 -6471634 -6032999 -5483850
14097e483850O91566Q21924Q91585Q71513P69629O20259M58033L01324J48724
$$ -5483850 -4792284 -3970360 -3078775 -2207262 -1437633 -817374 -359341 -58017 90707
14088I0707j6108k07365m14940o01235p23309p55224o90764n36906l16050p0741
$$ 90707 74599 -132766 -547706 -1148941 -1872250 -2627474 -3318238 -3855144 -4171194 -4241935
14078d241935J48941L11245M15262M80929N33738N91903O51158O77742O24791
$$ -4241935 -4092994 -3781749 -3366487 -2885558 -2351820 -1759917 -1108759 -431017 193774
14069A93774M63355J99806j32730m88891q13212j042430j124738j042383q15047
$$ 193774 657129 856935 724205 235314 -577898 -1620328 -2745066 -3787449 -4602496
14060d602496m89273j31031J82109L80296M25354L23383J19067j26376l64229
$$ -4602496 -5091769 -5222800 -5040691 -4660395 -4235041 -3911658 -3792591 -3918967 -4283196
14051d283196n75923p65556r36422j075367j157003j157073j059035q54238n46580
$$ -4283196 -4859119 -5624675 -6561097 -7636464 -8793467 -9950540 -11009575 -11863813 -12410393
14042a2410393j63680K37543N82848Q04214Q60317P51247N26286K70972P1520
$$ -12410393 -12574073 -12336530 -11753682 -10949468 -10089151 -9337904 -8811618 -8540646 -8469126
14033h469126j9094M942J07293K33060L41852M23611M87589N43861N92004O18712
$$ -8469126 -8488220 -8483278 -8375985 -8142925 -7801073 -7377462 -6889873 -6346012 -5754008 -5135296
14023e135296O08512N63184N08349M75461M76384M97206N16325N23507N19489
$$ -5135296 -4526784 -3963600 -3455251 -2979790 -2503406 -2006200 -1489875 -966368 -446879
14014d46879N06447M87910M73986M78661N07859N46237N56718N02441L74428J95871
$$ -446879 59568 547478 1021464 1500125 2007984 2554221 3110939 3613380 3987808 4183679
14004D183679K602j76369l24841m35685n05234n31934n19909m79815m20458l38176
$$ 4183679 4186281 4009912 3685071 3249386 2744152 2212218 1692309 1212494 792036 453860
13994D53860k16290l5664K10134N02524P99062J050273J219673J293400J273985
$$ 453860 237570 201906 412040 914564 1713626 2763899 3983572 5276972 6550957
13985F550957J165386R69087O98214L86761P5294k10377m63347o83947q68387
$$ 6550957 7716343 8685430 9383644 9770405 9845699 9635322 9171975 8488028 7619641
13976G619641j007714j098259j154660j208415j288099j400134j522793j608482
$$ 7619641 6611927 5513668 4359008 3150593 1862494 462360 -1060433 -2668915
13968b668915j596961j445323j156930p82881l93987m7874K24923M14841N21051
$$ -2668915 -4265876 -5711199 -6868129 -7651010 -8044997 -8092871 -7867948 -7453107 -6932056
13959f932056N42924M79902L41541J58103k5010j68040k50515k65735k08469p0401
$$ -6932056 -6389132 -5909230 -5567689 -5409586 -5434596 -5602636 -5853151 -6118886 -6327355 -6397756
13949f397756J53202M49839P81180J090684J322778J440303J432463J312586J109803
$$ -6397756 -6244554 -5794715 -5013535 -3922851 -2600073 -1159770 272693 1585279 2695082
13940B695082Q60971O04367L70995J77409K9879o5356j01533q0971k1620M6484
$$ 2695082 3556053 4160420 4531415 4708824 4738703 4673347 4571814 4490843 4469223 4515707
13930D515707R1530R1205M1257m1809j28380j91260k16994k03964j51829n6347
$$ 4515707 4607237 4698442 4739699 4697890 4569510 4378250 4161256 3957292 3805463 3749116
13920C749116Q3812K55367M23651N39366N61785M83076L30626J44080n0700k46540
$$ 3749116 3832928 4088295 4511946 5051312 5613097 6096173 6426799 6570879 6520179 6273639
13910F273639m40657o24363p87144r21240j017244j059330j028702r13457p18850
$$ 6273639 5832982 5208619 4421475 3500235 2482991 1423661 394959 -518498 -1237348
13901a237348m74991k38980q0506m6851j30126k67436l76887m02640l38391k19250
$$ -1237348 -1712339 -1951319 -2031825 -2078676 -2208802 -2476238 -2853125 -3255765 -3594156 -3813406
13891c813406r4211k37M6400M2818p056r1481j92774k93805l75897m08586l52254
$$ -3813406 -3907617 -3907854 -3861454 -3818636 -3825692 -3917173 -4109947 -4403752 -4779649 -5188235 -5540489
13880e540489j83371P7934L66673O03759P36278P60019P12908O47371O01992N87795
$$ -5540489 -5723860 -5645926 -5279253 -4675494 -3939216 -3179197 -2466289 -1818918 -1216926 -629131
13870f29131N88623N70064M96712L52205J50097o8805k50466l50163l53662k79679
$$ -629131 -40508 529556 1026268 1378473 1528570 1459765 1209299 859136 505474 225795
13860B25795j58992j0032J65040L60340N45224O68955O89177N96415M14482J82767
$$ 225795 66803 56771 221811 582151 1127375 1796330 2485507 3081922 3496404 3679171
13850C679171o2502k97715n10909o93932q32540r03640q87670p84924o18165m23327
$$ 3679171 3616669 3318954 2808045 2114113 1281573 377933 -509737 -1294661 -1912826 -2336153
13840b336153k38651r4851p595K5526K2883J2171K2222P4898J77630L20285M77350
$$ -2336153 -2574804 -2669655 -2677250 -2651724 -2628841 -2616670 -2594448 -2519550 -2341920 -2021635 -1544285
13829a544285O13174O91301O87839O02789M61536L03440J63778O0558q126n6588
$$ -1544285 -931111 -239810 448029 1050818 1512354 1815794 1979572 2040130 2032004 1975416
13819A975416r9035j42122j86270k28883k65816k91535k97280k68727j88032m4568
$$ 1975416 1876381 1734259 1547989 1319106 1053290 761755 464475 195748 7716 -36852
13809c6852J49526L54160N18662O11121O32834O05686N49544M73162L81113K82375
$$ -36852 112674 466834 985496 1596617 2229451 2835137 3384681 3857843 4238956 4521331
13799D521331J92531J29244J01180R8562R9352Q9888P7835Q0729J04478J36349
$$ 4521331 4713862 4843106 4944286 5042848 5142200 5232088 5309923 5390652 5495130 5631479
13789E631479J54300J39860Q7562P891p9863j63541k51705l69370n34882p41019
$$ 5631479 5785779 5925639 6013201 6021092 5941229 5777688 5525983 5156613 4621731 3880712
13779C880712r58999j155831j306204j392245j397795j312051j146472r41844
$$ 3880712 2921713 1765882 459678 -932567 -2330362 -3642413 -4788885 -5730729
13771e730729p42752n58276l54938r6012K12669N19919P69775R37024J024250
$$ -5730729 -6473481 -7031757 -7386695 -7482707 -7270038 -6750119 -5980344 -5043320 -4019070
13762d019070J039467R86798Q74133P22801N67133M39077L44668K54183J22012
$$ -4019070 -2979603 -1992805 -1118672 -395871 171262 610339 955007 1209190 1331202
13753A331202p7566l28791n80730p70513q46345p84139n97494l36351o9310J46496
$$ 1331202 1253636 924845 344115 -426398 -1272743 -2056882 -2654376 -2990727 -3060037 -2913541
13743b913541K89354L68751L96815L67343K63830Q6473j29438l21315m25556m06656
$$ -2913541 -2624187 -2255436 -1858621 -1491278 -1227448 -1140975 -1270413 -1591728 -2017284 -2423940
13733b423940k77671r6690O4842J57307J66642J07835J1049r1353j71449k06281
$$ -2423940 -2701611 -2798301 -2733459 -2576152 -2409510 -2301675 -2290626 -2381979 -2553428 -2759709
13723b759709j80523r6007J7321J02223R9354j4142k06033m04211n27366n15229
$$ -2759709 -2940232 -3036239 -3018918 -2916695 -2817341 -2831483 -3037516 -3441727 -3969093 -4484322
13713d484322l53553q0631K34468N26801P59209R24427J030158J079303J058992
$$ -4484322 -4837875 -4918506 -4684038 -4157237 -3398028 -2473601 -1443443 -364140 694852
13704F94852R47122P35661M54467J68338n8551j97461k55172k50888k04808j44044
$$ 694852 1641974 2377635 2832102 3000440 2941889 2744428 2489256 2238368 2033560 1889516
13694A889516j03697j12032j73325k66308l59937m31705m72923m81241m54676
$$ 1889516 1785819 1673787 1500462 1234154 874217 442512 -30411 -511652 -966328
13685i66328l95294l15518k36716j78464j47649j37306j33718j24283j02024o6482
$$ -966328 -1361622 -1677140 -1913856 -2092320 -2239969 -2377275 -2510993 -2635276 -2737300 -2803782
13675b803782k0989L3011R8340J73653K43333K86452K99552L02631L19688L58039
$$ -2803782 -2824771 -2791760 -2693420 -2519767 -2276434 -1989982 -1690430 -1387799 -1068111 -710072
13665g10072M04144M28689L93145K64968M5008k15192m35846n62231o00170o01044
$$ -710072 -305928 122761 515906 780874 825882 610690 174844 -387387 -987557 -1588601
13655a588601o15247o59477p19933p70686p82779p31608o14776m61657l14394
$$ -1588601 -2203848 -2863325 -3583258 -4353944 -5136723 -5868331 -6483107 -6944764 -7259158
13646g259158j99118j21003q1455q6688j35913k10049k77591l10914l03218k77938
$$ -7259158 -7458276 -7579279 -7660734 -7747422 -7883335 -8093384 -8370975 -8681889 -8985107 -9263045
13636i263045k75195l16353l77532m00318l35816j85486J217J70276L01721M09786
$$ -9263045 -9538240 -9854593 -10232125 -10632443 -10968259 -11153745 -11152528 -10982252 -10680531 -10270745
13626a0270745N18200O39788P70236Q92593R88958J051799J082544J078206J025524
$$ -10270745 -9752545 -9112757 -8342521 -7449928 -6460970 -5409171 -4326627 -3248421 -2222897
13617b222897R12739P44266N43304L41800J64095J7269j00693j85919k26729k14350
$$ -2222897 -1310158 -565892 -22588 319212 483307 500576 399883 213964 -12765 -227115
13607b27115j51816n4303N6099J57504K35069K84627L10547L19683L16814L05627
$$ -227115 -378931 -433234 -377135 -219631 15438 300065 610612 930295 1247109 1552736
13597A552736K94213K97512L29465L89480M55072M87089M46116L10393Q4176k06721
$$ 1552736 1846949 2144461 2473926 2863406 3318478 3805567 4251683 4562076 4646252 4439531
13587D439531n28258q50611j147060j381937j510449j500773j359128j133602
$$ 4439531 3911273 3060662 1913602 531665 -978784 -2479557 -3838685 -4972287
13579d972287q89420o72491m91802l35061k00044j10540j01687j87852l41487
$$ -4972287 -5861707 -6534198 -7026000 -7361061 -7561105 -7671645 -7773332 -7961184 -8302671
13570h302671n02942o14193o46067n95998m68118k67052j4243K38252M20629M78857
$$ -8302671 -8805613 -9419806 -10065873 -10661871 -11129989 -11397041 -11411284 -11173032 -10752403 -10273546
13560a0273546M04095K40048O4146m8653n8050L3181J92157L72317N25595O15696
$$ -10273546 -9869451 -9629403 -9565257 -9613910 -9671960 -9638779 -9446622 -9074305 -8548710 -7933014
13550g933014O32192N94271N37790M94360M76228M73901M66266M40628M09707
$$ -7933014 -7300822 -6706551 -6168761 -5674401 -5198173 -4724272 -4258006 -3817378 -3407671
13541c407671M05453M51266N40885O40853P06049O97691O01808M37205K42138
$$ -3407671 -3002218 -2550952 -2010067 -1369214 -663165 34526 636334 1073539 1315677
13532A315677N3386j00668j96410k14856j46654J80J92546L75800M96468N30959
$$ 1315677 1369063 1268395 1071985 857129 710475 710655 903201 1279001 1775469 2306428
13522B306428M95152M26845L60721L18289L11372L43933M09257M92214N78207
$$ 2306428 2801580 3228425 3589146 3907435 4218807 4562740 4971997 5464211 6042418
13513F042418O58764P27349P70008P61770O75597M99195K47843l7035l04243n13029
$$ 6042418 6701182 7428531 8198539 8960309 9635906 10135101 10382944 10345909 10041666 9528637
13503I528637o44529p02035p04326o73748o23416n55182m70272l77314k86708
$$ 9528637 8884108 8182073 7477747 6803999 6180583 5625401 5155129 4777815 4491107
13494D491107k01745j19300l4816N6875J60950K79444M09072N39135O49425P14321
$$ 4491107 4289362 4170062 4135246 4192121 4353071 4632515 5041587 5580722 6230147 6944468
13484F944468P14639O51225N50859M56349M02364L91074L88376L47560K38316
$$ 6944468 7659107 8310332 8861191 9317540 9719904 10110978 10499354 10846914 11085230
13475A1085230N7874j71869m09549o05701p24282p59537p32372o72008n98769
$$ 11085230 11143104 10971235 10561686 9955985 9231703 8472166 7739794 7067786 6469017
13466F469017n14661m03974k44800k5599K40913N12635P29365Q40187Q26780P02264
$$ 6469017 5954356 5550382 5305582 5279983 5520896 6033531 6762896 7603083 8429863 9132127
13456I132127M94532K36594l3155k72854m46342n35897n51626n30955n27312n91900
$$ 9132127 9626659 9863253 9830098 9557244 9110902 8575005 8023379 7492424 6965112 6373212
13446F373212p53400j003563j298419j575515j778117j875347j865237j758786
$$ 6373212 5619812 4616249 3317830 1742315 -35802 -1911149 -3776386 -5535172
13438e535172j566299j301146r86564o52711l28111l0539K34749M62424O33434
$$ -5535172 -7101471 -8402617 -9389181 -10041892 -10370003 -10400542 -10165793 -9703369 -9069935
13429i069935P20862P11077O14919M57481K65709P3694o6831r5613K6140K87901
$$ -9069935 -8349073 -7637996 -7023077 -6565596 -6299887 -6226193 -6293024 -6388637 -6362497 -6074596
13419f074596O26810R53264J188860J293822J270764J147170R49902O90933L74583
$$ -6074596 -5447786 -4494522 -3305662 -2011840 -741076 406094 1355996 2046929 2421512
13410B421512J5648l50097o72582r09173j046217j096044j068843r57731p60097
$$ 2421512 2437160 2087063 1414481 505308 -540909 -1636953 -2705796 -3663527 -4423624
13401d423624n05386k52991o2932L3081M0061j2800r2342j73902k42691k92549
$$ -4423624 -4929010 -5182001 -5244933 -5211852 -5171791 -5184591 -5276933 -5450835 -5693526 -5986075
13391e986075l24206l37349l20647k54111j28102L6680J91253K86587L05326K71207
$$ -5986075 -6310281 -6647630 -6968277 -7222388 -7350490 -7313810 -7122557 -6835970 -6530644 -6259437
13381f259437K33707K42933L26266M74218O41311P59624P61962O13153L35440
$$ -6259437 -6025730 -5782797 -5456531 -4982313 -4341002 -3581378 -2819416 -2206263 -1870823
13372a870823O756k71860m20139m11107k79710j02535M3208J16602J21859Q9501
$$ -1870823 -1864067 -2135927 -2556066 -2967173 -3246883 -3349418 -3306210 -3189608 -3067749 -2978248
13362b978248N2449L4540M9813J01778J77576K45226K66564K20769J16302j9005
$$ -2978248 -2925799 -2891259 -2841446 -2739668 -2562092 -2316866 -2050302 -1829533 -1713231 -1732236
13352a732236j55769k71816l49885l72900l26609k11203n0227J15688K48178L29559
$$ -1732236 -1888005 -2159821 -2509706 -2882606 -3209215 -3420418 -3470645 -3354957 -3106779 -2777220
13342b777220L66344L76366L73375L60858L34161K87991K24462J53021Q3022J8443
$$ -2777220 -2410876 -2034510 -1661135 -1300277 -966116 -678125 -453663 -300642 -217620 -199177
13332a99177m3308j11542j97843l03944m12221m90682n10422m64589l75624k80839
$$ -199177 -242485 -354027 -551870 -855814 -1268035 -1758717 -2269139 -2733728 -3109352 -3390191
13322c390191k05495j48614r4420l3335L3331J04452J81705K58756L18754L48460
$$ -3390191 -3595686 -3744300 -3838720 -3872055 -3838724 -3734272 -3552567 -3293811 -2975057 -2626597
13312b626597L51013L42300L34840L24756K94377K28001J29799L4180j877P2040
$$ -2626597 -2275584 -1933284 -1598444 -1273688 -979311 -751310 -621511 -587331 -589208 -517168
13302e17168K68690N55127Q66761J128498J278472J288930J171319R63666P12582
$$ -517168 -248478 306649 1173410 2301908 3580380 4869310 6040629 7004295 7716877
13293G716877M59928K36136N9216o1973j24804j36130j17099r6720r8058j35280
$$ 7716877 8176805 8412941 8472157 8410184 8285380 8149250 8032151 7935431 7837373 7702093
13283G702093k21474l69343n79425q30797j086724j308469j465765j543926j548017
$$ 7702093 7480619 7111276 6531851 5701054 4614330 3305861 1840096 296170 -1251847
13274a251847j496008j400100j254499j047391p86528n10140k70891j07258k5247
$$ -1251847 -2747855 -4147955 -5402454 -6449845 -7236373 -7746513 -8017404 -8124662 -8149909
13265h149909M02J3030N6657J57628L13004M93688O60259P80438Q37622Q27092
$$ -8149909 -8149507 -8136477 -8079820 -7922192 -7609188 -7115500 -6455241 -5674803 -4837181 -4010089
13255d010089P44884N81792L32264J2340l32095o37607q45226r15748q35843o19091
$$ -4010089 -3265205 -2683413 -2351149 -2338809 -2670904 -3308511 -4153737 -5069485 -5905328 -6524419
13245f524419l01507O7105M32161P47398R89899J159291J257650J274338J192504
$$ -6524419 -6825926 -6758821 -6326660 -5579262 -4589363 -3430072 -2172422 -898084 294420
13236B94420J007819P43906M54956K10041O4753L9156J16281K58536M28019N96031
$$ 294420 1302239 2046145 2501101 2711142 2775895 2815051 2931332 3189868 3617887 4213918
13226D213918P37633Q23255Q20757P07545M84836J85779j30710l98344n60079
$$ 4213918 4951551 5774806 6595563 7303108 7787944 7973723 7843013 7444669 6884590
13217F884590n80516m62015k54650m1977R6504J24919O3125m2758j65240l09811
$$ 6884590 6304074 5842059 5587409 5545432 5641936 5766855 5829980 5787222 5621982 5312171
13207E312171m88523o89927q78912j019800j095163j104302j047572r16227o99321
$$ 5312171 4823648 4133721 3254809 2235009 1139846 35544 -1012028 -1928255 -2627576
13198b627576l99871m6536L04106N75141O89121N96744L04034j15034n36704q38889
$$ -2627576 -3027447 -3073983 -2769877 -2194736 -1505615 -908871 -604837 -719871 -1256575 -2095464
13188b095464r55333q93132p07277m62344k11735O119J71407K85346L61516M12411
$$ -2095464 -3050797 -3943929 -4651206 -5113550 -5325285 -5319166 -5147759 -4862413 -4500897 -4088486
13178d088486M40802M36542L82440K71900J24069j7981j03127r3669J4587J85724
$$ -4088486 -3647684 -3211142 -2828702 -2556802 -2432733 -2450714 -2553841 -2647510 -2632923 -2447199
13168b447199L59067M78482N19148M98150M59251M38528M40609M46009M33827
$$ -2447199 -2088132 -1609650 -1090502 -592352 -133101 305427 746036 1192045 1625872
13159A625872L94247L30546K61058K13123J99651J98991J67469P5881o8702k30647
$$ 1625872 2020119 2350665 2611723 2824846 3024497 3223488 3390957 3466838 3398136 3167489
13149C167489l62818m20047l77334k51595j02800o90J5937m8972j64269k88892
$$ 3167489 2804671 2384624 2007290 1755695 1652895 1652205 1668142 1619170 1454901 1166009
13139A166009l82399m16742l87697l16373k38324j85978j72424j87397k08440
$$ 1166009 783610 366868 -20829 -337202 -575526 -761504 -933928 -1121325 -1329765
13130a329765k14117j88376j24003l3011M7871P0736O116j31937k88890m02900
$$ -1329765 -1543882 -1732258 -1856261 -1889272 -1841401 -1770665 -1764549 -1896486 -2185376 -2588276
13120b588276m43146m23389l82044l47669l19684k78690k12129j29324n5957j4506
$$ -2588276 -3031422 -3454811 -3836855 -4184524 -4504208 -4782898 -4995027 -5124351 -5180308 -5194814
13110e194814l918L884M4250J35620K72627M33710N89887P14118P93902Q37481
$$ -5194814 -5198732 -5194848 -5150598 -5014978 -4742351 -4308641 -3718754 -3004636 -2210734 -1373253
13100a373253Q65183Q94296R28969R55333R44048Q67739P25415N48430L77022
$$ -1373253 -508070 386226 1315195 2270528 3214576 4082315 4807730 5356160 5733182
13091E733182K32502J15401K2479m5846r3463j35143j90607k71774l74599m79596
$$ 5733182 5965684 6081085 6103564 6057718 5964255 5829112 5638505 5366731 4992132 4512536
13081D512536n59704n93254n74898n14766m23658k96894j18271J10770L45333
$$ 4512536 3952832 3359578 2784680 2269914 1846256 1549362 1431091 1541861 1887194
13072A887194N07455N28633L91020J38295j51308m07890n93070o96227p25756
$$ 1887194 2394649 2923282 3314302 3452597 3301289 2893399 2300329 1604102 878346
13063H78346p01311o36875n28008l64334j53203P3489K68793L85028L94845L09388
$$ 878346 177035 -459840 -987848 -1352182 -1505385 -1431896 -1163103 -778075 -383230 -73842
13053g3842J69603J4538j39989k94210m45758n86213p12917q32723r47459j037893
$$ -73842 95761 110299 -29690 -323900 -769658 -1355871 -2068788 -2901511 -3848970 -4886863
13043d886863j069642j020534r02888p58692o32380n44754m87156m31282l40740
$$ -4886863 -5956505 -6977039 -7879927 -8638619 -9270999 -9815753 -10302909 -10734191 -11074931
13034a1074931j87420K5099K54264M45092N66777O21338O22136N74166M76709
$$ -11074931 -11262351 -11237252 -10982988 -10537896 -9971119 -9349781 -8727645 -8153479 -7676770
13025g676770L37967J81884L9490o8089j39808j87857k18621k19398j66935n3185
$$ -7676770 -7338803 -7156919 -7117429 -7185518 -7325326 -7513183 -7731804 -7951202 -8118137 -8171322
13015h171322R8328K46809L64438M47704N04148N41607N72826O17673O90714P86796
$$ -8171322 -8072994 -7826185 -7461747 -7014043 -6509895 -5968288 -5395462 -4777789 -4087075 -3300279
13005c300279Q79135R28855Q99191P70369N51109K79731R472k16920l85209n04898
$$ -3300279 -2421144 -1492289 -593098 177271 728380 1008111 1017583 800663 415454 -89444
12995h9444n88852o39708o51476o15424n24061l76722j83295M3574L00826N89756
$$ -89444 -678296 -1318004 -1969480 -2584904 -3108965 -3485687 -3668982 -3625408 -3324582 -2734826
12985b734826Q91939J155544J313703J322268J184728R45272O61811L83680J43169
$$ -2734826 -1842887 -687343 626360 1948628 3133356 4078628 4740439 5124119 5267288
12976E267288m3202j65710k11779j71280n7513Q2731J89458K20371J64369L7611
$$ 5267288 5224086 5058376 4846597 4675317 4617804 4700535 4889993 5110364 5274733 5312344
12966E312344j25464k82805l99361m59414m61664m02110k73099q2643J35854L39002
$$ 5312344 5186880 4904075 4504714 4045300 3583636 3181526 2908427 2825784 2961638 3300640
12956C300640M95443N94419O39785O36646N79699M54754K56839J0986k26122l93319
$$ 3300640 3796083 4390502 5030287 5666933 6246632 6701386 6958225 6969211 6743089 6349770
12946F349770m63295m55448m09166l50426k88638k37018k23064k69957l65697
$$ 6349770 5886475 5431027 5021861 4671435 4382797 4145779 3922715 3652758 3287061
12937C287061m58493m91316m44844l50667k65293k27030k32505k53086k70692
$$ 3287061 2828568 2337252 1892408 1541741 1276448 1049418 816913 563827 293135
12928B93135k92778l36718m11803n17665o46759p80681q89861r44232r28927q52914
$$ 293135 357 -336361 -748164 -1265829 -1912588 -2693269 -3583130 -4527362 -5456289 -6309203
12918f309203p41928o22260n11918m21822l55005l00761k34457j29146K9854K38757
$$ -6309203 -7051131 -7673391 -8185309 -8607131 -8962136 -9262897 -9497354 -9626500 -9596646 -9357889
12908i357889M78779P24217R48076J124286J232547J262067J207423J066043Q44347
$$ -9357889 -8879110 -8154893 -7206817 -6082531 -4849984 -3587917 -2380494 -1314451 -470104
12899d70104N62946K56134k9145k39276l35918l22599k45860j65906j26277j43917
$$ -470104 92842 348976 319831 80555 -255363 -577962 -823822 -989728 -1116005 -1259922
12889a259922k12236l05338l85323m15962l77502k78011j53481m5280L0790R0138
$$ -1259922 -1472158 -1777496 -2162819 -2578781 -2956283 -3234294 -3387775 -3433055 -3402265 -3312127
12879c312127J56285K40605L43801M63204N89662P03669P81766Q05268P61495
$$ -3312127 -3155842 -2915237 -2571436 -2108232 -1518570 -814901 -33135 772133 1533628
12870A533628O41249M39658J61859j68573n06283p93115r73610j006378q72026
$$ 1533628 2174877 2614535 2776394 2607821 2101538 1308423 334813 -671565 -1543591
12861a543591n82646j85139K53495O70891J023661J287571J454623J530562J530965
$$ -1543591 -2126237 -2311376 -2057881 -1386990 -363329 924242 2378865 3909427 5440392
12852E440392J476708J389104J282766J157450R95955P75215M87741J59883j51287
$$ 5440392 6917100 8306204 9588970 10746420 11742375 12517590 13005331 13165214 13013927
12843A3013927l88882n33001o08380o54451o90010p08299o98236o58851n94596
$$ 13013927 12625045 12092044 11483664 10829213 10139203 9430904 8732668 8073817 7479221
12834G479221n10050m15364l31840k88883l13673m16502n77881p48649q69256
$$ 7479221 6969171 6553807 6221967 5933084 5619411 5202909 4625028 3876379 3007123
12825C007123q97749q26340o76176m78334k57164k7297J95824L84798N05536N38702
$$ 3007123 2109374 1283034 606858 128524 -128640 -155937 39887 424685 930221 1468923
12815A468923M93219L97306K82261J73664Q5221J5662m1633q5871j13046j30932
$$ 1468923 1962142 2359448 2641709 2815373 2900594 2916256 2874623 2788752 2675706 2544774
12805B544774j60423k17355k92632l53453l70362l45135l07896k85430k75247
$$ 2544774 2384351 2166996 1874364 1520911 1150549 805414 497518 212088 -63159
12796f3159k49763j81304o1651R7778K74976M41242N63782O16776N95625N20817
$$ -63159 -312922 -494226 -555877 -458099 -183123 258119 821901 1438677 2034302 2555119
12786B555119M27149L44592K83781K39011K03312J75060J47671R6910j2102j93889
$$ 2555119 2982268 3326860 3610641 3849652 4052964 4228024 4375695 4472605 4460503 4266614
12776D266614m17557o22585p64759q42516q77964q79496q25788o81408m27002
$$ 4266614 3849057 3226472 2461713 1619197 741233 -138263 -964051 -1645459 -2072461
12767b072461q1234K99443O43963R00813J058106J132562J144511J107139J030871
$$ -2072461 -2153695 -1854252 -1210289 -309476 748630 1881192 3025703 4132842 5163713
12758E163713R24319P88184O19059M27913K49900J28662Q8140J14022J58806J69918
$$ 5163713 6088032 6876216 7495275 7923188 8173088 8301750 8389890 8503912 8662718 8832636
12748H832636J21133K2334r8358k21709l48907m88859o36623p65084q38767q37682
$$ 8832636 8953769 8976103 8877745 8656036 8307129 7818270 7181647 6416563 5577796 4740114
12738D740114p67689o49874n06060l53708k06419p7175J9494P6104J03059J20295
$$ 4740114 3972425 3322551 2816491 2462783 2256364 2179189 2198683 2274787 2377846 2498141
12728B498141J37376J49507J51647J48591J49444J56834J64405J62803J47827
$$ 2498141 2635517 2785024 2936671 3085262 3234706 3391540 3555945 3718748 3866575
12719C866575J29161J32260J81015K71972L68573M21175L92365K71564P6098j59164
$$ 3866575 3995736 4127996 4309011 4580983 4949556 5370731 5763096 6034660 6110758 5951594
12709E951594l97164o07472p65347q51844q59390p93057o65189m94841l15085
$$ 5951594 5554430 4946958 4181611 3329767 2470377 1677320 1012131 517290 202205
12700B02205j72257j06346j27554k12103l22321m34830n51543o83424q24758r42410
$$ 202205 29948 -76398 -203952 -416055 -738376 -1173206 -1724749 -2408173 -3232931 -4175341
12690d175341r90791r45072q25328o87807n91991n69824o11389o71515o97311
$$ -4175341 -5166132 -6111204 -6936532 -7624339 -8216330 -8786154 -9397543 -10069058 -10766369
12681a0766369o59073n59761m22324k74108j37536k4051O7835J49191K38267L60311
$$ -10766369 -11425442 -11985203 -12407527 -12681635 -12819171 -12843222 -12775387 -12626196 -12387929 -12027618
12671a2027618N42840Q04052J139414J514742J871171K139631K259334K195427
$$ -12027618 -11484778 -10680726 -9541312 -8026570 -6155399 -4015768 -1756434 438993
12663D38993J948017J546856J041156M97994R86l71010n79108o39307o01388n18154
$$ 438993 2387010 3933866 4975022 5473016 5474002 5102992 4523884 3884577 3283189 2765035
12653B765035m31830l70066l38694l20011k84160k05760p9670O9288J95221K55750
$$ 2765035 2333205 1963139 1624445 1304434 1020274 814514 734844 804132 999353 1255103
12643A255103K28807J13159p1247k80130m56217n55068n62450m92922l79636k61851
$$ 1255103 1483910 1597069 1525822 1245692 789475 234407 -328043 -820965 -1200601 -1462452
12633a462452j71603j26373j29031j67593k16857k48259k41847j92111j06891
$$ -1462452 -1634055 -1760428 -1889459 -2057052 -2273909 -2522168 -2764015 -2956126 -3063017
12624c063017j781J05220J97633K67516L23090L87237M84024O22053P86938R48001
$$ -3063017 -3064798 -2959578 -2761945 -2494429 -2171339 -1784102 -1300078 -678025 108913 1056914
12614A056914J071702J128609J093611R53966P26814M64606K32380P1161k1649
$$ 1056914 2128616 3257225 4350836 5304802 6031616 6496222 6728602 6799763 6778114
12605F778114p9428j34537j97209k62322l28096l99828m80513n68760o63761p62986
$$ 6778114 6698686 6564149 6366940 6104618 5776522 5376694 4896181 4327421 3663660 2900674
$$ [...]
##END NTUPLES=NMR SPECTRUM
##END=
