##TITLE=31P ikalashn
DE-76k2_TFA
17.12.2024
##JCAMPDX= 6.0         $$ Bruker NMR JCAMP-DX V2.0
##DATA TYPE= NMR SPECTRUM
##DATA CLASS= NTUPLES
##ORIGIN= UXNMR, Bruker Analytische Messtechnik GmbH
##OWNER= root
$$ TOPSPIN		Version 1.3
$$ 2024-12-17 16:31:49.031 +0400  Irina@DPX200
$$ Compression mode = diff/dup
##.OBSERVE FREQUENCY= 81.01967998063
##.OBSERVE NUCLEUS= ^31P
##.ACQUISITION MODE= SIMULTANEOUS
##.ACQUISITION SCHEME= undefined
##.AVERAGES= 64
##.DIGITISER RES= 17
##SPECTROMETER/DATA SYSTEM= spect
##.PULSE SEQUENCE= zgpg
##.SOLVENT NAME= D2O
##.SHIFT REFERENCE= INTERNAL, D2O, 1, 298.5841
##AUDIT TRAIL= $$ (NUMBER, WHEN, WHO, WHERE, WHAT)
$$ ##TITLE= Audit trail, TOPSPIN		Version 1.3
$$ ##JCAMPDX= 5.01
$$ ##ORIGIN= Bruker BioSpin GmbH
$$ ##OWNER= Irina
$$ $$ F:/spectra/data/iren/nmr/P31dec/1/pdata/1/auditp.txt
$$ ##AUDIT TRAIL=  $$ (NUMBER, WHEN, WHO, WHERE, VERSION, WHAT)
(   1,<2024-12-17 16:30:52.750 +0400>,<Irina>,<DPX200>,<TOPSPIN 1.3>,
      <created by zg
	started at 2024-12-17 16:29:09.953 +0400,
	POWCHK disabled, PULCHK disabled
       configuration hash MD5:
       BE 6D 3F 07 2A EA 11 49 91 17 2B D3 AF B3 58 0D
       data hash MD5: 32K
       FA 1D 45 FC FB FA 40 15 65 3C A9 05 05 45 1A 56>)
(   2,<2024-12-17 16:31:08.921 +0400>,<Irina>,<DPX200>,<TOPSPIN 1.3>,
      <Start of raw data processing
       efp BC_mod = 2 LB = 10 FT_mod = 6 PKNL = 1 PHC0 = 120.2485 PHC1 = 309.3095 SI = 32K 
       data hash MD5: 32K
       7D 6C 9F BC 4D 21 06 C2 F5 F0 B8 46 B2 75 D7 68>)
(   3,<2024-12-17 16:31:10.968 +0400>,<Irina>,<DPX200>,<TOPSPIN 1.3>,
      <apk 
       data hash MD5: 32K
       19 29 66 9A 68 5D 2C BA AE DB 66 11 76 B5 84 EA>)
(   4,<2024-12-17 16:31:19.000 +0400>,<Irina>,<DPX200>,<TOPSPIN 1.3>,
      <pk fgphup PHC0 = 5.6 PHC1 = 0 
       data hash MD5: 32K
       52 B4 45 3B 3C F7 F2 F0 89 AE BD 9E 02 39 0A FB>)
(   5,<2024-12-17 16:31:20.812 +0400>,<Irina>,<DPX200>,<TOPSPIN 1.3>,
      <abs n ABSG = 5 
       data hash MD5: 32K
       E5 D7 DE F6 17 64 0F 5B B7 95 D6 DE D9 71 55 0B>)
$$ ##END=
$$ 
$$ $$ hash MD5
$$ $$ 71 9B F3 EC C5 FB 48 F8 A8 0D E7 DE 0F 20 76 CA
##$RELAX= 
##$RELAX= 
##$RELAX= 
##$RELAX= 
##$RELAX= 
##$RELAX= 
##$RELAX= 
##$RELAX= 
##$RELAX= 
##$RELAX= 
##$RELAX= 
$$ Bruker specific parameters
$$ --------------------------
##$DU= <F:/spectra>
##$EXPNO= 1
##$NAME= <P31dec>
##$PROCNO= 1
##$TYPE= <nmr>
##$USER= <iren>
##$AMP= (0..31)
100 100 100 100 100 100 100 100 100 100 100 100 100 100 100 100 100 100 
100 100 100 100 100 100 100 100 100 100 100 100 100 100 
##$ANAVPT= -1
##$AQSEQ= 0
##$AQ_mod= 1
##$AUNM= <au_zg>
##$AUTOPOS= <>
##$BF1= 81.014009
##$BF2= 200.13
##$BF3= 200.13
##$BF4= 200.13
##$BF5= 200.13
##$BF6= 200.13
##$BF7= 200.13
##$BF8= 200.13
##$BYTORDA= 1
##$CFDGTYP= 0
##$CFRGTYP= 5
##$CHEMSTR= <none>
##$CNST= (0..63)
1 1 145 1 1 1 1 1 1 1 1 1 1 1 1 1 1 1 1 1 1 1 1 1 1 1 1 1 1 1 1 1 1 1 
1 1 1 1 1 1 1 1 1 1 1 1 1 1 1 1 1 1 1 1 1 1 1 1 1 1 1 1 1 1 
##$CPDPRG= <waltz16>
##$CPDPRG1= <>
$$ [...]
##$SW_h= 37037.037037037
##$TD= 32768
##$TD0= 1
##$TE= 300
##$TE2= 300
##$TE3= 300
##$TEG= 300
##$TL= (0..7)
0 120 53 12 22 120 120 120 
##$TP= (0..7)
150 150 150 150 150 150 150 150 
##$TP07= 0
##$TPNAME0= <>
##$TPNAME1= <>
##$TPNAME2= <>
##$TPNAME3= <>
##$TPNAME4= <>
##$TPNAME5= <>
##$TPNAME6= <>
##$TPNAME7= <>
##$TPOAL= (0..7)
0.5 0.5 0.5 0.5 0.5 0.5 0.5 0.5 
##$TPOFFS= (0..7)
0 0 0 0 0 0 0 0 
##$TUNHIN= 0
##$TUNHOUT= 0
##$TUNXOUT= 0
##$USERA1= <user>
##$USERA2= <user>
##$USERA3= <user>
##$USERA4= <user>
##$USERA5= <user>
##$V9= 5
##$VALIST= <valist>
##$VCLIST= <CCCCCCCCCCCCCCC>
##$VD= 0
##$VDLIST= <DDDDDDDDDDDDDDD>
##$VPLIST= <PPPPPPPPPPPPPPP>
##$VTLIST= <TTTTTTTTTTTTTTT>
##$WBST= 1024
##$WBSW= 4
##$XGAIN= (0..3)
0 0 0 0 
##$XL= 0
##$YL= 0
##$YMAX_a= 5802
##$YMIN_a= -809
##$ZGOPTNS= <>
##$ZL1= 120
##$ZL2= 120
##$ZL3= 120
##$ZL4= 120
##$ABSF1= 298.5841
##$ABSF2= -158.5842
##$ABSG= 5
##$ABSL= 5
##$ALPHA= 0
##$AQORDER= 0
##$ASSFAC= 0
##$ASSFACI= 0
##$ASSFACX= 0
##$ASSWID= 0
##$AUNMP= <proc_1d>
##$AXLEFT= 0
##$AXRIGHT= 0
##$AXTYPE= 0
##$AXUNIT= <>
##$AZFE= 0.1
##$AZFW= 0.5
##$BCFW= 0
##$BC_mod= 2
##$BYTORDP= 0
##$COROFFS= 0
##$CY= 12.5935478210449
##$DATMOD= 1
##$DC= 0
##$DFILT= <>
##$DTYPP= 0
##$F1P= 47.1127640792319
##$F2P= -24.0371245302204
##$FCOR= 0.5
##$FTSIZE= 32768
##$FT_mod= 6
##$GAMMA= 0
##$GB= 0
##$INTBC= 1
##$INTSCL= 7.269226e-011
##$ISEN= 30
##$LB= 10
##$LEV0= 0
##$LPBIN= 0
##$MAXI= 12.09355
##$MC2= 0
##$MEAN= 0
##$ME_mod= 0
##$MI= 0.7550151
##$NCOEF= 0
##$NC_proc= -12
##$NLEV= 6
##$NOISF1= 298.5841
##$NOISF2= 270.0111
##$NSP= 0
##$NTH_PI= 0
##$NZP= 0
##$OFFSET= 298.5841
##$PC= 1.4
##$PHC0= 165.2236
##$PHC1= 413.3014
##$PH_mod= 1
##$PKNL= yes
##$PPARMOD= 0
##$PPDIAG= 0
##$PPIPTYP= 0
##$PPMPNUM= 100
##$PPRESOL= 1
##$PSCAL= 0
##$PSIGN= 0
##$REVERSE= no
##$SF= 81.014009
##$SI= 32768
##$SIGF1= 270.0111
##$SIGF2= -158.5842
##$SINO= 77.54984
##$SIOLD= 32768
##$SREGLST= <31P.CDCl3>
##$SSB= 0
##$STSI= 32768
##$STSR= 0
##$SW_p= 37037.037037037
##$SYMM= 0
##$S_DEV= 0
##$TDeff= 32768
##$TDoff= 0
##$TI= <>
##$TILT= no
##$TM1= 0
##$TM2= 0
##$TOPLEV= 0
##$USERP1= <user>
##$USERP2= <user>
##$USERP3= <user>
##$USERP4= <user>
##$USERP5= <user>
##$WDW= 1
##$XDIM= 32768
##$YMAX_p= 275932471
##$YMIN_p= -15186239
$$ End of Bruker specific parameters
$$ ---------------------------------
##NTUPLES= NMR SPECTRUM
##VAR_NAME=  FREQUENCY,     SPECTRUM/REAL,   SPECTRUM/IMAG
##SYMBOL=    X,             R,               I
##VAR_TYPE=  INDEPENDENT,   DEPENDENT,       DEPENDENT
##VAR_FORM=  AFFN,          ASDF,            ASDF
##VAR_DIM=   32768,         32768,           32768
##UNITS=     HZ,            ARBITRARY UNITS, ARBITRARY UNITS
##FACTOR=    1.13031516577767, 1,            1
##FIRST=     37037.037037037, 1576033,       -7620380
##LAST=      0,             4768250,         -12341244
##MIN=       0,             -15186239,       0
##MAX=       37037.037037037, 275932471,     0
$$ Real data points
##PAGE= N=1
##DATA TABLE= (X++(R..R)), XYDATA
$$ [...]
17953f513018L71629K95401L51184O21363J012734J337828J393282J109437O24135
17944F03975J04536l93214q17046j031766r66998p54732n76738m50904l07057
17935d589944j19464J49231N53363J065620J545527J784682J648456J193931O00937
17926C832339N7046k93973l94274k93236j01586P7066K02855K85963L25358K33136
17916C930694j23533o89188j192095j427271j387793j136514p02227j64235L07542
17907b584620O17350P92829Q57002Q02360O73132N76804N80118O23253N67194
17898C505422K90771k26916q52282j358394j582374j500375j178231p26065k94476
17889c922920n9958r8376l04861n59827q21487r68201q09604l37950K02762N09516
$$ y = [-6513018, -6141389, -5845988, -5494804, -4873441, -3860707, -2522879, -1129597, -20160, 603975, 708511, 315297, -501749, -1533515, -2500513, -3255245, -3831983, -4282887, -4589944, -4709408, -4560177, -4006814, -2941194, -1395667, 389015, 2037471, 3231402, 3832339, 3889385, 3595412, 3201138, 2907902, 2806316, 2883382, 3086237, 3372200, 3697558, 3930694, 3807161, 3117973, 1925878, 498607, -889186, -2025700, -2727927, -2892162, -2584620, -1967270, -1174441, -317439, 484921, 1158053, 1734857, 2314975, 2938228, 3505422, 3796193, 3569277, 2716995, 1358601, -223773, -1724148, -2902379, -3628444, -3922920, -3982878, -4081254, -4386115, -4945942, -5767429, -6735630, -7545234, -7883184, -7680422, -7170906]
17879g170906M55978J70650j03852k29226k33620k13740k26399k36838j49524
17870g937477P0199L37189N47990O56366O24218M00257K1449l52420n67921n82219
17860f782369m33655j77655J17525L88311O44728R39936J260555J528537J675321
17851h38766J672579J509112J178454O89644Q4360n00515q23283p25703l15977
17842A929905J10037K97290J75594j64296n87393j003479j346237j543140j530600
17833c662319j295738r33611n92644l74897l01613l26893l81356m07503l93537
17824h670111m01669m83133n85159n96045m44573j02745M29800J014916J401321
17815h437398J423608J112615O61992K62690j2443j75062k44412k12251n6351
$$ y = [-7170906, -6714928, -6544278, -6648130, -6877356, -7110976, -7324716, -7551115, -7787953, -7937477, -7867278, -7530089, -6982099, -6325733, -5701515, -5301258, -5279809, -5632229, -6200150, -6782369, -7216024, -7393679, -7276154, -6887843, -6243115, -5303179, -4042624, -2514087, -838766, 833813, 2342925, 3521379, 4211023, 4295383, 3794868, 2971585, 2245882, 1929905, 2039942, 2337232, 2512826, 2348530, 1761137, 757658, -588579, -2131719, -3662319, -4958057, -5891668, -6484312, -6859209, -7160822, -7487715, -7869071, -8276574, -8670111, -9071780, -9554913, -10140072, -10736117, -11180690, -11283435, -10853635, -9838719, -8437398, -7013790, -5901175, -5239183, -4976493, -4988936, -5163998, -5408410, -5620661, -5677012]
17806e677012K33528N93401Q56731Q68141O30351K79112n6245l18071m80464n12145
17796c582673l83139j40698N5633R2781L672j32317k33063k13882l6000K66413
17786d303273N34234N72814L57214O6956l6312J63715M77034N91325M25454J40977
17776a009862j04377k43370k47793j49502n3439k3327o0555j76251l10109l10105
17766b688690j49489L7512J73602K68759K73635J12971k10873n99346q48721p68252
17756d398892l84785Q1120M13285N16558M52281L95569M70703O24580P09280O50213
17746d70088M98071L36774J96629P0955m4798j09630m8870J22069K59801K40330
17736A051243J26947P4422Q6316K3511j99515n11395p07506n79821j41644L26687
$$ y = [-5677012, -5443484, -4850083, -3993352, -3125211, -2494860, -2215748, -2271993, -2590064, -3070528, -3582673, -3965812, -4106510, -4050877, -3958096, -3954424, -4086741, -4319804, -4533686, -4569686, -4303273, -3769039, -3196225, -2839011, -2772055, -2808367, -2644652, -2167618, -1576293, -1150839, -1009862, -1114239, -1357609, -1605402, -1754904, -1808343, -1831670, -1892225, -2068476, -2378585, -2688690, -2838179, -2800667, -2627065, -2358306, -2084671, -1971700, -2182573, -2781919, -3630640, -4398892, -4783677, -4702557, -4289272, -3772714, -3320433, -2924864, -2454161, -1829581, -1120301, -470088, 27983, 364757, 561386, 632341, 587543, 477913, 429043, 551112, 810913, 1051243, 1178190, 1252612, 1338928, 1362439, 1162924, 651529, -55977, -635798, -777442, -450755]
17726d50755N61825N06947K36314j12130l87887n25725n43229m33972j25454M21097
17716h52969J068929J546394J686928J562274J318340R98648N83958R9497l62895
17707G649104o89704p97567o97373n08719l62372l19192m03656o22332r18784
17698B329405j149847j132898q02770k77919K86193P85329J073141R91806N55068
17689B657508k3009m97364p55441q36098q34465p66091n40034j09639L89305P17696
17679e97632P34995M81935J26301j29736j42292P3750L19688L46623L5097m99679
17669G49050r57934j071416q01355l51537j5623K6106j74121m09056n39491n73616
17659d118993n12357k87110Q3526M42823O59797P08879O11491M35411L10688L57039
$$ y = [-450755, 111070, 618017, 854331, 742201, 354314, -171411, -714640, -1148612, -1274066, -852969, 215960, 1762354, 3449282, 5011556, 6329896, 7328544, 7912502, 8011999, 7649104, 6959400, 6161833, 5464460, 4955741, 4593369, 4274177, 3870521, 3248189, 2329405, 1179558, 46660, -756110, -1034029, -747836, 37493, 1110634, 2102440, 2657508, 2634499, 2137135, 1381694, 545596, -288869, -1054960, -1594994, -1704633, -1315328, -597632, 137363, 619298, 745599, 615863, 473571, 547321, 867009, 1213632, 1248729, 749050, -208884, -1280300, -2081655, -2433192, -2448815, -2422709, -2596830, -3005886, -3545377, -4118993, -4631350, -4918460, -4834934, -4392111, -3732314, -3023435, -2411944, -1976533, -1665845, -1308806]
17649a308806N47800P22747P62377O58726M86071L19594J71722N2118n909j8882
17639B387558o9143k20843m32335n48301m38371j25842K67642O18403Q24522Q32214
17629C095504O77782M49496K21317L9997r7310k06144k87992l82968n31982o94078
17619B283622p65497o98938n46802l57564j33625J25578M01972O09806N90895
17610A509447K63440k46317o76926q32036p24208n33327m20625m34309n52722
17601b647583o94304p40728o41416m27996j50424J24444K95762L12637K40792
17592d328816K11380L50489O55541R25632R44552O93542L22789r03j57612j24748
17582e08154J765J36602K82825M70242P08431R72944J176948J216004J068895
$$ y = [-1308806, -761006, -38259, 724118, 1382844, 1868915, 2188509, 2360231, 2412349, 2406440, 2387558, 2318415, 2097572, 1665237, 1116936, 678565, 552723, 820365, 1438768, 2263290, 3095504, 3773286, 4222782, 4444099, 4484096, 4386786, 4180642, 3892650, 3509682, 2977700, 2283622, 1518125, 819187, 272385, -85179, -218804, -93226, 308746, 918552, 1509447, 1772887, 1526570, 849644, 17608, -706600, -1239927, -1660552, -2094861, -2647583, -3341887, -4082615, -4724031, -5152027, -5302451, -5178007, -4882245, -4569608, -4328816, -4117436, -3766947, -3111406, -2185774, -1241222, -547680, -224891, -225794, -383406, -508154, -506389, -369787, -86962, 383280, 1091711, 2064655, 3241603, 4457607, 5526502]
17573E526502P98147M64227P7629l81870q84322j301644j464776j269839p85144
17564G78910k35681J82985M40174O28165Q31016J026446J109762J024854Q36458
17555F623089O16865L30840o1936m76198p99377r47343q13997m06843N4563L18215
17545D437878K68612l7212m02486o37792o68366n17656k62902j7371R0394N128
17535B258227j84506l26390l21642j64153J6344Q075k37860n29761o55099n92313
17525g29078m91844m67131m80371m45782l36158j83812m9763L7165R4083J25352
17515b927339J44498J56723P0460j76127m42165n31064m45243l33415k55468j29363
17505d868503Q7694K64565K53838R2528l5038m563J21313K31807L14680L83609
$$ y = [5526502, 6324649, 6788876, 6866505, 6484635, 5600313, 4298669, 2833893, 1564054, 778910, 543229, 726214, 1166388, 1794553, 2625569, 3652015, 4761777, 5786631, 6623089, 7239954, 7570794, 7508858, 7032660, 6233283, 5285940, 4471943, 4065100, 4119663, 4437878, 4706490, 4669278, 4266792, 3629000, 2960634, 2442978, 2180076, 2162705, 2253099, 2258227, 2073721, 1747331, 1425689, 1261536, 1277880, 1285955, 1048095, 518334, -136765, -729078, -1220922, -1688053, -2168424, -2614206, -2950364, -3134176, -3183939, -3146774, -3052691, -2927339, -2782841, -2626118, -2555658, -2731785, -3173950, -3705014, -4150257, -4483672, -4739140, -4868503, -4780809, -4516244, -4262406, -4169878, -4204916, -4209479, -4088166, -3856359, -3541679, -3158070]
17495c158070L96498L31114K37972J60344R7217M4039J7467O0814K14429M99757
17485a098419Q76733J186978J250443J028089O43210K42458q1765k60797k94874
17476C492056k70982k73356l60350n53567p99856r91827j017202q17342m43812
17467b036238m7935K26421L37964L22801K51258J83894J00847m4763j86048j94774
17457a086573k9164K70599O73818J150738J574609J750073J592188J189291O66695
17448G752274J20951l35402o30672p71883p72852o73990n58426m88332m76180
17439C165488m90341m91439m56255l33493o9848K65596N03251N12644K80903k6276
17429B860230j43898N3934M65608Q57858J020913R04041O23648L46500J80602
$$ y = [-3158070, -2761572, -2430458, -2192486, -2032142, -1934925, -1890886, -1873419, -1812605, -1598176, -1098419, -221686, 965292, 2215735, 3243824, 3887034, 4129492, 4047727, 3786930, 3492056, 3221074, 2947718, 2587368, 2033801, 1233945, 242118, -775084, -1592426, -2036238, -2084173, -1857752, -1519788, -1196987, -945729, -761835, -660988, -705751, -891799, -1086573, -1115737, -845138, -171320, 979418, 2554027, 4304100, 5896288, 7085579, 7752274, 7873225, 7537823, 6907151, 6135268, 5362416, 4688426, 4130000, 3641668, 3165488, 2675147, 2183708, 1727453, 1393960, 1324112, 1589708, 2092959, 2605603, 2886506, 2860230, 2716332, 2770266, 3235874, 4093732, 5114645, 6018686, 6642334, 6988834, 7169436]
17420G169436J16455L7505j35256l79022o51726r16867j095114j061054p33615
17411B350742k11597K97968P33583J117674J364227J370724J143425P51879K43822
17402I162447l23161q43077j197612j291968j141651r16350p54422o32862m66897
17393A594447j96350J93748O39584R96516J121371R36324M74865n5439m20671
17384E284395n90533o70926o77480n50373l26951j12996M6011J46928K22013L48908
17374C118996M91118M95918L05856J3795k14123k77168k38650k21250k88063m22674
17364B763755n16902m27050j24842K38521M65550M64531K64227j5326j98179k09522
17354B704763j54805j74989k86467l34247j64731J29940K89476K08226J1852j62332
$$ y = [7169436, 7285891, 7323396, 7188140, 6809118, 6157392, 5240525, 4145411, 3084357, 2350742, 2139145, 2437113, 3170696, 4288370, 5652597, 7023321, 8166746, 8918625, 9162447, 8839286, 7996209, 6798597, 5506629, 4364978, 3448628, 2694206, 2061344, 1594447, 1398097, 1591845, 2231429, 3227945, 4349316, 5285640, 5760505, 5705066, 5284395, 4693862, 4022936, 3345456, 2795083, 2468132, 2355136, 2401147, 2548075, 2770088, 3118996, 3610114, 4106032, 4411888, 4425683, 4211560, 3934392, 3695742, 3474492, 3186429, 2763755, 2246853, 1819803, 1694961, 1933482, 2399032, 2863563, 3127790, 3112464, 2914285, 2704763, 2549958, 2374969, 2088502, 1754255, 1589524, 1719464, 2008940, 2217166, 2229018, 2066686]
17344B066686k77920l62428m99007p75041j194582j648584j925185j830603j395683
17335g842347q44445l11280K15507P15588J097922J271199J208973R74822O69773
17326b844288L79448J81425R1634o017k03340l94962l99778j56184K12969M68287
17316b670806M55951K60364R6232O5830R6671P2559l9493j92603l30567m03565
17306b589427l78149k69523j33304j7496O3961J43642K84731M55516M70634K08207
17296a761208j83216m45007m64727l07667j09653N3727J71526J90529P8818n1480
17286b828358m0250J85292N87749J036948J377938J485353J265378P36727R5726
17277C902503l86774n17999k84784R7023L10219K05854o9117k47645j73386J06089
$$ y = [2066686, 1788766, 1426338, 927331, 152290, -1042292, -2690876, -4616061, -6446664, -7842347, -8686792, -8998072, -8782565, -8066977, -6969055, -5697856, -4488883, -3514061, -2844288, -2464840, -2283415, -2191781, -2197798, -2401138, -2796100, -3195878, -3352062, -3139093, -2670806, -2214855, -1954491, -1858259, -1792429, -1695758, -1623199, -1662692, -1855295, -2185862, -2589427, -2967576, -3237099, -3370403, -3387899, -3323938, -3180296, -2895565, -2440049, -1969415, -1761208, -1944424, -2389431, -2854158, -3161825, -3271478, -3217751, -3046225, -2855696, -2776878, -2828358, -2868608, -2683316, -2095567, -1058619, 319319, 1804672, 3070050, 3806777, 3902503, 3515729, 2997730, 2712946, 2809969, 3120188, 3326042, 3256925, 3009280, 2835894, 2941983]
17267B941983M07380N87236O03222M80983K88340N0680k48985n50491p34319p83047
17257C042982p85422p84700p24264n12364j38964K56674M95937N47966M94939
17248A892784L88362K63984J73451J16790O1123M293o7228j73062k88966l93211
17238A978320n19068o87327q50616r60958j012460r79744q18176n34254j92575
17229d576858J14294L36770N10513O82126Q28666Q88058Q15856O04680L03706
17220E07811J9193j35708j27508q8857k51666o32967r37141r06325n85765k05467
17210c344400M6588J22876R3231O2212P6363P8871q096j28294j13720J07879M30370
17199b576120O60628O49695L98266O8840j25608r0854J03655L13829M10301L38883
$$ y = [2941983, 3349363, 3936599, 4539821, 5020804, 5309144, 5359824, 5110839, 4560348, 3826029, 3042982, 2257560, 1472860, 748596, 236232, 97268, 353942, 849879, 1397845, 1892784, 2281146, 2545130, 2718581, 2835371, 2896494, 2900787, 2833559, 2660497, 2371531, 1978320, 1459252, 771925, -78691, -1039649, -2052109, -3031853, -3850029, -4384283, -4576858, -4462564, -4125794, -3615281, -2933155, -2104489, -1216431, -400575, 204105, 507811, 527004, 391296, 263788, 174931, -76735, -709702, -1646843, -2553168, -3138933, -3344400, -3297812, -3174936, -3081705, -3019493, -2943130, -2864259, -2872355, -3000649, -3114369, -3006490, -2576120, -1915492, -1265797, -867531, -798691, -924299, -1015153, -911498, -597669, -187368, 151515]
17189A51515J51003o6412k73243m30004m75912m24411l49800k78283k12968j95668
17179b404183k87718n04193p48103q64753p89979n38522j38551K80469M89597
17170e505936L71144L7850k90693m80031n61542o50471p94183r44452j040440
17161i858754j041388r27878p47315n87982m72328l50487j76805O4634L26558
17152a3771745N10603N47499L99706P0052l33571o08630n84393k71004J51422
17143a3890061N39170Q72788J131894J229747J092369P94280N37089M59744N68136
17134f664844Q22616J183057J527895J654887J450853R77289M10086p9085m43527
17125H39227p39528r96999j191684j253688j046834n33658P2778M70694N23854
$$ y = [151515, 302518, 236106, -37137, -467141, -943053, -1367464, -1717264, -1995547, -2208515, -2404183, -2691901, -3196094, -3944197, -4808950, -5598929, -6137451, -6276002, -5995533, -5505936, -5134792, -5096942, -5387635, -5867666, -6429208, -7079679, -7873862, -8818314, -9858754, -10900142, -11828020, -12575335, -13163317, -13635645, -13986132, -14162937, -14098303, -13771745, -13261142, -12713643, -12313937, -12243885, -12577456, -13186086, -13770479, -14041483, -13890061, -13350891, -12478103, -11346209, -10116462, -9024093, -8229813, -7692724, -7232980, -6664844, -5842228, -4659171, -3131276, -1476389, -25536, 951753, 1361839, 1282754, 839227, 99699, -897300, -2088984, -3342672, -4389506, -4923164, -4850386, -4379692, -3855838]
17116c855838L35734J22979J4921k3369n4268j1318K32662O77978J138135J381909
17106d0475J293286R57036O55005O23887P76968Q37879O93117M59254K77404J20012
17096F653373j04184l86539o99656j014149j213062j181792r52912o88927n33987
17087a21835n08713n17799m61729l34289j87506p5500k3715J8102J35689K98338
17077a778957L68044K90361J78156J70756K51759K72572J35422q9429k35149k05661
17067f42126m4122J04997R2837r5101l08022l78727k98680k29170l00297m60173
17057b558584n80398o05120n33111l42823l6458K87054N20775O38016O42978N78080
17047a989591N47448O12666P36533Q52633Q88647P65203M74746J49026l9021m5094
$$ y = [-3855838, -3520104, -3397125, -3382204, -3405573, -3459841, -3471159, -3238497, -2560519, -1422384, -40475, 1252811, 2209847, 2864852, 3488739, 4265707, 5103586, 5796703, 6255957, 6533361, 6653373, 6549189, 6162650, 5462994, 4448845, 3235783, 2053991, 1101079, 412152, -121835, -630548, -1148347, -1610076, -1944365, -2131871, -2207371, -2231086, -2212984, -2077295, -1778957, -1410913, -1120552, -942396, -771640, -519881, -247309, -111887, -201316, -436465, -642126, -686248, -581251, -488414, -583515, -891537, -1270264, -1568944, -1798114, -2098411, -2558584, -3138982, -3744102, -4277213, -4620036, -4656494, -4369440, -3848665, -3210649, -2567671, -1989591, -1442143, -829477, -92944, 759689, 1648336, 2413539, 2888285, 3037311, 2998290, 2953196]
17037B953196K3342K4397j03724l15059n06117n84786n47649m79697m64679n49220
17027e49996o99227p35272m81534J6235N31355Q56197R13684P06622L12827n0951
17017H19940j57821K4734L34743N49394N36541L18538l547l28178n76410p26619
17007G91315q33771r39224j021743j037779r33306o99641m07719j46041M8644
16998e179265K00334K92997K50328Q3064o9767j07858p8892p4886q6089o1099
16988d831133m5909j12425k22929k37417m1758L20158O96248J012929J289735
16979b172501J508600J588632J479106J214704Q61144M67171N4877l60920p25847
16970C914966r22574q61834o38840m83099m95478n95855p20085q63136r58564
$$ y = [2953196, 2976538, 3000935, 2897211, 2582152, 2076035, 1491249, 943600, 463903, -776, -549996, -1249223, -1984495, -2466029, -2449794, -1918439, -1062242, -148558, 558064, 870891, 819940, 662119, 686853, 1021596, 1570990, 2107531, 2426069, 2422522, 2094344, 1517934, 791315, -42456, -981680, -2003423, -3041202, -3974508, -4674149, -5081868, -5227909, -5179265, -4978931, -4685934, -4435606, -4352542, -4422309, -4530167, -4609059, -4683945, -4770034, -4831133, -4877042, -4989467, -5212396, -5449813, -5491571, -5171413, -4475165, -3462236, -2172501, -663901, 924731, 2403837, 3618541, 4479685, 4946856, 5001733, 4640813, 3914966, 2992392, 2130558, 1491718, 1008619, 513141, -82714, -802799, -1665935, -2624499]
16961b624499r04340p04487m87709l84049l83667l52735j98664K0310K15815M10998
16951e393027O35743P91960P36452M74659J71681m9372j71535k03578j62006l6563
16941c205586J90569M45931N82491N21460L44816K08781K12845L64599N76894
16932B42800P23468P38749O19931L51220q0442o09063j102250j383568j290310
16923a789465q36220k29918L28350P67172J061437J180541J156134J034060Q00145
16914C472236M63973R5220k33080m51114n09153m11188k27559p9739m9631j10614
16904A959351j81106k33117l21925n15523q10459j106386j285749j294705j129212
16895d918831q37531n45424l66237k96298k50041j35917P7181K87567L28878J94909
$$ y = [-2624499, -3528839, -4233326, -4721035, -5105084, -5488751, -5841486, -6040150, -6019840, -5804025, -5393027, -4757284, -3965324, -3228872, -2754213, -2582532, -2631904, -2803439, -3007017, -3169023, -3205586, -3015017, -2569086, -1986595, -1465135, -1120319, -911538, -698693, -334094, 242800, 966268, 1705017, 2324948, 2676168, 2595726, 1986663, 884413, -499155, -1789465, -2625685, -2855603, -2527253, -1760081, -698644, 481897, 1638031, 2672091, 3472236, 3936209, 4031429, 3798349, 3347235, 2838082, 2426894, 2199335, 2119596, 2069965, 1959351, 1778245, 1545128, 1223203, 707680, -102779, -1209165, -2494914, -3789619, -4918831, -5756362, -6301786, -6668023, -6964321, -7214362, -7350279, -7273098, -6985531, -6656653, -6461744]
16885f461744R1217J61094L17848M06969L79119K64892J07584j1900J110J13732
16875d630079J85861J58934N5748r9081k20810j89926n838K09179L83511N40703
16865c611798O58864O13468L34670p0422m47501p39380r48011j057463j010749
16856f278322p57057l28691J51329N49996Q04381Q60039O56433K31813k78729
16847d388808p63211j164485j414289j459791j306657r62072m02964L49341J154340
16838a0358596J794604K116569K114881J884734J513943J016070M31083n7948
16830D55340k56952j77919n487J17177K10371L80914O82252J078728J425813J545839
16820E456076J388044J019250N27346L4326l01132m03773l36768k45291k85898
$$ y = [-6461744, -6370527, -6209433, -5891585, -5484616, -5105497, -4840605, -4733021, -4744921, -4743811, -4630079, -4444218, -4285284, -4229536, -4328617, -4549427, -4739353, -4745191, -4536012, -4152501, -3611798, -2952934, -2339466, -2004796, -2075218, -2522719, -3262099, -4210110, -5267573, -6278322, -7035379, -7364070, -7212741, -6662745, -5858364, -4998325, -4341892, -4110079, -4388808, -5152019, -6316504, -7730793, -9190584, -10497241, -11459313, -11862277, -11512936, -10358596, -8563992, -6447423, -4332542, -2447808, -933865, 82205, 513288, 455340, 198388, 20469, 14982, 132159, 342530, 723444, 1405696, 2484424, 3910237, 5456076, 6844120, 7863370, 8390716, 8425042, 8123910, 7720137, 7383369, 7138078, 6852180]
16811F852180n12506q04313j003452j078674j085746j032314q46182m92034q2918
16802h5959K10771L17885K65637J27586K2093L7830J55887K99659M28662N65374
16792B345425P18252Q06257P28345M92687K03933j8883o8565Q0347L33735N55701
16782F177234O31311M98877K01874j03641l25246n84138j032055j611715k109698
16773A742803k373452k392316k210863j878538j463218j024992o06089k53068
16765a0459733K0986K74617N64432Q70501J145203J335055J378747J280759J079179
16756b510254P82693M30864J01792j62475l39652l86173l00446j16117J69016
16747b330752N06031P04109O00189K45360j24247k62373j37997M4266P4084r9878
$$ y = [6852180, 6339674, 5535361, 4531909, 3453235, 2367489, 1335175, 488993, -3041, -85959, 124812, 442697, 708334, 835920, 858013, 895843, 1051730, 1351389, 1780051, 2345425, 3063677, 3869934, 4598279, 5090966, 5294899, 5276016, 5207451, 5287798, 5621533, 6177234, 6808545, 7307422, 7509296, 7405655, 7080409, 6496271, 5464216, 3852501, 1742803, -630649, -3022965, -5233828, -7112366, -8575584, -9600576, -10206665, -10459733, -10438747, -10164130, -9599698, -8729197, -7583994, -6248939, -4870192, -3589433, -2510254, -1727561, -1296697, -1194905, -1357380, -1697032, -2083205, -2383651, -2499768, -2330752, -1824721, -1120612, -520423, -275063, -399310, -661683, -799680, -755414, -681330, -781208]
16737g81208l58955n37627n81717n35011m40342l04783j26217P9956K98935N07643
16727b779326O42406O19233M12581J28198p2553j30622j06374p6503q6340j58309
16717a607609k98852m80944o21414n84679k62238K47576O49936P60179O55409
16708a542636M84382L11728J77970J21762J28449J71337K63662M18473N61045
16699A096172N85466M96721L95096L55366L19149J48149k07962o46657r83851
16690A557649j102087r97478p44887m89347l42744l18628l47424k96370j06046
16681c187362R4203J30688j2094k18511l68233l86564k61256m4673K14294M97821
16671c541687P64260R52416J032375J026168R79938Q94284P49360N86434M68448
$$ y = [-781208, -1140163, -1677790, -2259507, -2794518, -3234860, -3539643, -3665860, -3585904, -3286969, -2779326, -2136920, -1517687, -1105106, -976908, -1049461, -1180083, -1286457, -1362960, -1449300, -1607609, -1906461, -2387405, -3008819, -3593498, -3855736, -3608160, -2958224, -2198045, -1542636, -1058254, -746526, -568556, -446794, -318345, -147008, 116654, 535127, 1096172, 1681638, 2178359, 2573455, 2928821, 3247970, 3396119, 3188157, 2541500, 1557649, 455562, -541916, -1286803, -1776150, -2118894, -2437522, -2784946, -3081316, -3187362, -3093159, -2962471, -2974565, -3193076, -3561309, -3947873, -4209129, -4253802, -4039508, -3541687, -2777427, -1825011, -792636, 233532, 1213470, 2107754, 2857114, 3443548, 3911996]
16662C911996M25374M06027K76913l8848m92868r74205j378361j638585j739124
16653a241681j685916j424614r02131k36547L37425P02959R09933R85647Q80384
16644a674541O20289L50531K53806M05239O61823P88900P18694N71745M88300
16635C184786N44079O77481O99397M54470m0858n76838r02243r10161o54723k78029
16625B197361M7091J87910J35405j8314k01129m05013o11469p41500p15365n17875
16615f42898k28955J312M3422j29060l72168m52651k61305J27194N16388P02276
16605f96445O22002L62821L2201k80732m67049m31620j77578J62757M20125N13838
16595F0320M68960L54889K32569J40455R8937P3109j1456j58699k83093l39775
$$ y = [3911996, 4337370, 4743397, 5020310, 4981462, 4488594, 3514389, 2136028, 497443, -1241681, -2927597, -4352211, -5254342, -5490889, -5153464, -4450505, -3540572, -2554925, -1674541, -1054252, -703721, -449915, -44676, 617147, 1406047, 2124741, 2696486, 3184786, 3728865, 4406346, 5105743, 5560213, 5519355, 4942517, 4040274, 3130113, 2475390, 2197361, 2244452, 2432362, 2567767, 2549453, 2348324, 1943311, 1331842, 590342, -125023, -642898, -871853, -870541, -827119, -956179, -1328347, -1780998, -2042303, -1915109, -1398721, -696445, -74443, 288378, 320579, 39847, -427202, -858822, -1036400, -873643, -453518, 60320, 529280, 884169, 1116738, 1257193, 1356130, 1429239, 1417783, 1259084, 975991, 636216]
16585F36216l54127l24493k36718j38651o1489Q0832L60137O90423R12807R02343
16575B467280O05709P8402n31448j061999j359404j339274j068215o39461q0109
16566b928519N20210R56938J052683P94137L14944k40820p80042j193318j383489
16557b887276j380861j247092r28935l94642K21184P16863R79638J020782Q95892
16548c004447O58447M26365L33837M05100N91735Q40369J018689R36622N47154
16539B753871J7430m02099n50866m52715k72937j73135j54083r5291M5422J96733
16529I12330K44116R7545j90555m42121n32141m70058l32393k07410j72309k30890
16519a323886k61247j11612K16526N41471O94950O89161O59560O90943P26371
$$ y = [636216, 282089, -42404, -279122, -417773, -479262, -398430, -38293, 652130, 1564937, 2467280, 3072989, 3151391, 2619943, 1557944, 198540, -1140734, -2208949, -2848410, -2928519, -2408309, -1451371, -398688, 395449, 710393, 469573, -310469, -1503787, -2887276, -4268137, -5515229, -6444164, -6838806, -6617622, -5900759, -4921121, -3900339, -3004447, -2346000, -1919635, -1585798, -1180698, -588963, 251406, 1270095, 2206717, 2753871, 2771301, 2369202, 1818336, 1365621, 1092684, 919549, 765466, 670175, 715597, 912330, 1156446, 1253991, 1063436, 621315, 89174, -380884, -713277, -920687, -1092996, -1323886, -1585133, -1696745, -1480219, -938748, -243798, 445363, 1104923, 1795866, 2522237]
16510B522237O47891L90600l1808n22884r37415j203138j374124j500841j478932
16501c488414j164787n92934M8583N72121Q87319J017263J049147J060288J063791
16492D52377J029875R59610Q30953N40077P0340l99202o57067o66490n64993m74030
16482A121450m02413k84689r8000L8116q006k20142m85804p03211q17482q12722
16472b672903p28793o37363n65940n14503n05673n40722n07230k27799L75935
16463f524991J226420K064024K421545J977005J025035J39319m36259p57047r29171
16454B05880j016617j016153q65069n43210j31599K38708M46045M19056K14795
16445b048164L3317M5353K21876L93442M54935M25970L58094L14402L91307O24287
$$ y = [2522237, 3170128, 3560728, 3528920, 3006036, 2068621, 865483, -508641, -2009482, -3488414, -4653201, -5246135, -5197552, -4625431, -3738112, -2720849, -1671702, -611414, 452377, 1482252, 2441862, 3272815, 3812892, 3883232, 3484030, 2826963, 2160473, 1595480, 1121450, 719037, 434348, 336348, 374464, 366458, 146316, -339488, -1042699, -1860181, -2672903, -3401696, -4039059, -4604999, -5119502, -5625175, -6165897, -6673127, -6900926, -6524991, -5298571, -3234547, -813002, 1164003, 2189038, 2328357, 1892098, 1135051, 205880, -810737, -1826890, -2691959, -3235169, -3366768, -3128060, -2682015, -2262959, -2048164, -2014847, -1969494, -1747618, -1354176, -899241, -473271, -115177, 199225, 590532, 1214819]
16435A214819Q73884R20136P10014M26743K65694K22292J35244j16552n00006
16426D152268q63999j023476q72940m45598J22042O15346Q16513O53772K58077
16417C412005j12544k08702K8833M35620Q19929J040446R36775M31351l00740
16408F482973q99521j108425r00265l90640J83675N36785N76585M82478M75811
16399E439456N94056P06798P12781O31597M91769K42460j58971o10998r55556
16390G093392j149138j207412j081876p02966j16305M58513P50601O72889L51179
16381E068877p2645n18365r03031j142298j199791j098747q64989n00997m9394
16372a281380M15776Q31617J150219J340115J342850J051274M43842k64571p72086
$$ y = [1214819, 2088703, 3008839, 3718853, 4145596, 4411290, 4633582, 4768826, 4652274, 4152268, 3288269, 2264793, 1391853, 946255, 1068297, 1683643, 2500156, 3153928, 3412005, 3299461, 3090759, 3119592, 3555212, 4375141, 5415587, 6352362, 6783713, 6482973, 5583452, 4475027, 3574762, 3184122, 3367797, 3904582, 4481167, 4963645, 5439456, 6033512, 6740310, 7453091, 8084688, 8576457, 8818917, 8659946, 8048948, 7093392, 5944254, 4736842, 3654966, 2952000, 2835695, 3294208, 4044809, 4717698, 5068877, 4996232, 4477867, 3574836, 2432538, 1232747, 134000, -730989, -1231986, -1281380, -865604, -33987, 1116232, 2456347, 3799197, 4850471, 5294313, 5029742, 4257656]
16363D257656j001716j086998j096404r25373m76642J29879O51206R63282J114670
16354B529560J194176J202952J100566R22979P03473L73081p0474n00529p70132
16345F685652p73729n67536m12274n43429q83975j097356r76494o75861m77178
16336B77820m48964m36713k98209p0741J22889K48315L56375M63128M85368L52447
16326A051715J57579Q7506K37021N77157J000513J329167J431898J350425J247781
16317H470762J261770J429070J706803J986296K136278K087634J812666J289017
16309B2180296M47121r32606k896682m712869n328451m565284l135400j806760
16301g50635r57395n95486n25864m72434k39917J26949M70478P49870J008864
$$ y = [4257656, 3255940, 2168942, 1072538, 147165, -329477, -199598, 451608, 1414890, 2529560, 3723736, 4926688, 6027254, 6950233, 7653706, 8026787, 7956313, 7455784, 6685652, 5911923, 5344387, 4932113, 4388684, 3504709, 2407353, 1430859, 754998, 277820, -171144, -607857, -906066, -976807, -853918, -605603, -249228, 213900, 699268, 1051715, 1209294, 1296800, 1533821, 2110978, 3111491, 4440658, 5872556, 7222981, 8470762, 9732532, 11161602, 12868405, 14854701, 16990979, 19078613, 20891279, 22180296, 22627417, 21694811, 18798129, 14085260, 8756809, 4191525, 1056125, -750635, -1708030, -2303516, -2829380, -3301814, -3541731, -3414782, -2944304, -2194434, -1185570]
16292a185570J210545J242611J076334Q10909N54661L59068K27573J10413n8460
16283D348084l10640n96602p78012p73631o75395o49300p36353q36489q87980
16274a896318r28145r94596j034928r17810n66851r5669K69984M47015N38541
16265e178777N86858M75009J75010j21709k14703p1531K10919N05203O86349O72174
16255b275198M56240R3307l03531n92033o56290m52733l4562M84878R60008J244175
16245a075739J288099J157821R35601O92509N14489M38290L77834J71186k70627
16236D229463q47858j344131j585173j526600j260565r19611n73112k30046J10230
16227c947403M31778P07368Q87156Q83967O77255L87328J64370O1547L9536P0307
$$ y = [-1185570, 24975, 1267586, 2343920, 3154829, 3709490, 4068558, 4296131, 4406544, 4348084, 4037444, 3440842, 2662830, 1889199, 1213804, 564504, -171849, -1008338, -1896318, -2824463, -3819059, -4853987, -5771797, -6338648, -6434317, -6164333, -5717318, -5178777, -4591919, -4116910, -3941900, -4063609, -4278312, -4349843, -4138924, -3633721, -2947372, -2275198, -1818958, -1725651, -2029182, -2621215, -3277505, -3730238, -3764800, -3279922, -2319914, -1075739, 212360, 1370181, 2305782, 2998291, 3512780, 3951070, 4328904, 4500090, 4229463, 3381605, 2037474, 452301, -1074299, -2334864, -3254475, -3827587, -4057633, -3947403, -3515625, -2808257, -1921101, -1037134, -359879, 27449, 191819, 253366, 292902, 363209]
16217C63209J58136K59128K95575K46286J75308J78703K68127L35431K90507J72550
16207B742960R8286J50167L06173M50735M46948K49873l8438k48259k80889j83477
16197C694079r4407j03543j68069k04021k25415l18455m97208o37045o03393m16902
16187D25621k06047m8839L9540M5056l0856j53700k61387l10372l07726k68319
16177a077029j98376j11508k740J44305K84285L29175K46152P6152r6180j83854
16167e89618j46057o504J91719M04259N36445N10642M24713M60188O15417O95337
16157C096541N13439O6216m07800o16903m90802j97579L6422P1893r1948l64760
16147A614719o53735q72567r46073q82673p67789o89711o85509p18155p06016
$$ y = [363209, 521345, 780473, 1076048, 1322334, 1497642, 1676345, 1944472, 2279903, 2570410, 2742960, 2841246, 2991413, 3297586, 3748321, 4195269, 4445142, 4406704, 4158445, 3877556, 3694079, 3599672, 3496129, 3328060, 3124039, 2898624, 2580169, 2082961, 1445916, 842523, 425621, 219574, 170735, 210275, 255331, 224475, 70775, -190612, -500984, -808710, -1077029, -1275405, -1386913, -1389653, -1245348, -961063, -631888, -385736, -309584, -405764, -589618, -735675, -742179, -550460, -146201, 390244, 900886, 1325599, 1785787, 2401204, 3096541, 3609980, 3676196, 3268396, 2651493, 2160691, 1963112, 1999534, 2071427, 1979479, 1614719, 960984, 88417, -857656, -1740329, -2508118, -3197829, -3883338, -4601493, -5307509]
16138e307509n70832k84101J18146N67339R58139J128026R67779N61152J44657
16129a717204q3437p5100J05888L51085N54646O48216O34180N94377O35827P42061
16119B390539O82702K43809m86770j194387j563676j433737q82291j49168N40583
16110a852396J035534J237133J168393J013705R43238R26303Q10011N30968J49356
16101E962245k38638n32997o72936o87025o67521o90888p88396r61433j175165
16092d52754j336417j304101r93030n00475k9818K85647M00379L15567J12575
16083c502427l0875K2498K43783N06477O77520O70411N43205M75553N71998P41252
16073I19395Q20558P54307N90986L84451J74648O3113J29624K71181L00326J66546
$$ y = [-5307509, -5878341, -6162442, -6044296, -5476957, -4518818, -3390792, -2423013, -1861861, -1717204, -1800641, -1875741, -1769853, -1418768, -864122, -215906, 418274, 1012651, 1648478, 2390539, 3073241, 3317050, 2830280, 1635893, 72217, -1361520, -2243811, -2392979, -1852396, -816862, 420271, 1588664, 2602369, 3545607, 4471910, 5281921, 5812889, 5962245, 5723607, 5190610, 4517674, 3830649, 3163128, 2472240, 1683844, 722411, -452754, -1789171, -3093272, -4086302, -4586777, -4616595, -4330948, -3930569, -3615002, -3502427, -3533302, -3510804, -3267021, -2760544, -2083024, -1412613, -869408, -393855, 178143, 919395, 1739953, 2494260, 3085246, 3469697, 3644345, 3707458, 3837082, 4108263, 4408589, 4575135]
16063D575135j160n7277j8539m2983k21357m55082n85032n61724m44182l08859
16053A878940j81935o0630N4416J53682J97813J64425J24923K13265M82126P93643
16043C820668R46504R01297P61222O10366M64635L20551J85103O4678r3989l75050
16033G605985p14127r13028q96495p68625o72299p05892q52716j000950j074452
16024G401j043409q41411l95841K55502Q77506J155477R98676O52927M31304M18893
16014B517025M74382M24637K24157k3855k06667l51189n57489q44891j107595
16005E48515j172078r48734n75148l13853k87077l65179l06923J3266M93166Q93237
15995b020808J040774R13700N97916K16734j56681m84953p10462p66273o34623
$$ y = [4575135, 4573975, 4516698, 4498159, 4455176, 4233819, 3778737, 3193705, 2631981, 2187799, 1878940, 1697005, 1636375, 1690791, 1844473, 2042286, 2206711, 2331634, 2544899, 3027025, 3820668, 4767172, 5668469, 6429691, 7040057, 7504692, 7825243, 8010346, 8075024, 7981035, 7605985, 6891858, 5978830, 5082335, 4313710, 3641411, 2935519, 2082803, 1081853, 7401, -1036008, -1877419, -2273260, -2017758, -1140252, 15225, 1013901, 1666828, 2098132, 2517025, 2991407, 3416044, 3640201, 3616346, 3409679, 3058490, 2501001, 1656110, 548515, -623563, -1572297, -2147445, -2461298, -2748375, -3113554, -3420477, -3407211, -2914045, -2020808, -980034, -66334, 531582, 748316, 591635, 106682, -603780, -1370053, -2004676]
15986b004676l73918q1699J60462L42951N38271P71881R10869P67810L15974k17219
15976A130706n26868n22655l78160k68309k09566j62122j64074l13157n92045
15967b006250q52895j034787j180486j256206j153988q42410m65638k60168l44094
15958i396922o33190r52636j162803j169618q87119k79304N43965J330497J822205
15949a0784925J906526J674086J323321R98694P31149N16489L78415L29265L18898
15940b608082K96354K91426L22330K92185P5120l13204o55163p07712m44557k7691
15930c478994L63596O16151P16182P13652O55217N77763N12066M68686M52856
15921A597175M45369L82791K09595p4184l73428m89283k83307J07884L97031M45432
$$ y = [-2004676, -2378594, -2460293, -2299831, -1956880, -1418609, -646728, 264141, 1031951, 1347925, 1130706, 603838, 81183, -296977, -565286, -774852, -936974, -1101048, -1414205, -2006250, -2859145, -3893932, -5074418, -6330624, -7484612, -8327022, -8792660, -9052828, -9396922, -10030112, -10982748, -12145551, -13315169, -14202288, -14481592, -13937627, -12607130, -10784925, -8878399, -7204313, -5880992, -4882298, -4151149, -3634660, -3256245, -2926980, -2608082, -2311728, -2020302, -1697972, -1405787, -1330667, -1643871, -2299034, -3006746, -3451303, -3478994, -3115398, -2499247, -1783065, -1069413, -414196, 163567, 675633, 1144319, 1597175, 2042544, 2425335, 2634930, 2560746, 2187318, 1698035, 1414728, 1522612, 1919643, 2365075]
15911B365075K72528o3686m28995o25983n74600l60318p4451K73112O80671J072007
15901B535360J319733J304869R91120M98039K4895l17223n38849o85617q08191
15892D324136r55138j102785j171928j141228j020886p72435l78992M5201K98052
15883a876003K32767j25490n55099p90366p57132o04795m68079l09302m0525L14075
15873d979949O28690P99584Q29855P67067O01884L60602J53488M5664N9848K32919
15863e00348N21310P44407O97786L32693j59511n36808p39840q33909q32137p03082
15853b009439m82885k55142n0250J38518L09894M97484P57916J065391J299697
15844A271184J388245J340942J150481Q24123M82081K65431J64437R9391Q4811
$$ y = [2365075, 2637603, 2573917, 2144922, 1518939, 944339, 584021, 509570, 782682, 1463353, 2535360, 3855093, 5159962, 6151082, 6649121, 6674016, 6356793, 5817944, 5132327, 4324136, 3368998, 2266213, 1094285, -46943, -1067829, -1840264, -2219256, -2174055, -1876003, -1643236, -1768726, -2323825, -3114191, -3871323, -4476118, -4944197, -5253499, -5294024, -4979949, -4351259, -3551675, -2721820, -1954753, -1352869, -992267, -838779, -793115, -733267, -500348, 20962, 765369, 1463155, 1795848, 1636337, 1099529, 359689, -474220, -1306357, -2009439, -2492324, -2747466, -2797716, -2659198, -2349304, -1851820, -1093904, -28513, 1271184, 2659429, 4000371, 5150852, 5974975, 6457056, 6722487, 6886924, 6986315, 7071126]
15835G071126J43455J89285J40562N2776K4501J3643j04180l16199m64140m06777
15825F344052j54405Q1438O7155j99154n45520q36843j001656j000254q81689
15816A873124p75227p97041r50116j085184j028428p30617k84906J22150L54044
15807c302201M57075N72213P58836R15924Q33271M22900j30551n29203o22530
15798f24266n18968l86469k20340M0439L54832O44266Q20538Q03465O27112M20085
15788A960694K69330J62075N7078j7729j6699P697k4680j18125k48057l98801
15778A632783n48307o53433o83474o56713o51655p40667q60130q87272q23167
15769d872035p42887o32371m11378p1309L40056P31734R33480Q43786N52772K62607
$$ y = [7071126, 7214581, 7403866, 7544428, 7597204, 7621705, 7635348, 7531168, 7214969, 6750829, 6344052, 6189647, 6271085, 6338240, 6139086, 5593566, 4756723, 3755067, 2754813, 1873124, 1097897, 300856, -649260, -1734444, -2762872, -3493489, -3778395, -3656245, -3302201, -2845126, -2272913, -1514077, -598153, 235118, 658018, 527467, -1736, -624266, -1143234, -1529703, -1750043, -1709604, -1354772, -710506, 110032, 913497, 1540609, 1960694, 2230024, 2392099, 2449177, 2431448, 2414749, 2422446, 2397766, 2279641, 2031584, 1632783, 1084476, 431043, -252431, -909144, -1560799, -2301466, -3161596, -4048868, -4872035, -5614922, -6247293, -6658671, -6729980, -6389924, -5658190, -4724710, -3880924, -3328152, -3065545]
15759c065545J49040K83490O00714Q85544Q76010M66774j71225o84729q23488
15750a483415o25320l12151p3693K7677N7497J57471L70900N16210L93345N8847
15740i12632k18515k15597M1013L09505L93654L11651J60912l4377k61225m24164
15730h49775m23142k74537o0823J61232L86360O35800Q91458J072703J095342
15721B634618R71216P83586N50229K31580j43575m33797m61125j90593J91766
15712D133905M71697O09598O98669Q14137R01579Q03734M71673N6036k82672n01059
15702H177297o07417o07424n71522o20590p64125q75184q34778o66006n01610
15693B128641l98875k88324r9277J58247M40881P35165J021170J223508J247105
$$ y = [-3065545, -2916505, -2633015, -2032301, -1146757, -270747, 196027, 24802, -659927, -1483415, -2108735, -2420886, -2494579, -2466902, -2409405, -2251934, -1881034, -1364824, -971479, -912632, -1131147, -1346744, -1305731, -996226, -602572, -290921, -130009, -164386, -425611, -849775, -1272917, -1547454, -1608277, -1447045, -1060685, -424885, 466573, 1539276, 2634618, 3605834, 4389420, 4939649, 5171229, 5027654, 4593857, 4132732, 3942139, 4133905, 4605602, 5215200, 5913869, 6728006, 7629585, 8433319, 8904992, 8961028, 8678356, 8177297, 7569880, 6962456, 6390934, 5770344, 5006219, 4131035, 3296257, 2630251, 2128641, 1729766, 1441442, 1342165, 1500412, 1941293, 2676458, 3697628, 4921136, 6168241]
15684F168241J041434O35844J28085l25010n40329m72935l14403l10713n36916
15675E473298r14304j295648j460562j232738o62560J5464N39723P32701O03840
15666A799214L53816K37703L74845O75170R33937J008771Q88936O13744K33340
15657G119476j85297n59394q00177q57813p53415n79719m63365m79488n61985
15648A878823n07122j60870M10023R48176J213792J212592J129287J074719J034872
15639H234292R51585P75721N05330K06809k8020j68475k69482m14902o76866j040052
15629H075940j312559j285294r63307n32095j83245k0920n3789j94188k97819
15620C232724k85873j87840o6038O092k9317j62931l21973m27909m64926m46997
$$ y = [6168241, 7209675, 7845519, 7973604, 7648594, 7108265, 6635330, 6320927, 6010214, 5473298, 4558994, 3263346, 1802784, 570046, -92514, -77050, 462673, 1195374, 1799214, 2153030, 2390733, 2765578, 3440748, 4374685, 5383456, 6272392, 6886136, 7119476, 6934179, 6374785, 5574608, 4716795, 3963380, 3383661, 2920296, 2440808, 1878823, 1371701, 1210831, 1620854, 2569030, 3782822, 4995414, 6124701, 7199420, 8234292, 9185877, 9961598, 10466928, 10673737, 10645717, 10477242, 10207760, 9792858, 9115992, 8075940, 6763381, 5478087, 4514780, 3982685, 3799440, 3778520, 3724731, 3530543, 3232724, 2946851, 2759011, 2692973, 2699065, 2669748, 2506817, 2184844, 1756935, 1292009, 845012]
15610H45012l33237p6757K61286N16351N23593K49801j40685m07646m39299k98219
15600G00200j12528K8323J04589J21651N5722p7180j73356j55749n7790P1504
15590E05386K70763N94541R67917J199869J143623Q14493L91005Q0040n9805j02931
15580E804901j39531k20449l56806n52613p74755r58565j080208j137242j088812
15571e04080r10121o53708m16007l18239m72865q30327j129552j088697o03866
15562f927462J35734P52419J048740J159101J311880J561069J747919J681473
15554B470873J328953Q55270M79139K74715J94784K31693M00638O50723R22360
15545G809148J161287J244804J052872N81647m1415n93485q86468r38762r07645
$$ y = [845012, 511775, 435018, 696304, 1212655, 1736248, 1986049, 1845364, 1437718, 998419, 700200, 587672, 615995, 720584, 842235, 897957, 820777, 647421, 491672, 433882, 505386, 776149, 1370690, 2338607, 3538476, 4682099, 5496592, 5887597, 5967637, 5907832, 5804901, 5665370, 5444921, 5088115, 4535502, 3760747, 2802182, 1721974, 584732, -504080, -1414201, -2067909, -2483916, -2802155, -3275020, -4105347, -5234899, -6323596, -6927462, -6791728, -6039309, -4990569, -3831468, -2519588, -958519, 789400, 2470873, 3799826, 4655096, 5134235, 5408950, 5603734, 5835427, 6236065, 6886788, 7809148, 8970435, 10215239, 11268111, 11849758, 11808343, 11214858, 10328390, 9389628, 8481983]
15536H481983q72987q26078p21898n39224l67822k92605k73571k56101k60647
15527D071050l61906n73247p53169p64661o28790m22657j90783M7932L12595O18702
15517A355066Q93282J009518R30647P34849M87866K27357J7239j14135j94647
15508E347042k67360l64181m46964m27996k87320j08631L3743J56029K62263K76933
15498D173558J67821L6982M383O7826J37284J36591O1882l1278o7338L7488K77887
15487E003086M95634N28968L67437J62543R6330J92986L05134K90400J63664P7970
15477G684152J50600L72627O57622Q60732Q58280O83401M81604L39946K55387
15468A2344351K21394K34089K71217L09578K85105Q5701l27617q40718j251916
$$ y = [8481983, 7608996, 6782918, 6061020, 5521796, 5153974, 4861369, 4587798, 4331697, 4071050, 3709144, 3135897, 2382728, 1618067, 989277, 566620, 375837, 423769, 736364, 1355066, 2248348, 3257866, 4188513, 4923362, 5411228, 5638585, 5655824, 5541689, 5347042, 5079682, 4715501, 4268537, 3840541, 3553221, 3444590, 3478333, 3634362, 3896625, 4173558, 4341379, 4378361, 4382744, 4450570, 4587854, 4724445, 4786327, 4755049, 4687711, 4725199, 5003086, 5498720, 6027688, 6395125, 6557668, 6653998, 6846984, 7152118, 7442518, 7606182, 7684152, 7834752, 8207379, 8865001, 9725733, 10584013, 11267414, 11749018, 12088964, 12344351, 12565745, 12799834, 13071051, 13380629, 13665734, 13751435, 13423818, 12583100, 11331184]
15459A1331184j387785j233792r50692o65789l16371J98428P56652J068452R96011
15450I796298O78182L67553K19958K25566K70516K25394N3772j68669l57814m78197
15440A0832559n00475l94411j83894O6212K94758M27616M00789K58693J19955
15431A1321802L3251l4904j34957l11298n50441p75466q97923q04227m22807J13420
15421G536450N19592O43974N80230M67206L91646M42414O37024Q53389R61676
15412A3033601R50132Q80980Q00065O97347N53127L78460J93043P5811J02656
15403A7665222J41672j7129l63928p12292r22544r96971j005125r58641q32696
15394A1997568o64438n63053n84797o16287m99344k25294J18360M79690Q04215
$$ y = [11331184, 9943399, 8709607, 7758915, 7093126, 6776755, 6975183, 7731835, 8800287, 9796298, 10474480, 10842033, 11061991, 11287557, 11558073, 11783467, 11837239, 11668570, 11310756, 10832559, 10332084, 9937673, 9753779, 9819991, 10114749, 10542365, 10943154, 11201847, 11321802, 11355053, 11320149, 11185192, 10873894, 10323453, 9547987, 8650064, 7845837, 7423030, 7536450, 8056042, 8700016, 9280246, 9747452, 10139098, 10581512, 11218536, 12071925, 13033601, 13983733, 14864713, 15664778, 16362125, 16915252, 17293712, 17486755, 17562566, 17665222, 17806894, 17789765, 17425837, 16713545, 15791001, 14794030, 13788905, 12830264, 11997568, 11333130, 10770077, 10185280, 9568993, 9069649, 8844355, 8962715, 9442405, 10246620]
15385A0246620R99488J022479Q91924O22680K76666j9187j62112j58976j64166
15376A3555416l24883n33940n24388k33776J37930L69779L62805J68526n7075
15367A2920394j90295j86817k8283K54990N64824Q27482J041372J189430J186597
15358A7579694R57464N52256J63915n1956j37097j92349j79615P493L39092O25366
15348A9664263P05121O25282N72580O34882P20252O98577N62604M04118K44017
15339B4831696M5466j29239j55415m4062O3467J04463J47870K54646L89940M79352
15329B5988184N19746O07551Q06863J043850J218379J315381J358917J345492
15321C4204363J263988J162265J118464J152306J197167J172155J068566R28158
$$ y = [10246620, 11246108, 12268587, 13160511, 13783191, 14059857, 14040670, 13878558, 13719582, 13555416, 13230533, 12696593, 12172205, 11938429, 12076359, 12446138, 12808943, 12977469, 12920394, 12730099, 12543282, 12514999, 12769989, 13334813, 14162295, 15203667, 16393097, 17579694, 18537158, 19089414, 19253329, 19201373, 19064276, 18871927, 18692312, 18699805, 19038897, 19664263, 20369384, 20994666, 21567246, 22202128, 22922380, 23620957, 24183561, 24587679, 24831696, 24877162, 24747923, 24592508, 24548446, 24611913, 24716376, 24864246, 25118892, 25508832, 25988184, 26507930, 27115481, 27922344, 28966194, 30184573, 31499954, 32858871, 34204363, 35468351, 36630616, 37749080, 38901386, 40098553, 41270708, 42339274, 43267432]
15313D3267432P76202O47764N82233N93907O88104Q33683R96291J190837J438445
15304E1014898J756713K179686K683364L141496L453039L649928L845289M089874
15296G5814287M337919M549202M680105M694177M677316M798578N143409N675470
15288A14370463O333257P093163P954507Q882093R776930J0527858J1101634J1559323
15280A87599228J1918164J2085808J1978635J1562049J0820864R739075Q264550
15273B63968373O353041M061037J550020r78543l283754n097002o260330o783140
15265B53529702o741084o207451n283541m095982k726347j207392M01178J956853
15257B29625936L316094M478010N503568O306063O674442O440971N494369L742539
$$ y = [43267432, 44043634, 44691398, 45273631, 45867538, 46555642, 47389325, 48385616, 49576453, 51014898, 52771611, 54951297, 57634661, 60776157, 64229196, 67879124, 71724413, 75814287, 80152206, 84701408, 89381513, 94075690, 98753006, 103551584, 108694993, 114370463, 120703720, 127796883, 135751390, 144633483, 154410413, 164938271, 176039905, 187599228, 199517392, 211603200, 223581835, 235143884, 245964748, 255703823, 263968373, 270321414, 274382451, 275932471, 274953928, 271670174, 266573172, 260312842, 253529702, 246788618, 240581167, 235297626, 231201644, 228475297, 227267905, 227669083, 229625936, 232942030, 237420040, 242923608, 249229671, 255904113, 262345084, 267839453, 271581992]
15249B71581992J243218j707231m764565p694423j0301815j2366114j3706401
15242B22284661j4320351j4378591j4047037j3389451j2450040j1317509j0073749
15235A32307933q824354p716453o780513n889903m964184m067879l261277k502579
15227H8300791j714397r22462k90915L1709M3883j13586k40482k03879j4316J91488
15217H5067834K55369Q0854l87550j076593j745537k193187k434368k568005k569650
15208G2429167k339366j852318j241885o99934k76024O9559K82239L13448K60936
15199F6945822K71220M43174P93693J247982J688247K008755K132240K064040
15191G7595173J928622J798508J622222J444369J467172J860581K575696L354560
$$ y = [271581992, 272825210, 271117979, 266353414, 258658991, 248357176, 235991062, 222284661, 207964310, 193585719, 179538682, 166149231, 153699191, 142381682, 132307933, 123483579, 115767126, 108986613, 103096710, 98132526, 94064647, 90803370, 88300791, 86586394, 85663932, 85373017, 85404726, 85448609, 85335023, 85094541, 84890662, 84876346, 85067834, 85323203, 85404057, 85016507, 83939914, 82194377, 80001190, 77566822, 74998817, 72429167, 70089801, 68237483, 66995598, 66295664, 66019640, 66089199, 66371438, 66684886, 66945822, 67217042, 67660216, 68453909, 69701891, 71390138, 73398893, 75531133, 77595173, 79523795, 81322303, 82944525, 84388894, 85856066, 87716647, 90292343, 93646903]
15183I3646903L955930M346233M652962M917982N036351M952350M741227M537629
15175A30787567M389607M153427L643348K843487J892182R28716J7835q30432
15167A47825737j623455k333835k898146l255935l429519l555072l740176m010904
15159A22978695m454551n168614o055037o869897p390140p450822p053161o406792
15151G2129681n699304n014536m429365l978697l599957l184182k690992k219828
15143D1312820j924093j825205j786712j705430j626617j659510j831873k036545
15135B6916835k124158k015709j726765j343857r80516p20544n77281m81936l30091
15126A6615978q4844J86214L44340K28016k10084q16536j357242j664624j682472
$$ y = [93646903, 97602833, 101949066, 106602028, 111520010, 116556361, 121508711, 126249938, 130787567, 135177174, 139330601, 142973949, 145817436, 147709618, 148638334, 148656169, 147825737, 146202282, 143868447, 140970301, 137714366, 134284847, 130729775, 126989599, 122978695, 118524144, 113355530, 107300493, 100430596, 93040456, 85589634, 78536473, 72129681, 66430377, 61415841, 56986476, 53007779, 49407822, 46223640, 43532648, 41312820, 39388727, 37563522, 35776810, 34071380, 32444763, 30785253, 28953380, 26916835, 24792677, 22776968, 21050203, 19706346, 18725830, 18005286, 17428005, 16946069, 16615978, 16531134, 16717348, 17061688, 17289704, 17079620, 16263084, 14905842, 13241218, 11558746]
15117A1558746j471852j130426o82482j29525M45535R06683J161360J209086J093036
15108A2960161Q39161M84268R7100k53994m68415m25283j49057J47479K63273
15099A3494693J99885J10551O9856P347j11296k10801k67452l58075n17352p13029
15089A1704327q80511r02008p01229l85592j47784k8073J06723L19765M43229
15080I528847K62409j86731o18243q01117p38964n66447l74357j63752O1984K38294
15070F641923L06149K82610K52279K79171L08134K49336J12200l9550j62260k42339
15060G987653k91814l23482l02544j52714J18533L32981K99478P7166j00730j58603
15050G485924k18697l32296l89188l17300j68015l1766l204j05225k08073j75934
$$ y = [11558746, 10086894, 8956468, 8273986, 8144461, 8589996, 9496679, 10658039, 11867125, 12960161, 13799322, 14283590, 14380690, 14126696, 13658281, 13232998, 13083941, 13231420, 13494693, 13694578, 13805129, 13874985, 13882332, 13771036, 13560235, 13292783, 12934708, 12417356, 11704327, 10823816, 9921808, 9220579, 8834987, 8687203, 8659130, 8765853, 9085618, 9528847, 9791256, 9604525, 8986282, 8185165, 7446201, 6879754, 6505397, 6341645, 6403629, 6641923, 6948072, 7230682, 7482961, 7762132, 8070266, 8319602, 8431802, 8392252, 8229992, 7987653, 7695839, 7372357, 7069813, 6917099, 7035632, 7368613, 7668091, 7745257, 7644527, 7485924, 7267227, 6934931, 6545743, 6228443, 6060428, 6028662, 6025458, 5920233, 5712160, 5536226]
15040E536226j1345K11012M32848N85601O18152N95868O27767O91781O06713J89067
15030A0083690n48652j341435j854015j937489j691127j312741r93962q51142
15022d46873p99746o04113j21533N38000J086831J311214J211860Q94416M44537
15013C514593k4193l83138o27171q25519r67170r69301p76686m32454n1774K90050
15003a252763N80168P89827Q26970O19685K79072O830j44221k58052l92054n17732
14993E37730n69306m93583k61657R5242M27027N63289M98630L94515M08843N31125
14983B131855N82271M00352J0447m08391o75636p00627n05153k06843L8644J05222
14973G72141l0707k66710m39118m31483k89527j93136k33603l40093l92490k94493
$$ y = [5536226, 5524881, 5735893, 6168741, 6754342, 7372494, 7968362, 8596129, 9287910, 9894623, 10083690, 9535038, 8193603, 6339588, 4402099, 2710972, 1398231, 404269, -446873, -1246619, -1850732, -1972265, -1434265, -347434, 963780, 2175640, 3070056, 3514593, 3490400, 3107262, 2480091, 1654572, 687402, -281899, -1058585, -1491039, -1542813, -1252763, -672595, 117232, 944202, 1563887, 1842959, 1849789, 1705568, 1447516, 1055462, 537730, -31576, -525159, -786816, -691574, -264547, 298742, 797372, 1191887, 1600730, 2131855, 2714126, 3114478, 3124925, 2716534, 2040898, 1340271, 835118, 628275, 666919, 772141, 741434, 474724, 35606, -395877, -685404, -878540, -1112143, -1452236, -1844726, -2139219]
14963b139219m6101K50659M42030L96059J51784o3923j04234r4349k29017m87808
14953a924119o55922n58276j97230L05200Q20998J242078J455245J366821J004835
14944B859630N28558J13631j40220k10859q8968J93747M92581O30960N69437M28016
14934E376513K93050J17194j17881l16889l62713j71310K38524O42366P22451
14925F421305L42348l43519r97766j291307j092295n29366J10833N34249O62389
14916C816871O81171P40729P96500P79650P04985N92078M40747K51945j8568m06168
14906H379940p44787o98247j45484N84694J030184J020700P43952N10340M46427
14897A1127719M30854L04880L5114l00424o05468q58319j055527j077845q13989
$$ y = [-2139219, -2185320, -1934661, -1492631, -1096572, -944788, -1008711, -1112945, -1207294, -1436311, -1924119, -2580041, -3138317, -3335547, -3030347, -2209349, -967271, 487974, 1854795, 2859630, 3388188, 3501819, 3361599, 3150740, 3061772, 3255519, 3748100, 4379060, 4948497, 5376513, 5669563, 5786757, 5668876, 5351987, 4989274, 4817964, 5056488, 5698854, 6421305, 6763653, 6420134, 5422368, 4131061, 3038766, 2509400, 2620233, 3154482, 3816871, 4498042, 5238771, 6035271, 6814921, 7519906, 8111984, 8552731, 8804676, 8786108, 8379940, 7635153, 6936906, 6791422, 7376116, 8406300, 9427000, 10170952, 10681292, 11127719, 11558573, 11863453, 11898567, 11598143, 10992675, 10134356, 9078829, 8000984, 7186995]
14888G186995l53419J08472M58917O40063N81168L21603K7188j81327k82424k85183
14878H222053k33265k05116k74293m53602o45271p19392o31826m01330k9360M45585
14868E074183Q64733J021988Q38942M43425O2357j58559k03976j15482K1450P0139
14858G919200o5999l68717p18984r47756r38145o86819k88118Q3634K93383L66178
14848D647857M30770N68789P01656O87086N30065L51965J70424j44136o54023
14839G290453j169308j373598j104671m72677K67552Q73270J152109J043278O83024
14830G189432K79894k8989k34652m55193q20130j282187j580662j468747r51523
14821F47243k83963K64608O39473R37345J166337J198125R56777N85997L37903
$$ y = [7186995, 6833576, 6942048, 7400965, 8041028, 8622196, 8943799, 8970987, 8789660, 8507236, 8222053, 7988788, 7783672, 7509379, 7055777, 6410506, 5691114, 5059288, 4657958, 4628598, 5074183, 5938916, 6960904, 7799846, 8243271, 8305628, 8147069, 7943093, 7827611, 7849061, 7919200, 7853201, 7484484, 6765500, 5817744, 4879599, 4192780, 3904662, 3988296, 4281679, 4647857, 5078627, 5647416, 6349072, 7036158, 7566223, 7918188, 8088612, 7944476, 7290453, 6121145, 4747547, 3642876, 3170199, 3437751, 4311021, 5463130, 6506408, 7189432, 7469326, 7440337, 7205685, 6750492, 5930362, 4648175, 3067513, 1598766, 647243, 363280, 627888, 1267361, 2204706, 3371043, 4569168, 5525945, 6111942, 6449845]
14812F449845L03814L81965M50026M58639M51560M70880M21014J94993j42975
14803I439761m30149n55232n14201m33465m54267n62690o34382n69249l69626
14794D916500j54661o9762j49867k80090l16079k65561k72796m18804o33756p65191
14784A589933o68872k79680L24568R24878J292472J324453J068943O77981K94866
14775F549542J8354j1482L06484Q42935J296839J444218J268334Q79753L96790
14766A2991767o8946m07620n92235p01836p98357q27544p03776m72171l18701
14757H100581l92921o25184p88406p36748n25473k93750j21898o4793j56785k91149
14747D103474k27642J56849O57517R19515P70479L15613k24744o82044r40617
$$ y = [6449845, 6753659, 7135624, 7585650, 8044289, 8495849, 8966729, 9387743, 9582736, 9439761, 9009612, 8454380, 7940179, 7506714, 7052447, 6489757, 5855375, 5286126, 4916500, 4761839, 4692077, 4542210, 4262120, 3946041, 3680480, 3407684, 2988880, 2355124, 1589933, 921061, 641381, 965949, 1890827, 3183299, 4507752, 5576695, 6254676, 6549542, 6567896, 6556414, 6862898, 7705833, 9002672, 10446890, 11715224, 12594977, 12991767, 12922821, 12515201, 11922966, 11221130, 10422773, 9595229, 8891453, 8419282, 8100581, 7707660, 7082476, 6294070, 5557322, 5031849, 4738099, 4616201, 4551408, 4394623, 4103474, 3875832, 4032681, 4690198, 5609713, 6380192, 6695805, 6471061, 5789017, 4848400]
14738D848400r04397n83099j66492J29377K39937K25904J71143J14001M3117m4050
14728D073841j02046o4658R0604L01768M68974N01292L35902j1065m24502p29336
14718D440774p66536m98943n2085L77235O40437O67800M75051J75698j07940l54943
14708D996548o01142q19254r20175q72674p45423o02414m37520j92691J86603
14699h142O39688R93710J155166J175499J090887Q61168N08604J84902N2034J41283
14689F794799K99757L44249K68247J90587J68097J85187K75840M76870O79587
14680I683220O60824K92962k83637p47936r01450q22533p17124o74262o22762
14671E867302m71907j92974J48864M01101M24176K53245J32333K75410O17090
$$ y = [4848400, 3944003, 3360904, 3194412, 3323789, 3563726, 3789630, 3960773, 4074774, 4117891, 4073841, 3971795, 3907137, 3997741, 4299509, 4768483, 5269775, 5605677, 5594612, 5170110, 4440774, 3674238, 3175295, 3123210, 3500445, 4140882, 4808682, 5283733, 5459431, 5351491, 4996548, 4395406, 3576152, 2655977, 1783303, 1037880, 435466, -2054, -194745, -8142, 631546, 1625256, 2780422, 3955921, 5046808, 5907976, 6416580, 6601482, 6653516, 6794799, 7094556, 7438805, 7707052, 7897639, 8065736, 8250923, 8526763, 9003633, 9683220, 10344044, 10637006, 10353369, 9605433, 8703983, 7881450, 7164326, 6490064, 5867302, 5395395, 5202421, 5351285, 5752386, 6176562, 6429807, 6562140, 6837550, 7454640]
14662G454640Q76487Q61628N97277J82398k52852n35451n89025m79420k87820
14653G827862n2723J72180L04755K94307J89167Q8152K6284N497O8871K39741
14643I164093L96708L68399J61346j02671l60460n81119p23750p71922p41687
14634F808937o28379l93161m7414K58168L05426J5652m64855q61489r92894q97694
14624C102297o93187m41237j56677J76548N12470O97152O41419M56484L02203
14615D597472J78099J2874j21903p4641J50899L53949L37713R7678k00977l75718
14605D955445l64349k66225k20494k45898k77743l03542l80319n35453o95082
14596A666340p39274o19753m17361k44930j23941j2529R9120J74737K20224K65247
$$ y = [7454640, 8331127, 9192755, 9790032, 9972430, 9719578, 9184127, 8595102, 8115682, 7827862, 7775139, 7947319, 8252074, 8546381, 8735548, 8823700, 8849984, 8855481, 8924352, 9164093, 9560801, 9929200, 10090546, 9987875, 9627415, 9046296, 8322546, 7550624, 6808937, 6180558, 5787397, 5739983, 5998151, 6303577, 6319229, 5854374, 4992885, 3999991, 3102297, 2409110, 1967873, 1811196, 1987744, 2500214, 3197366, 3838785, 4295269, 4597472, 4775571, 4788445, 4666542, 4591901, 4742800, 5096749, 5434462, 5532140, 5331163, 4955445, 4591096, 4324871, 4104377, 3858479, 3580736, 3277194, 2896875, 2361422, 1666340, 927066, 307313, -110048, -354978, -478919, -491448, -392328, -217591, 2633, 267880]
14586B67880K62007J93153J40658J21934M2254j44628l39819l76637j79671J41597
14576A28728L99038N00702M43895K79946J06368r317n3986k6870O7040K22644
14566B058188M29442N55914M11478N5619j82205r9044J79888M37189N35457L96635
14556D778561O1826k99311n75700p57950q14478p20079n14936k94943j77393k09607
14546D75990l41055m57213m33133k54431o1032J6193M5325J75314L77988M72149
14536A6095L46011M8113k81018n12280o02178n88849n32311m77249m42240l79707
14526c405613k15602J0900J80849K72102L71127N43535P42881Q33017P13707M28101
14516D75004J32929p5935k17742k92968k78611k51227l49714n98724q73752j017614
$$ y = [267880, 529887, 723040, 863698, 985632, 1027886, 883258, 543439, 166802, -12869, 128728, 527766, 1028468, 1472363, 1752309, 1858677, 1849360, 1795374, 1768504, 1835544, 2058188, 2487630, 3043544, 3455022, 3510641, 3328436, 3229392, 3409280, 3846469, 4381926, 4778561, 4840387, 4541076, 3965376, 3207426, 2392948, 1672869, 1157933, 862990, 685597, 475990, 134935, -322278, -755411, -1009842, -1070874, -1054681, -1009356, -834042, -456054, 16095, 362106, 410219, 129201, -383079, -985257, -1574106, -2106417, -2583666, -3025906, -3405613, -3621215, -3610315, -3429466, -3157364, -2786237, -2242702, -1499821, -666804, 46903, 475004, 607933, 531998, 314256, 21288, -257323, -508550, -858264, -1456988, -2330740, -3348354]
14506c348354r20465n26752J15419P69331J126137J091517Q63336P02755P02331
14497E75255P37012O08795K77509j09652l92797m84098l57728r1112J53020K66330
14487A182534K61291J70303k3207k94319m93037m91474l99018m36929o47187q68191
14477b039234r38767q16378n38537j94622J28032M49695Q32504J201645J374928
14468e40734J268219R69882O12417K76377n165k03994k88177k25250j6433K06234
14458B053376K56869R0281j69602l74053m63841m22290k45120Q64K28000M08722
14448A363206N29595N58103N03167M53843M74320N18592N27317M87085L81594
14439E796822K08017J3908j38313k10598k26929k66668l78899n60368p95884j035134
$$ y = [-3348354, -4268819, -4795571, -4680152, -3910821, -2784684, -1693167, -829831, -127076, 575255, 1312267, 1921062, 2198571, 2088919, 1696122, 1212024, 854296, 763184, 916204, 1182534, 1443825, 1614128, 1590921, 1296602, 803565, 312091, -86927, -523856, -1171043, -2039234, -2978001, -3794379, -4332916, -4527538, -4399506, -3949811, -3117307, -1915662, -540734, 727485, 1697367, 2309784, 2586161, 2580996, 2377002, 2088825, 1863575, 1847142, 2053376, 2310245, 2400526, 2230924, 1856871, 1393030, 970740, 725620, 726484, 954484, 1363206, 1892801, 2450904, 2954071, 3407914, 3882234, 4400826, 4928143, 5415228, 5796822, 6004839, 6018747, 5880434, 5669836, 5442907, 5176239, 4797340, 4236972, 3441088, 2405954]
14429B405954j179757j170170j045686q64857o21924l08486J9246K52661K79040
14420b233979P1723k55143n25925o20670n31939m02985m21785o15518q41524r38815
14410g316560q69697o93719m27505q0421K64907N40505P51295Q82517Q78801P77896
14400e291981P07469P23772P50826O74877M97388L60560L77723M82560N24303
14391a92503M36074K38939k3286l20279o21484q26895p74277m07925J18199O07147
14381a766290R88572J258600J403890J424002J319018J076769P02781K40021k58777
14372F388586p31927j054151j095356q57966m98804k52664k74528m92433o74775
14363D55982o52373m78610l47176l16214k46360j5430K98981M88048M75280L90831
$$ y = [2405954, 1226197, 56027, -989659, -1854516, -2476440, -2784926, -2765680, -2513019, -2233979, -2162256, -2417399, -2943324, -3563994, -4095933, -4498918, -4920703, -5536221, -6377745, -7316560, -8186257, -8879976, -9307481, -9387902, -9122995, -8582490, -7831195, -6948678, -6069877, -5291981, -4584512, -3860740, -3109914, -2435037, -1937649, -1577089, -1199366, -716806, -192503, 243571, 482510, 459224, 138945, -482539, -1309434, -2083711, -2491636, -2373437, -1766290, -777718, 480882, 1884772, 3308774, 4627792, 5704561, 6407342, 6647363, 6388586, 5656659, 4602508, 3507152, 2649186, 2150382, 1897718, 1623190, 1130757, 455982, -196391, -675001, -1022177, -1338391, -1584751, -1600181, -1301200, -813152, -337872, 52959]
14353E2959L66690L46511J73200j73804n05295n86238l45033J31168P22664J275479
14343A458301J543251J314378O09732l30272j199818j753080j885958j637485
14335a880951j150790o26110k46158j14138k03413l74010m72431l84560r1338
14326e543899K78960N79446P53656P67573N71711J88752k48271n87012p44100
14317c983184p56378p28964o52475l80855J41807P31896J091218J060258P24044
14308b752633L09545N6276R2919L20660N21661O02770O44262P39963Q60681R09689
14298B305793Q12221M78012j55223r42690j573192j853062j811730j590110j308250
14289e638231r75712n66186j05843L73901Q34690J187104J353304J294438J007019
$$ y = [52959, 419649, 766160, 939360, 765556, 260261, -325977, -671010, -539842, 182822, 1458301, 3001552, 4315930, 4925662, 4595390, 3395572, 1642492, -243466, -1880951, -3031741, -3657851, -3904009, -4018147, -4221560, -4595570, -5068001, -5452561, -5543899, -5264939, -4685493, -3931837, -3164264, -2592553, -2403801, -2652072, -3239084, -3983184, -4739562, -5468526, -6121001, -6501856, -6360049, -5628153, -4536935, -3476677, -2752633, -2443088, -2386812, -2293893, -1973233, -1451572, -848802, -204540, 535423, 1396104, 2305793, 3118014, 3596026, 3440803, 2498113, 924921, -928141, -2739871, -4329981, -5638231, -6613943, -7180129, -7285972, -6912071, -6077381, -4890277, -3536973, -2242535, -1235516]
14280a235516N93458K19026m2091k27043l88655n13438m95591k52986J56298O01191
14270a585347R53824J055439P92246K79046j67439l18782k29988p8501N9421J51546
14260I11465J20522n2288k73394m41379n44980o54772p90244q67512q23506o48285
14250d064373l30541Q1522M16108M93427L26461J24278M2750N4414P3755O9928
14240b712271L0944p4587k59874m56947n39641m66376k96975q2350J24297K63791
14230d469989L57792M73948O40704Q25524R41648R32227Q29730P07287O23381
14221A862252N84542N23263L71870J48837n3822j61789k29900l68580n73190p71799
14211A331684r56719j169100j395131j545834j546262j362584j009444n40790
$$ y = [-1235516, -642058, -423032, -465123, -692166, -1080821, -1594259, -2089850, -2342836, -2186538, -1585347, -631523, 423916, 1216162, 1495208, 1327769, 1008987, 778999, 700498, 759919, 911465, 1031987, 979699, 706305, 264926, -280054, -934826, -1725070, -2592582, -3416088, -4064373, -4394914, -4313392, -3897284, -3403857, -3077396, -2953118, -2910368, -2855954, -2782199, -2712271, -2681327, -2755914, -3015788, -3472735, -4012376, -4478752, -4775727, -4858077, -4733780, -4469989, -4112197, -3638249, -2997545, -2172021, -1230373, -298146, 531584, 1238871, 1862252, 2446794, 2970057, 3341927, 3490764, 3436942, 3275153, 3045253, 2676673, 2103483, 1331684, 374965, -794135, -2189266, -3735100, -5281362, -6643946, -7653390, -8194180]
14203h194180K8006O65273J200738J403412J202581P90961M17052J46418q2407
14194b422146k97765m14906l09002L21L43693N50327N33534K78115j58082n93590
14184b489501q08201p46477n84365n20682n35236m58767k50380p1220n9384j29093
14174f653306o5785K09345N39686P19720P06766O04428N22789N14359N37719M88654
14164a875625K95359n4891m70332p18644o03199k14691J43565L05823L98977O00058
14154b193600Q52213R11769O15702L0847o21797j141098j469520j620045j531006
14145f166535j144390n58378K2965M33072O06641N58212L05913j23808n59770
14136f626078p10685l91108L26294J120881J636537J762321J650186J427947J104987
$$ y = [-8194180, -8166174, -7500901, -6300163, -4896751, -3694170, -2903209, -2486157, -2339739, -2422146, -2719911, -3134817, -3443819, -3443498, -3099805, -2549478, -2015944, -1737829, -1895911, -2489501, -3297702, -4044179, -4628544, -5149226, -5684462, -6143229, -6393609, -6464829, -6524213, -6653306, -6719091, -6509746, -5970060, -5250340, -4543574, -3939146, -3416357, -2901998, -2364279, -1875625, -1580266, -1635157, -2105489, -2824133, -3427332, -3642023, -3498458, -3192635, -2793658, -2193600, -1341387, -429618, 186084, 216931, -404866, -1545964, -3015484, -4635529, -6166535, -7310925, -7869303, -7846338, -7413266, -6806625, -6248413, -5942500, -6066308, -6626078, -7336763, -7727871, -7401577, -6280696, -4644159, -2881838, -1231652, 196295, 1301282]
14127A301282P63473N41191M46310L43079J23297j56174l47463m16818m54574
14118B143603m76784l74008r7147K14457L62209K64722m2699m33320p16229p87693
14108E7111o79626m33041q5854K14019K73340O5433k33445m29118m88698n04255
14098b244134n35555n60051n11597l36037r0876O8141J06376J62713L13413M78977
14088c148630N54604N17795M21090L28276K95674L66858N27939O89345P19428
14079A272379N18668R3641m12434q15457j043535j123083j075494r11099o66108
14070d162522m15780k39713j36601R704L11479P16296J029551J107639R75080
14061h04867P24552M01410O7144j44116j60313k8356J65069K62207Q8109l13146
$$ y = [1301282, 2064755, 2605946, 3052256, 3395335, 3518632, 3362458, 3014995, 2598177, 2143603, 1666819, 1292811, 1195664, 1410121, 1772330, 2037052, 1994353, 1561033, 844804, 57111, -622515, -1055556, -1141410, -927391, -654051, -588618, -822063, -1251181, -1739879, -2244134, -2779689, -3339740, -3851337, -4187374, -4278250, -4210109, -4103733, -3941020, -3627607, -3148630, -2594026, -2076231, -1655141, -1326865, -1031191, -664333, -136394, 552951, 1272379, 1791047, 1884688, 1472254, 656797, -386738, -1509821, -2585315, -3496414, -4162522, -4578302, -4818015, -4954616, -4944912, -4633433, -3917137, -2887586, -1779947, -804867, -80315, 321095, 388239, 244123, 83810, 55454, 220523, 482730, 570839, 257693]
14051B57693o38462n92548j18685N80162J194922J582885J833094K001166J974782
14042H075009J651170J084929M45423p5974l71082m96758o09023q23864j117185
14033G762645j335317j331956j111077p82893m08518j3384L19711N10023N50504
14024D159738M82231L29155O7775k87534o54973j001228j337268j585998j619495
14015a447597j413755j074233p68553n99485n14799m23189l01089j39968N9383
14006f623285K49317L82742M92936O25516O97164O04018L88794K02719J79963
13997b800116L64075P05476J095802J445649J664694J575674J071314L05901m31053
13988D997416r41568j166336j157496j044885q93636o68827l58893j746L33193
$$ y = [257693, -380769, -973317, -1092002, -511840, 683082, 2265967, 4099061, 6100227, 8075009, 9726179, 10811108, 11256531, 11180557, 10809475, 10312717, 9703694, 8879830, 7762645, 6427328, 5095372, 3984295, 3201402, 2792884, 2779500, 3099211, 3609234, 4159738, 4641969, 4971124, 5038899, 4751365, 4096392, 3095164, 1757896, 171898, -1447597, -2861352, -3935585, -4704138, -5303623, -5818422, -6241611, -6542700, -6682668, -6623285, -6373968, -5991226, -5498290, -4872774, -4175610, -3571592, -3182798, -2980079, -2800116, -2436041, -1730565, -634763, 810886, 2475580, 4051254, 5122568, 5428469, 4997416, 4055848, 2889512, 1732016, 687131, -206505, -875332, -1234225, -1235971, -902778]
13979i02778N27243N11804L82238L19081M36947O57197P38127N33809J58721j44921
13969C217468k20979o9473K05066M50192N17141L61677M5716l91759r39544j468523
13959A706982j755819j729746j513372j217182q39642l21861L34746R42742J226902
13950c166250J126761Q77031P48965P96203Q62575P36960L19914k75784p88460
13941A237915j008380r32961p33992n71183m82500m24879l40712j86575N3219
13932c390048L39262O16288Q30090Q91147P43877M60590J85719J0011o7211j13948
13922E05777k07107l55869m70529m14417j41465K34881N37753O20914M42083Q8945
13912H40966k82233m85164l88737k0698M18638O68451O31687M31153K23475N7530
$$ y = [-902778, -375535, 136269, 518507, 837588, 1274535, 1931732, 2669859, 3203668, 3362389, 3217468, 2996489, 2927016, 3132082, 3582274, 4099415, 4461092, 4506808, 4115049, 3175505, 1706982, -48837, -1778583, -3291955, -4509137, -5348779, -5670640, -5335894, -4393152, -3166250, -2039489, -1162458, -413493, 382710, 1245285, 1982245, 2302159, 2026375, 1237915, 229535, -703426, -1437418, -2008601, -2491101, -2915980, -3256692, -3443267, -3390048, -3050786, -2434498, -1604408, -713261, 30616, 491206, 676925, 686936, 619725, 505777, 298670, -57199, -527728, -942145, -1083610, -848729, -310976, 309938, 752021, 840966, 558733, 73569, -315168, -335866, 82772, 751223, 1382910, 1814063, 2037538, 2095068]
13902B095068j16797l41994n57974o46225n77069m47445l91294m89168o93467
13893b166365q40461p80649m97408q0940L81217P86257R96157R54033P20640M02969
13883a24550R5464j41963k83990l39666l41496l35516l49835l04258o5483L45626
13873a845667P14446Q35324P01553M50498J89311m8320k47714l69704l83175l35802
13863c39250k96695k53813j85901j65849k97068n73008q57037j009750j001263
13854d979634r13693q29480p35995n90654m34861l52741l21176k40573j10280
13845i509087k8924m2721q6760q7585l5099N9802J79955K78108K98417K48352
13835h725542K14383K79524M49967O49763P68224P27391N44622K97187L4968j80086
$$ y = [2095068, 1978271, 1636277, 1078303, 432078, -144991, -592436, -983730, -1472898, -2166365, -3006826, -3787475, -4284883, -4365823, -3984606, -3198349, -2202192, -1248159, -527519, -124550, -29086, -171049, -455039, -794705, -1136201, -1471717, -1821552, -2125810, -2191293, -1845667, -1131221, -295897, 405656, 856154, 1045465, 997145, 749431, 379727, -3448, -339250, -635945, -889758, -1075659, -1241508, -1538576, -2111584, -2968621, -3978371, -4979634, -5893327, -6722807, -7458802, -8049456, -8484317, -8837058, -9158234, -9398807, -9509087, -9538011, -9580732, -9667492, -9755077, -9790176, -9730374, -9550419, -9272311, -8973894, -8725542, -8511159, -8231635, -7781668, -7131905, -6363681, -5636290, -5091668, -4794481, -4759513, -4939599]
13825d939599k42424q8299K56232O54038R00969R09312Q12596P88045Q49656Q92722
13815G93248Q28140O26907L33554N7376r6930j40935k28976m65029p76113j034669
13805a03427j154179j093613r05066o84252m31175j09028K57624O18497Q82655
13796b721964R22896P10703L83697J12763n4130j03875O1144M82717J019810J422622
13786B236383J509305J266836P51458P2862n66735j052804j433581j718293j792682
13777g27251j554900j041662m00975K05395O72275R91098J167655J174335J073621
13768A559591J047178J222893J495709J570120J223461N20547k92768j053488
13760G293243j686684k069698k067956j640381r23231j95993L08062N23201N41580
$$ y = [-4939599, -5182023, -5270322, -5014090, -4360052, -3459083, -2549771, -1737175, -949130, -99474, 793248, 1621388, 2248295, 2581849, 2639225, 2542295, 2401360, 2172384, 1707355, 931242, -103427, -1257606, -2351219, -3256285, -3940537, -4371712, -4480740, -4223116, -3604619, -2721964, -1799068, -1088365, -704668, -591905, -646035, -749910, -688766, -206049, 813761, 2236383, 3745688, 5012524, 5763982, 5836844, 5270109, 4217305, 2783724, 1065431, -727251, -2282151, -3323813, -3724788, -3519393, -2847118, -1856020, -688365, 485970, 1559591, 2606769, 3829662, 5325371, 6895491, 8118952, 8639499, 8346731, 7293243, 5606559, 3536861, 1468905, -171476, -1094707, -1290700, -982638, -459437, 82143]
13751H2143N30412N42627M92759L76415L00276K78976J80933o5470l49331m99710
13741A870030m70468l74560l54647m68957o74082q79878j006429r95597q44006
13732d198594o00937l04203o745K27413L81486M48305L98054K31410N015j96696
13722c615492k78864j54814J94176O55527R78914Q96772L69926l25022q24898
13713b103775r70986q78794p49627o26084l89367j7908L27269N36175O70564Q03938
13703c398595Q90849Q60064P14635M79025J67314j81254m85800o21849n07604
13694b083215k38735P523J97281L91167N55148O12656N78974M97219L32117O6577
13684I16712j63762j92643q586K57278M33425L87500J08559k70703o06890q91772
$$ y = [82143, 612555, 1155182, 1647941, 2024356, 2324632, 2603608, 2784541, 2719071, 2369740, 1870030, 1399562, 1025002, 670355, 201398, -472684, -1352562, -2358991, -3354588, -4198594, -4799531, -5103734, -5110479, -4883066, -4501580, -4053275, -3655221, -3423811, -3418796, -3615492, -3894356, -4049170, -3854994, -3199467, -2220553, -1323781, -953855, -1278877, -2103775, -3074761, -3953555, -4703182, -5329266, -5718633, -5736541, -5409272, -4873097, -4202533, -3398595, -2507746, -1647682, -933047, -454022, -286708, -467962, -953762, -1575611, -2083215, -2321950, -2314427, -2117146, -1725979, -1170831, -558175, 20799, 518018, 850135, 916712, 752950, 560307, 551721, 808999, 1242424, 1629924, 1738483, 1467780, 860890, -30882]
13674c0882j182166j384347j320793j023172p05306n12393m61958n13671n70494
13665g705182n30884l92484k11786p7357j41009m09994n80415l73763J25288O60930
13655i636656J101889J461687J776851K013227K058689J863872J543149J249426
13647C432134J001564O97174K67296j99699n25748o38005o31498o66589q28369
13638A908260j101168j416288j672801j779398j684721j359967q12245j60821
13630h079149L78529O52561O60012N06697L13991J55292Q2470J21492K12939K52578
13620d742588K08256J30575M9231n8253k14758m27500o66187q63864r69748r80026
13610h534862r38634q93932q35980p33375n67810l10269J8263L06462M62713N03778
$$ y = [-30882, -1213048, -2597395, -3918188, -4941360, -5646666, -6159059, -6621017, -7134688, -7705182, -8236066, -8628550, -8840336, -8917693, -9058702, -9468696, -10049111, -10422874, -10297586, -9636656, -8534767, -7073080, -5296229, -3283002, -1224313, 639559, 2182708, 3432134, 4433698, 5130872, 5398168, 5198469, 4672721, 4034716, 3403218, 2736629, 1908260, 807092, -609196, -2281997, -4061395, -5746116, -7106083, -7918328, -8079149, -7700620, -7048059, -6388047, -5881350, -5567359, -5412067, -5329597, -5208105, -4995166, -4742588, -4534332, -4403757, -4354526, -4412779, -4627537, -5055037, -5721224, -6585088, -7554836, -8534862, -9473496, -10367428, -11203408, -11936783, -12504593, -12814862, -12796599, -12490137, -12027424, -11523646]
13600a1523646M79023M03035L21300L21513M20537N73012P78802J068543J413487
13591e744394J710842J862670J845502J680501J381748R98252O64596N05337M71440
13582E376494L90524J79530j38938n29027q88355j063286r90215p24471l78372
13573A233884n0234K20818M46401O28851P40704P74861P54331P01012O28011N38815
13563F617454M14401K68275K00602K93475N26336Q22513J057721J078543Q21097
13554A2100417L76277o4369l20407l44792k24345o1828R4296J90390J79937J22043
13544A2047619P6208K397j00721j41358r4361n7898j41708l55196o05160q03094
13534I826728q99312q85241p53282m49026l3818K74589L79105M12088N06467O27464
$$ y = [-11523646, -11044623, -10641588, -10320288, -9998775, -9578238, -9005226, -8226424, -7157881, -5744394, -4033552, -2170882, -325380, 1355121, 2736869, 3735121, 4399717, 4905054, 5376494, 5767018, 5946548, 5807610, 5278583, 4390228, 3326942, 2336727, 1612256, 1233884, 1183650, 1404468, 1850869, 2479720, 3220424, 3995285, 4749616, 5450628, 6078639, 6617454, 7031855, 7300130, 7500732, 7794207, 8320543, 9143056, 10200777, 11279320, 12100417, 12476694, 12412325, 12091918, 11747126, 11522781, 11460953, 11555249, 11745639, 11925576, 12047619, 12123827, 12126224, 12025503, 11884145, 11789784, 11731886, 11590178, 11234982, 10629822, 9826728, 8927416, 8042175, 7288893, 6839867, 6806049, 7080638, 7459743, 7871831, 8378298, 9005762]
13524I005762O45931M87354K06537n4869j72415j14376O5462K66505L74580L62549
13514A1073020L42715L84149L33605l051n65168j099250j413570j468100j311176
13505F273174j059779q95677r07760r63129q69391n88945k19717R5377K58222
13496A122375L03020L55092M88184O43653P15288O70433N55637L96986J66491
13487E417159r2972k54117k75250k52357k79453l61449m54436m89609m04113j89275
13477B364128R6473L08550K88977O6206j74879l67607n72467p68652q79042q78331
13467e16644p44459m18239J02614O80479J139124J393440J440988J283337R14297
13458E274937M22598J7095j70094k15510k69758m14190o53887r41787j169838
$$ y = [9005762, 9651693, 10139047, 10345584, 10290715, 10118300, 10003924, 10069386, 10335891, 10710471, 11073020, 11415735, 11799884, 12133489, 12130438, 11565270, 10466020, 9052450, 7584350, 6273174, 5213395, 4317718, 3409958, 2446829, 1577438, 988493, 768776, 864153, 1122375, 1425395, 1780487, 2268671, 2912324, 3627612, 4298045, 4853682, 5250668, 5417159, 5324187, 5070070, 4794820, 4542463, 4263010, 3901561, 3447125, 2957516, 2553403, 2364128, 2460601, 2769151, 3058128, 3124334, 2949455, 2581848, 2009381, 1240729, 361687, -516644, -1261103, -1679342, -1576728, -896249, 242875, 1636315, 3077303, 4360640, 5274937, 5697535, 5714630, 5544536, 5329026, 5059268, 4645078, 3991191, 3049404, 1879566]
13449A879566j191846r58702o12750l60182k95197l83428n05356n31479m39655
13440c399029l00321j30318J09994L64374M61852K87794o3017l61769m65688m11989
13430c908117l26707k92756k56306r7919J83506M74119O73397P08293N28506J82160
13420b131824k04987n63222q94506j191815j416961j493962j320973q61007k14298
13411a0293555M14171Q07339Q36185N29381Q5600k37923l12240j73379P2906K92291
13401g979224L59091K57805J30120J38561K75195L80606L49726K08431K6904j35882
13391e988667k49556l45279m86467p08766r27288r30597o02854o6782M61281Q50863
13381h994112J062225J100498J031912R60228R16662Q19259N98023K75838q9843
$$ y = [1879566, 687720, -270982, -883732, -1243914, -1539111, -1922539, -2427895, -2959374, -3399029, -3699350, -3829668, -3719674, -3355300, -2893448, -2605654, -2668671, -3030440, -3496128, -3908117, -4234824, -4527580, -4783886, -4881805, -4698299, -4224180, -3550783, -2842490, -2313984, -2131824, -2336811, -2900033, -3794539, -4986354, -6403315, -7897277, -9218250, -10079257, -10293555, -9879384, -9072045, -8235860, -7706479, -7620879, -7858802, -8171042, -8344421, -8271515, -7979224, -7620133, -7362328, -7232208, -7093647, -6818452, -6437846, -6088120, -5879689, -5852785, -5988667, -6238223, -6583502, -7069969, -7778735, -8706023, -9636620, -10239474, -10306256, -9844975, -8994112, -7931887, -6831389, -5799477, -4839249, -3922587, -3103328, -2505305, -2229467, -2319310]
13372b319310m27016o25472n77649k72500K09016P60544J226222J412349J231193
13363F17377P73010J79971m31659q80489r74054p13623k88984J24999M48372O36442
13353e08638O68594N98169N41859N75992O62673P12112O72908M98598J80484j97758
13343D404993n24962p35637q30610q11038o35942l23084k6334O3510j73655o97563
13333b90322j233021j424433j169785o71585j64651K28567M72358N75291N67872
13324c109709M92825L85690K80184K19138K16982K32665K01355R3872n9586j86225
13314a232809j83301j6582J60651J91089J52341K37089M97751P97760R64688R24213
13304B492890P40314N41237M03566L24696K41499M6507l13685p10448r34249r23123
$$ y = [-2319310, -2746326, -3371798, -3949447, -4221947, -4012931, -3252387, -2026165, -613816, 617377, 1390387, 1570358, 1138699, 258210, -715844, -1429467, -1718451, -1593452, -1145080, -508638, 159956, 758125, 1299984, 1875976, 2538649, 3250761, 3923669, 4422267, 4602751, 4404993, 3880031, 3144394, 2313784, 1502746, 866804, 543720, 517386, 580896, 407241, -290322, -1523343, -2947776, -4117561, -4789146, -4953797, -4725230, -4252872, -3677581, -3109709, -2616884, -2231194, -1951010, -1731872, -1514890, -1282225, -1080870, -986998, -1046584, -1232809, -1416110, -1432692, -1272041, -1080952, -928611, -691522, -193771, 603989, 1568677, 2492890, 3233204, 3774441, 4178007, 4502703, 4744202, 4790709, 4477024, 3766576, 2832327, 1909204]
13294A909204p79565o32365n56430n69472o44420p05747o93170o23811n33741
13285c829517m25471k72015k3983L62437Q98078J498916J964113K113669J902886
13276D189113J415739Q24858K82645j70183n45857q52512j067105j118146r76985
13267A981567p21034m71920l10791k40881j64083O6994M63229Q49740J038086
13258B490907R95122Q39458P05137O30476N55280L98087J32130j48212k34358
13249F364027j5571L34778N02193L23396j03518n38683p78483q03860p56371p49293
13239C778615p76480p71908o88290n23164l63878l89881o81376j060431j263662
13230b740455j217583j009386p25399m44008k23005n8927P2270J95263L38190
$$ y = [1909204, 1129639, 497274, -59156, -628628, -1273048, -1978795, -2671965, -3295776, -3829517, -4254988, -4527003, -4550986, -4188549, -3290471, -1791555, 172558, 2286227, 4189113, 5604852, 6429710, 6712355, 6542172, 5996315, 5143803, 4076698, 2958552, 1981567, 1260533, 788613, 477822, 236941, 72858, 139852, 603081, 1452821, 2490907, 3486029, 4325487, 5030624, 5661100, 6216380, 6614467, 6746597, 6598385, 6364027, 6348456, 6683234, 7185427, 7508823, 7405305, 6866622, 6088139, 5284279, 4527908, 3778615, 3002135, 2230227, 1541937, 1018773, 654895, 265014, -416362, -1476793, -2740455, -3958038, -4967424, -5692823, -6136831, -6359836, -6418763, -6346493, -6151230, -5813040]
13221e813040M64852M69746K93890L6091j37869k07808l00102m76170o36932o40291
13211f947633m59446k44429j59406k41874m79737q31952j157361j304946j250652
13202a3077436j054625p42703l11475J83253O53591J042240J257608J186415Q72247
13193i990885N35350L58108L65320M78891O01032P17347Q97058J121579J224857
13184c691343J046257N85475K4450l85844n27895n09489n03140n27749m15958
13175d905236n8380L93713O43083N26295J44309k59767n01040n48933m67106l11732
13165e344794j29968l281J8778L02L7049R4146L1711j88868m72370p39876r50894
13154g648065j041038r34263o03731r3052N04004J045209J356786J313994R30579
$$ y = [-5813040, -5348188, -4878442, -4584552, -4548461, -4686330, -4894138, -5194240, -5670410, -6307342, -6947633, -7407079, -7651508, -7810914, -8052788, -8532525, -9364477, -10521838, -11826784, -13077436, -14132061, -14874764, -15186239, -15002986, -14349395, -13307155, -12049547, -10863132, -9990885, -9455535, -9097427, -8732107, -8253216, -7652184, -6934837, -6037779, -4916200, -3691343, -2645086, -2059611, -2035161, -2421005, -2948900, -3458389, -3961529, -4489278, -4905236, -4963616, -4569903, -3926820, -3400525, -3256216, -3515983, -4017023, -4565956, -5033062, -5344794, -5474762, -5478043, -5459265, -5458963, -5421914, -5327768, -5296057, -5484925, -5957295, -6697171, -7648065, -8689103, -9623366, -10227097, -10320149, -9816145, -8770936, -7414150, -6100156, -5169577]
13145e169577L47903k24529n70918n90421m01310k21610j03515K5569J21113P4274
13135f713021j14391l13235l55945k10606p333J52471K89442M42271O14170Q00797
13125e415380R57609J022693J017330J032482J073259J000901P10922K89748o8342
13116A621222k29659j61763R0346M23367P17409Q54237P16422K73221k93725o93552
13106C317525q37423r08523j078641j301006j400197j278284r79931o48436m62425
13097e577341m67145n31944n17836l36577J1900L61850M90104L42003O8251j39759
13087f296494j74281k1412K60761N53036P36143P80251P48702P21529P45525Q25561
13077a120679R08740R20342Q05819N42505J83069j60032l75102m41304m61180
$$ y = [-5169577, -4821674, -5046203, -5617121, -6207542, -6608852, -6830462, -6933977, -6908408, -6787295, -6713021, -6827412, -7140647, -7496592, -7707198, -7714531, -7562060, -7272618, -6830347, -6216177, -5415380, -4457771, -3435078, -2417748, -1385266, -312007, 688894, 1399816, 1689564, 1621222, 1391563, 1229800, 1320146, 1743513, 2460922, 3315159, 4031581, 4304802, 4011077, 3317525, 2480102, 1571579, 492938, -808068, -2208265, -3486549, -4466480, -5114916, -5577341, -6044486, -6576430, -7094266, -7430843, -7418943, -7057093, -6566989, -6224986, -6156735, -6296494, -6470775, -6492187, -6231426, -5678390, -4942247, -4161996, -3413294, -2691765, -1946240, -1120679, -211939, 708403, 1514222, 2056727, 2239796, 2079764, 1704662, 1263358, 802178]
13068H02178m91946m47738l39237l77480o37504q69376q05519m92195k06592j16823
13058c982232j41093j16674M2171K74175L62713J34922l28678p90148j069876
13049e614720j118913r74756o90704l27674J2334K49790M20278O06683Q25285
13040f612397J044180J245416J392868J389274J166835P72359L28277j6107j47399
13031E63306o6379J49360M26732O91018Q45641P90648M98163N0692m22260p59486
13021B767435p99354n51143k60699j72475l00958n19660p68350j008119j073328
13012b686651q42148m10853R4692N91976R20779R41926O98247L71140J01503q7952
13002c07341j98841k10113j11767Q7086L51707N92496P12938P23046O90865O39919
$$ y = [802178, 310232, -137506, -476743, -854223, -1491727, -2361103, -3166622, -3658817, -3865409, -3982232, -4123325, -4239999, -4197828, -3923653, -3560940, -3426018, -3754696, -4544844, -5614720, -6733633, -7708389, -8399093, -8726767, -8714433, -8464643, -8044365, -7437682, -6612397, -5568217, -4322801, -2929933, -1540659, -373824, 398535, 726812, 710705, 563306, 496927, 646287, 1073019, 1764037, 2609678, 3400326, 3898489, 3949181, 3526921, 2767435, 1968081, 1416938, 1156239, 983764, 682806, 163146, -605204, -1613323, -2686651, -3528799, -3939652, -3844960, -3252984, -2332205, -1390279, -692032, -320892, -219389, -307341, -506182, -716295, -828062, -740976, -389269, 203227, 916165, 1639211, 2330076, 2969995]
12992B969995N79118N32359N06177M95466M85295M30515L01564J49515M1772n2544
12982F439232k07048m00397n31421n15629l52814j52685m9269j07484l33725o61296
12972C127464r22825r40244o58420k09367J43345K15686N9546j11126q7132J62443
12962G79370M39012N02153K99693j2733k53327l53971l24012k21050j57377j69497
12952E28261j57010l5123J57437L42174M76613N38488N02945L35761Q6493j12573
12942B663466k20086l05152l66201k81721J0711L91285O35648N87838K57956j67479
12932C206265m31590m68612m47194m89213n05451l22371Q1875N01907P00087O16017
12922B441720L77207J84784K16730N12302Q99142J090879Q81867L10286l78476
$$ y = [2969995, 3549113, 4081472, 4587649, 5083115, 5568410, 5998925, 6300489, 6450004, 6491776, 6439232, 6232184, 5831787, 5300366, 4784737, 4431923, 4279238, 4229969, 4122485, 3788760, 3127464, 2204639, 1264395, 605975, 396608, 539953, 755639, 815185, 704059, 616927, 779370, 1218382, 1720535, 2020228, 2007495, 1754168, 1400197, 1076185, 855135, 697758, 528261, 371251, 336128, 493565, 835739, 1312352, 1850840, 2353785, 2689546, 2776039, 2663466, 2443380, 2138228, 1772027, 1490306, 1501017, 1892302, 2527950, 3115788, 3373744, 3206265, 2774675, 2306063, 1858869, 1369656, 864205, 541834, 623709, 1125616, 1825703, 2441720, 2818927, 3003711, 3220441, 3732743, 4631885, 5722764, 6604631, 6914917, 6536441]
12913F536441q94861j078326r81796p63972n60083m26435l01701r4168J48633
12904A583732K88467K58673Q1540j71714m05376n36236m94667k13293L05323R42870
12894A639319J532208J891984J879756J498959Q86587J95363m59438r22034r92434
12885G150270o22014l2151M45547O17513M83035J38323k41860m43416l70326j43433
12875F981488L6539J08631J39609J68541K07938L00331M21172M52556L52984J86076
12865I355865k5895k93220n32884o50296o98379p75350q56154q63034p98726p26984
12855C134943p12882q11865j025436j235878j265604j027430o04028j59283J83667
12846c523796L17219J41913k58203n91309o14084l45205k6598J28422J18056O9121
$$ y = [6536441, 5641580, 4563254, 3581458, 2817486, 2257403, 1830968, 1529267, 1435099, 1583732, 1872199, 2130872, 2212412, 2040698, 1635322, 1099086, 604419, 391126, 696449, 1639319, 3171527, 5063511, 6943267, 8442226, 9328813, 9524176, 9064738, 8142704, 7150270, 6528256, 6496105, 6941652, 7559165, 8042200, 8180523, 7938663, 7495247, 7124921, 6981488, 7018027, 7126658, 7266267, 7434808, 7642746, 7943077, 8364249, 8816805, 9169789, 9355865, 9329970, 9036750, 8503866, 7853570, 7155191, 6379841, 5523687, 4660653, 3861927, 3134943, 2422061, 1610196, 584760, -651118, -1916722, -2944152, -3548180, -3707463, -3523796, -3206577, -3064664, -3322867, -3914176, -4528260, -4873465, -4900063, -4771641, -4653585, -4584464]
12836d584464M7742L4988K1842L9877J40131L28024N24992O45956O53716N32355
12826a614841K89435Q836j71856j76264o2400P4836K24778L82642M84781M39844
12816a20209J68440k97073p48926r58160q90387o85792n17214m88477n97309p81556
12806e916663r41281r36115p20562m04577j17076J15084L84725P73317J219299
12797f543849J567868J695972J590951J376825J216820J161020J133738J011988
12789D211333P44163M30902J94921K8276j44243l35861m81402n07437m29288l45165
12779C366199l07281k90718k80651k76312k67822k70122l05094l79251m72366
12770E16582n20412m78819l94654l61380m22915n65953p20211p58860o24935l81695
$$ y = [-4584464, -4536722, -4501734, -4479892, -4440015, -4299884, -3971860, -3446868, -2800912, -2147196, -1614841, -1325406, -1316570, -1488426, -1664690, -1727090, -1652254, -1427476, -1044834, -560053, -120209, 48231, -248842, -997768, -1955928, -2846315, -3532107, -4049321, -4537798, -5135107, -5916663, -6857944, -7794059, -8514621, -8919198, -9036274, -8921190, -8536465, -7763148, -6543849, -4975981, -3280009, -1689058, -312233, 904587, 2065607, 3199345, 4211333, 4955496, 5386398, 5581319, 5609595, 5465352, 5129491, 4648089, 4140652, 3711364, 3366199, 3058918, 2768200, 2487549, 2211237, 1943415, 1673293, 1368199, 988948, 516582, -3830, -482649, -877303, -1238683, -1661598, -2227551, -2947762, -3706622, -4331557, -4713252]
12760d713252r4918J94631M12629M78441L80537K46156K88342N71770R26857J123135
12750a85672J051275P64309L97169R6762m0641n1376m0256m4055k9444N1915K29751
12739B199737M95043Q14138J102728J229093J151698R44324O93004M50272K28553
12730I308590O753k36079m76906o56684p19074o35638m10534r6071K40737N29220
12720F854314O61755N75397L15329j2307l04139n44375p72233r59233j045070
12711D769438j019889r03004p31382n56931m13980l33274l15545k68520q5567
12702A41346K27395N46254P14573O66175N14569M51635N37629O69663P40508P30152
12692E939899O68858N90986M98949L34555M3006l39203o94901r10381r38698p78825
$$ y = [-4713252, -4808170, -4613539, -4200910, -3722469, -3341932, -3095776, -2807434, -2235664, -1308807, -185672, 865603, 1629912, 2027081, 2123843, 2083202, 2031826, 1991570, 1947515, 1918071, 1969986, 2199737, 2694780, 3508918, 4611646, 5840739, 6992437, 7936761, 8629765, 9080037, 9308590, 9315343, 9079264, 8602358, 7945674, 7226600, 6590962, 6180428, 6084357, 6325094, 6854314, 7516069, 8091466, 8406795, 8394488, 8090349, 7545974, 6773741, 5814508, 4769438, 3749549, 2846545, 2115163, 1558232, 1144252, 810978, 495433, 226913, 141346, 368741, 914995, 1629568, 2295743, 2810312, 3261947, 3799576, 4469239, 5209747, 5939899, 6608757, 7199743, 7698692, 8033247, 8076253, 7737050, 7042149, 6131768, 5193070, 4414245]
12682D414245m67181j25935N4307n3484l75926o68450p47382o44966m88238l46859
12672E50131k44550k05599k29226k64813k58069k13851j90201k51166m16052n83043
12662b306439n72627l49059q8163K5083l2541j45101j91996j45772o6506k2536
12652c895657k4716l0686M766J10967K86814M78742O08743O43829N65587L26938
12642i24673n0114m09810n79590n47520m71000m77853n02842l94672j37901J55192
12632d340783M07635N81305O45883O23108N18602K91746J4032j21499l9738J54168
12622a265541L08248K88714J3789m69264r40343j121379q88419l99468K6919K10571
12612d236173K21578K06421K21772K40065K03639N3124j84738l56350l22307q9002
$$ y = [4414245, 3947064, 3821129, 3875436, 3821952, 3446026, 2777576, 2030194, 1385228, 896990, 550131, 305581, 99982, -129244, -394057, -652126, -865977, -1056178, -1307344, -1723396, -2306439, -2879066, -3228125, -3316288, -3291205, -3323746, -3468847, -3660843, -3806615, -3873121, -3895657, -3920373, -3951059, -3946293, -3835326, -3548512, -3069770, -2461027, -1817198, -1251611, -924673, -974787, -1384597, -1964187, -2511707, -2982707, -3460560, -3963402, -4358074, -4495975, -4340783, -3933148, -3351843, -2705960, -2082852, -1564250, -1272504, -1258472, -1379971, -1419709, -1265541, -957293, -668579, -654790, -1124054, -2064397, -3185776, -4074195, -4473663, -4446744, -4236173, -4014595, -3808174, -3586402, -3346337, -3142698, -3089574, -3274312, -3630662, -3952969, -4041971]
12602d041971J94371L38763L07387K34704K14128K47157L40215M87687O11280
12593a066279N93353L97431J06872j61716l00507k29452l010J87336K36087K15814
12583b4071J86336J52340J62963K54222L95283N11897N24923M10297K01647n7866
12573B717971l09995m91358n85365o10535n83089m95908l40115j67755q2764j40948
12563a089861k70405l42726k94177j15051J93990N75915R24656J162725J257980
12554B003046J199289R93149P00913L91021N1224l43138p05182q81434q33904
12545B574984o67550m71204k42964L3811K87282L94189L49072K76531K35190J53730
12535B923071l6465k92354m58316l92669j07396K53577N18051N72309M27718J84533
$$ y = [-4041971, -3847600, -3508837, -3201450, -2966746, -2752618, -2505461, -2165246, -1677559, -1066279, -472926, -75495, 31377, -130339, -430846, -660298, -663308, -475972, -239885, -24071, 162265, 314605, 477568, 731790, 1127073, 1638970, 2163893, 2574190, 2775837, 2717971, 2407976, 1916618, 1331253, 720718, 137629, -358279, -698394, -866149, -948913, -1089861, -1360266, -1702992, -1997169, -2112220, -1918230, -1342315, -417659, 745066, 2003046, 3202335, 4195484, 4896397, 5287418, 5338642, 4995504, 4290322, 3408888, 2574984, 1907434, 1436230, 1193266, 1227077, 1514359, 1908548, 2257620, 2534151, 2769341, 2923071, 2886606, 2594252, 2135936, 1743267, 1635871, 1889448, 2407499, 2979808, 3407526, 3592059]
12525C592059l5495j17327j0642K45173N61533Q52115J037858J015643P36752
12516G877669L15974m9355k18667j77503q1910j47399m29129q00048j100362j240161
$$ y = [3592059, 3556564, 3439237, 3428595, 3673768, 4235301, 5087416, 6125274, 7140917, 7877669, 8193643, 8144288, 7925621, 7748118, 7666208, 7518809, 7089680, 6289632, 5189270, 3949109]
$$ [...]
##END NTUPLES=NMR SPECTRUM
##END=
