##TITLE=31P ikalashn
DE-76H_2
12.12.2024
##JCAMPDX= 6.0         $$ Bruker NMR JCAMP-DX V2.0
##DATA TYPE= NMR SPECTRUM
##DATA CLASS= NTUPLES
##ORIGIN= UXNMR, Bruker Analytische Messtechnik GmbH
##OWNER= root
$$ TOPSPIN		Version 1.3
$$ 2024-12-12 14:59:37.703 +0400  Irina@DPX200
$$ Compression mode = diff/dup
##.OBSERVE FREQUENCY= 81.01967998063
##.OBSERVE NUCLEUS= ^31P
##.ACQUISITION MODE= SIMULTANEOUS
##.ACQUISITION SCHEME= undefined
##.AVERAGES= 64
##.DIGITISER RES= 17
##SPECTROMETER/DATA SYSTEM= spect
##.PULSE SEQUENCE= zgpg
##.SOLVENT NAME= D2O
##.SHIFT REFERENCE= INTERNAL, D2O, 1, 298.5841
##AUDIT TRAIL= $$ (NUMBER, WHEN, WHO, WHERE, WHAT)
$$ ##TITLE= Audit trail, TOPSPIN		Version 1.3
$$ ##JCAMPDX= 5.01
$$ ##ORIGIN= Bruker BioSpin GmbH
$$ ##OWNER= Irina
$$ $$ F:/spectra/data/iren/nmr/P31dec/1/pdata/1/auditp.txt
$$ ##AUDIT TRAIL=  $$ (NUMBER, WHEN, WHO, WHERE, VERSION, WHAT)
(   1,<2024-12-12 14:58:58.625 +0400>,<Irina>,<DPX200>,<TOPSPIN 1.3>,
      <created by zg
	started at 2024-12-12 14:57:15.265 +0400,
	POWCHK disabled, PULCHK disabled
       configuration hash MD5:
       BE 6D 3F 07 2A EA 11 49 91 17 2B D3 AF B3 58 0D
       data hash MD5: 32K
       09 02 AC EB 94 A4 25 D0 83 A2 36 4C AB F4 BD 20>)
(   2,<2024-12-12 14:58:59.828 +0400>,<Irina>,<DPX200>,<TOPSPIN 1.3>,
      <Start of raw data processing
       efp BC_mod = 2 LB = 12 FT_mod = 6 PKNL = 1 PHC0 = 30.77854 PHC1 = 385.5591 SI = 32K 
       data hash MD5: 32K
       3A 87 66 A7 6E 5C 85 C4 2F 88 46 B1 6B 71 62 EA>)
(   3,<2024-12-12 14:59:01.875 +0400>,<Irina>,<DPX200>,<TOPSPIN 1.3>,
      <apk 
       data hash MD5: 32K
       0E F1 0C BE FD 7F E2 73 D1 5C 3B FE 81 72 29 98>)
(   4,<2024-12-12 14:59:08.187 +0400>,<Irina>,<DPX200>,<TOPSPIN 1.3>,
      <pk fgphup PHC0 = 6 PHC1 = 0 
       data hash MD5: 32K
       A0 25 D7 01 B3 63 1A D3 2F 8D AC 85 E7 2B FF DC>)
(   5,<2024-12-12 14:59:09.890 +0400>,<Irina>,<DPX200>,<TOPSPIN 1.3>,
      <abs n ABSG = 5 
       data hash MD5: 32K
       8E E1 AF 72 B0 DA 2B 97 9E 23 6B B0 25 C2 24 68>)
(   6,<2024-12-12 14:59:24.734 +0400>,<Irina>,<DPX200>,<TOPSPIN 1.3>,
      <pk fgphup PHC0 = 38.47764 PHC1 = -67.2 
       data hash MD5: 32K
       7C E0 C7 62 4C A9 68 CA A2 B8 C0 17 D6 F6 C2 6C>)
(   7,<2024-12-12 14:59:26.234 +0400>,<Irina>,<DPX200>,<TOPSPIN 1.3>,
      <abs n ABSG = 5 
       data hash MD5: 32K
       6F 6A 5E 8B BE AA 4C A8 AD B5 E5 1B EC 83 84 02>)
$$ ##END=
$$ 
$$ $$ hash MD5
$$ $$ 46 58 6E 36 B0 85 4E 9F 3D 0F 7F 64 0F 8A 61 69
##$RELAX= 
##$RELAX= 
##$RELAX= 
##$RELAX= 
##$RELAX= 
##$RELAX= 
##$RELAX= 
##$RELAX= 
##$RELAX= 
##$RELAX= 
##$RELAX= 
$$ Bruker specific parameters
$$ --------------------------
##$DU= <F:/spectra>
##$EXPNO= 1
##$NAME= <P31dec>
##$PROCNO= 1
##$TYPE= <nmr>
##$USER= <iren>
##$AMP= (0..31)
100 100 100 100 100 100 100 100 100 100 100 100 100 100 100 100 100 100 
100 100 100 100 100 100 100 100 100 100 100 100 100 100 
##$ANAVPT= -1
##$AQSEQ= 0
##$AQ_mod= 1
##$AUNM= <au_zg>
##$AUTOPOS= <>
$$ [...]
##$SW_h= 37037.037037037
##$TD= 32768
##$TD0= 1
##$TE= 300
##$TE2= 300
##$TE3= 300
##$TEG= 300
##$TL= (0..7)
0 120 53 12 22 120 120 120 
##$TP= (0..7)
150 150 150 150 150 150 150 150 
##$TP07= 0
##$TPNAME0= <>
##$TPNAME1= <>
##$TPNAME2= <>
##$TPNAME3= <>
##$TPNAME4= <>
##$TPNAME5= <>
##$TPNAME6= <>
##$TPNAME7= <>
##$TPOAL= (0..7)
0.5 0.5 0.5 0.5 0.5 0.5 0.5 0.5 
##$TPOFFS= (0..7)
0 0 0 0 0 0 0 0 
##$TUNHIN= 0
##$TUNHOUT= 0
##$TUNXOUT= 0
##$USERA1= <user>
##$USERA2= <user>
##$USERA3= <user>
##$USERA4= <user>
##$USERA5= <user>
##$V9= 5
##$VALIST= <valist>
##$VCLIST= <CCCCCCCCCCCCCCC>
##$VD= 0
##$VDLIST= <DDDDDDDDDDDDDDD>
##$VPLIST= <PPPPPPPPPPPPPPP>
##$VTLIST= <TTTTTTTTTTTTTTT>
##$WBST= 1024
##$WBSW= 4
##$XGAIN= (0..3)
0 0 0 0 
##$XL= 0
##$YL= 0
##$YMAX_a= 4645
##$YMIN_a= -1690
##$ZGOPTNS= <>
##$ZL1= 120
##$ZL2= 120
##$ZL3= 120
##$ZL4= 120
##$ABSF1= 298.5841
##$ABSF2= -158.5842
##$ABSG= 5
##$ABSL= 5
##$ALPHA= 0
##$AQORDER= 0
##$ASSFAC= 0
##$ASSFACI= 0
##$ASSFACX= 0
##$ASSWID= 0
##$AUNMP= <proc_1d>
##$AXLEFT= 0
##$AXRIGHT= 0
##$AXTYPE= 0
##$AXUNIT= <>
##$AZFE= 0.1
##$AZFW= 0.5
##$BCFW= 0
##$BC_mod= 2
##$BYTORDP= 0
##$COROFFS= 0
##$CY= 12.5935478210449
##$DATMOD= 1
##$DC= 0
##$DFILT= <>
##$DTYPP= 0
##$F1P= 47.1127640792319
##$F2P= -24.0371245302204
##$FCOR= 0.5
##$FTSIZE= 32768
##$FT_mod= 6
##$GAMMA= 0
##$GB= 0
##$INTBC= 1
##$INTSCL= 7.269226e-011
##$ISEN= 30
##$LB= 12
##$LEV0= 0
##$LPBIN= 0
##$MAXI= 12.09355
##$MC2= 0
##$MEAN= 0
##$ME_mod= 0
##$MI= 0.7550151
##$NCOEF= 0
##$NC_proc= -12
##$NLEV= 6
##$NOISF1= 298.5841
##$NOISF2= 270.0111
##$NSP= 0
##$NTH_PI= 0
##$NZP= 0
##$OFFSET= 298.5841
##$PC= 1.4
##$PHC0= 54.4441
##$PHC1= 353.6201
##$PH_mod= 1
##$PKNL= yes
##$PPARMOD= 0
##$PPDIAG= 0
##$PPIPTYP= 0
##$PPMPNUM= 100
##$PPRESOL= 1
##$PSCAL= 0
##$PSIGN= 0
##$REVERSE= no
##$SF= 81.014009
##$SI= 32768
##$SIGF1= 270.0111
##$SIGF2= -158.5842
##$SINO= 77.54984
##$SIOLD= 32768
##$SREGLST= <31P.CDCl3>
##$SSB= 0
##$STSI= 32768
##$STSR= 0
##$SW_p= 37037.037037037
##$SYMM= 0
##$S_DEV= 0
##$TDeff= 32768
##$TDoff= 0
##$TI= <>
##$TILT= no
##$TM1= 0
##$TM2= 0
##$TOPLEV= 0
##$USERP1= <user>
##$USERP2= <user>
##$USERP3= <user>
##$USERP4= <user>
##$USERP5= <user>
##$WDW= 1
##$XDIM= 32768
##$YMAX_p= 444195180
##$YMIN_p= -13884354
$$ End of Bruker specific parameters
$$ ---------------------------------
##NTUPLES= NMR SPECTRUM
##VAR_NAME=  FREQUENCY,     SPECTRUM/REAL,   SPECTRUM/IMAG
##SYMBOL=    X,             R,               I
##VAR_TYPE=  INDEPENDENT,   DEPENDENT,       DEPENDENT
##VAR_FORM=  AFFN,          ASDF,            ASDF
##VAR_DIM=   32768,         32768,           32768
##UNITS=     HZ,            ARBITRARY UNITS, ARBITRARY UNITS
##FACTOR=    1.13031516577767, 1,            1
##FIRST=     37037.037037037, 4082167,       11333356
##LAST=      0,             -126840,         -917717
##MIN=       0,             -13884354,       0
##MAX=       37037.037037037, 444195180,     0
$$ Real data points
##PAGE= N=1
##DATA TABLE= (X++(R..R)), XYDATA
$$ [...]
16465D830341O96793L09977j87031p88272j371800j732726j739274j447126j025432
$$ 4830341 5527134 5837111 5650080 4861808 3490008 1757282 18008 -1429118 -2454550
16456b454550n97441j92821J81596M83797O54717O67763N52578L76605J99445
$$ -2454550 -3051991 -3244812 -3063216 -2579419 -1924702 -1256939 -704361 -327756 -128311
16447a28311M5984p5944j54907j84720j77720j54562j29585j20138j48997k15431
$$ -128311 -82327 -158271 -313178 -497898 -675618 -830180 -959765 -1079903 -1228900 -1444331
16437a444331k85901l38030l89816m64969n48428n86574n27725l63245j25903
$$ -1444331 -1730232 -2068262 -2458078 -2923047 -3471475 -4058049 -4585774 -4949019 -5074922
16428e074922J31846L41957M51652M72230M53713M11650L16916J56105k2565j24080
$$ -5074922 -4943076 -4601119 -4149467 -3677237 -3223524 -2811874 -2494958 -2338853 -2361418 -2485498
16418b485498p3779J06994L06703M20982M20751L28254J76430M355j46080k41692
$$ -2485498 -2559277 -2452283 -2145580 -1724598 -1303847 -975593 -799163 -794808 -940888 -1182580
16408a182580k60307k07085j30654q9413r6217j10493q4463j1487O5985R1518
$$ -1182580 -1442887 -1649972 -1780626 -1870039 -1966256 -2076749 -2161212 -2172699 -2106714 -2015196
16398b015196M8707j9837o1464p1780r0124j63710l23450n48401p53437q40402
$$ -2015196 -1966489 -1986326 -2047790 -2119570 -2209694 -2373404 -2696854 -3245255 -3998692 -4839094
16388d839094p42962m45249j2080M27934P71810R97967J138430J231273J308777
$$ -4839094 -5582056 -6027305 -6039385 -5611451 -4839641 -3841674 -2703244 -1471971 -163194
16379a63194J404099J520185J587127J500793J215364P80517L02755j10585l83786
$$ -163194 1240905 2761090 4348217 5849010 7064374 7844891 8147646 8037061 7653275
16370G653275m86406m35795k88919j22091K505O5731Q2831O3974j768j23325k95999
$$ 7653275 7166869 6731074 6442155 6320064 6322569 6388300 6471131 6535105 6533337 6410012 6114013
16359F114013n19238p90877j070170j271690j315647j189365r45466o47661l43333
$$ 6114013 5594775 4803898 3733728 2462038 1146391 -42974 -988440 -1636101 -1979434
16350a979434o1082J97511M43647O53891P47785O44331L53519l355k81312m18174
$$ -1979434 -2040516 -1843005 -1399358 -745467 2318 646649 1000168 996813 715501 297327
16340B97327m36142l60366k07637m6157J9393n6324k06698l07693k78793j28888
$$ 297327 -138815 -499181 -706818 -752975 -733582 -789906 -996604 -1304297 -1583090 -1711978
16330a711978P1483K33641K89079K28391J00814l7399j68010l01760m32497n21772
$$ -1711978 -1640495 -1406854 -1117775 -889384 -788570 -825969 -993979 -1295739 -1728236 -2250008
16320b250008n26616m24452k32435j0648J82566L33772M67740O21634Q25433J078694
$$ -2250008 -2776624 -3201076 -3433511 -3444159 -3261593 -2927821 -2460081 -1838447 -1013014 65680
16310F5680J324608J445614J314122R04991L71193n2639k29688j86177n5284J9438
$$ 65680 1390288 2835902 4150024 5055015 5426208 5373569 5143881 4957704 4902420 4921858
16300D921858k8212j60115k87118l53102l74444m02189m55464m99174m93028m48813
$$ 4921858 4893646 4733531 4446413 4093311 3718867 3316678 2861214 2362040 1869012 1420199
16290A420199m11818m05912m24236m46727m38476l55047j85899J9140J81146K38020
$$ 1420199 1008381 602469 178233 -268494 -706970 -1062017 -1247916 -1228776 -1047630 -809610
16280h09610J69831o80k29047m60771o31146o87775o30252n15453m08237l32290
$$ -809610 -639779 -640459 -869506 -1330277 -1961423 -2649198 -3279450 -3794903 -4203140 -4535430
16270d535430k64974j60372J4873K48885M85884O68088P76315Q20267Q11901P68899
$$ -4535430 -4800404 -4960776 -4945903 -4697018 -4211134 -3543046 -2766731 -1946464 -1134563 -365664
16260c65664P07684O12296M52401K51546R8813P5067J81819L41411M54341M51298
$$ -365664 342020 954316 1406717 1658263 1757076 1832143 2013962 2355373 2809714 3261012
16250C261012L10148N8507k32438m74763n99514n97014n37341n13208n54437o30361
$$ 3261012 3571160 3629667 3397229 2922466 2322952 1725938 1188597 675389 120952 -509409
16240e09409p06122p53584p51385p08128o52282n83456m47198j72315K50708P32320
$$ -509409 -1215531 -1969115 -2720500 -3428628 -4080910 -4664366 -5111564 -5283879 -5033171 -4300851
16230d300851J133586J344673J324750J103094P52343L47094n5015m07007o73977
$$ -4300851 -3167265 -1822592 -497842 605252 1357595 1704689 1649674 1242667 568690
16221E68690q43343r20497r11994q12251o10312l26823l5347J84354L04379L45555
$$ 568690 -274653 -1195150 -2107144 -2919395 -3529707 -3856530 -3891877 -3707523 -3403144 -3057589
16211c057589L50030L61616L81407L43533J82822p7539l36783n00988n34482m56017
$$ -3057589 -2707559 -2345943 -1964536 -1621003 -1438181 -1515720 -1852503 -2353491 -2887973 -3343990
16201c343990l21617j99246j24933p8052j7762O3454J43913K13790K85731L67996
$$ -3343990 -3665607 -3864853 -3989786 -4067838 -4085600 -4022146 -3878233 -3664443 -3378712 -3010716
16191c010716M41638M69594M29819L40442K37050J27076L144j07422j49849q6143
$$ -3010716 -2569078 -2099484 -1669665 -1329223 -1092173 -965097 -961953 -1069375 -1219224 -1305367
16181a305367R0687L52932O25844Q11426Q55815P82907O46640M77930K91677J11743
$$ -1305367 -1214680 -861748 -235904 575522 1431337 2214244 2860884 3338814 3630491 3742234
16171C742234k5692r6432j16643j34755j96523l18676m79197o30468p39080q05831
$$ 3742234 3716542 3620110 3503467 3368712 3172189 2853513 2374316 1743848 1004768 198937
16161A98937q36570q14639p10886n05539k04294J51471M92887P52927Q89600Q88384
$$ 198937 -637633 -1452272 -2163158 -2668697 -2872991 -2721520 -2228633 -1475706 -586106 302278
16151C02278P68705N95484M47037L53868K93936K47252K23050K27728K34487K02936
$$ 302278 1070983 1666467 2113504 2467372 2761308 3008560 3231610 3459338 3693825 3896761
16141C896761J14945j2869j39921k31780k85848l18839l31488k93917j68793M4840
$$ 3896761 4011706 3998837 3858916 3627136 3341288 3022449 2690961 2397044 2228251 2273091
16131B273091K88689M68335N00989L61942J09438j38545k67880k31518p3484J01556
$$ 2273091 2561780 3030115 3531104 3893046 4002484 3863939 3596059 3364541 3291057 3392613
16121C392613J85664J17519r1558l63777n97920p33956p88736q19698q53071q58712
$$ 3392613 3578277 3695796 3604238 3240461 2642541 1908585 1119849 300151 -552920 -1411632
16111a411632p91849o51190m94095l90053l61219l73915l75940l36011k58864
$$ -1411632 -2203481 -2854671 -3348766 -3738819 -4100038 -4473953 -4849893 -5185904 -5444768
16102e444768j65099o1582M8812J32228J38253O6154n580K5927J93071M13993
$$ -5444768 -5609867 -5671449 -5622637 -5490409 -5352156 -5286002 -5291582 -5265655 -5072584 -4658591
16092d658591N60315N66138M52155K71343P1256j00397j97866k02682j28872j982
$$ -4658591 -4098276 -3532138 -3079983 -2808640 -2737384 -2837781 -3035647 -3238329 -3367201 -3369183
16082c369183J49964K90467L75171L67644K59223O6952j83348m57707p10443q99080
$$ -3369183 -3219219 -2928752 -2553581 -2185937 -1926714 -1859762 -2043110 -2500817 -3211260 -4110340
16072d110340j004989j037009j011533r30259p79780n59719l17213j25216r603
$$ -4110340 -5115329 -6152338 -7163871 -8094130 -8873910 -9433629 -9750842 -9876058 -9885661
16063i885661O6803J46528K40452L38606M28366M87631M78460L80721K26456Q3732
$$ -9885661 -9818858 -9672330 -9431878 -9093272 -8664906 -8177275 -7698815 -7318094 -7091638 -7007906
16053g007906M467p080J6290M1710P4513J46079K56752L60599M17760M32596M27460
$$ -7007906 -7003439 -7010519 -6994229 -6952519 -6878006 -6731927 -6475175 -6114576 -5696816 -5264220 -4836760
16042d836760M06100L55103K66727J52147L4993n0990o1417K3945J67392L00853
$$ -4836760 -4430660 -4075557 -3808830 -3656683 -3621690 -3672680 -3734097 -3710152 -3542760 -3241907
16032c241907L82326M14002M14035L88818L38851K82342K61692L12132M16671
$$ -3241907 -2859581 -2445579 -2031544 -1642726 -1303875 -1021533 -759841 -447709 -31038
16023c1038N11173N42789N12507M59304M07496L39771K20874L2739k04639m24419
$$ -31038 480135 1022924 1535431 1994735 2402231 2742002 2962876 2995615 2790976 2366557
16013B366557n34055m78457k95873r6736J7897J6400o4125j60708k36632l04118
$$ 2366557 1832502 1354045 1058172 961436 979333 995733 931608 770900 534268 230150
16003B30150l87012m71826n18813n00378m12227k75463j31215p357R9728J92351
$$ 230150 -156862 -628688 -1147501 -1647879 -2060106 -2335569 -2466784 -2474141 -2374413 -2182062
15993b182062K41895K13582J11104j3849j02263j37068j33241r4732j6554R4899
$$ -2182062 -1940167 -1726585 -1615481 -1629330 -1731593 -1868661 -2001902 -2096634 -2113188 -2018289
15983b018289K35270M14955O36279Q60665J019447J066354J008994Q96801P74848
$$ -2018289 -1783019 -1368064 -731785 128880 1148327 2214681 3223675 4120476 4895324
15974D895324O42709M67316K27631n8023l37009n47894o49357o37065n34360l82191
$$ 4895324 5538033 6005349 6232980 6174957 5837948 5290054 4640697 4003632 3469272 3087081
15964C087081k44396j85793k25751l31804m62205n96276p26157q39706r21870
$$ 3087081 2842685 2656892 2431141 2099337 1637132 1040856 314699 -525007 -1446877
15955a446877r66443r73147r34562q40306o88706m83694k24485Q7387M16457O82740
$$ -1446877 -2413320 -3386467 -4321029 -5161335 -5850041 -6333735 -6558220 -6470833 -6054376 -5371636
15945e371636Q10282P87332O59887M73332K52546L1040j40892k25310k23448j72994
$$ -5371636 -4561354 -3774022 -3114135 -2640803 -2388257 -2357217 -2498109 -2723419 -2946867 -3119861
15935c119861j11710l9723P4248K48639M50594O07054O58328N94600M41022K15375
$$ -3119861 -3231571 -3271294 -3197046 -2948407 -2497813 -1890759 -1232431 -637831 -196809 18566
15925A8566p2359l71430n89691o72074o56016o34259o77802p94579r26677r77779
$$ 18566 -53793 -425223 -1014914 -1686988 -2343004 -2977263 -3655065 -4449644 -5376321 -6354100
15915f354100q85348o72261m10745j47315J23965M26410P59639J085600J328411
$$ -6354100 -7239448 -7911709 -8322454 -8469769 -8345804 -7919394 -7159755 -6074155 -4745744
15906d745744J398780J250259R22471N19752J27012k36051n62385q10910r40943
$$ -4745744 -3346964 -2096705 -1174234 -654482 -527470 -763521 -1325906 -2136816 -3077759
15897c077759r57793r04611q25253p41097o52596n60437m73145l82062k60807
$$ -3077759 -4035552 -4940163 -5765416 -6506513 -7159109 -7719546 -8192691 -8574753 -8835560
15888h835560j07837M9144K04996L91070O15529Q17713R09339Q65303P64870P20760
$$ -8835560 -8943397 -8894253 -8689257 -8298187 -7682658 -6864945 -5955606 -5090303 -4325433 -3604673
15878c604673P69109Q46259Q58401P61706N84142L79614J80903N006j22816j76884
$$ -3604673 -2835564 -1989305 -1130904 -369198 214944 594558 775461 780467 657651 480767
15868D80767j57435r1250j3417M1384N3809L3933Nm1478p8798q3688l2123Q0291
$$ 480767 323332 232082 218665 260049 313858 347791 347796 306318 227520 143832 111709 192000
15856A92000K40944M06406N05066M94832L98848K64544J13536m5028j76415k23331
$$ 192000 432944 839350 1344416 1839248 2238096 2502640 2616176 2571148 2394733 2171402
15846B171402j47202K2615J83986K34054J50280j2826j97811l91725n91425p48031
$$ 2171402 2024200 2046815 2230801 2464855 2615135 2602309 2404498 2012773 1421348 673317
15836F73317p78628o34336l52783m8686J57169K13864J56481O1123j9209q8238
$$ 673317 -105311 -739647 -1092430 -1141116 -983947 -770083 -613602 -552479 -571688 -659926
15826f59926j78073k94281l97958m32271l52399j47752J26786L50974M17681L30945
$$ -659926 -837999 -1132280 -1530238 -1962509 -2314908 -2462660 -2335874 -1984900 -1567219 -1236274
15816a236274J99643J22711J03646Q6126L9319k8080j06262j91737k76662l56855
$$ -1236274 -1036631 -913920 -810274 -724148 -684829 -712909 -819171 -1010908 -1287570 -1644425
15806a644425m32418m87435m91735m34925l31932j85993R612K27468M16196N55960
$$ -1644425 -2076843 -2564278 -3056013 -3490938 -3822870 -4008863 -3999251 -3771783 -3355587 -2799627
15796b799627O69880P79201Q70134R09418Q76766P81233O46933M82364K85998
$$ -2799627 -2129747 -1350546 -480412 429006 1305772 2087005 2733938 3216302 3502300
15787C502300Q1462q8007j97006k49560k67213k79448l09250l43950l31768k30026
$$ 3502300 3583762 3495755 3298749 3049189 2781976 2502528 2193278 1849328 1517560 1287534
15777A287534m9683J56987L42558M86635N75683N84513M93536L15333J01618p3902
$$ 1287534 1237851 1394838 1737396 2224031 2799714 3384227 3877763 4193096 4294714 4220812
15767D220812j58277j60301j46517j81796k60962l10124k58572j00843J11831
$$ 4220812 4062535 3902234 3755717 3573921 3312959 3002835 2744263 2643420 2755251
15758B755251L28193N17469O35059O16069M36935J64426r1911k68425l65314m06044
$$ 2755251 3083444 3600913 4235972 4852041 5288976 5453402 5361491 5093066 4727752 4321708
15748D321708m02690l44240k27758j06453p1347j69466l56962n38602o46032o72846
$$ 4321708 3919018 3574778 3347020 3240567 3169220 2999754 2642792 2104190 1458158 785312
15738G85312o41064n63685m42426k75610p2033J37478L11933M24718M72574M59435
$$ 785312 144248 -419437 -861863 -1137473 -1209506 -1072028 -760095 -335377 137197 596632
15728E96632L84747K65616J53224R8906J13184J65979K13450K27644K10274J84596
$$ 596632 981379 1246995 1400219 1499125 1612309 1778288 1991738 2219382 2429656 2614252
15718B614252J72370J70090J52357Q8536m4279k35505m34528n91462o97429p79280
$$ 2614252 2786622 2956712 3109069 3197605 3153326 2917821 2483293 1891831 1194402 415122
15708D15122q48046q58806p51120n20890k31484K2505J59872J68498J25009J22554
$$ 415122 -432924 -1291730 -2042850 -2563740 -2795224 -2772719 -2612847 -2444349 -2319340 -2196786
15698b196786J85673K73276L30034L10803J86537l3995k87823m88339n81092n71797
$$ -2196786 -2011113 -1737837 -1407803 -1097000 -910463 -944458 -1232281 -1720620 -2301712 -2873509
15688b873509n09066m39185l73542k88451j47207O5769L18228N44450O92391P44221
$$ -2873509 -3382575 -3821760 -4195302 -4483753 -4630960 -4565191 -4246963 -3702513 -3010122 -2265901
15678b265901P06319O09237N08013M48307M26755M06045L59530K89156K20263
$$ -2265901 -1559582 -950345 -442332 5975 432730 838775 1198305 1487461 1707724
15669A707724J77126J53875J18863L9109r5293k44448l34937l28920k57423j81992
$$ 1707724 1884850 2038725 2157588 2196697 2101404 1856956 1522019 1193099 935676 753684
15659G53684j42862j33215j12931o3283j8527k0090o4194j18716j56246j49695
$$ 753684 610822 477607 364676 301393 282866 262776 198582 79866 -76380 -226075
15649b26075p2199P1013K15976K62547J43010j17716m03223n80007n84490m41669
$$ -226075 -298274 -227261 -11285 251262 394272 276556 -126667 -706674 -1291164 -1732833
15639a732833k24785q483J61928K64143K73099J72136j5745k37873m48855o15394
$$ -1732833 -1957618 -1966101 -1804173 -1540030 -1266931 -1094795 -1110540 -1348413 -1797268 -2412662
15629b412662o98782o62469m97535k35659O4871L57827O16545P87354P88725N96956
$$ -2412662 -3111444 -3773913 -4271448 -4507107 -4442236 -4084409 -3467864 -2680510 -1891785 -1294829
15619a294829K90862m978j87914k04339n8555J91458M62388O81352Q05243Q30947
$$ -1294829 -1003967 -1008945 -1196859 -1401198 -1459753 -1268295 -805907 -124555 680688 1511635
15609A511635P93918P29377O28975M54343J82715j70098n45036q54666j032376
$$ 1511635 2305553 3034930 3663905 4118248 4300963 4130865 3585829 2731163 1698787
15600A698787j071276j003465q65317o97191n43228m33607l69945l25415k68376
$$ 1698787 627511 -375954 -1241271 -1938462 -2481690 -2915297 -3285242 -3610657 -3879033
15591c879033j83035o6543O1797J52743J71178J43783J25885J29625J25710J04582
$$ -3879033 -4062068 -4128611 -4066814 -3914071 -3742893 -3599110 -3473225 -3343600 -3217890 -3113308
15581c113308Q9074R7489J21927J23908N7624o5941j59131j34787M774J70406
$$ -3113308 -3024234 -2926745 -2804818 -2680910 -2623286 -2689227 -2848358 -2983145 -2978371 -2807965
15571b807965K79677L25518L37934L12015K11339K0237k33323m83561o43764o37523
$$ -2807965 -2528288 -2202770 -1864836 -1552821 -1341482 -1321245 -1554568 -2038129 -2681893 -3319416
15561c319416m30750n3430L93585P64101R31786Q65586O48648M08357K30771J40116
$$ -3319416 -3750166 -3803596 -3410011 -2645910 -1714124 -848538 -199890 208467 439238 579354
15551E79354J18230J31915J65530K16980K60523K48004J48782k9610k48694m48638
$$ 579354 697584 829499 995029 1212009 1472532 1720536 1869318 1839708 1591014 1142376
15541A142376n72327o04308n64149m71620l64056l14797l69069m80110n49196
$$ 1142376 570049 -34259 -598408 -1070028 -1434084 -1748881 -2117950 -2598060 -3147256
15532c147256n18226m04544k53131p7687J34959L75285N91522P25930P57540P04314
$$ -3147256 -3665482 -4070026 -4323157 -4400844 -4265885 -3890600 -3299078 -2573148 -1815608 -1111294
15522a111294N91549M28498K19000j7212k46130m33619n37818n09930l40528r3917
$$ -1111294 -519745 -91247 127753 110541 -135589 -569208 -1107026 -1616956 -1957484 -2051401
15512b051401J27663K55984K99474L17213L45434L67211L59035L32303L13955
$$ -2051401 -1923738 -1667754 -1368280 -1051067 -705633 -338422 20613 352916 666871
15503F66871L09360L00886K79133K58685K58181K73698K78178K51398J98645J25805
$$ 666871 976231 1277117 1556250 1814935 2073116 2346814 2624992 2876390 3075035 3200840
15493C200840J4069j50732l31650m49149m43008l24081j67746o6572q5637k32007
$$ 3200840 3214909 3064177 2732527 2283378 1840370 1516289 1348543 1281971 1196334 964327
15483I64327m42302o15429o68397n69382l53489j06507R2842K03429K09646J27712
$$ 964327 522025 -93404 -761801 -1331183 -1684672 -1791179 -1698337 -1494908 -1285262 -1157550
15473a157550K0805l5736k7984k2695q6724j96595k51032j70121L8072K93749
$$ -1157550 -1136745 -1172481 -1200465 -1223160 -1309884 -1506479 -1757511 -1927632 -1889560 -1595811
15463a595811M98055N89550N64890M50310K83043J09211l0931j11351j14005k4564
$$ -1595811 -1097756 -508206 56684 506994 790037 899248 868317 756966 642961 618397
15453F18397J59888M07396O49596Q24189Q98046Q50291O75973M09042J02997k15368
$$ 618397 778285 1185681 1835277 2659466 3557512 4407803 5083776 5492818 5595815 5380447
15443E380447n37363q24874j022571j121576j170248j213320j246850j234490
$$ 5380447 4843084 4018210 2995639 1874063 703815 -509505 -1756355 -2990845
15435b990845j143102r54852o63686k97526O1356L17667M26981M17276L52469
$$ -2990845 -4133947 -5088799 -5752485 -6050011 -5988655 -5670988 -5244007 -4826731 -4474262
15426d474262K66898J59657O0505M3189J43005K98556M06419M08687L13483J63566
$$ -4474262 -4207364 -4047707 -3987202 -3944013 -3801008 -3502452 -3096033 -2687346 -2373863 -2210297
15416b210297P436j11018j62809j47307r5009n6208o9017j33364k18310k73034
$$ -2210297 -2202861 -2313879 -2476688 -2623995 -2719004 -2775212 -2844229 -2977593 -3195903 -3468937
15406c468937k52178j66138p9556m6865p1495j24225j77367k06398j75806o5672
$$ -3468937 -3721115 -3887253 -3966809 -4013674 -4085169 -4209394 -4386761 -4593159 -4768965 -4834637
15396d834637R4368K55677L94001M93205N17885M38742K79824J15971J8985P193
$$ -4834637 -4740269 -4484592 -4090591 -3597386 -3079501 -2640759 -2360935 -2244964 -2225979 -2218786
15386b218786L4575K8222n8772k23850m17686n56832n52079l54789k757L85006
$$ -2218786 -2184211 -2155989 -2214761 -2438611 -2856297 -3413129 -3965208 -4319997 -4322754 -3937748
15376c937748O92777Q91550J025862J131971J189872J150301R86237P16246L95794
$$ -3937748 -3244971 -2353421 -1327559 -195588 994284 2144585 3130822 3847068 4242862
15367D242862R3444j31864k52672k89206k86188k61289j95809p5854Q1747K42813
$$ 4242862 4336306 4204442 3951770 3662564 3376376 3115087 2919278 2843424 2925171 3167984
15357C167984L61944L74773K28701o0133l97517o68998q10705q34383p88750p05086
$$ 3167984 3529928 3904701 4133402 4073269 3675752 3006754 2196049 1361666 572916 -132170
15347a32170n99963n10064m78956n13199n78952o41275o90243p23561p13907o13902
$$ -132170 -732133 -1242197 -1721153 -2234352 -2813304 -3454579 -4144822 -4868383 -5582290 -6196192
15337f196192m00715j00015K35343N46018P69287Q62256Q33926P42797O64574
$$ -6196192 -6596907 -6696922 -6461579 -5915561 -5146274 -4284018 -3450092 -2707295 -2042721
15328b042721O54086P12824P79926P79091O87898N38078L58707J45652j21683
$$ -2042721 -1388635 -675811 104115 883206 1571104 2109182 2467889 2613541 2491858
15319B491858m30810p03380q51438q62402p99458p35304o97180o59383n76303
$$ 2491858 2061048 1357668 506230 -356172 -1155630 -1890934 -2588114 -3247497 -3823800
15310c823800m25406k30554m1775J12123K35270L39710M35416N22501N72236N50549
$$ -3823800 -4249206 -4479760 -4521535 -4409412 -4174142 -3834432 -3399016 -2876515 -2304279 -1753730
15300a753730M71785L91934L54725L63390L92504M22438M53648M88622N14272
$$ -1753730 -1281945 -890011 -535286 -171896 220608 643046 1096694 1585316 2099588
15291B099588N03216M32998L04039J44175Q738m0766J3790J23253K02700J81832
$$ 2099588 2602804 3035802 3339841 3484016 3492754 3451988 3465778 3589031 3791731 3973563
15281C973563L9849j88979m36520o33314p38757p45793o57967m76038k24695J3176
$$ 3973563 4013412 3824433 3387913 2754599 2015842 1270049 612082 136044 -88651 -75475
15271g5475J22092L7802k00335m86613p24899q64189q88363q04092o39911m37994
$$ -75475 46617 84419 -115916 -602529 -1327428 -2191617 -3079980 -3884072 -4523983 -4961977
15261d961977k42169r6124k3814J0689Q5506K29358L75368M29036L61631K19163
$$ -4961977 -5204146 -5300270 -5324084 -5313395 -5227889 -4998531 -4623163 -4194127 -3832496 -3613333
15251c613333N9540q6380j98699k64380l07484l77721m95861o43477p98336r47144
$$ -3613333 -3553793 -3640173 -3838872 -4103252 -4410736 -4788457 -5284318 -5927795 -6726131 -7673275
15241g673275j059812j071539r13197n73743j26870L09886O31744P83993P85164
$$ -7673275 -8733087 -9804626 -10717823 -11291566 -11418436 -11108550 -10476806 -9692813 -8907649
15232h907649P19920O93821P75711R48899J108119J144876J049482Q98629P53336
$$ -8907649 -8187729 -7493908 -6718197 -5769298 -4661179 -3516303 -2466821 -1568192 -814856
15223h14856O21133N02773M02871K96323J52946m288j16009j49106j13156l7086
$$ -814856 -193723 309050 711921 1008244 1161190 1156902 1040893 891787 778631 741545
15213G41545N0025J28431K00361K80307L55218L79224L16877J78515K4299o4700
$$ 741545 791570 920001 1120362 1400669 1755887 2135111 2451988 2630503 2654802 2590102
15203B590102l8383Q7475K41607L48742L86556L81007L53153L06350K36440J18804
$$ 2590102 2551719 2639194 2880801 3229543 3616099 3997106 4350259 4656609 4893049 5011853
15193E011853p6076l29862n65316p10480p75358q34923r23564r79368r02985o58674
$$ 5011853 4935777 4605915 4040599 3330119 2554761 1719838 796274 -183094 -1086079 -1744753
15183a744753l23017l6219J10956J39347J22737R9028O3948J3204n1566j39600
$$ -1744753 -2067770 -2103989 -1993033 -1853686 -1730949 -1631921 -1567973 -1554769 -1606335 -1745935
15173a745935k61099m00899n12879n39267m45979k67856j04968l1731k3496K294
$$ -1745935 -2007034 -2407933 -2920812 -3460079 -3906058 -4173914 -4278882 -4310613 -4334109 -4331815
15163d331815R9022K51965L89788M31803L50473J85131m757j72287k71634k57915
$$ -4331815 -4232793 -3980828 -3591040 -3159237 -2808764 -2623633 -2628390 -2800677 -3072311 -3330226
15153c330226j25718P3200K69165M19587N11302N42221N22468M84184M70060M99141
$$ -3330226 -3455944 -3382744 -3113579 -2693992 -2182690 -1640469 -1118001 -633817 -163757 335384
15143C35384N47417N74772N68706N45850N27933N45204O23479P34441P99174P59109
$$ 335384 882801 1457573 2026279 2572129 3100062 3645266 4268745 5003186 5802360 6561469
15133F561469O20121M31818K44409Q6887k2100p2376r6364j76139l75857o69572
$$ 6561469 7181590 7613408 7857817 7944704 7922604 7850228 7753864 7577725 7201868 6532296
15123F532296r58538j145641j180877j068601q56797o11681l84122j85841P56
$$ 6532296 5573758 4428117 3247240 2178639 1321842 710161 326039 140198 140954
15114A40954J77515L08742L57549L27048K54476J67197N5245j02827l00255n02660
$$ 140954 318469 627211 984760 1311808 1566284 1733481 1788726 1685899 1385644 882984
15104H82984o69681p57209p25166n73637l58144j50853N209J02883J56850J87223
$$ 882984 213303 -543906 -1269072 -1842709 -2200853 -2351706 -2346497 -2243614 -2086764 -1899541
15094a899541K01446J94084J59102R2541j634j00279j69809j98546k20639k76854
$$ -1899541 -1698095 -1504011 -1344909 -1252368 -1254002 -1354281 -1524090 -1722636 -1943275 -2220129
15084b220129l42523l40910k31618n2979J12757K01561J98535J27088L5373j5840
$$ -2220129 -2562652 -2903562 -3135180 -3188159 -3075402 -2873841 -2675306 -2548218 -2512845 -2528685
15074b528685J4408J07163J88161J94920J32795N2052j7650r2987k08311l78096
$$ -2528685 -2514277 -2407114 -2218953 -2024033 -1891238 -1839186 -1856836 -1949823 -2158134 -2536230
15064b536230n71489p17506p54389o84101n71890m79621m09383l21669j87950
$$ -2536230 -3107719 -3825225 -4579614 -5263715 -5835605 -6315226 -6724609 -7046278 -7234228
15055g234228j0507J84120L50953M54149M91651M78821M34698L90344L88557M62101
$$ -7234228 -7244735 -7060615 -6709662 -6255513 -5763862 -5285041 -4850343 -4459999 -4071442 -3609341
15045c609341O00004P34258P81049O99440N06825K58494J0499k06841l66429m19100
$$ -3609341 -3009337 -2275079 -1494030 -794590 -287765 -29271 -18772 -225613 -592042 -1011142
15035a011142l23895r1149K05262M48137N42249M82020L38776J86153N4849n5625
$$ -1011142 -1335037 -1426186 -1220924 -772787 -230538 251482 590258 776411 831260 775635
15025G75635j47847k26485l13725m25145n38775o21124o61643o58315n92038m42274
$$ 775635 627788 401303 87578 -337567 -876342 -1497466 -2159109 -2817424 -3409462 -3851736
15015c851736k28077p937J70032K97849L81756M13001L89036L40821L09159L08371
$$ -3851736 -4079813 -4087750 -3917718 -3619869 -3238113 -2825112 -2436076 -2095255 -1786096 -1477725
15005a477725L24342L27074K82009J80242O1611j2133j0274L7908O3204J7011
$$ -1477725 -1153383 -826309 -544300 -364058 -302447 -314580 -324854 -286946 -223742 -206731
14995b06731q5622j91300k60190k81622k75301k89248l49665m04037l59289j88757
$$ -206731 -292353 -483653 -743843 -1025465 -1300766 -1590014 -1939679 -2343716 -2703005 -2891762
14985b891762K9760J84112K14361J39256K3822o0651o1061L9255K07575L60268
$$ -2891762 -2862002 -2677890 -2463529 -2324273 -2300451 -2361102 -2422163 -2382908 -2175333 -1815065
14975a815065M09228L43091K34920J54293R5326r046k08292m64842o80381p79706
$$ -1815065 -1405837 -1062746 -827826 -673533 -578207 -587253 -795545 -1260387 -1940768 -2720474
14965b720474p35896n53464k83375j7002J85496L28189M31541M98177N20582M85017
$$ -2720474 -3456370 -4009834 -4293209 -4310211 -4124715 -3796526 -3364985 -2866808 -2346226 -1861209
14955a861209L76003K03881J8825j20588j88666j96759j60267p6202N5543J99592
$$ -1861209 -1485206 -1281325 -1262500 -1383088 -1571754 -1768513 -1928780 -2004982 -1949439 -1749847
14945a749847K87919K57205R2913j54143l97306n51247n52336l92228j40194J07111
$$ -1749847 -1461928 -1204723 -1111810 -1265953 -1663259 -2214506 -2766842 -3159070 -3299264 -3192153
14935c192153L06175M77938O51330Q23438R75796J099947J177773J156760R83398
$$ -3192153 -2885978 -2408040 -1756710 -933272 42524 1142471 2320244 3477004 4460402
14926D460402O64935K91706r048j59187j72651j11832k5405O1967J22418J17082
$$ 4460402 5125337 5417043 5407995 5248808 5076157 4964325 4938920 5000887 5123305 5240387
14916E240387K7242j29045l21732n20817o82243p55541p20707o09870m81165l70110
$$ 5240387 5267629 5138584 4816852 4296035 3613792 2858251 2137544 1527674 1046509 676399
14906F76399k69529j54559k0002J14868K30025L22658M07098N10223O67561Q97523
$$ 676399 406870 252311 232309 347177 577202 899860 1306958 1817181 2484742 3382265
14896C382265J161588J373807J461037J387681J139199P37727K57791k09931n86302
$$ 3382265 4543853 5917660 7378697 8766378 9905577 10643304 10901095 10691164 10104862
14887A0104862q14670q87906q43396p26619n85600m73008m05508l41953k39354
$$ 10104862 9290192 8402286 7558890 6832271 6246671 5773663 5368155 5026202 4786848
14878D786848j07272P649N7293J6397j00912k58174m19125n46441o06644n82345
$$ 4786848 4679576 4687225 4744518 4760915 4660003 4401829 3982704 3436263 2829619 2247274
14868B247274m75665l11512j36799J974Q6933J17927Q2442k9822j87038l14679
$$ 2247274 1771609 1460097 1323298 1325272 1412205 1530132 1612574 1582752 1395714 1081035
14858A081035l46239k73929j48019m0493o907n8905j58972k53065l19120l64545
$$ 1081035 734796 460867 312848 272355 265448 206543 47571 -205494 -524614 -889159
14848h89159l78785l28876k02677k9539J42785K86526M02748M86269M90747L45231
$$ -889159 -1267944 -1596820 -1799497 -1829036 -1686251 -1399725 -996977 -510708 -19961 325270
14838C25270K4650l94614p76631j031018j143842j116173r40482o46691l15800
$$ 325270 349920 -44694 -821325 -1852343 -2996185 -4112358 -5052840 -5699531 -6015331
14829f015331k3467K11792M08517N55818N89515M54017J72962j56035m18329n31866
$$ -6015331 -6038798 -5827006 -5418489 -4862671 -4273156 -3819139 -3646177 -3802212 -4220541 -4752407
14819d752407m70691k70674j5977K04457L45316M15620M57792N21388O27871P35499
$$ -4752407 -5223098 -5493772 -5509749 -5305292 -4959976 -4544356 -4086564 -3565176 -2937305 -2201806
14809b201806P57402O34528L77064L9864l10354o08320q07291q92967q69881p39772
$$ -2201806 -1444404 -809876 -432812 -392948 -703302 -1311622 -2118913 -3011880 -3881761 -4621533
14799d621533n07495k09062Q3042K96337M00885M18645L97785L75608L61462L51385
$$ -4621533 -5129028 -5338090 -5255048 -4958711 -4557826 -4139181 -3741396 -3365788 -3004326 -2652941
14789b652941L40651L14179K51612J48341J9889j07197k00234k25130j76609j02886
$$ -2652941 -2312290 -1998111 -1746499 -1598158 -1578269 -1685466 -1885700 -2110830 -2287439 -2390325
14779b390325o4920p5801j11755j56786k00091k20437j99673j33117k4176J05362
$$ -2390325 -2455245 -2531046 -2642801 -2799587 -2999678 -3220115 -3419788 -3552905 -3577081 -3471719
14769c471719K02414K12370J33760K7640l8740n0408m1051m3468o5530j11947
$$ -3471719 -3269305 -3056935 -2923175 -2895535 -2934275 -2984683 -3025734 -3069202 -3134732 -3246679
14759c246679k03355l59906n57873p04146o89987m88945j81491J07961K84588
$$ -3246679 -3450034 -3809940 -4367813 -5071959 -5761946 -6250891 -6432382 -6324421 -6039833
14750f039833L32333L15138L05867L17985L36507L78849M76452O24487P73567
$$ -6039833 -5707500 -5392362 -5086495 -4768510 -4432003 -4053154 -3576702 -2952215 -2178648
14741b178648Q55730Q15568O30288L25099j7105k89035m33868m77201m70523m22620
$$ -2178648 -1322918 -507350 122938 448037 430932 141897 -291971 -769172 -1239695 -1662315
14731a662315l04264j07422J11464K53569K59260J65923P5099O7234J51643K77460
$$ -1662315 -1966579 -2074001 -1962537 -1708968 -1449708 -1283785 -1208686 -1141452 -989809 -712349
14721g12349L72325L89349L41947K85886K55299K31482J84719J24537R2933J16583
$$ -712349 -340024 49325 391272 677158 932457 1163939 1348658 1473195 1566128 1682711
14711A682711J73147K08393J88323J22821M0252k8731m0436L5007J59874K50890
$$ 1682711 1855858 2064251 2252574 2375395 2415647 2386916 2346480 2381487 2541361 2792251
14701B792251K63608K25463J95031K01467K14249J78317Q5270j1141n4196l1226
$$ 2792251 3055859 3281322 3476353 3677820 3892069 4070386 4155656 4144515 4090319 4059093
14691D059093K6556O9014O4358J0163p9554j70230k09944j63143l0766J57418
$$ 4059093 4085649 4154663 4219021 4229184 4149630 3979400 3769456 3606313 3575547 3732965
14681C732965L54302N08513N82899N72962N03524M00375K69508J01869j04546
$$ 3732965 4087267 4595780 5178679 5751641 6255165 6655540 6925048 7026917 6922371
14672F922371l29707n53534p76810r87051j128096j133177r78425o98934l64445
$$ 6922371 6592664 6039130 5262320 4275269 3147173 2013996 1035571 336637 -27808
14663b7808m4597K09314L59635L75647K55533N9606j15201k14491k62722l17408
$$ -27808 -72405 136909 496544 872191 1127724 1187330 1072129 857638 594916 277508
14653B77508m04276n01010n70509o04096o31017o74588p03784o49103m77856k40903
$$ 277508 -126768 -627778 -1198287 -1802383 -2433400 -3107988 -3811772 -4460875 -4938731 -5179634
14643e179634k7682J15855K04866K63580K85759K48423J58205P7352Q2381J86966
$$ -5179634 -5207316 -5091461 -4886595 -4623015 -4337256 -4088833 -3930628 -3853276 -3770895 -3583929
14633c583929L09280L32781K10976o27k15386l93123n40335o62515p46226p79686
$$ -3583929 -3274649 -2941868 -2730892 -2731519 -2946905 -3340028 -3880363 -4542878 -5289104 -6068790
14623f068790p74280p60860p51371p07909n73827l36120m6727K17952M12958N40332
$$ -6068790 -6843070 -7603930 -8355301 -9063210 -9637037 -9973157 -10019884 -9801932 -9388974 -8848642
14613h848642O26045O95844P67429Q41773Q95872Q93216Q00906O06489L30070
$$ -8848642 -8222597 -7526753 -6759324 -5917551 -5021679 -4128463 -3327557 -2721068 -2390998
14604b390998J8932k68865m78822n68931n17540l42647j10310R5808K26712L03434
$$ -2390998 -2372066 -2640931 -3119753 -3688684 -4206224 -4548871 -4659181 -4563373 -4336661 -4033227
14594d033227L89853N27175P11739Q94285R71860Q43304N10101R6704k41105m21891
$$ -4033227 -3643374 -3116199 -2404460 -1510175 -538315 304989 815090 911794 670689 248798
14584B48798m65933m45164m29154m62058n38336n96077n70548m61998l45114l13394
$$ 248798 -217135 -662299 -1091453 -1553511 -2091847 -2687924 -3258472 -3720470 -4065584 -4378978
14574d378978m09348o00304q11584r76321j064958j081238j031960r06825o85633
$$ -4378978 -4788326 -5388630 -6200214 -7176535 -8241493 -9322731 -10354691 -11261516 -11947149
14565a1947149l52475Q2699N62756J003808J344633J557517J619940J511500J235700
$$ -11947149 -12299624 -12216925 -11654169 -10650361 -9305728 -7748211 -6128271 -4616771 -3381071
14556c381071Q20816L21103j66127n26385o92671o68467n03304k72832o3065O2805
$$ -3381071 -2560255 -2239152 -2405279 -2931664 -3624335 -4292802 -4796106 -5068938 -5132003 -5069198
14546e069198R0968N2657J165k2508l931O8823K11995M11790O19273P95860R30917
$$ -5069198 -4978230 -4925573 -4924408 -4946916 -4950847 -4882024 -4670029 -4258239 -3638966 -2843106 -1912189
14535a912189J015133J022511R17146O90421M06375J78339P6451O9160N4969n3793
$$ -1912189 -897056 125455 1042601 1733022 2139397 2317736 2394187 2463347 2518316 2464523
14525B464523k65571n09362o74124o54351m11110j5480L86107O55555P23356O12042
$$ 2464523 2198952 1689590 1015466 361115 -49995 -65475 320632 976187 1699543 2311585
14515B311585M19417K59815K01587K44101L34466M07095M22005L58852K04546
$$ 2311585 2731002 2990817 3192404 3436505 3770971 4178066 4600071 4958923 5163469
14506E163469k3726k76136n06849o95989q29832q78317q11016o23808l41068j4030
$$ 5163469 5139743 4863607 4356758 3660769 2830937 1952620 1141604 517796 176728 162698
14496A62698K77913M52495M73283L74362K38519J52734J59554K31891L02523L23864
$$ 162698 440611 893106 1366389 1740751 1979270 2132004 2291558 2523449 2825972 3149836
14486C149836L00894K64633K26671J79538J21918N6153k4475j17819j92076k02932
$$ 3149836 3450730 3715363 3942034 4121572 4243490 4299643 4275168 4157349 3965273 3762341
14476C762341j32842p194J28761K37856L04089L36142L59270L99455M68677N47905
$$ 3762341 3629499 3622305 3751066 3988922 4293011 4629153 4988423 5387878 5856555 6404460
14466F404460N83479N22231L57060J24476j36628m01131o40307q20507r22466
$$ 6404460 6987939 7510170 7867230 7991706 7855078 7453947 6813640 5993133 5070667
14457E070667r42501q86847p81160o64062n52249m23060k38492K0437L25123N97107
$$ 5070667 4128166 3241319 2460159 1796097 1243848 820788 582296 602733 927856 1524963
14447A524963P56093P69960O59488M73957K59499L6300j86741l81097n04501n29264
$$ 1524963 2281056 3051016 3710504 4184461 4443960 4480260 4293519 3912422 3407921 2878657
14437B878657m58770l29080j94722j01115p3645j32945k92202n28443p73607r37878
$$ 2878657 2419887 2090807 1896085 1794970 1721325 1588380 1296178 767735 -5872 -943750
14427i43750r53071q22949o14510l82787j35073J36237M16308O49899P58003O88777
$$ -943750 -1896821 -2719770 -3334280 -3717067 -3852140 -3715903 -3299595 -2649696 -1891693 -1202916
14417a202916M57773J51154j22823l04077l87005l75976k78907j33226N712J18132
$$ -1202916 -745143 -593989 -716812 -1020889 -1407894 -1783870 -2062777 -2196003 -2190291 -2072159
14407b072159K37615L92260N45399O20723N74696M35176K84997J99844J89176
$$ -2072159 -1834544 -1442284 -896885 -276162 298534 733710 1018707 1218551 1407727
14398A407727K08511K18762K07217J61347N7260j19720l53438n88517p50076p95820
$$ 1407727 1616238 1835000 2042217 2203564 2260824 2141104 1787666 1199149 449073 -346747
14388c46747p49035o68285n95194n36007m74521l94201k87072j35769Q5503L57685
$$ -346747 -1095782 -1764067 -2359261 -2895268 -3369789 -3763990 -4051062 -4186831 -4101328 -3743643
14378c743643N92864O96209O38465M60785K31952J9686j25159j93704k10535j85683
$$ -3743643 -3150779 -2454570 -1816105 -1355320 -1123368 -1103682 -1228841 -1422545 -1633080 -1818763
14368a818763r9766N4178K39020M01315N09081N56435N53414N08383M24318L22573
$$ -1818763 -1918529 -1864351 -1625331 -1224016 -714935 -158500 394914 903297 1327615 1650188
14358A650188K37445J73068R7601j1168j43187k80453m15698n46283o58803p20648
$$ 1650188 1887633 2060701 2158302 2147134 2003947 1723494 1307796 761513 102710 -617938
14348f17938o92446n58789l48444j08126J39493L87176O00095P11152O69921M90161
$$ -617938 -1310384 -1869173 -2217617 -2325743 -2186250 -1799074 -1198979 -487827 182094 672255
14338F72255K52382O3896r00M8174J20909J31133P8216K5919K0373M9864O7197
$$ 672255 924637 988533 987633 1035807 1156716 1287849 1366065 1391984 1412357 1462221 1529418
14327A529418M1236o713j9474M8596K03514M07380N83496O41629N18358K05370
$$ 1529418 1570654 1563941 1544467 1593063 1796577 2203957 2787453 3429082 3947440 4152810
14317D152810k43903p19521j081648j233203j183669j012868p86557n34318k81760
$$ 4152810 3908907 3189386 2107738 874535 -309134 -1322002 -2108559 -2642877 -2924637
14308b924637p4793L4507L0291m3597j07926r9497j1897J14943K42224L54176
$$ -2924637 -2999430 -2964923 -2934632 -2978229 -3086155 -3185652 -3197549 -3082606 -2840382 -2486206
14298b486206M38223M63203L90202K01468q3377m05905o74541p90874p00087m30149
$$ -2486206 -2047983 -1584780 -1194578 -993110 -1076487 -1482392 -2156933 -2947807 -3647894 -4078043
14288d078043p8573K45111M67656N63425N52371M90152M26841L69520L06902K61443
$$ -4078043 -4156616 -3911505 -3443849 -2880424 -2328053 -1837901 -1411060 -1041540 -734638 -473195
14278d73195K76315L39280L65553K81151R5733j15567k71095l19822k58846j30781
$$ -473195 -196880 142400 507953 789104 884837 769270 498175 178353 -80493 -211274
14268b11274J1709J33961K14546K54331K82853L22558L65101L85808L57777K56852
$$ -211274 -199565 -65604 148942 403273 686126 1008684 1373785 1759593 2117370 2374222
14258B374222P0162j87730m58957o58317p18842o15418l66317l7882K74983M96228
$$ 2374222 2444384 2256654 1797697 1139380 420538 -194880 -561197 -599079 -324096 172132
14248A72132O01127O09054N46961M30592K84425J53912Q2195P6324R3851O9220
$$ 172132 773259 1382313 1929274 2359866 2644291 2798203 2880398 2956722 3050573 3119793
14238C119793k8301j62609k67458l14418l40447m02356n08608o01773o01095m62147
$$ 3119793 3091492 2928883 2661425 2347007 2006560 1604204 1095596 493823 -107272 -569419
14228e69419k02739J18893M41061P07135Q50580Q08954N75034K24591j22458l68581
$$ -569419 -772158 -653265 -212204 494931 1345511 2154465 2729499 2954090 2831632 2463051
14218B463051m72138m43264l28352j94764j14362j36394k45844l54985l64842
$$ 2463051 1990913 1547649 1219297 1024533 910171 773777 527933 172948 -191894
14209a91894k42352l2226J86905L33848L50520K43590Q4967m1558q7002n9403
$$ -191894 -434246 -466472 -279567 54281 404801 648391 733358 691800 604798 545395
14199E45395j8350k2954o7219q3895k4704Q8827K01331K89435L75205M69363N24388
$$ 545395 527045 504091 436872 352977 328273 417100 618431 907866 1283071 1752434 2276822
14188B276822M69433K89126N1696j41441k23208j79448k8696J90680M23978O14681
$$ 2276822 2746255 3035381 3087077 2945636 2722428 2542980 2514284 2704964 3128942 3743623
14178C743623P13245O72175M65921J31932k31163n17236o64758o79071o16903
$$ 3743623 4456868 5129043 5594964 5726896 5495733 4978497 4313739 3634668 3017765
14169C017765n41162m89367m69478m65125m56692m42154m30205m23641m07066
$$ 3017765 2476603 1987236 1517758 1052633 595941 153787 -276418 -700059 -1107125
14160a107125l47924k24390n2892J28482L03869M93579P22757R72884J176605
$$ -1107125 -1455049 -1679439 -1732331 -1603849 -1299980 -806401 -83644 889240 2065845
14151B065845J263024J191356R63734O34788K90209r544k56774m62389o16506
$$ 2065845 3328869 4520225 5483959 6118747 6408956 6399412 6142638 5680249 5063743
14142E063743o89659o52896n07002l15717j83203j74249k70289m03803n11196
$$ 5063743 4374084 3721188 3214186 2898469 2715266 2541017 2270728 1866925 1355729
14133A355729n46506m80283l16859r7310J37419L70963N97250Q05422R69142J044188
$$ 1355729 809223 328940 12081 -85229 52190 423153 1020403 1825825 2794967 3839155
14123C839155R96437Q28507N70605K75029L0050p5050m5066L175m6281k15622
$$ 3839155 4835592 5664099 6234704 6509733 6539783 6464733 6419667 6422842 6376561 6160939
14113F160939m45185o46114p45776p18105n87722m14624k65811j79057j39701
$$ 6160939 5715754 5069640 4323864 3605759 3018037 2603413 2337602 2158545 2018844
14104B018844r2900O123J52760L01679M03838M40134M23117L75002L19967K84610
$$ 2018844 1925944 1932067 2084827 2386506 2790344 3230478 3653595 4028597 4348564 4633174
14094D633174K80072K95566L23641L74422M65151O04480P66127Q81208Q88679
$$ 4633174 4913246 5208812 5532453 5906875 6372026 6976506 7742633 8623841 9512520
14085I512520Q01248P03296O65135O71119O44128N22351L08116O1892j40357k40912
$$ 9512520 10313768 11017064 11682199 12353318 12997446 13519797 13827913 13889805 13749448 13508536
14075A3508536k07768n2250J48996K90972L31890L29007L65501M62257N67058
$$ 13508536 13300768 13248518 13397514 13688486 14020376 14349383 14714884 15177141 15744199
14066A5744199O00688N10897L06125M2545k19821m40409n84567o11822n05594
$$ 15744199 16344887 16855784 17161909 17204454 16984633 16544224 15959657 15347835 14842241
14057A4842241l14389j32918k9782q508l3159o7000q4312p0538l8700l6162j09888
$$ 14842241 14527852 14394934 14365152 14356644 14323485 14256485 14172173 14101635 14062935 14026773 13916885
14046A3916885k64908m66049o65839q11689q57199q02967p05705o23490n73047
$$ 13916885 13651977 13185928 12520089 11708400 10851201 10048234 9342529 8719039 8145992
14037H145992n52791n72302o31683o92103o98041o26244m99523l54175k01703
$$ 8145992 7593201 7020899 6389216 5697113 4999072 4372828 3873305 3519130 3317427
14028C317427m0610J02025J76526J66044J11142O7665N8430P2989Q8253Q0898
$$ 3317427 3276817 3378842 3555368 3721412 3832554 3900219 3958649 4031638 4119891 4200789
14018D200789M6633P042j6343j7937j813J4725O453l1564p7783j05686r0088j2571
$$ 4200789 4247422 4254464 4238121 4220184 4218371 4233096 4239549 4207985 4130202 4024516 3934428 3921857
14006C921857J08575K07325K07054P0535j81464m77022p03978p47922n63083k10458
$$ 3921857 4030432 4237757 4444811 4515346 4333882 3856860 3152882 2404960 1841877 1631419
13996A631419J84071N04022O82357P06640O20865N07819M28561L82443L45935
$$ 1631419 1815490 2319512 3001869 3708509 4329374 4837193 5265754 5648197 5994132
13987E994132L20930L15861L16358L04930K89509K94512L19586L16806K32142
$$ 5994132 6315062 6630923 6947281 7252211 7541720 7836232 8155818 8472624 8704766
13978H704766P4732p2499j12918o389K02018M20299N77088O40059N87287M01205
$$ 8704766 8779498 8706999 8594081 8587692 8789710 9210009 9787097 10427156 11014443 11415648
13968A1415648J10896j79085l44116l36322k18118j02493o6308j14297k01243
$$ 11415648 11526544 11347459 11003343 10667021 10448903 10346410 10280102 10165805 9964562
13959I964562k68379k70807j92776m2091J64810M00604O04074O83541N87447L79286
$$ 9964562 9696183 9425376 9232600 9190509 9355319 9755923 10359997 11043538 11630985 12010271
13949A2010271J96052J08252N1400r3251l71901p11017r73492j053638r28557
$$ 12010271 12206323 12314575 12365975 12272724 11900823 11189806 10216314 9162676 8234119
13940H234119o60485l75066j87028j06046m3275P9498K62208M55581O07775O78927
$$ 8234119 7573634 7198568 7011540 6905494 6862219 6941717 7203925 7659506 8267281 8946208
13930H946208O49799N39384L96696K68514J79743J32919J27382J79284L02118
$$ 8946208 9596007 10135391 10532087 10800601 10980344 11113263 11240645 11419929 11722047
13921A1722047M66433N98966O33004N57421M11984K54241J36168Q4017R2473J41180
$$ 11722047 12188480 12787446 13420450 13977871 14389855 14644096 14780264 14864281 14956754 15097934
13911A5097934K03780K44369K26385J41515K5002o2898o7726L5137K33389M80296
$$ 15097934 15301714 15546083 15772468 15913983 15938985 15876087 15808361 15843498 16076887 16557183
13901A6557183O97156P96151P32211N40834L09041J01349p5046k39731l94208
$$ 16557183 17254339 18050490 18782701 19323535 19632576 19733925 19658879 19419148 19024940
13892A9024940n05343n41494n40780o04599p87296j024832j188167j180076r86392
$$ 19024940 18519597 17978103 17437323 16832724 16045428 15020596 13832429 12652353 11665961
13883A1665961o60555k70502J24923M60597O77965P67263P77162P81586Q30519
$$ 11665961 11005406 10734904 10859827 11320424 11998389 12765652 13542814 14324400 15154919
13874A5154919R19774J007004J038800R56443P21387L71614K4300k05020k76525
$$ 15154919 16074693 17081697 18120497 19076940 19798327 20169941 20194241 19989221 19712696
13865A9712696k31433j54052j24718j73650k60779l08273k56947j01401J02453
$$ 19712696 19481263 19327211 19202493 19028843 18768064 18459791 18202844 18101443 18203896
13856A8203896K67788L44805L50931L27145L05597L20192L97368N23591O57834
$$ 18203896 18471684 18816489 19167420 19494565 19800162 20120354 20517722 21041313 21699147
13847B1699147P86079R27350J079295J189155J193117J079886R06777P42654O04775
$$ 21699147 22485226 23412576 24491871 25681026 26874143 27954029 28860806 29603460 30208235
13838C0208235M67006L12351J61123N5772K8972Q4962J98204L21113M12628M77477
$$ 30208235 30675241 30987592 31148715 31204487 31233459 31318421 31516625 31837738 32250366 32727843
13828C2727843N58312O85583Q52165J021525J153175J234692J280330J288628
$$ 32727843 33286155 33971738 34823903 35845428 36998603 38233295 39513625 40802253
13820D0802253J220687J039778P69116M98353L26398K94203L73353N09649O57651
$$ 40802253 42022940 43062718 43831834 44330187 44656585 44950788 45324141 45833790 46491441
13811D6491441P83808Q62501Q81172Q55655Q30226Q42635Q91706R46336R83846
$$ 46491441 47275249 48137750 49018922 49874577 50704803 51547438 52439144 53385480 54369326
13802E4369326J021869J109276J272247J462515J576144J547107J419827J315874
$$ 54369326 55391195 56500471 57772718 59235233 60811377 62358484 63778311 65094185
13794F5094185J322495J414815J498405J518617J505518J526175J619943J778366
$$ 65094185 66416680 67831495 69329900 70848517 72354035 73880210 75500153 77278519
13786G7278519J969243K166883K356474K515728K602435K571240K420560K219762
$$ 77278519 79247762 81414645 83771119 86286847 88889282 91460522 93881082 96100844
13778I6100844K059028J974094J934396J886257J795856J663429J507475J351509
$$ 96100844 98159872 100133966 102068362 103954619 105750475 107413904 108921379 110272888
13770A10272888J233592J205973J308467J534389J829822K146435K487292K885350
$$ 110272888 111506480 112712453 114020920 115555309 117385131 119531566 122018858 124904208
13762A24904208L346419L829383M275253M642900M918924N097090N177573N206334
$$ 124904208 128250627 132080010 136355263 140998163 145917087 151014177 156191750 161398084
13754A61398084N265429N398562N575211N729361N823678N886173O000297O260840
$$ 161398084 166663513 172062075 177637286 183366647 189190325 195076498 201076795 207337635
13746B07337635O725281P385439Q159958Q915564R527458R931913J0124163J0137719
$$ 207337635 214062916 221448355 229608313 238523877 248051335 257983248 268107411 278245130
13738B78245130J0045091R952311R953084J0066831J0216963J0280084J0170601
$$ 278245130 288290221 298242532 308195616 318262447 328479410 338759494 348930095
13731C48930095R882488R461952Q962354Q422452P856999P257070O616190N956399
$$ 348930095 358812583 368274535 377236889 385659341 393516340 400773410 407389600 413345999
13723D13345999N317633M731935M211426L742049L291918K840939K390590J936356
$$ 413345999 418663632 423395567 427606993 431349042 434640960 437481899 439872489 441808845
13715D41808845J439990Q41341J05004p56940j698272k648977l532089m295013
$$ 441808845 443248835 444090176 444195180 443438240 441739968 439090991 435558902 431263889
13707D31263889m918850n412146n826056o251332o757910p339330p926324q445993
$$ 431263889 426345039 420932893 415106837 408855505 402097595 394758265 386831941 378385948
13699C78385948q864760r193869r466425r699271r867955r926826r864183r728811
$$ 378385948 369521188 360327319 350860894 341161623 331293668 321366842 311502659 301773848
13691C01773848r592855r493036r402042r249531q986285q640661q294037p993105
$$ 301773848 292180993 282687957 273285915 264036384 255050099 246409438 238115401 230122296
13683B30122296p722079p450052p154164o831235o524007o287628o123985n988028
$$ 230122296 222400217 214950165 207796001 200964766 194440759 188153131 182029146 176041118
13675A76041118n830283n607489n285421m862356m386951l938056l578545l319950
$$ 176041118 170210835 164603346 159317925 154455569 150068618 146130562 142552017 139232067
13667A39232067l126499k954550k792866k669599k617567k636857k697443k763707
$$ 139232067 136105568 133151018 130358152 127688553 125070986 122434129 119736686 116972979
13659A16972979k807690k814848k787783k732656k646902k528483k381171k199137
$$ 116972979 114165289 111350441 108562658 105830002 103183100 100654617 98273446 96074309
13651I6074309j959793j654267j319327j017240p87729o28383n04989l76766k36382
$$ 96074309 94114516 92460249 91140922 90123682 89335953 88707570 88202581 87825815 87589433
13642H7589433j30622j20920k18862l77555n39177o69233p52421p82062p56229
$$ 87589433 87458811 87337891 87119029 86741474 86202297 85533064 84780643 83998581 83242352
13633H3242352o69887n21984l43124j94859j27985j54674k57862m07874n74640
$$ 83242352 82572465 82050481 81707357 81512498 81384513 81229839 80971977 80564103 79989463
13624G9989463p42046r15894j111308j322240j502690j582036j520532j365975
$$ 79989463 79247417 78331523 77220215 75897975 74395285 72813249 71292717 69926742
13616F9926742j231596j195076j229091j245729j197224j110188j032394r79099
$$ 69926742 68695146 67500070 66270979 65025250 63828026 62717838 61685444 60706345
13608F0706345r37790r03363q88137r00650r32909r72202j004463j002921r41404
$$ 60706345 59768555 58865192 57977055 57076405 56143496 55171294 54166831 53163910 52222506
13599E2222506q28322o96772n47367l54274j38483L0418J08042J13324R9288J08930
$$ 52222506 51394184 50697412 50150045 49795771 49657288 49687706 49795748 49909072 50008360 50117290
13589E0117290J66827K82922M26005N16906M85782L30256J14310q5879k36481
$$ 50117290 50284117 50567039 50993044 51509950 51995732 52325988 52440298 52354419 52117938
13580E2117938l50398m61654o04242p91042r86808j099023j035842q01800n19985
$$ 52117938 51767540 51305886 50701644 49910602 48923794 47824771 46788929 45987129 45467144
13571D5467144l41262l29535m41150n96463p39334q36587q67155q37161p86919
$$ 45467144 45125882 44796347 44355197 43758734 43019400 42182813 41315658 40478497 39691578
13562C9691578p58283p56807p57237p36038o92073o47670o36122o84778p93740
$$ 39691578 38933295 38176488 37419251 36683213 35991140 35343470 34707348 34022570 33228830
13553C3228830r21931j014800j054900j070687j089779j088472j002744p98020
$$ 33228830 32306899 31292099 30237199 29166512 28076733 26988261 25985517 25187497
13545B5187497n12855k33313l9760K8887j9162j52616l47661n92413q68521j140941
$$ 25187497 24674642 24441329 24401569 24430456 24411294 24258678 23911017 23318604 22450083 21309142
13535B1309142j357723j453375j379072j159871r16573p89720q20169r17424r54377
$$ 21309142 19951419 18498044 17118972 15959101 15042528 14252808 13432639 12515215 11560838
13526A1560838q80204p37548o02701n32000n36825n78320n81480m72218k31977
$$ 11560838 10680634 9943086 9340385 8808385 8271560 7693240 7111760 6639542 6407565
13517F407565P8856L60522N44734O25230O23795N56244M41870L23886K53148K45468
$$ 6407565 6486421 6846943 7391677 8016907 8640702 9196946 9638816 9962702 10215850 10461318
13507A0461318K74516L08312L31451L33792K96615K01808N3954j16359k75790
$$ 10461318 10735834 11044146 11375597 11709389 12006004 12207812 12261766 12145407 11869617
13498A1869617m12747n34272o43383p31572p88046p98628p31242n52608k85618
$$ 11869617 11456870 10922598 10279215 9547643 8759597 7960969 7229727 6677119 6391501
13489F391501k4643J37826J87680J73471J37747R1033M0618P016L59N994M706
$$ 6391501 6366858 6504684 6692364 6865835 7003582 7094615 7135233 7142249 7142608 7148602 7153308
13478G153308l583O638P0960J89485K91133K77088J15211j32491l71552n32255
$$ 7153308 7149725 7156363 7227323 7416808 7707941 7985029 8100240 7967749 7596197 7063942
13468G063942n77536n06834l59565j80697P647J78780K77027K54751J22469o8636
$$ 7063942 6486406 5979572 5620007 5439310 5446957 5625737 5902764 6157515 6279984 6211348
13458F211348k86118n18651p34273q82801r32243q78501p31400n02093k02575
$$ 6211348 5925230 5406579 4672306 3789505 2857262 1978761 1247361 745268 542693
13449E42693J26066L95940N27398N13851M06166K49463N6335j54206l19451l77125
$$ 542693 668759 1064699 1592097 2105948 2512114 2761577 2817912 2663706 2344255 1967130
13439A967130l33111k48316j73199j16982o2234J3548J16720K28466L21522L70385
$$ 1967130 1634019 1385703 1212504 1095522 1033288 1046836 1163556 1392022 1713544 2083929
13429B083929L58071K99907K46002K49714L23418M01369L77722K14137j2305j75415
$$ 2083929 2442000 2741907 2987909 3237623 3561041 3962410 4340132 4554269 4541964 4366549
13419D366549k00673j11810R367J06083J67974J85132J36686L1559q3319j66990
$$ 4366549 4165876 4054066 4063433 4169516 4337490 4522622 4659308 4690867 4607548 4440558
13409D440558k03801j80044q2776P5712K54173M05366N05546N59284N76554N54496
$$ 4440558 4236757 4056713 3973937 4049649 4303822 4709188 5214734 5774018 6350572 6905068
13399F905068M68214K83386P464k81798m83749n44823m77252l29626j47422N8093
$$ 6905068 7373282 7656668 7664132 7382334 6898585 6353762 5876510 5546884 5399462 5457555
13389E457555K96386N41932P24009P92917P68595P07233O49211O01127N34560
$$ 5457555 5753941 6295873 7019882 7812799 8581394 9288627 9937838 10538965 11073525
13380A1073525M12055K42365R3637L2688O7860J52691K27371K57435K43520K13597
$$ 11073525 11485580 11727945 11821582 11854270 11922130 12074821 12302192 12559627 12803147 13016744
13370A3016744K10662K63436L56325M39665M70955M34770L26204J44116q6085
$$ 13016744 13227406 13490842 13847167 14286832 14757787 15192557 15518761 15662877 15576792
13361A5576792l03695m41787m71306m10895k88392j12995J10368L63444O06103
$$ 15576792 15273097 14831310 14360004 13949109 13660717 13547722 13658090 14021534 14627637
13352A4627637P65292P73887O44991M63759L02153J74791O5290m1286j62274l19957
$$ 14627637 15392929 16166816 16811807 17275566 17577719 17752510 17817800 17776514 17614240 17294283
13342A7294283m98437o18884o05488m71122l13510k21502j95305j69181r5425
$$ 17294283 16795846 16176962 15571474 15100352 14786842 14565340 14370035 14200854 14105429
13333A4105429Q886R0650J27776J47619J80302K30264K90838L55609M04702L95033
$$ 14105429 14114315 14204965 14332741 14480360 14660662 14890926 15181764 15537373 15942075 16337108
13323A6337108K92290J07590j14379l33826n29079o77043p46827p33827o89260
$$ 16337108 16629398 16736988 16622609 16288783 15759704 15082661 14335834 13602007 12912747
13314A2912747o83680p28566p60992p14280n81641m19472l02215k72395l26575
$$ 12912747 12229067 11500501 10739509 10025229 9443588 9024116 8721901 8449506 8122931
13305H122931m31744n54830o78470p86375q43779q00313o22914l41168n0240J56790
$$ 8122931 7691187 7136357 6457887 5671512 4827733 4027420 3404506 3063338 3013098 3169888
13295C169888K60312L02625L16498K87446J76735l1722k98073n42521p06570p84631
$$ 3169888 3430200 3732825 4049323 4336769 4513504 4481782 4183709 3641188 2934618 2149987
13285B149987p90036p20046n74753l89262k17960q8011J1044Q9088J39921J70354
$$ 2149987 1359951 639905 65152 -324110 -542070 -630081 -619037 -529949 -390028 -219674
13275b19674K09668K90488M28970O03056P53793Q18276P61856N99358L91961K11751
$$ -219674 -10006 280482 709452 1312508 2066301 2884577 3646433 4245791 4637752 4849503
13265D849503J04733P7088J06102J65860K43778L30828M00250M06359L24616J95318
$$ 4849503 4954236 5031324 5137426 5303286 5547064 5877892 6278142 6684501 7009117 7204435
13255G204435R8696Q8521J66546K96843M19497M58194L51877J07908j81399l92334
$$ 7204435 7303131 7391652 7558198 7855041 8274538 8732732 9084609 9192517 9011118 8618784
13245H618784m55940l97410k91221j98845j54854j63030j83169j60309q1550P485
$$ 8618784 8162844 7765434 7474213 7275368 7120514 6957484 6774315 6614006 6532456 6539941
13235F539941L4890m3342j99821l51527m35263m61258m83398n36588o14309o79265
$$ 6539941 6574831 6531489 6331668 5980141 5544878 5083620 4600222 4063634 3449325 2770060
13225B770060o94150o56309n90131n16148m55532m43156m98815n98754o80182
$$ 2770060 2075910 1419601 829470 313322 -142210 -585366 -1084181 -1682935 -2363117
13216b363117o65204n08808k39624N4206K85248M14512M47967M09443L24048K17468
$$ -2363117 -3028321 -3537129 -3776753 -3722547 -3437299 -3022787 -2574820 -2165377 -1841329 -1623861
13206a623861J16204K9413n5921j37838j85113j80949j47154j09075p0849m2250
$$ -1623861 -1507657 -1478244 -1534165 -1672003 -1857116 -2038065 -2185219 -2294294 -2365143 -2407393
13196b407393o2245j78666m00300o62473q55103r01965q04193o12236l88313j99388
$$ -2407393 -2469638 -2648304 -3048604 -3711077 -4566180 -5468145 -6272338 -6884574 -7272887 -7472275
13186g472275j01908j00473j38052j44783q8345K2660J60571K90215L79448M22967
$$ -7472275 -7574183 -7674656 -7812708 -7957491 -8045836 -8023176 -7862605 -7572390 -7192942 -6769975
13176f769975M45629M49199L80526K03458l2718k32395l24804k86941j41071L9784
$$ -6769975 -6324346 -5875147 -5494621 -5291163 -5323881 -5556276 -5881080 -6168021 -6309092 -6269308
13166f269308J47549J05698o3188k44066l14398k29583k5823K35677M91965O70842
$$ -6269308 -6121759 -6016061 -6079249 -6323315 -6637713 -6867296 -6893119 -6657442 -6165477 -5494635
13156e494635P18058O44506N31445M75635N18205O20293O94105O62953N18890
$$ -5494635 -4776577 -4132071 -3600626 -3124991 -2606786 -1986493 -1292388 -629435 -110545
13147a10545L24917J55815N7157N5426J63730L59906N78704P39645P89043P27706
$$ -110545 214372 370187 427344 482770 646500 1006406 1585110 2324755 3113798 3841504
13137C841504O00063M53468L00828J22232q3064k53902k97398j69264P1572K93118
$$ 3841504 4441567 4895035 5195863 5318095 5235031 4981129 4683731 4514467 4586039 4879157
13127D879157L88475L42335K19602J20809J15394J78242K12837J42134l8529k71591
$$ 4879157 5267632 5609967 5829569 5950378 6065772 6244014 6456851 6598985 6560456 6288865
13117F288865m79909o16453o80301o99991p16743p53588p87352p75242p02820
$$ 6288865 5808956 5192503 4512202 3812211 3095468 2341880 1554528 779286 76466
13108G6466n89342m64222l53389k67843j85878o3684J16569L22672N03821O29079
$$ 76466 -512876 -977098 -1330487 -1598330 -1784208 -1847892 -1731323 -1408651 -904830 -275751
13098b75751O98679P29605P21489O48772N04710L33627J98108J24420J01682J16463
$$ -275751 422928 1152533 1874022 2522794 3027504 3361131 3559239 3683659 3785341 3901804
13088C901804J58477K10142K57704L06369L69930M39336M64764L79260J46308
$$ 3901804 4060281 4270423 4528127 4834496 5204426 5643762 6108526 6487786 6634094
13079F634094k01058n66217q49180r98434j012388r19505p55098n43527l10638
$$ 6634094 6433036 5866819 5017639 4019205 3006817 2087312 1332214 788687 478049
13070D78049j01488M1128J18355J80941K86094M52023O51218Q33293R61580J048185
$$ 478049 376561 417689 536044 716985 1003079 1455102 2106320 2939613 3901193 4949378
13060D949378J137876J235839J272231J166203R14520N92790K78945K032k39300
$$ 4949378 6087254 7323093 8595324 9761527 10676047 11268837 11547782 11549814 11310514
13051A1310514m36134n69416o30758o11062m89806k64949K4292L19621N69753
$$ 11310514 10874380 10304964 9674206 9063144 8573338 8308389 8332681 8652302 9222055
13042I222055P32622P78634P03341N32421L15857J09716m9604j59900k39629l01986
$$ 9222055 9954677 10733311 11436652 11969073 12284930 12394646 12345042 12185142 11945513 11643527
13032A1643527l42205l43209l04961k61667k49218k66815k87384k89811k67869
$$ 11643527 11301322 10958113 10653152 10391485 10142267 9875452 9588068 9298257 9030388
13023I030388k25200j77344j51708j67914k25343l24201m69216o34373p55345
$$ 9030388 8805188 8627844 8476136 8308222 8082879 7758678 7289462 6655089 5899744
13014E899744p75465o83238m98315k50780J1271K22679L31883L29674K56439J76323
$$ 5899744 5124279 4441041 3942726 3691946 3703217 3925896 4257779 4587453 4843892 5020215
13004E020215J19380M9470r7447l33470n73422o81819n68035k44902J64199M79684
$$ 5020215 5139595 5189065 5091618 4758148 4184726 3502907 2934872 2689970 2854169 3333853
12994C333853N86260N09882L59873K17967R6787j3615q8464p5941M6194K29485
$$ 3333853 3920113 4429995 4789868 5007835 5104622 5091007 5002543 4926602 4972796 5202281
12984E202281L66088L69476K57185J22533L8443J6968L2707N0786M8194L4634
$$ 5202281 5568369 5937845 6195030 6317563 6356006 6372974 6405681 6456467 6504661 6539295
12974F539295M4112Q7944J30182J22250N0063m7358r8262n4106O0638J59740J66782
$$ 6539295 6583407 6671351 6801533 6923783 6973846 6926488 6828226 6774120 6834758 6994498 7161280
12963G161280O2950j39286m25378p61135j081089j305659j355194j185561q49689
$$ 7161280 7224230 7084944 6659566 5898431 4817342 3511683 2156489 970928 121239
12954A21239m84664k09125o1188k7371p6298j54369j92067j46202l8286O0177
$$ 121239 -363425 -572550 -633738 -661109 -737407 -891776 -1083843 -1230045 -1268331 -1208154
12944a208154R0082N4329O40m0643q0482j36368j89304j75804l6093K22902N34252
$$ -1208154 -1118072 -1063743 -1063103 -1103746 -1184228 -1320596 -1509900 -1685704 -1721797 -1498895 -964643
12933i64643Q28349J049074J141211J069749Q49043N43129K36827j2026k00068
$$ -964643 -136294 912780 2053991 3123740 3972783 4515912 4752739 4740713 4540645
12924D540645l45564m30082l95334k04217J05800M29284O62661P84570Q47146
$$ 4540645 4195081 3764999 3369665 3165448 3271248 3700532 4363193 5147763 5994909
12915E994909Q77562Q36479O91330M73522K44108N2135o6419r4221m9629J1773
$$ 5994909 6872471 7708950 8400280 8873802 9117910 9170045 9103626 9009405 8959776 8971549
12905H971549K2279m6105j51712k22382k21275j68171j15503j17816k04270l64190
$$ 8971549 8993828 8947723 8796011 8573629 8352354 8184183 8068680 7950864 7746594 7382404
12895G382404n59839p53048r18887j039670j092728j050834r14427p44441o39316
$$ 7382404 6822565 6069517 5150630 4110960 3018232 1967398 1052971 308530 -330786
12886c30786o62640p84300r06712r57369r28465q40229p14075n70532m19437k52291
$$ -330786 -993426 -1777726 -2684438 -3641807 -4570272 -5410501 -6124576 -6695108 -7114545 -7366836
12876g366836n6190J65318L86412N70898O95335P58134P62903P12713O31724N62669
$$ -7366836 -7423026 -7257708 -6871296 -6300398 -5605063 -4846929 -4084026 -3371313 -2739589 -2176920
12866b176920N23044M89694M39614L90615L87624M46485N37437O26661O99430
$$ -2176920 -1653876 -1164182 -724568 -333953 53671 500156 1037593 1664254 2363684
12857B363684P40015P21114O27586M70671K75748O9473j20453k54787k90016k14515
$$ 2363684 3103699 3824813 4452399 4923070 5198818 5268291 5147838 4893051 4603035 4388520
12847D388520o9360P9178J87333K39201K09297N8266k13744n22801p33072p51832
$$ 4388520 4319160 4398338 4585671 4824872 5034169 5092435 4878691 4355890 3622818 2870986
12837B870986n94835l57221j38490o99K7100n7969k26057m16958n52790n67415
$$ 2870986 2276151 1918930 1780440 1779741 1806841 1748872 1522815 1105857 553067 -14348
12827a4348m43751k19354M1699K86727M93008O55317P69159Q22229P94941O81514
$$ -14348 -458099 -677453 -635754 -349027 143981 799298 1568457 2390686 3185627 3867141
12817C867141N07858L22818J85455J42890J92182K76623L28976L11775K25106
$$ 3867141 4374999 4697817 4883272 5026162 5218344 5494967 5823943 6135718 6360824
12808F360824R0218o6203k08806k90769k71837j39969Q2293L41642N65317O90762
$$ 6360824 6451042 6384839 6176033 5885264 5613427 5473458 5555751 5897393 6462710 7153472
12798G153472P00209O26240N29015M61025M29020L88268K78788O9885k15677n15384
$$ 7153472 7853681 8479921 9008936 9469961 9898981 10287249 10566037 10635922 10420245 9904861
12788I904861p60003q97025r14095q39096p03963n22270k93251j4241L04620O31795
$$ 9904861 9144858 8247833 7333738 6494642 5790679 5268409 4975158 4960917 5265537 5897332
12778E897332R17748J111765J178116J095115Q50475M62745J1542l87100o57323
$$ 5897332 6815080 7926845 9104961 10200076 11050551 11513296 11524838 11137738 10480415
12769A0480415p90423p91938o56632m09256j28847Q8255J89485J99593J98844
$$ 10480415 9689992 8898054 8241422 7832166 7703319 7791574 7981059 8180652 8379496
12760H379496K53805L70146N13854O49756P48532P81369P27678N87396L87372
$$ 8379496 8633301 9003447 9517301 10167057 10915589 11696958 12424636 13012032 13399404
12751A3399404J82873L9351j599N7700J65489K33479J84727O245k39785m53235
$$ 13399404 13582277 13621628 13620029 13677729 13843218 14076697 14261424 14267669 14027884 13574649
12741A3574649n60025n52468m74657l83886l28774l46814m45220n70215o40489
$$ 13574649 13014624 12462156 11987499 11603613 11274839 10928025 10482805 9912590 9272101
12732I272101o22068n31353l90647k25247p5216J5875J8949n7126j48809j66094
$$ 9272101 8650033 8118680 7728033 7502786 7427570 7443445 7462394 7405268 7256459 7090365
12722G090365o1176J21570K72705L10891K47420J53198Q3045M4348J1497m8276
$$ 7090365 7029189 7150759 7423464 7734355 7981775 8134973 8218018 8262366 8273863 8225587
12712H225587j45413k44659k83801k37449j48987q2039o1890q0801j34652k24966
$$ 8225587 8080174 7835515 7551714 7314265 7165278 7083239 7021349 6940548 6805896 6580930
12702F580930l27750l92303l85021l12415j99797p2480M1303J14625J46944J66587
$$ 6580930 6253180 5860877 5475856 5163441 4963644 4891164 4932467 5047092 5194036 5360623
12692E360623J79981J46562M2662p6093j08503M418K29543M64417O06999O21151
$$ 5360623 5540604 5687166 5729828 5653735 5545232 5549650 5779193 6243610 6850609 7471760
12682G471760N40323M08628K38750L9806j39797k27612j88906o3580O2366J13562
$$ 7471760 8012083 8420711 8659461 8699267 8559470 8331858 8142952 8079372 8141738 8255300
12672H255300N8307q9271k73111m01647m01094l00731k13982k13290k82236l75418
$$ 8255300 8313607 8224336 7951225 7549578 7148484 6847753 6633771 6420481 6138245 5762827
12662E762827m68409n59612o47558p07677p06462o46422n68514n05930m60161
$$ 5762827 5294418 4734806 4087248 3379571 2673109 2026687 1458173 952243 492082
12653D92082m17240l62522k74788j35727L6626J91654K99617L81415M69842N62258
$$ 492082 74842 -287680 -562468 -698195 -661569 -469915 -170298 211117 680959 1243217
12643A243217O22452O05713M77095K22569j36528n24393q23132r41094q75987
$$ 1243217 1865669 2471382 2948477 3171046 3034518 2510125 1686993 745899 -130088
12634a30088o90062m35138j40307J44494L49203M30321L94453K94074K08745J95052
$$ -130088 -820150 -1255288 -1395595 -1251101 -901898 -471577 -77124 216950 425695 620747
12624F20747K34623K52826K02809J14435N3840N3372R7122J57110K04157J92483
$$ 620747 855370 1108196 1311005 1425440 1479280 1532652 1629774 1786884 1991041 2183524
12614B183524P6717j36137l59219m71927m02191j78039Q4425K64740L28054L25450
$$ 2183524 2260241 2124104 1764885 1292958 890767 712728 797153 1061893 1389947 1715397
12604A715397L23876L59532M35342N34503O32460O94236O76198N51254L29506
$$ 1715397 2039273 2398805 2834147 3368650 4001110 4695346 5371544 5922798 6252304
12595F252304N7187k01181l93940m96170n02704m25933k88830j10101R8194L20229
$$ 6252304 6309491 6108310 5714370 5218200 4715496 4289563 4000733 3890632 3988826 4309055
12585D309055N29655O85998P33498O29493L91893J01367j48715l01480l52672
$$ 4309055 4838710 5524708 6258206 6887699 7279592 7380959 7232244 6930764 6578092
12576F578092l28169k53082j56240q1633n9603p4991q8673q8682j04263j67789
$$ 6578092 6249923 5996841 5840601 5758968 5699365 5624374 5535701 5447019 5342756 5174967
12566E174967k78844m05105n01035n25999m60954l22553j63664m8955j6994n3990
$$ 5174967 4896123 4491018 3989983 3463984 3003030 2680477 2516813 2467858 2450864 2396874
12556B396874j03841j05340k7294J05362K17560K40194J69386O7191Q261L2084
$$ 2396874 2293033 2187693 2160399 2265761 2483321 2723515 2892901 2960092 2968353 3000437
12546C000437J36112K95318M80060O53258P74019Q27605Q30298P96549P27931
$$ 3000437 3136549 3431867 3911927 4565185 5339204 6166809 6997107 7793656 8521587
12537H521587O42788N79148N45402N08859M52592M09826M23690M95135N78996
$$ 8521587 9164375 9743523 10288925 10797784 11250376 11660202 12083892 12579027 13158023
12528A3158023O10090N44911M04273K72534K49680L87477O44313R02906J052673
$$ 13158023 13768113 14313024 14717297 14989831 15239511 15626988 16271301 17174207 18226880
12519A8226880J060288R69422Q58667P93136P87782Q15014Q37031Q20221P48440
$$ 18226880 19287168 20256590 21115257 21908393 22696175 23511189 24348220 25168441 25916881
12510B5916881O44211N57149N27687N75661O99259Q60058R88154J028932R93517
$$ 25916881 26561092 27118241 27645928 28221589 28920848 29780906 30769060 31797992 32791509
12501C2791509R50802R65613J062132J231876J442880J653616J837509J981001
$$ 32791509 33742311 34707924 35770056 37001932 38444812 40098428 41935937 43916938
12493D3916938K062820K059826J972011J834540J698071J589325J493306J368196
$$ 43916938 45979758 48039584 50011595 51846135 53544206 55133531 56626837 57995033
12485E7995033J175333R15597O46766M49176L64421L74421M37185N27470O36773
$$ 57995033 59170366 60085963 60732729 61181905 61546326 61920747 62357932 62885402 63522175
12476F3522175P46230Q20894Q28502P50576N86290L56790J04092j18638k71380
$$ 63522175 64268405 65089299 65917801 66668377 67254667 67611457 67715549 67596911 67325531
12467F7325531l50695l86968m20326m76583n58143o45756p09741p30880p20467
$$ 67325531 66974836 66587868 66167542 65690959 65132816 64487060 63777319 63046439 62325972
12458F2325972p24527p91781r24174j072224j177424j212330j193375j160822
$$ 62325972 61601445 60809664 59885490 58813266 57635842 56423512 55230137 54069315
12450E4069315j150760j185044j268198j381533j482208j514666j440833j279625
$$ 54069315 52918555 51733511 50465313 49083780 47601572 46086906 44646073 43366448
12442D3366448j112147j027444j049517j113299j120382j018422q21025n71741
$$ 43366448 42254301 41226857 40177340 39064041 37943659 36925237 36104212 35532471
12434C5532471l19724j18908j7858m8557k24746n17870q29984j036527j077752
$$ 35532471 35212747 35093839 35075981 35027424 34802678 34284808 33454824 32418297 31340545
12425C1340545j002905r30632r60603j097577j254284j329048j270614j101919
$$ 31340545 30337640 29407008 28446405 27348828 26094544 24765496 23494882 22392963
12417B2392963r14130q01490p78600p77604p19942n78579l83097j84754k0329
$$ 22392963 21478833 20677343 19898743 19121139 18401197 17822618 17439521 17254767 17234438
12408A7234438J09477K37557L91007N47015O41467O22502M98691L36395J97496
$$ 17234438 17343915 17581472 17972479 18519494 19160961 19783463 20282154 20618549 20816045
12399B0816045R0257o025r8104j83006k69863l78005n13140o50911p59330q32806
$$ 20816045 20906302 20900277 20802173 20619167 20349304 19971299 19458159 18807248 18047918 17215112
12389A7215112q83602r12961r20094r18902r18811r07682q63693p74472o46168
$$ 17215112 16331510 15418549 14498455 13579553 12660742 11753060 10889367 10114895 9468727
12380I468727m98310l55387k41788j62470r2017o281Q7300J62980K06620K28060
$$ 9468727 8970417 8615030 8373242 8210772 8118755 8112474 8199774 8362754 8569374 8797434
12370H797434K48516K79100L12055L25322K90043J85592K2412j55781k96846l62821
$$ 8797434 9045950 9325050 9637105 9962427 10252470 10438062 10460474 10304693 10007847 9645026
12360I645026l42793k66154j99800j95073k23610k04537j07587P177O4398M9414
$$ 9645026 9302233 9036079 8836279 8641206 8417596 8213059 8105472 8112649 8177047 8226461
12350H226461K045l0938l2766j8082m728J594q017n8294j72322l32929m69866
$$ 8226461 8228506 8197568 8164802 8146720 8141992 8143586 8135569 8077275 7904953 7572024 7102158
12339G102158n06837m10611j88721J19317M38030O80778P93948P75699O63461
$$ 7102158 6595321 6184710 5995989 6115306 6553336 7234114 8028062 8803761 9467222
12330I467222N11935L71999K62671J66831P1710j0823o4152p4769l3731L9294
$$ 9467222 9979157 10351156 10613827 10780658 10852368 10841545 10777393 10702624 10668893 10708187
12320A0708187P9375J7916j48338l53052n20954o03948n79744m62985l08274j71356
$$ 10708187 10787562 10805478 10657140 10304088 9783134 9179186 8599442 8136457 7828183 7656827
12310G656827o9154J4618R0638J28664P0345j12681l78062o33431q06416q87781
$$ 7656827 7587673 7602291 7692929 7821593 7891938 7779257 7401195 6767764 5961348 5073567
12300E073567q95062q16948o20852l16988M256K21352K73436J95977O8311n4679
$$ 5073567 4178505 3361557 2740705 2423717 2427973 2649325 2922761 3118738 3187049 3132370
12290C132370j51579k00046j64401k3941J89572L82897M43410L20810P6429j66757
$$ 3132370 2980791 2780745 2616344 2592403 2781975 3164872 3608282 3929092 4005521 3838764
12280C838764l30019m31497n32639o49774p35644p29882o00692l45670N995L77156
$$ 3838764 3508745 3077248 2544609 1894835 1159191 429309 -171383 -517053 -511058 -133902
12270a33902O69732Q30656Q68480Q14037O98329N49068L80186J90087j9140k20275
$$ -133902 535830 1366486 2234966 3049003 3747332 4296400 4676586 4866673 4847533 4627258
12260D627258l72780m48735m31782l14293j13953J29964L75214N71414O67122
$$ 4627258 4254478 3805743 3373961 3059668 2945715 3075679 3450893 4022307 4689429
12251D689429O56864N91256N12004L95974J85528j25167m59068p17235q42341
$$ 4689429 5346293 5937549 6449553 6845527 7031055 6905888 6446820 5729585 4887244
12242D887244q25194o92309n02588l28493k21610j94344k33926l29221m62023
$$ 4887244 4062050 3369741 2867153 2538660 2317050 2122706 1888780 1559559 1097536
12233A097536n84998o54733o67470o30083n36788l89472k13242n4940L4862K8746
$$ 1097536 512538 -142195 -809665 -1439748 -1976536 -2366008 -2579250 -2634190 -2599328 -2570582
12223b570582o3857j94333k91259l03074k22763p2447J07268K60474L50308L88562
$$ -2570582 -2634439 -2828772 -3120031 -3423105 -3645868 -3718315 -3611047 -3350573 -3000265 -2611703
12213b611703M12376M47094M95302N45053N82551N93360N56828M47794K50228
$$ -2611703 -2199327 -1752233 -1256931 -711878 -129327 464033 1020861 1468655 1718883
12204A718883j9536k98015m96956n65182n33817m82988m63186m56743m09511k89266
$$ 1718883 1699347 1401332 904376 339194 -194623 -677611 -1140797 -1597540 -2007051 -2296317
12194b296317j02589J26197L69473N95685P62128Q23796P56500N60537K52657
$$ -2296317 -2398906 -2272709 -1903236 -1307551 -545423 278373 1034873 1595410 1848067
12185A848067j22477m78260p14106p74997o78838m93134k93189j26938j2837L7522
$$ 1848067 1725590 1247330 533224 -241773 -920611 -1413745 -1706934 -1833872 -1846709 -1809187
12175a809187K3058k4165o1151q6761j36208k22282l16282l79686l96482l78370
$$ -1809187 -1786129 -1810294 -1871445 -1958206 -2094414 -2316696 -2632978 -3012664 -3409146 -3787516
12165c787516l28191k19422m1605J66086L42462M46606M74172M47062M00154L70959
$$ -3787516 -4115707 -4335129 -4376734 -4210648 -3868186 -3421580 -2947408 -2500346 -2100192 -1729233
12155a729233L77279M04749M28390M32608M13764L84846L71447L91576M38380
$$ -1729233 -1351954 -947205 -518815 -86207 327557 712403 1083850 1475426 1913806
12146A913806M84219N07674N06583M80903M25244L38939K26229R1212n5844j90240
$$ 1913806 2398025 2905699 3412282 3893185 4318429 4657368 4883597 4974809 4918965 4728725
12136D728725k79749l09075k93246k56617k13797j80773j86803k52295l38005
$$ 4728725 4448976 4139901 3846655 3590038 3376241 3195468 3008665 2756370 2418365
12127B418365l42422j86536J12876M61029P42879Q68238Q09149O11087L56580
$$ 2418365 2075943 1889407 2002283 2463312 3206191 4074429 4883578 5494665 5851245
12118E851245J17044p2579k16105l33768m28743m78012m64816m11118l57791l19034
$$ 5851245 5968289 5895710 5679605 5345837 4917094 4439082 3974266 3563148 3205357 2886323
12108B886323k73000j95793r7107j8152R379o737m4337j05159j98088k90470l11129
$$ 2886323 2613323 2417530 2320423 2302271 2311650 2304913 2260576 2155417 1957329 1666859 1355730
12097A355730k21616p4118K1789q002j54839l57050n40954o41400o28255n23560
$$ 1355730 1134114 1059996 1081785 1073783 918944 561894 20940 -620460 -1248715 -1772275
12087a772275l73528j99171K1286L16730O66413R89407J193543J232181J131872
$$ -1772275 -2145803 -2344974 -2323688 -2006958 -1340545 -351138 842405 2074586 3206458
12078C206458R68042P97703O17943L92278J16447j44417l01150l23742k62620
$$ 3206458 4174500 4972203 5590146 5982424 6098871 5954454 5653304 5329562 5066942
12069E066942j96323j75277k09582k87910l95371n20094o44318p31053p40809
$$ 5066942 4870619 4695342 4485760 4197850 3802479 3282385 2638067 1907014 1166205
12060A166205o73755n79971n07666m49409l64109k48038j59096j62836k63288
$$ 1166205 492450 -87521 -595187 -1044596 -1408705 -1656743 -1815839 -1978675 -2241963
12051b241963l89903m50082l98922k65467j20916k3146K5062P4131J81465L61861
$$ -2241963 -2631866 -3081948 -3480870 -3746337 -3867253 -3890399 -3865337 -3791206 -3609741 -3247880
12041c247880N82525Q06906J018497J188489J249159J130105Q40156M98473K49190
$$ -3247880 -2665355 -1858449 -839952 348537 1597696 2727801 3567957 4066430 4315620
12032D315620J41040J12087R0512P0150P9334J20376J51622J22346K9559p4202
$$ 4315620 4456660 4568747 4659259 4729409 4808743 4929119 5080741 5203087 5232646 5158444
12022E158444j36473j52776j49410j27584m6157J28359L65762N76436O63866N79007
$$ 5158444 5021971 4869195 4719785 4592201 4546044 4674403 5040165 5616601 6280467 6859474
12012F859474L47617M5572k57386n23126p32094q65093q95090q06365o21930l84811
$$ 6859474 7207091 7252663 6995277 6472151 5740057 4874964 3979874 3173509 2551579 2166768
12002B166768j24321J41433L86903N65985O23614N29748K99327p453k99590n02742
$$ 2166768 2042447 2183880 2570783 3136768 3760382 4290130 4589457 4582004 4282414 3779672
11992C779672o08100o55846o65982o11876m72287k73093o8130Q7213J45614Q2910
$$ 3779672 3171572 2515726 1849744 1237868 765581 492488 424358 511571 657185 740095
11982G40095q3645k98563m87339n80050n47705m14164k24136k6519J23941J98410
$$ 740095 656450 357887 -129452 -709502 -1257207 -1671371 -1895507 -1922026 -1798085 -1599675
11972a599675K23205K46227K93590L67511M48970N04362N09599M56613L48494
$$ -1599675 -1376470 -1130243 -836653 -469142 -20172 484190 993789 1450402 1798896
11963A798896K22269J57863K15630L66948N15875N75892N08121L07622j0013l93906
$$ 1798896 2021165 2179028 2394658 2761606 3277481 3853373 4361494 4669116 4659103 4265197
11953D265197p56722j007557j077973r36587o16673k20577J33288L72659M85986
$$ 4265197 3508475 2500918 1422945 486358 -130315 -350892 -217604 155055 641041
11944F41041M92924M10641K44983J4185k20290l68962l74547k50947o2713J25827
$$ 641041 1133965 1544606 1789589 1803774 1583484 1214522 839975 589028 526315 652142
11934F52142K79177L80651M13280L60941K31158P2734l6855k9748J08823L20359
$$ 652142 931319 1311970 1725250 2086191 2317349 2390083 2353228 2323480 2432303 2752662
11924B752662M96990N36926L91996Q4403k95619o12536p50240o84762m88482k71018
$$ 2752662 3249652 3786578 4178574 4262977 3967358 3354822 2604582 1919820 1431338 1160320
11914A160320j24940r6705j72560k90661l78361l87448l05463j46172N8859K63419
$$ 1160320 1035380 938675 766115 475454 97093 -290355 -595818 -741990 -683131 -419712
11904d19712M17549M93659N07076M92875M61383L94882K87667J79200J36736J98913
$$ -419712 -2163 491496 998572 1491447 1952830 2347712 2635379 2814579 2951315 3150228
11894C150228L41450M92260N71053N31864L94309K28579R1211m999n0925k6787
$$ 3150228 3491678 3983938 4554991 5086855 5481164 5709743 5800954 5795955 5745030 5718243
11884E718243M3289P2976n135j59288k93160l49474l50220l44143l46830l38569
$$ 5718243 5761532 5834508 5829373 5670085 5376925 5027451 4677231 4333088 3986258 3647689
11874C647689l01515k42355j72217p6561P2530K71571M68408N97577O21445N30093
$$ 3647689 3346174 3103819 2931602 2855041 2927571 3199142 3667550 4265127 4886572 5416665
11864E416665L21357N222l73349p36999j000166j096786j024777q59716o93642
$$ 5416665 5738022 5743244 5369895 4632896 3632730 2535944 1511167 651451 -42191
11855d2191n75519n07763m58189l73545k17461j2289J73529K97935L86621M86371
$$ -42191 -617710 -1125473 -1583662 -1957207 -2174668 -2186957 -2013428 -1715493 -1328872 -842501
11845h42501O09243P31770Q12296P97961O46887L70223M1981k47492m36937m91010
$$ -842501 -233258 498512 1310808 2108769 2755656 3125879 3167860 2920368 2483431 1992421
11835A992421l90147j63403R2857K75603L41604L09889K34293J77352J86580K68159
$$ 1992421 1602274 1438871 1531728 1807331 2148935 2458824 2693117 2870469 3057049 3325208
11825C325208L69346M02563L07388R4964j59231l56697m30360l90913l14534k64456
$$ 3325208 3694554 4097117 4404505 4499469 4340238 3983541 3553181 3162268 2847734 2583278
11815B583278k39125k06906j63180j37369j59559k30426l16706l68034l36556
$$ 2583278 2344153 2137247 1974067 1836698 1677139 1446713 1130007 761973 425417
11806D25417j95916M4251L37775O14858Q15705R18422R23537Q37462O82738M91586
$$ 425417 229501 273752 611527 1226385 2042090 2960512 3884049 4721511 5404249 5895835
11796E895835K79895L9242k41481n44795q12616r66440r51693p76166n01702j94914
$$ 5895835 6175730 6214972 5973491 5428696 4616080 3649640 2697947 1921781 1420079 1225165
11786A225165R4680L18246M40734M73908M57737M13090L36719K29672J14972K1508
$$ 1225165 1319845 1638091 2078825 2552733 3010470 3423560 3760279 3989951 4104923 4126431
11776D126431n1545j31491k19484k72428k56675j94810j41167j27688j58569k34604
$$ 4126431 4074886 3943395 3723911 3451483 3194808 2999998 2858831 2731143 2572574 2337970
11766B337970l35850l95455l48695k06860l6166J20260K55012L59200M15143M13440
$$ 2337970 2002120 1606665 1257970 1051110 1014944 1135204 1390216 1749416 2164559 2577999
11756B577999L56872K43805O2036j81758m35791o38493p72626q52783q78481q42470
$$ 2577999 2934871 3178676 3240712 3058954 2623163 1984670 1212044 359261 -519220 -1361690
11746a361690p76155p35957p33719p10144n94843l86007j51154M1839J62380K06758
$$ -1361690 -2137845 -2873802 -3607521 -4317665 -4912508 -5298515 -5449669 -5407830 -5245450 -5038692
11736e038692J90785J52922J51283K31607L82187N34736O15873N93716M86790
$$ -5038692 -4847907 -4694985 -4543702 -4312095 -3929908 -3395172 -2779299 -2185583 -1698793
11727a698793L43234K12581J21329O0378N381m7165p9757p6454k5602P6233J96697
$$ -1698793 -1355559 -1142978 -1021649 -961271 -955890 -1003055 -1082812 -1159266 -1184868 -1108635 -911938
11716i11938K63561K24949J01631n2783k17641l97663n68582o64811o27727m63896
$$ -911938 -648377 -423428 -321797 -374580 -592221 -989884 -1558466 -2223277 -2851004 -3314900
11706c314900k54105j01916q5571k26904m69759p09890q59801q90596q28921p16038
$$ -3314900 -3569005 -3670921 -3756492 -3983396 -4453155 -5163045 -6022846 -6913442 -7742363 -8458401
11696h458401n70976l96721j97697J6443K29135M24711N93026P26556Q23987Q90050
$$ -8458401 -9029377 -9426098 -9623795 -9607352 -9378217 -8953506 -8360480 -7633924 -6809937 -5919887
11686e919887R27190R35766R21074Q83777Q03056O49492M25507J77408l3648j58400
$$ -5919887 -4992697 -4056931 -3135857 -2252080 -1449024 -799532 -374025 -196617 -230265 -388665
11676c88665j78049j18690l2844M8999J40890K67997M06855M65214L52873P3298
$$ -388665 -566714 -685404 -718248 -669249 -528359 -260362 146493 611707 964580 1037878
11666A037878k82125o09343q30991q96443p93748n67479k97714m2543J89437M02251
$$ 1037878 755753 146410 -684581 -1581024 -2374772 -2942251 -3239965 -3282508 -3093071 -2690820
11656b690820N66592O33427N91502M87019L87163L43281L66320M18277M42119
$$ -2690820 -2124228 -1490801 -899299 -412280 -25117 318164 684484 1102761 1544880
11647A544880M03497L11580K12010J49882J38017J63863K07372K45228K52435
$$ 1544880 1948377 2259957 2471967 2621849 2759866 2923729 3131101 3376329 3628764
11638C628764K08346R9065p9953l02146n05769o39491o84300o17322m14800j16822
$$ 3628764 3837110 3936175 3856222 3554076 3048307 2408816 1724516 1107194 692394 575572
11628E75572J61291L02734K61111P2476j87642m48534o43332p04285o05237l92515
$$ 575572 736863 1039597 1300708 1373184 1185542 737008 93676 -610609 -1215846 -1608361
11618a608361j40091J07917L31461N08583O25571O84172O86556O41289N77322
$$ -1608361 -1748452 -1640535 -1309074 -800491 -174920 509252 1195808 1837097 2414419
11609B414419N20214M58653L58720K14431P1972j469K5329J24943K49196L75689
$$ 2414419 2934633 3393286 3752006 3966437 4038409 4036940 4062269 4187212 4436408 4812097
11599D812097N08704O53535P87729Q41090P30354M40404N7792k90664n27504o52750
$$ 4812097 5320801 5974336 6762065 7603155 8333509 8773913 8831705 8541041 8013537 7360787
11589G360787p08401p39829p77788q27839q70545q78949q41213p70203o93036
$$ 7360787 6652386 5912557 5134769 4306930 3436385 2557436 1716223 946020 252984
11580B52984o30241n75557m93393l42086j11698J52685L84440N53783O71824P46816
$$ 252984 -377257 -952814 -1446207 -1788293 -1899991 -1747306 -1362866 -809083 -137259 609557
11570F09557P55786O66276M79597K38427o144k18704l78132m81890n44513n70970
$$ 609557 1365343 2031619 2511216 2749643 2743499 2524795 2146663 1664773 1120260 549290
11560E49290n48025m72407l73297l04387l07785l71576m30426m16668l12780j64323
$$ 549290 1265 -471142 -844439 -1148826 -1456611 -1828187 -2258613 -2675281 -2988061 -3152384
11550c152384l9393M0118J15616K30337L81701N36866O45327O45242N26561L71589
$$ -3152384 -3191777 -3151659 -3036043 -2805706 -2424005 -1887139 -1241812 -596570 -70009 301580
11540C01580K83450L08318M37950O29593Q17657R36489R42011Q32837O69142N55365
$$ 301580 585030 893348 1331298 1960891 2778548 3715037 4657048 5489885 6159027 6714392
11530F714392N63142O57496P19954O34519L48407r5675n55586q52740q80571o62105
$$ 6714392 7277534 7935030 8654984 9289503 9637910 9542235 8986649 8133909 7253338 6591233
11520F591233l12227K9279K47994L02505K37264J29693K7985o1689j53404k58820
$$ 6591233 6279006 6308285 6556279 6858784 7096048 7225741 7253726 7192037 7038633 6779813
11510F779813l73173m76812n61586o51214p68784q88341r52732r34769q49520
$$ 6779813 6406640 5929828 5368242 4717028 3948244 3059903 2107171 1172402 322882
11501C22882p03865m71212j42637K35251N93551Q71742J019566J013736Q79367
$$ 322882 -380983 -852195 -994832 -759581 -166030 705712 1725278 2739014 3618381
11492C618381O78172M68370K79037J27330L9811K9373N8436N0234n2444k41805
$$ 3618381 4296553 4764923 5043960 5171290 5211101 5240474 5298910 5349144 5296700 5054895
11482E054895m54119o11434o65703o22389n20984l95915k72451j90992k01937
$$ 5054895 4600776 3989342 3323639 2701250 2180266 1784351 1511900 1320908 1118971
11473A118971l20369m94612o36135o79908o10950m53767k45290j0252K27580M24269
$$ 1118971 798602 303990 -332145 -1012053 -1623003 -2076770 -2322060 -2332312 -2104732 -1680463
11463a680463N34487N45044M79265L71285K38786Q7527o5323j93733k82462l22013
$$ -1680463 -1145976 -600932 -121667 249618 488404 575931 510608 316875 34413 -287600
11453b87600k93480j87332l1254J24460K43658L20893L70863L94850L57237K22472
$$ -287600 -581080 -768412 -799666 -675206 -431548 -110655 260208 655058 1012295 1234767
11443A234767J9370j51639j85071n6089J47938K89925K92248J86478O4616n128
$$ 1234767 1254137 1102498 917427 861338 1009276 1299201 1591449 1777927 1842543 1837415
11433A837415k3057m5362j27483k65005l98729m71901m63094l71453k00773K3912
$$ 1837415 1814358 1768996 1641513 1376508 977779 505878 42784 -328669 -529442 -505530
11423e05530K42311L86096M24919L92385L77113M63534O54228Q52074R32625Q41855
$$ -505530 -263219 122877 547796 940181 1317294 1780828 2435056 3287130 4219755 5061610
11413E061610O23689L66749J40480l2250j69390l06338m71480o63610q44241r65434
$$ 5061610 5685299 6052048 6192528 6160278 5990888 5684550 5213070 4549460 3705219 2739785
11403B739785j000236r47474q31903o92349n48429l92720k27401p9997K8088J05934
$$ 2739785 1739549 792075 -39828 -732177 -1280606 -1673326 -1900727 -1980724 -1952636 -1846702
11393a846702J76041K40709K81797K92706K80560K32666J17895o8807k81861m40189
$$ -1846702 -1670661 -1429952 -1148155 -855449 -574889 -342223 -224328 -293135 -574996 -1015185
11383a015185m70457l58733j66840MN1697l9559k41449m97113p52229r59481j077217
$$ -1015185 -1485642 -1844375 -2011215 -2011211 -1959514 -1999073 -2240522 -2737635 -3489864 -4449345 -5526562
11372e526562j076893r56118p49683n16118k86061l4037K67507N80833Q21026
$$ -5526562 -6603455 -7559573 -8309256 -8825374 -9111435 -9145472 -8877965 -8297132 -7476106
11363g476106R35290R41180Q89855Q11248P03438N62135L98860K34075Q4267l9149
$$ -7476106 -6540816 -5599636 -4709781 -3898533 -3195095 -2632960 -2234100 -2000025 -1915758 -1954907
11353a954907j24931j77312k33354l44223n27265p41170r15532r92479r36776
$$ -1954907 -2079838 -2257150 -2490504 -2834727 -3361992 -4103162 -5018694 -6011173 -6947949
11344f947949p37388m25954q2229K02759L77247M42426M27957L68186K95619K34186
$$ -6947949 -7685337 -8111291 -8193520 -7990761 -7613514 -7171088 -6743131 -6374945 -6079326 -5845140
11334e845140J77629R3651k4540j31428j72392j39127p2259k9164n7652j66133
$$ -5845140 -5667511 -5573860 -5598400 -5729828 -5902220 -6041347 -6113606 -6142770 -6200422 -6366555
11324f366555l05342l97944l96310l14372k01515q7402M3437K12128L82293M64912
$$ -6366555 -6671897 -7069841 -7466151 -7780523 -7982038 -8069440 -8026003 -7813875 -7431582 -6966670
11314f966670L93252J87028n1356k10953k47773j85124o9405N7722J77559L00880
$$ -6966670 -6573418 -6386390 -6437746 -6648699 -6896472 -7081596 -7151001 -7093279 -6915720 -6614840
11304f614840M39897N77642O76755P06852O59736N57742M57054M31161N16072
$$ -6614840 -6174943 -5597301 -4920546 -4213694 -3553958 -2996216 -2539162 -2108001 -1591929
11295a591929O63409P80487Q11317P57228O43990M96964L31126J37491j06873
$$ -1591929 -928520 -148033 663284 1420512 2064502 2561466 2892592 3030083 2923210
11286B923210l98491o87514q99650r69438q74711o66340m39368k60589j57087
$$ 2923210 2524719 1837205 937555 -31883 -906594 -1572934 -2012302 -2272891 -2429978
11277b429978j49390k33525l52505m29163m17079l10165j21772J18918L53023
$$ -2429978 -2579368 -2812893 -3165398 -3594561 -4011640 -4321805 -4443577 -4324659 -3971636
11268c971636N08420N49201M89126L57158J83598P34j75274l36730m50557m67213
$$ -3971636 -3463216 -2914015 -2424889 -2067731 -1884133 -1883399 -2058673 -2395403 -2845960 -3313173
11258c313173l72847k17439p5244M1183K03777M68461P78145R99024J041499R20703
$$ -3313173 -3686020 -3903459 -3978703 -3937520 -3733743 -3265282 -2487137 -1488113 -446614 474089
11248D74089P12899M89854K87176J02794q7116k95520m90684n99704n68957m29694
$$ 474089 1186988 1676842 1964018 2066812 1979696 1684176 1193492 593788 24831 -404863
11238d04863k67353j26861K948J25754K14810K48350K33208J92693J49543J16938
$$ -404863 -672216 -799077 -796129 -670375 -455565 -207215 25993 218686 368229 485167
11228D85167Q6930M0107k4761q4833j16503j23333j34468j71444k27842k80422
$$ 485167 572097 612204 587443 502610 386107 262774 128306 -43138 -270980 -551402
11218e51402l15599l45702l93068m68806n74762p05129q38296r36291r55240q64821
$$ -551402 -867001 -1212703 -1605771 -2074577 -2649339 -3354468 -4192764 -5129055 -6084295 -6949116
11208f949116o68283m07791j47195N9042J81497K01667J13703n0883k28190l53698
$$ -6949116 -7617399 -8025190 -8172385 -8113343 -7931846 -7730179 -7616476 -7667359 -7895549 -8249247
11198h249247l93682l59269k95922k50468k31717k06754j38842k5543R6855J83006
$$ -8249247 -8642929 -9002198 -9298120 -9548588 -9780305 -9987059 -10125901 -10151444 -10054589 -9871583
11188i871583K11106J99492J90015J98944J93347J25554j2037j72102k83025k79480
$$ -9871583 -9660477 -9460985 -9270970 -9072026 -8878679 -8753125 -8765162 -8937264 -9220289 -9499769
11178i499769j30104J23881L71219N11109N25147M54917L44067K26039J35862
$$ -9499769 -9629873 -9505992 -9134773 -8623664 -8098517 -7643600 -7299533 -7073494 -6937632
11169f937632J03005J29971J91950K68990L65814M85619O04749O93098P35436
$$ -6937632 -6834627 -6704656 -6512706 -6243716 -5877902 -5392283 -4787534 -4094436 -3359000
11160c359000P20530O42876N24903M09557L29662K96488L10922L66795M36169
$$ -3359000 -2638470 -1995594 -1470691 -1061134 -731472 -434984 -124062 242733 678902
11151F78902M71935M42057L52339K31696J11373J2724n6459r7686j22313j47444
$$ 678902 1150837 1592894 1945233 2176929 2288302 2301026 2244567 2146881 2024568 1877124
11141A877124j86932k50718l48934m99189p12756r48838j113664j142602j059252
$$ 1877124 1690192 1439474 1090540 591351 -121405 -1070243 -2183907 -3326509 -4385761
11132d385761r36679q32694p59907o80255n26113k51564J14501M64534O79724
$$ -4385761 -5322440 -6155134 -6915041 -7595296 -8121409 -8372973 -8258472 -7793938 -7114214
11123g114214P11732O08325M67623L58871K91780K68357L19454M47564N67318
$$ -7114214 -6402482 -5794157 -5326534 -4967663 -4675883 -4407526 -4088072 -3640508 -3073190
11114c073190N68238M31015K33060N9783m0947l1797J25444M21134P62990J021381
$$ -3073190 -2504952 -2073937 -1840877 -1781094 -1822041 -1853838 -1728394 -1307260 -544270 477111
11104D77111J105556R96778P33482L89742N1562k31106m62883o47094p49694p51805
$$ 477111 1582667 2579445 3312927 3702669 3754231 3523125 3060242 2413148 1663454 911649
11094I11649o90876o17321n50481m86657m07240k86756j29676J0260O6621R886
$$ 911649 220773 -396548 -947029 -1433686 -1840926 -2127682 -2257358 -2247098 -2180477 -2170591
11084b170591j34778k96607l86627l34475j22396K02950N58608Q63996J057138
$$ -2170591 -2305369 -2601976 -2988603 -3323078 -3445474 -3242524 -2683916 -1819920 -762782
11075g62782J096090R70041P15804M09780J38695m0405j48900k84721n30464q62635
$$ -762782 333308 1303349 2019153 2428933 2567628 2527223 2378323 2093602 1563138 700503
11065G00503j156671j273090j159380q93356o29322m90342m88385n24750m72221
$$ 700503 -456168 -1729258 -2888638 -3781994 -4411316 -4901658 -5390043 -5914793 -6387014
11056f387014k72771K7175L09428M60679M45313L04822J00516j18027l00878l95540
$$ -6387014 -6659785 -6632610 -6323182 -5862503 -5417190 -5112368 -5011852 -5129879 -5430757 -5826297
11046e826297l77530k73054j37657j3074Q7896J61658J98085J85563J22404K3017
$$ -5826297 -6203827 -6476881 -6614538 -6627612 -6539716 -6378058 -6179973 -5994410 -5872006 -5848989
11036e848989q0570j48027j54656j07197l2605M7123J28760K21397L26074M23081
$$ -5848989 -5929559 -6077586 -6232242 -6339439 -6372044 -6324921 -6196161 -5974764 -5648690 -5225609
11026e225609M92468N45773O17848P26574Q48207R27667R11416P74826N36347
$$ -5225609 -4733141 -4187368 -3569520 -2842946 -1994739 -1067072 -155656 619170 1155517
11017A155517K55499p426k37081m50047o53041q27229r24386q80290o64929l24304
$$ 1155517 1411016 1403590 1166509 716462 63421 -763808 -1688194 -2568484 -3233413 -3557717
11007c557717L8814L28252M96096N35168M66520L44129K35319J72592J33905P6182
$$ -3557717 -3518903 -3190651 -2694555 -2159387 -1692867 -1348738 -1113419 -940827 -806922 -730740
10997g30740k0249j37974k40669l07900l48750l76468l85783l74174l74962m33876
$$ -730740 -750989 -888963 -1129632 -1437532 -1786282 -2162750 -2548533 -2922707 -3297669 -3731545
10987c731545n51976o77152p50703p44626o54581m81925k40472M0281L26497N69333
$$ -3731545 -4283521 -4960673 -5711376 -6456002 -7110583 -7592508 -7832980 -7792699 -7466202 -6896869
$$ [...]
##END NTUPLES=NMR SPECTRUM
##END=
