##TITLE=31P ikalashn
DE-76H
11.12.2024
##JCAMPDX= 6.0         $$ Bruker NMR JCAMP-DX V2.0
##DATA TYPE= NMR SPECTRUM
##DATA CLASS= NTUPLES
##ORIGIN= UXNMR, Bruker Analytische Messtechnik GmbH
##OWNER= root
$$ TOPSPIN		Version 1.3
$$ 2024-12-11 15:48:31.203 +0400  Irina@DPX200
$$ Compression mode = diff/dup
##.OBSERVE FREQUENCY= 81.01967998063
##.OBSERVE NUCLEUS= ^31P
##.ACQUISITION MODE= SIMULTANEOUS
##.ACQUISITION SCHEME= undefined
##.AVERAGES= 64
##.DIGITISER RES= 17
##SPECTROMETER/DATA SYSTEM= spect
##.PULSE SEQUENCE= zgpg
##.SOLVENT NAME= D2O
##.SHIFT REFERENCE= INTERNAL, D2O, 1, 298.5841
##AUDIT TRAIL= $$ (NUMBER, WHEN, WHO, WHERE, WHAT)
$$ ##TITLE= Audit trail, TOPSPIN		Version 1.3
$$ ##JCAMPDX= 5.01
$$ ##ORIGIN= Bruker BioSpin GmbH
$$ ##OWNER= Irina
$$ $$ F:/spectra/data/iren/nmr/P31dec/1/pdata/1/auditp.txt
$$ ##AUDIT TRAIL=  $$ (NUMBER, WHEN, WHO, WHERE, VERSION, WHAT)
(   1,<2024-12-11 15:46:19.453 +0400>,<Irina>,<DPX200>,<TOPSPIN 1.3>,
      <acquisition in progress>)
(   2,<2024-12-11 15:48:00.437 +0400>,<Irina>,<DPX200>,<TOPSPIN 1.3>,
      <Start of raw data processing
       efp BC_mod = 2 LB = 10 FT_mod = 6 PKNL = 1 PHC0 = 176.7467 PHC1 = 207.5653 SI = 32K 
       data hash MD5: 32K
       12 83 E8 FD 93 E6 CF 5A C9 8B 2B 82 8D D2 4E 4E>)
(   3,<2024-12-11 15:48:02.562 +0400>,<Irina>,<DPX200>,<TOPSPIN 1.3>,
      <apk 
       data hash MD5: 32K
       E1 E2 32 91 39 44 AA 32 54 34 C6 7C 2C 63 41 30>)
(   4,<2024-12-11 15:48:05.156 +0400>,<Irina>,<DPX200>,<TOPSPIN 1.3>,
      <abs n ABSG = 5 
       data hash MD5: 32K
       76 06 80 EB 86 CD 86 04 38 58 1A 6A 62 BB 71 20>)
$$ ##END=
$$ 
$$ $$ hash MD5
$$ $$ D9 B4 94 B1 C4 C1 B0 A4 9E 57 F3 5A 71 AE 91 5B
##$RELAX= 
##$RELAX= 
##$RELAX= 
##$RELAX= 
##$RELAX= 
##$RELAX= 
##$RELAX= 
##$RELAX= 
##$RELAX= 
##$RELAX= 
##$RELAX= 
$$ Bruker specific parameters
$$ --------------------------
##$DU= <F:/spectra>
##$EXPNO= 1
##$NAME= <P31dec>
##$PROCNO= 1
##$TYPE= <nmr>
##$USER= <iren>
##$AMP= (0..31)
100 100 100 100 100 100 100 100 100 100 100 100 100 100 100 100 100 100 
100 100 100 100 100 100 100 100 100 100 100 100 100 100 
##$ANAVPT= -1
##$AQSEQ= 0
##$AQ_mod= 1
##$AUNM= <au_zg>
##$AUTOPOS= <>
##$BF1= 81.014009
##$BF2= 200.13
##$BF3= 200.13
##$BF4= 200.13
##$BF5= 200.13
##$BF6= 200.13
##$BF7= 200.13
##$BF8= 200.13
##$BYTORDA= 1
##$CFDGTYP= 0
##$CFRGTYP= 5
##$CHEMSTR= <none>
##$CNST= (0..63)
1 1 145 1 1 1 1 1 1 1 1 1 1 1 1 1 1 1 1 1 1 1 1 1 1 1 1 1 1 1 1 1 1 1 
1 1 1 1 1 1 1 1 1 1 1 1 1 1 1 1 1 1 1 1 1 1 1 1 1 1 1 1 1 1 
##$CPDPRG= <waltz16>
##$CPDPRG1= <>
##$CPDPRG2= <waltz16>
##$CPDPRG3= <>
##$CPDPRG4= <mlev>
##$CPDPRG5= <mlev>
##$CPDPRG6= <mlev>
##$CPDPRG7= <mlev>
##$CPDPRG8= <mlev>
##$CPDPRGB= <>
##$CPDPRGT= <>
##$D= (0..63)
0 1 0 0 0 0 0 0 0 0.06 0 0.03 2e-005 3e-006 0 0 0.0002 0 0 0 0 0 0 0 0 
0 0 0 0 0 0 0 0 0 0 0 0 0 0 0 0 0 0 0 0 0 0 0 0 0 0 0 0 0 0 0 0 0 0 0 
0 0 0 0 
##$DATE= 1733917678
##$DBL= (0..7)
120 120 120 11 120 120 24 19 
##$DBP= (0..7)
150 150 150 150 150 150 150 150 
$$ [...]
##$SW_h= 37037.037037037
##$TD= 32768
##$TD0= 1
##$TE= 300
##$TE2= 300
##$TE3= 300
##$TEG= 300
##$TL= (0..7)
0 120 53 12 22 120 120 120 
##$TP= (0..7)
150 150 150 150 150 150 150 150 
##$TP07= 0
##$TPNAME0= <>
##$TPNAME1= <>
##$TPNAME2= <>
##$TPNAME3= <>
##$TPNAME4= <>
##$TPNAME5= <>
##$TPNAME6= <>
##$TPNAME7= <>
##$TPOAL= (0..7)
0.5 0.5 0.5 0.5 0.5 0.5 0.5 0.5 
##$TPOFFS= (0..7)
0 0 0 0 0 0 0 0 
##$TUNHIN= 0
##$TUNHOUT= 0
##$TUNXOUT= 0
##$USERA1= <user>
##$USERA2= <user>
##$USERA3= <user>
##$USERA4= <user>
##$USERA5= <user>
##$V9= 5
##$VALIST= <valist>
##$VCLIST= <CCCCCCCCCCCCCCC>
##$VD= 0
##$VDLIST= <DDDDDDDDDDDDDDD>
##$VPLIST= <PPPPPPPPPPPPPPP>
##$VTLIST= <TTTTTTTTTTTTTTT>
##$WBST= 1024
##$WBSW= 4
##$XGAIN= (0..3)
0 0 0 0 
##$XL= 0
##$YL= 0
##$YMAX_a= 1643
##$YMIN_a= -6375
##$ZGOPTNS= <>
##$ZL1= 120
##$ZL2= 120
##$ZL3= 120
##$ZL4= 120
##$ABSF1= 298.5841
##$ABSF2= -158.5842
##$ABSG= 5
##$ABSL= 5
##$ALPHA= 0
##$AQORDER= 0
##$ASSFAC= 0
##$ASSFACI= 0
##$ASSFACX= 0
##$ASSWID= 0
##$AUNMP= <proc_1d>
##$AXLEFT= 0
##$AXRIGHT= 0
##$AXTYPE= 0
##$AXUNIT= <>
##$AZFE= 0.1
##$AZFW= 0.5
##$BCFW= 0
##$BC_mod= 2
##$BYTORDP= 0
##$COROFFS= 0
##$CY= 12.5935478210449
##$DATMOD= 1
##$DC= 0
##$DFILT= <>
##$DTYPP= 0
##$F1P= 47.1127640792319
##$F2P= -24.0371245302204
##$FCOR= 0.5
##$FTSIZE= 32768
##$FT_mod= 6
##$GAMMA= 0
##$GB= 0
##$INTBC= 1
##$INTSCL= 7.269226e-011
##$ISEN= 30
##$LB= 10
##$LEV0= 0
##$LPBIN= 0
##$MAXI= 12.09355
##$MC2= 0
##$MEAN= 0
##$ME_mod= 0
##$MI= 0.7550151
##$NCOEF= 0
##$NC_proc= -12
##$NLEV= 6
##$NOISF1= 298.5841
##$NOISF2= 270.0111
##$NSP= 0
##$NTH_PI= 0
##$NZP= 0
##$OFFSET= 298.5841
##$PC= 1.4
##$PHC0= 58.08414
##$PHC1= 346.9353
##$PH_mod= 1
##$PKNL= yes
##$PPARMOD= 0
##$PPDIAG= 0
##$PPIPTYP= 0
##$PPMPNUM= 100
##$PPRESOL= 1
##$PSCAL= 0
##$PSIGN= 0
##$REVERSE= no
##$SF= 81.014009
##$SI= 32768
##$SIGF1= 270.0111
##$SIGF2= -158.5842
##$SINO= 77.54984
##$SIOLD= 32768
##$SREGLST= <31P.CDCl3>
##$SSB= 0
##$STSI= 32768
##$STSR= 0
##$SW_p= 37037.037037037
##$SYMM= 0
##$S_DEV= 0
##$TDeff= 32768
##$TDoff= 0
##$TI= <>
##$TILT= no
##$TM1= 0
##$TM2= 0
##$TOPLEV= 0
##$USERP1= <user>
##$USERP2= <user>
##$USERP3= <user>
##$USERP4= <user>
##$USERP5= <user>
##$WDW= 1
##$XDIM= 32768
##$YMAX_p= 454337403
##$YMIN_p= -14532679
$$ End of Bruker specific parameters
$$ ---------------------------------
##NTUPLES= NMR SPECTRUM
##VAR_NAME=  FREQUENCY,     SPECTRUM/REAL,   SPECTRUM/IMAG
##SYMBOL=    X,             R,               I
##VAR_TYPE=  INDEPENDENT,   DEPENDENT,       DEPENDENT
##VAR_FORM=  AFFN,          ASDF,            ASDF
##VAR_DIM=   32768,         32768,           32768
##UNITS=     HZ,            ARBITRARY UNITS, ARBITRARY UNITS
##FACTOR=    1.13031516577767, 1,            1
##FIRST=     37037.037037037, 798986,        -1407566
##LAST=      0,             -2317988,        -4393833
##MIN=       0,             -14532679,       0
##MAX=       37037.037037037, 454337403,     0
$$ Real data points
##PAGE= N=1
##DATA TABLE= (X++(R..R)), XYDATA
$$ [...]
$$ plain form
16454 7052756 4594682 2374547 534144 -733265 -1309771 -1236883 -674542 176814 1086233
16445 1086233 1835623 2331578 2609567 2727499 2700804 2526655 2226172 1835686 1355243 727230
16435 727230 -81901 -969082 -1733482 -2202542 -2295745 -2092987 -1872857 -1937369 -2367480 -3033139
16425 -3033139 -3802021 -4619707 -5407517 -6045352 -6489715 -6788135 -6979491 -7035035 -6884847 -6484510
16415 -6484510 -5883643 -5285253 -4965770 -5053723 -5441342 -5949453 -6483641 -6986360 -7322922 -7303973
16405 -7303973 -6852592 -6075343 -5166209 -4373008 -3954184 -3959791 -4139021 -4194154 -4017620 -3620472
16395 -3620472 -2981265 -2080076 -1036045 -110250 456672 617358 574886 629451 882291 1114939
16385 1114939 1079597 873145 838217 1137759 1635828 2137918 2536391 2771485 2802709 2578935
$$ packed form
16454G052756k458074k220135j840403j267409n76506P2888N62341Q51356R09419
16445A086233P49390M95955K77989J17932k6695j74149l00483l90486m80443o28013
16435G27230q09131q87181p64400m69060r3203K02758K20130o4512m30111o65659
16425c033139p68882q17686p87810o37835m44363k98420j91356n5544J50188M00337
16415f484510O00867N98390L19483q7953l87619n08111n34188n02719l36562J8949
16405g303973M51381P77249R09134P93201M18824n607j79230n5133J76534L97148
16395c620472O39207R01189J044031R25795N66922J60686m2472N4565K52840K32648
16385A114939l5342k06452l4928K99542M98069N02090L98473K35094L1224k23774
$$ plain form
16375 2578935 2003085 996658 -425174 -2174586 -4106593 -6001012 -7577570 -8610264
16367 -8610264 -9097598 -9242686 -9220836 -9073831 -8777977 -8277119 -7512003 -6476719 -5207953
16358 -5207953 -3757722 -2211578 -690883 660002 1701014 2336488 2510000 2198813 1526960
16349 1526960 821374 420959 482620 1005285 1926088 3171847 4643018 6139222 7394727
16340 7394727 8220507 8568688 8493863 8086743 7445119 6696426 5967465 5313399 4685774 3955635
16330 3955635 3018017 1916642 835226 -33291 -556936 -662269 -366798 200435 870296
16321 870296 1496120 1955909 2205703 2294257 2242176 1963752 1341851 372167 -816713 -2128684
16311 -2128684 -3574368 -5106528 -6498182 -7518015 -8103933 -8252066 -7933844 -7176166 -6090040
$$ packed form
16375B578935n75850j006427j421832j749412j932007j894419j576558j032694
16367h610264m87334j45088K1850J47005K95854N00858P65116J035284J268766
16358e207953J450231J546144J520695J350885J041012O35474J73512l11187o71853
16349A526960p05586m00415O1661N22665R20803J245759J471171J496204J255505
16340G394727Q25780L48181p4825m07120o41624p48693p28961o54066o27625p30139
16330C955635r37618j101375j081416q68517n23645j05333K95471N67233O69861
16321H70296O25824M59789K49794Q8554n2081k78424o21901r69684j188880j311971
16311b128684j445684j532160j391654j019833n85918j48133L18222P57678J086126
$$ plain form
16302 -6090040 -4812628 -3446670 -2050660 -730023 287907 754846 628737 201602 -96741
16293 -96741 -62817 233919 715461 1382915 2160025 2846244 3269692 3411242 3350242 3135558
16283 3135558 2790666 2387056 1992209 1579914 1050113 336882 -506835 -1310086 -1878845
16274 -1878845 -2147717 -2235417 -2314425 -2471850 -2698822 -2942211 -3185660 -3498912 -3949513 -4484873
16264 -4484873 -4913294 -4961401 -4410213 -3277413 -1830381 -383379 836603 1689440 2169679
16255 2169679 2446899 2735780 3069444 3236304 3014304 2414054 1685209 1195153 1226006 1765996
16245 1765996 2496903 3015378 3105489 2829464 2393104 1949166 1492426 903515 100136 -861870
16235 -861870 -1800442 -2435810 -2480388 -1821905 -622581 796601 2166400 3324491 4137275
$$ packed form
16302f090040J277412J365958J396010J320637J017930M66939j26109m27135k98343
16293i6741L3924K96736M81542O67454P77110O86219M23448J41550o1000k14684
16283C135558l44892m03610l94847m12295n29801p13231q43717q03251n68759
16274a878845k68872q7700p9008j57425k26972k43389k43449l13252m50601n35360
16264d484873m28421m8107N51188J132800J447032J447002J219982Q52837M80239
16255B169679K77220K88881L33664J66860k22000o00250p28845m90056L0853N39990
16245A765996P30907N18475R0111k76025m36360m43938m56740n88911q03379r62006
16235h61870r38572o35368m4578O58483J199324J419182J369799J158091Q12784
$$ plain form
16226 4137275 4495524 4385750 3942461 3392399 2904229 2532759 2304824 2259939 2374974 2544468
16216 2544468 2636722 2541255 2226414 1750741 1181074 522515 -236689 -1038793 -1754981 -2255451
16206 -2255451 -2462259 -2341399 -1921941 -1343876 -796530 -423097 -305376 -447090 -773688
16197 -773688 -1199815 -1701665 -2274682 -2844762 -3329728 -3733144 -4071988 -4303120 -4372556 -4234830
16187 -4234830 -3814439 -3028049 -1901327 -628590 584724 1689018 2700590 3567032 4225133
16178 4225133 4694128 5011238 5152025 5071115 4736552 4151574 3393858 2603255 1933030 1511336
16168 1511336 1360834 1326020 1139726 597718 -273182 -1214131 -1949045 -2371212 -2522175 -2510342
16158 -2510342 -2456428 -2438765 -2447153 -2371451 -2071629 -1473916 -616263 357454 1278809 2067980
$$ packed form
16226D137275L58249j09774m43289n50062m88170l71470k27935m4885J15035J69494
16216B544468R2254r5467l14841m75673n69667o58559p59204q02104p16188n00470
16206b255451k06808J20860M19458N78065N47346L73433J17721j41714l26598
16197g73688m26127n01850n73017n70080m84966m03416l38844k31132o9436J37726
16187d234830M20391P86390J126722J272737J213314J104294J011572Q66442O58101
16178D225133M68995L17110J40787q0910l34563n84978p57716p90603o70225m21694
16168A511336j50502l4814j86294n42008q70900r40949p34914m22167j50963J1833
16158b510342N3914J7663q388P5702K99822N97713Q57653R73717R21355P89171
$$ plain form
16148 2067980 2711723 3126821 3160880 2791144 2226934 1752552 1557524 1736732 2297026 3095842
16138 3095842 3862106 4359545 4555458 4603963 4668717 4770557 4768263 4481447 3846015 2948074
16128 2948074 1926967 881891 -107777 -928368 -1483818 -1764246 -1822639 -1754713 -1719995 -1890477
16118 -1890477 -2320354 -2902406 -3482880 -3984360 -4367792 -4567007 -4596379 -4625538 -4841919 -5307610
16108 -5307610 -5937408 -6587060 -7206103 -7849925 -8527734 -9119971 -9425861 -9285353 -8689397
16099 -8689397 -7829458 -7052221 -6672856 -6770436 -7168173 -7571158 -7709567 -7447158 -6830233 -6032522
16089 -6032522 -5230786 -4496885 -3757013 -2875563 -1854947 -919175 -340141 -238411 -566945
16080 -566945 -1194682 -1976849 -2781497 -3477852 -3955882 -4169901 -4109380 -3738651 -3035363 -2073550
$$ packed form
16148B067980O43743M15098L4059l69736n64210m74382j95028J79208N60294P98816
16138C095842P66264M97439J95913M8505O4754J01840k294k86816o35432q97941
16128B948074j021107j045076r89668q20591n55450k80428n8393O7926L4718j70482
16118a890477m29877n82052n80474n01480l83432j99215k9372k9159k16381m65691
16108e307610o29798o49652o19043o43822o77809n92237l05890J40508N95956
16099h689397Q59939P77237L79365r7580l97737m02985j38409K62409O16925P97711
16089f032522Q01736P33901P39872Q81450J020616R35772N79034J01730l28534
16080e66945o27737p82167q04648o96355m78030k14019O0521L70729P03288R61813
$$ plain form
16070 -2073550 -1010471 -25144 685214 952725 766713 307587 -205970 -672036 -1071747
16061 -1071747 -1388654 -1651822 -1970270 -2397771 -2808570 -3004135 -2907244 -2616376 -2309635 -2136042
16051 -2136042 -2162629 -2361843 -2637485 -2851212 -2871827 -2671170 -2344939 -2019286 -1747397 -1489693
16041 -1489693 -1195032 -858366 -513884 -275342 -338354 -836274 -1693809 -2663395 -3483289 -3984255
16031 -3984255 -4127174 -3985246 -3681255 -3339468 -3088583 -3006131 -3015541 -2950271 -2746308 -2497281
16021 -2497281 -2349519 -2376049 -2518596 -2675572 -2798105 -2879051 -2952974 -3091188 -3300958 -3462164
16011 -3462164 -3452528 -3269926 -2931669 -2365878 -1512243 -471014 494138 1104765 1246098 1013786
16001 1013786 616819 231970 -83519 -347315 -570959 -719546 -727676 -550119 -198916 239532
$$ packed form
16070b073550J063079R85327P10358K67511j86012m59126n13557m66066l99711
16061a071747l16907k63168l18448m27501m10799j95565R6891K90868L06741J73593
16051b136042k6587j99214k75642k13727k0615K00657L26231L25653K71889K57704
16041a489693K94661L36666L44482K38542o3012m97920q57535r69586q19894n00966
16031c984255j42919J41928L03991L41787K50885Q2452r410O5270K03963K49027
16021b497281J47762k6530j42547j56976j22533q0946p3923j38214k09770j61206
16011c462164R636J82602L38257N65791Q53635J041229R65152O10627J41333k32312
16001A013786l96967l84849l15489k63796k23644j48587q130J77557L51203M38448
$$ plain form
15991 239532 648011 970777 1229690 1467446 1702909 1917103 2089347 2266790 2557984 3001981
15981 3001981 3536752 4118256 4744603 5361985 5821806 5932686 5574238 4757285 3590215
15972 3590215 2244737 918373 -196396 -936834 -1213256 -1026108 -444997 385756 1244301
15963 1244301 1899836 2183630 2032232 1568298 1074072 790344 776089 922135 1030250 900784
15953 900784 430673 -305580 -1076611 -1637807 -1874385 -1843509 -1696694 -1542967 -1448925 -1519187
15943 -1519187 -1788238 -2112492 -2296723 -2260905 -2060848 -1782893 -1470365 -1149655 -900416 -848447
15933 -848447 -1024953 -1309893 -1534252 -1590677 -1471823 -1252267 -1055683 -1002648 -1127076 -1351825
15923 -1351825 -1586261 -1817687 -2091285 -2406699 -2642736 -2644626 -2363475 -1846871 -1159258 -364169
$$ packed form
15991B39532M08479L22766K58913K37756K35463K14194J72244J77443K91194M43997
15981C001981N34771N81504O26347O17382M59821J10880l58448q16953j167070
15972C590215j345478j326364j114769p40438k76422J87148N81111Q30753Q58545
15963A244301O55535K83794j51398m63934m94226k83728j4255J46046J08115j29466
15953I00784m70111p36253p71031n61196k36578L0876J46815J53727R4042p0262
15943a519187k69051l24254j84231L5818K00057K77955L12528L20710K49239N1969
15933h48447j76506k84940k24359n6425J18854K19556J96584N3035j24428k24749
15923a351825k34436k31426k73598l15414k36037j890K81151N16604O87613P95089
$$ plain form
15913 -364169 464077 1241917 1876620 2242510 2236651 1887681 1313516 624346 -90887 -790365
15903 -790365 -1499365 -2261360 -3116673 -4061735 -4957833 -5570769 -5742598 -5486997 -4901623 -4068041
15893 -4068041 -3091134 -2084228 -1094127 -172899 568999 1021661 1123030 876120 345853
15884 345853 -327438 -938307 -1327012 -1491494 -1580700 -1787467 -2218181 -2796929 -3292741 -3476738
15874 -3476738 -3241412 -2630491 -1817643 -1011906 -368577 -9553 -40117 -444985 -1013148 -1498829
15864 -1498829 -1818842 -1996271 -1995098 -1715736 -1133881 -366139 386656 952019 1282403 1417278
15854 1417278 1399399 1293757 1199822 1181538 1209374 1184849 1000592 579522 -89993 -904389
15844 -904389 -1638187 -2049686 -2043029 -1719623 -1276142 -903507 -765572 -963864 -1485277 -2224903
$$ packed form
15913c64169Q28246P77840O34703L65890n859l48970n74165o89170p15233o99478
15903g90365p09000p61995q55313r45062q96098o12936j71829K55601N85374Q33582
15893d068041R76907J006906R90101R21228P41898M52662J01369k46910n30267
15884C45853o73291o10869l88705j64482q9206k06767m30714n78748m95812j83997
15874c476738K35326O10921Q12848Q05737O43329L59024l0564m04868n68163m85681
15864a498829l20013j77429J173K79362N81855P67742P52795N65363L30384J34875
15854A417278j7879j05642r3935j8284K7836k4525j84257m21070o69515q14396
15844i04389p33798m11499O657L23406M43481L72635J37935j98292n21413p39626
$$ plain form
15834 -2224903 -3062378 -3948916 -4913926 -5923366 -6802625 -7363106 -7535738 -7394166 -7091171
15825 -7091171 -6724039 -6262384 -5622325 -4782304 -3842705 -2987880 -2412739 -2265861 -2578168
15816 -2578168 -3242024 -4119768 -5134088 -6177724 -7013184 -7383651 -7207152 -6595199 -5713756
15807 -5713756 -4744144 -3890748 -3260588 -2785690 -2362868 -2036249 -1931240 -2054654 -2282233
15798 -2282233 -2486628 -2590392 -2550569 -2368301 -2086115 -1722783 -1255863 -684897 -50864 584290
15788 584290 1155585 1655472 2143680 2618724 2965644 3099599 3038281 2797186 2352602 1696344
15778 1696344 846671 -147579 -1172760 -2066158 -2716660 -3153405 -3544318 -4067065 -4782895
15769 -4782895 -5667171 -6653715 -7607162 -8377683 -8916686 -9241821 -9325502 -9123249 -8667370 -8069375
$$ packed form
15834b224903q37475q86538r65010j009440q79259n60481j72632J41572L02995
15825g091171L67132M61655O40059Q40021R39599Q54825N75141J46878l12307
15816b578168o63856q77744j014320j043636q35460l70467J76499O11953Q81443
15807e713756R69612Q53396O30160M74898M22822L26619J05009j23414k27579
15798b282233k04395j03764L9823J82268K82186L63332M66920N70966O34033O35154
15788E84290N71295M99887M88208M75044L46920J33955o1318k41095m44584o56258
15778A696344q49673r94250j025181q93398o50502m36745l90913n22747p15830
15769d782895q84276r86544r53447p70521n39003l25135q3681K02253M55879N97995
$$ plain form
15759 -8069375 -7445962 -6861162 -6346557 -5893690 -5435707 -4932632 -4394718 -3836196 -3277301
15750 -3277301 -2700424 -2004933 -1109687 -79006 913524 1726011 2292407 2545380 2380667
15741 2380667 1754921 781887 -311400 -1306054 -2065519 -2541177 -2749867 -2798873 -2928316
15732 -2928316 -3389025 -4222960 -5253331 -6321626 -7367526 -8268015 -8823761 -8942226 -8723384
15723 -8723384 -8372162 -8043895 -7734125 -7328415 -6756904 -6049935 -5277099 -4505159 -3799497
15714 -3799497 -3197244 -2681953 -2214756 -1750726 -1234083 -629388 26054 605097 931179
15705 931179 881150 482511 -108109 -710607 -1233825 -1719693 -2246013 -2791225 -3183040 -3190137
15695 -3190137 -2698841 -1761185 -492948 942451 2275647 3225578 3661520 3635404 3319184
$$ packed form
15759h069375O23413N84800N14605M52867M57983N03075N37914N58522N58895
15750c277301N76877O95491Q95246J030681R92530Q12487N66396K52973j64713
15741B380667o25746r73034j093287r94654p59465m75658k08690m9006j29443
15732b928316m60709q33935j030371j068295j045900r00489n55746j18465K18842
15723h723384L51222L28267L09770M05710N71511P06969P72836P71940P05662
15714c799497O02253N15291M67197M64030N16643O04695O55442N79043L26082
15705I31179n0029l98639n90620o02498n23218m85868n26320n45212l91815p097
15695c190137M91296R37656J268237J435399J333196R49931M35942k6116l16220
$$ plain form
15686 3319184 2961778 2813512 3006928 3534575 4281246 5018865 5468345 5453632 4988453 4236806
15676 4236806 3421728 2750056 2370374 2358606 2709191 3283115 3806328 4016847 3817952 3282985
15666 3282985 2580387 1904130 1419892 1255650 1479551 2042875 2763973 3362026 3580655
15657 3580655 3361270 2847349 2232068 1683819 1380400 1484476 2000034 2679762 3174879
15648 3174879 3309143 3166436 2960104 2834704 2742757 2491905 1929751 1071778 40516
15639 40516 -988869 -1804129 -2253848 -2309706 -2023392 -1469614 -761866 -63805 484434 797196
15629 797196 824141 603492 307348 151940 273190 697283 1385332 2272426 3255484 4140108
15619 4140108 4643390 4532684 3817257 2785631 1806399 1107579 743937 693317 915963
$$ packed form
15686C319184l57406j48266J93416N27647P46671P37619M49480j4713m65179p51647
15676D236806q15078o71672l79682j1768L50585N73924N23213K10519j98895n34967
15666C282985p02598o76257m84238j64242K23901N63324P21098N98053K18629
15657C580655k19385n13921o15281n48249l03419J04076N15558O79728M95117
15648C174879J34264j42707k06332j25400r1947k50852n62154q57973j031262
15639D0516j029385q15260m49719n5858K86314N53778P07748O98061N48239L12762
15629G97196K6945k20649k96144j55408J21250M24093O88049Q87094R83058Q84624
15619D140108N03282j10706p15427j031626r79232o98820l63642n0620K22646
$$ plain form
15610 915963 1324230 1750412 2008991 2030750 1924211 1861184 1917141 2041878 2151425 2178111
15600 2178111 2024271 1611850 1003136 376589 -88772 -299712 -285407 -193199 -246812 -617884
15590 -617884 -1305099 -2170004 -3037904 -3749699 -4193633 -4330793 -4210704 -3968654 -3756334 -3643631
15580 -3643631 -3641169 -3764926 -4005877 -4340160 -4792485 -5364298 -5891342 -6073569 -5682094 -4705766
15570 -4705766 -3347793 -1919822 -695904 181269 692728 874731 773008 468472 86168
15561 86168 -287514 -687396 -1228253 -1970992 -2821697 -3530230 -3821032 -3545767 -2754961 -1675206
15551 -1675206 -587002 338820 1073975 1576951 1699603 1307419 439966 -705265 -1946123
15542 -1946123 -3154346 -4126568 -4587197 -4397823 -3732132 -2971973 -2450894 -2297268 -2435916
$$ packed form
15610I15963M08267M26182K58579K1759j06539o3027N5957J24737J09547K6686
15600B178111j53840m12421o08714o26547m65361k10940J4305R2208n3613l71072
15590f17884o87215q64905q67900p11795m43934j37160J20089K42050K12320J12703
15580c643631K462j23757k40951l34283m52325n71813n27044j82227L91475R76328
15570d705766J357973J427971J223918Q77173N11459J82003j01723l04536l82304
15561H6168l73682l99882n40857p42739q50705p08533k90802K75265P90806J079755
15551a675206J088204R25822P35155N02976J22652l92184q67453j145231j240858
15542a946123j208223r72222m60629J89374O65691P60159N21079J53626j38648
$$ plain form
15533 -2435916 -2684506 -2815059 -2602007 -1938116 -901658 319134 1545525 2621515 3404007
15524 3404007 3856750 4094959 4272553 4427320 4454048 4212222 3613593 2623416 1251498
15515 1251498 -407099 -2138273 -3680673 -4829714 -5480781 -5643665 -5452822 -5120441 -4788418
15506 -4788418 -4464562 -4147301 -3895017 -3729206 -3595659 -3451372 -3307717 -3187824 -3099903 -3047158
15496 -3047158 -2986471 -2804419 -2428831 -1912027 -1341121 -732358 -54930 688585 1431537 2098783
15486 2098783 2626843 2936829 3011592 2972461 3009163 3272072 3843840 4740648 5872932 7008496
15476 7008496 7806180 7926150 7189152 5696279 3807712 1970939 488437 -616593 -1487383
15467 -1487383 -2195407 -2679094 -2881747 -2829063 -2555054 -2051494 -1326040 -475654 342567 1014683
$$ packed form
15533b435916k48590j30553K13052O63891J036458J220792J226391J075990P82492
15524C404007M52743K38209J77594J54767K6728k41826n98629r90177j371918
15515A251498j658597j731174j542400j149041o51067j62884J90843L32381L32023
15506d788418L23856L17261K52284J65811J33547J44287J43655J19893Q7921N2745
15496c047158O0687J82052L75588N16804N70906O08763O77428P43515P42952O67246
15486B098783N28060L09986P4763l9131L6702K62909N71768Q96808J132284J135564
15476G008496P97684J19970p36998j492873j888567j836773j482502j105030q70790
15467a487383p08024m83687k02653N2684K74009N03560P25454Q50386Q18221O72116
$$ plain form
15457 1014683 1488583 1716444 1630544 1213849 603096 71349 -147826 -29104 250897 478516
15447 478516 591332 659270 711353 686091 544871 386253 372619 557796 870298 1239617
15437 1239617 1702527 2350611 3188915 4094028 4853603 5247610 5166062 4687914 4034024 3411813
15427 3411813 2910568 2526647 2207188 1855224 1355854 638812 -250009 -1135613 -1811673
15418 -1811673 -2161046 -2158173 -1804537 -1137972 -270615 625193 1348917 1715429 1658514 1280156
15408 1280156 758806 246468 -163752 -457213 -705066 -1027942 -1493180 -1960548 -2083177
15399 -2083177 -1555605 -342237 1323501 3079969 4568566 5505466 5718897 5186281 4044955
15390 4044955 2552299 986028 -465340 -1712043 -2693116 -3320753 -3475506 -3087922 -2247406
$$ packed form
15457A014683M73900K27861q5900m16695o10753n31747k19175J18722K80001K27619
15447D78516J12816O7938N2083k5262j41220j58618j3634J85177L12502L69319
15437A239617M62910O48084Q38304R05113P59575L94007q1548m78148o53890o22211
15427C411813n01245l83921l19459l51964m99370p17042q88821q85604o76060
15418a811673l49373K873L53636O66565Q67357Q95808P23724L66512n6915l78358
15408A280156n21350n12338m10220k93461k47853l22876m65238m67368j22629
15399b083177N27572J213368J665738J756468J488597R36900K13431n32616j141326
15390D044955j492656j566271j451368j246703r81073o27637j54753L87584Q40516
$$ plain form
15381 -2247406 -1179698 -119666 732978 1213990 1247845 835173 -23351 -1330932 -3025195
15372 -3025195 -4910977 -6659522 -7906888 -8430606 -8300713 -7849444 -7438481 -7217479 -7141496
15363 -7141496 -7183551 -7392246 -7757046 -8112801 -8204223 -7851941 -7052738 -5912542 -4577394
15354 -4577394 -3251586 -2140032 -1365312 -982284 -985869 -1260085 -1569688 -1698913 -1595873
15345 -1595873 -1329513 -971871 -576136 -241338 -115404 -278796 -625709 -875647 -764768
15336 -764768 -261829 446361 1156922 1770744 2240683 2491749 2439914 2055970 1403991 619834
15326 619834 -198269 -1065957 -2052661 -3163032 -4293926 -5333955 -6287575 -7186639 -7845212
15317 -7845212 -7881737 -7051159 -5464271 -3470299 -1448997 228741 1246772 1510196 1199412
$$ packed form
15381b247406J067708J060032Q52644M81012L3855m12672q58524j307581j694263
15372c025195j885782j748545j247366n23718J29893M51269M10963K21002P5983
15363g141496m2055k08695l64800l55755r1422L52282P99203J140196J335148
15354d577394J325808J111554P74720L83028l585k74216l09603j29225J03040
15345a595873K66360L57642L95735L34798J25934j63392l46913k49938J10879
15336g64768N02939P08190P10561O13822M69939K51066n1835l83944o51979p84157
15326F19834q18103q67688r86704j110371j130894j040029r53620q99064o58573
15317g845212l6525Q30578J586888J993972K021302J677738J018031K63424l10784
$$ plain form
15308 1199412 614959 20088 -417535 -663720 -809534 -947586 -1046491 -980252 -685172 -235768
15298 -235768 197872 407803 275438 -134149 -682026 -1315420 -2016061 -2642978 -2983293 -2952996
15288 -2952996 -2647757 -2226974 -1792832 -1355464 -890699 -429858 -106554 -103274 -523226 -1316571
15278 -1316571 -2369497 -3608964 -4976519 -6371832 -7655491 -8683587 -9342083 -9583321
15270 -9583321 -9491925 -9269759 -9082638 -8959367 -8853474 -8750660 -8694194 -8725448 -8811620 -8865038
15260 -8865038 -8849763 -8786582 -8620988 -8212491 -7482876 -6482515 -5341638 -4227962 -3304160
15251 -3304160 -2679096 -2390297 -2411770 -2648072 -2934325 -3118266 -3156198 -3116460 -3115559 -3245261
15241 -3245261 -3513532 -3805054 -3894793 -3551187 -2696793 -1513822 -351634 511208 1016308
$$ packed form
15308A199412n84453n94871m37623k46185j45814j38052r8905O6239K95080M49404
15298b35768M33640K09931j32365m09587n47877o33394p00641o26917l40315L0297
15288b952996L05239M20783M34142M37368M64765M60841L23304L280m19952p93345
15278a316571j052926j239467j367555j395313j283659j028096o58496k41238
15270i583321R1396K22166J87121J23271J05893J02814N6466l1254q6172n3418
15260h865038J5275O3181J65594M08497P29615J000361J140877J113676R23802
15251c304160O25064K88799k1473k36302k86253j83941l7932L9738R01j29702
15241c245261k68271k91522q9739L43606Q54394J182971J162188Q62842N05100
$$ plain form
15232 1016308 1260808 1330513 1294078 1287261 1405148 1559921 1576539 1394442 1098559 825095
15222 825095 730443 973041 1621910 2578791 3632242 4609515 5455048 6212148 6975776 7813561
15212 7813561 8706975 9581590 10370390 11009383 11368976 11257627 10559530 9365203 7948230
15203 7948230 6573804 5337360 4204774 3127336 2110089 1207088 482359 -19130 -332472
15194 -332472 -605540 -989296 -1478778 -1902505 -2065537 -1826174 -1086265 169151 1794266
15185 1794266 3445094 4679867 5227204 5160095 4764561 4311617 3915731 3509426 2949588
15176 2949588 2165470 1238484 385481 -138865 -165243 337672 1240852 2253187 3054415
15167 3054415 3471582 3544975 3457027 3378257 3315536 3107815 2601768 1844332 1114233 713274
$$ packed form
15232A016308K44500O9705l6435o817J17887J54773J6618j82097k95883k73464
15222H25095r4652K42598O48869R56881J053451R77273Q45533P57100P63628Q37785
15212G813561Q93414Q74615P88800O38993L59593j11349o98097j194327j416973
15203G948230j374426j236444j132586j077438j017247r03001p24729n01489l13342
15194c32472k73068l83756m89482m23727j63032K39363P39909J255416J625115
15185A794266J650828J234773N47337o7109l95534m52944l95886m06305n59838
15176B949588p84118r26986q53003n24346k6378N02915R03180J012335Q01228
15167C054415M17167P3393q7948p8770o2721k07721n06047p57436p30099m00959
$$ plain form
15157 713274 680576 789386 826393 739994 551799 276326 -57335 -375463 -552914 -466169
15147 -466169 -99542 408761 832898 1006706 931248 731455 552631 526832 722694 1059570
15137 1059570 1340738 1411648 1294588 1186075 1289555 1601799 1929880 2136372 2267320 2414993
15127 2414993 2558498 2589602 2414545 2018635 1468780 858125 238241 -381897 -999393 -1590148
15117 -1590148 -2077833 -2402793 -2624522 -2818651 -2923831 -2805333 -2366647 -1581022 -568677
15108 -568677 375399 950130 1068287 872543 545897 172355 -233541 -641297 -976942 -1171090
15098 -1171090 -1235036 -1260453 -1317271 -1364329 -1257735 -864975 -211966 507865 1068538 1313015
15088 1313015 1190475 769619 182472 -473421 -1127988 -1647920 -1866340 -1751961 -1449394
$$ packed form
15157G13274l2698J08810L7007q6399j88195k75473l33661l18128j77451Q6745
15147d66169L66627N08303M24137J73808p5458j99793j78824k5799J95862L36876
15137A059570K81168P0910j17060j08513J03480L12244L28081K06492J30948J47673
15127B414993J43505L1104j75057l95910n49855o10655o19884o20138o17496n90755
15117a590148m87685l24960k21729j94129j05180J18498M38686P85625J012345
15108e68677R44076N74731J18157j95744l26646l73542m05896m07756l35645j94148
15098a171090o3946k5417n6818m7058J06594L92760O53009P19831N60673K44477
15088A313015j22540m20856n87147o55893o54567n19932k18420J14379L02567
$$ plain form
15079 -1449394 -1132599 -908393 -818357 -870548 -1045284 -1255032 -1389150 -1429703 -1440740 -1451823
15069 -1451823 -1419167 -1293131 -1060999 -719747 -295854 87752 274967 195111 -115657 -495831
15059 -495831 -674627 -429246 242678 1118521 1884214 2299115 2293774 1920771 1280831 521361
15049 521361 -198789 -780896 -1182157 -1363036 -1311033 -1079885 -719984 -203070 506658 1327485
15039 1327485 2081245 2644236 2974675 3020420 2750114 2242943 1688641 1316388 1297672 1656511
15029 1656511 2235493 2751641 2882529 2383970 1233476 -360465 -2092770 -3695818 -4984659
15020 -4984659 -5860949 -6353592 -6625249 -6867560 -7207406 -7724060 -8461393 -9359550 -10234697
15011 -10234697 -10885966 -11207752 -11180247 -10831415 -10278546 -9731029 -9309686 -8860477 -8076365
$$ packed form
15079a449394L16795K24206R0036n2191j74736k09748j34118m0553j1037j1083
15069a451823L2656J26036K32132L41252M23893L83606J87215p9856l10768l80174
15059d95831j78796K45381O71924Q75843P65693M14901n341l73003o39940p59470
15049E21361p20150n82107m01261j80879N2003K31148L59901N16914P09728Q20827
15039A327485P53760N62991L30439M5745k70306n07171n54302l72253j8716L58839
15029A656511N78982N16148J30888m98559j150494j593941j732305j603048j288841
15020d984659q76290m92643k71657k42311l39846n16654p37333q98157q75147
15011a0234697o51269l21786K7505L48832N52869N47517M21343M49209P84112
$$ plain form
15002 -8076365 -6800582 -5154765 -3436692 -1918096 -670159 412722 1428068 2382656
14994 2382656 3215535 3842264 4264082 4603039 4934056 5176093 5203592 4968270 4536809 4045647
14984 4045647 3612189 3288319 3056208 2857517 2618310 2284480 1902087 1648370 1712527 2133191
14974 2133191 2781946 3490287 4152400 4687930 5003269 5043235 4821617 4436482 4086601 3980739
14964 3980739 4174677 4546505 4953520 5312309 5449824 5015496 3716053 1623087 -792330
14955 -792330 -2909667 -4308363 -4935171 -4963717 -4583519 -3970209 -3363708 -3039604 -3155173
14946 -3155173 -3634377 -4192680 -4536665 -4598943 -4550668 -4603592 -4835767 -5192939 -5584992 -5951847
14936 -5951847 -6249447 -6425241 -6467558 -6466122 -6541254 -6744547 -7085058 -7564650 -8146256 -8749087
$$ packed form
15002h076365J275783J645817J718073J518596J247937J082881J015346R54588
14994B382656Q32879O26729M21818L38957L31017K42037K7499k35322m31461m91162
14984D045647m33458l23870k32111j98691k39207l33830l82393k53717O4157M20664
14974B133191O48755P08341O62113N35530L15339L9966k21618l85135l49881j05862
14964C980739J93938L71828M07015L58789J37515m34328j299443k092966k415417
14955g92330k117337j398696o26808k8546L80198O13310O06501L24104j15569
14946c155173m79204n58303l43985o2278M8275n2924k32175l57172l92053l66855
14936e951847k97600j75794m2317J436p5132k03293l40511m79592n81606o02831
$$ plain form
14926 -8749087 -9315102 -9862308 -10402383 -10792925 -10779643 -10209049 -9121672 -7727167 -6369170
14917 -6369170 -5408940 -5036884 -5168913 -5520794 -5827274 -6015494 -6132080 -6175407 -6100946 -5917521
14907 -5917521 -5654673 -5286302 -4763049 -4111572 -3478006 -3055387 -2978245 -3271503 -3837299 -4486217
14897 -4486217 -5024955 -5365246 -5572479 -5786873 -6081691 -6369632 -6475758 -6307318 -5878614
14888 -5878614 -5173191 -4110000 -2703440 -1143008 338647 1602400 2590244 3259724 3565711
14879 3565711 3494548 3111558 2568724 2039085 1637096 1484745 1753936 2482265 3463678 4374957
14869 4374957 4969664 5223232 5325672 5495676 5829346 6307204 6843193 7325261 7626165
14860 7626165 7597155 7157854 6411357 5571343 4755298 3941451 3098617 2255244 1474838 828355
$$ packed form
14926h749087n66015n47206n40075l90542J3282N70594J087377J394505J357997
14917f369170R60230L72056j32029l51881l06480j88220j16586m3327P4461J83425
14907e917521K62848L68371N23253O51477O33566M22619P7142k93258n65796o48918
14897d486217n38738l40291k07233k14394k94818k87941j06126J68440M28704
14888e878614P05423J063191J406560J560432J481655J263753R87844O69480L05987
14879C565711p1163l82990n42834n29639m01989j52351K69191P28329R81413R11279
14869D374957N94707K53568J02440J70004L33670M77858N35989M82068L00904
14860G626165k9010m39301p46497q40014q16045q13847q42834q43373p80406o46483
$$ plain form
14850 828355 379996 152932 83268 45385 -35051 -135556 -244688 -431289 -734054 -1103247
14840 -1103247 -1476876 -1801926 -2037880 -2182176 -2257945 -2304784 -2366072 -2475708 -2646855 -2839214
14830 -2839214 -2974341 -2977752 -2823876 -2568679 -2309069 -2078012 -1761939 -1184774 -309939 707974
14820 707974 1669138 2474250 3158911 3851216 4654721 5496399 6151239 6491295 6630803 6775244
14810 6775244 7003985 7222331 7248944 6919502 6167616 5066379 3797047 2576363 1567490
14801 1567490 835398 363901 61371 -220051 -596064 -1086801 -1708804 -2590381 -3921081
14792 -3921081 -5760681 -7878053 -9822362 -11165217 -11647846 -11182774 -9825421 -7779515
14784 -7779515 -5387895 -3055899 -1114871 272201 1109621 1526355 1717019 1871645 2117855
$$ packed form
14850H28355m48359k27064o9664l7883q0436j00505j09132j86601l02765l69193
14840a103247l73629l25050k35954j44296p5769m6839o1288j09636j71147j92359
14830b839214j35127l411J53876K55197K59610K31057L16073N77165Q74835J017913
14820G07974R61164Q05112O84661O92305Q03505Q41678O54840L40056J39508J44441
14810F775244K28741K18346K6613l29442p51886j101237j269332j220684j008873
14801A567490p32092m71497l02530k81422l76013m90737o22003q81577j330700
14792c921081j839600k117372j944309j342855m82629M65072J357353K045906
14784g779515K391620K331996J941028J387072Q37420M16734J90664J54626K46210
$$ plain form
14775 2117855 2468321 2814678 3009943 2970953 2700787 2232895 1592379 820677 32911 -556905
14765 -556905 -769523 -663812 -462926 -278229 -38008 336824 791726 1179385 1403559 1520537
14755 1520537 1694039 2014466 2366666 2562893 2592367 2627319 2794399 3038863 3202775 3186119
14745 3186119 3032504 2863242 2766048 2765616 2841444 2963029 3147465 3451716 3852262 4168695
14735 4168695 4168735 3721473 2873000 1825645 836752 103489 -333313 -565249 -655510 -551150
14725 -551150 -167302 492574 1328813 2173478 2863880 3426839 4092815 5037406 6181874
14716 6181874 7269321 8068671 8454508 8382909 7860919 6922204 5642639 4147169 2579357
14707 2579357 1072717 -241129 -1212834 -1711599 -1697764 -1242282 -459303 551670 1663035
$$ packed form
14775B117855L50466L46357J95265l8990k70166m67892o40516p71702p87766n89816
14765e56905k12618J05711K00886J84697K40221L74832M54902L87659K24174J16978
14755A520537J73502L20427L52200J96227K9474L4952J67080K44464J63912j6656
14745C186119j53615j69262r7194m32P5828J21585J84436L04251M00546L16433
14735D168695M0m47262q48473j047355r88893p33263m36802k31936r0261J04360
14725e51150L83848O59876Q36239Q44665O90402N62959O65976R44591J144468
14716F181874J087447P99350L85837p1599n21990r38715j279565j495470j567812
14707B579357j506640j313846r71705m98765J3835M55482P82979J010973J111365
$$ plain form
14698 1663035 2672749 3364399 3645286 3618243 3493345 3417760 3389845 3344419 3284051 3283616 3398507
14687 3398507 3603787 3806155 3935108 4015723 4112070 4220360 4209049 3889679 3208265 2347974
14677 2347974 1644111 1375770 1582714 2072192 2610822 3099438 3598460 4258970 5213497
14668 5213497 6429614 7646210 8508080 8776783 8447320 7736734 6950139 6305141 5844236
14659 5844236 5432029 4832747 3878324 2597037 1181722 -150100 -1267723 -2186400 -3040417
14650 -3040417 -3909138 -4633965 -4884546 -4492033 -3644835 -2713112 -1986777 -1574352 -1445771
14641 -1445771 -1527669 -1754452 -2065614 -2383555 -2600773 -2658795 -2634342 -2627964 -2616614 -2516290
14631 -2516290 -2331587 -2149377 -2003840 -1834856 -1587739 -1281620 -982666 -792576 -841172 -1213750
$$ packed form
14698A663035J009714O91650K80887k7043j24898p5585k7915m5426o0368m35J14891
14687C398507K05280K02368J28953Q0615R6347J08290j1311l19370o81414q60291
14677B347974p03863k68341K06944M89478N38630M88616M99022O60510R54527
14668E213497J216117J216596Q61870K68703l29463p10586p86595o44998m60905
14659E844236m12207n99282r54423j281287j415315j331822j117623r18677q54017
14650c040417q68721p24827k50581L92513Q47198R31723P26335M12425J28581
14641a445771q1898k26783l11162l17941k17218n8022K4453O378J1350J00324
14631b516290J84703J82210J45537J68984K47117L06119K98954J90090m8596l72578
$$ plain form
14621 -1213750 -1893872 -2777966 -3717713 -4547714 -5103694 -5275652 -5058042 -4550294 -3928424
14612 -3928424 -3343832 -2822280 -2313275 -1795627 -1295413 -838940 -469028 -286078 -370859 -674456
14602 -674456 -1052533 -1398642 -1680510 -1882387 -1967984 -1881988 -1602441 -1212858 -897014 -820887
14592 -820887 -1030047 -1460641 -1972359 -2370050 -2538895 -2596291 -2793069 -3262899 -3907440 -4467954
14582 -4467954 -4669813 -4322173 -3337775 -1780564 56100 1733826 2908631 3459183 3431324
14573 3431324 2976277 2306674 1583620 871582 244185 -185547 -357038 -282799 -29075 249225
14563 249225 325061 23930 -649031 -1490635 -2178333 -2406986 -2057855 -1248423 -217377 808147
14553 808147 1677254 2327323 2752669 2942752 2898543 2699781 2440197 2133282 1790888 1500397
$$ packed form
14621a213750o80122q84094r39747q30001n55980j71958K17610N07748O21870
14612c928424N84592N21552N09005N17648N00214M56473L69912J82950q4781l03597
14602f74456l78077l46109k81868k01877q5597Q5996K79547L89583L15844P6127
14592h20887k09160m30594n11718l97691j68845n7396j96778m69830o44541n60514
14582d467954k01859L47640R84398J557211J836664J677726J174805N50552k7859
14573C431324m55047o69603p23054p12038o27397m29732j71491P4239K53724K78300
14563B49225P5836l01131o72961q41604o87698k28653L49131Q09432J031046J025524
14553H08147Q69107O50069M25346J90083m4209j98762k59584l06915l42394k90491
$$ plain form
14543 1500397 1364995 1447387 1747508 2193156 2673508 3123687 3582276 4126617 4786586 5572687
14533 5572687 6496407 7516951 8520666 9340054 9789581 9728016 9101628 7978156 6554765
14524 6554765 5075332 3749716 2719638 2016788 1549503 1211969 1014198 1019534 1207459
14515 1207459 1475730 1725635 1925096 2108053 2316488 2585618 2966183 3447079 3884064
14506 3884064 4093488 3975123 3548015 2921199 2227791 1589368 1094014 738731 418541
14497 418541 42135 -351144 -644131 -770472 -764904 -713399 -658355 -551508 -339095 -62533
14487 -62533 191360 395726 597609 839677 1092887 1280912 1360838 1346671 1270094 1186378
14477 1186378 1181630 1277019 1347393 1188560 685763 -46053 -718491 -1103845 -1157262 -935442
$$ packed form
14543A500397j35402Q2392L00121M45648M80352M50179M58589N44341O59969P86101
14533E572687R23720J020544J003715Q19388M49527o1565o26388j123472j423391
14524F554765j479433j325616j030078p02850m67285l37534j97771N336J87925
14515A207459K68271K49905J99461J82957K08435K69130L80565M80896M36985
14506C884064K09424j18365m27108o26816o93408o38423m95354l55283l20190
14497D18541l76406l93279k92987j26341N568N1505N5044J06847K12413K76562
14487f2533K53893K04366K01883K42068K53210J88025P9926j4167p6577q3716
14477A186378m748R5389P0374j58833n02797p31816o72438l85354n3417K21820
$$ plain form
14467 -935442 -545093 -154501 92163 207028 321382 520882 772098 970433 1061473 1114421
14457 1114421 1229749 1433211 1710818 2077898 2576574 3207584 3879583 4460685 4841185
14448 4841185 4936982 4710212 4204327 3532456 2823575 2188620 1704652 1413871 1330647 1418699
14438 1418699 1586316 1728343 1767889 1682719 1491894 1213404 867270 480200 42226 -485549
14428 -485549 -1109079 -1784744 -2422317 -2878689 -3011319 -2787047 -2307353 -1681129 -914391 16318
14418 16318 1005322 1834404 2355809 2589258 2657169 2642456 2520542 2237303 1810352 1336946
14408 1336946 925414 609598 308013 -78085 -538521 -971298 -1277962 -1415748 -1444174 -1544941
14398 -1544941 -1897865 -2494309 -3101913 -3424822 -3289907 -2713865 -1867936 -1018008 -438370
$$ packed form
14467i35442L90349L90592K46664J14865J14354J99500K51216J98335R1040N2948
14457A114421J15328K03462K77607L67080M98676O31010O71999N81102L80500
14448D841185R5797k26770n05885o71871p08881o34955m83968k90781q3224Q8052
14438A418699J67617J42027L9546q5170j90825k78490l46134l87070m37974n27775
14428d85549o23530o75665o37573m56372j32630K24272M79694O26224P66738R30709
14418A6318R89004Q29082N21405K33449O7911j4713j21914k83239m26951m73406
14408A336946m11532l15816l01585l86098m60436m32777l06664j37786k8426j00767
14398a544941l52924n96444o07604l22909J34915N76042Q45929Q49928N79638
$$ plain form
14389 -438370 -290650 -559330 -1096595 -1710573 -2226475 -2502860 -2459998 -2142781 -1708034 -1299421
14379 -1299421 -944190 -573840 -133904 353085 849466 1368535 1953631 2631781 3368484
14370 3368484 4044497 4525426 4781649 4935767 5132114 5355437 5464132 5376781 5148500 4908280
14360 4908280 4768423 4774455 4891577 5032956 5145337 5260283 5442421 5710031 6056824 6484192
14350 6484192 6957621 7374507 7598213 7546109 7235978 6729981 6085518 5356020 4586302 3830354
14340 3830354 3176264 2703608 2432895 2318977 2279837 2240695 2156524 2042638 1977738 2036447
14330 2036447 2228985 2489265 2738756 2947245 3101196 3198389 3313381 3602782 4198406 5071046
14320 5071046 5980858 6601032 6735655 6408029 5762028 4904160 3858241 2682206 1526502
$$ packed form
14389d38370J47720k68680n37265o13978n15902k76385M2862L17217M34747M08613
14379a299421L55231L70350M39936M86989M96381N19069N85096O78150P36703
14370C368484O76013M80929K56223J54118J96347K23323J08695q7351k28281k40220
14360D908280j39857O032J17122J41379J12381J14946J82138K67610L46793M27368
14350F484192M73429M16886K23706n2104l10131n05997o44463p29498p69718p55948
14340C830354o54090m72656k70713j13918l9140l9142q4171j13886o4900N8709
14330B036447J92538K60280K49491K08489J53951R7193J14992K89401N95624Q72640
14320E071046R09812O20174J34623l27626o46001q57868j045919j176035j155704
$$ plain form
14311 1526502 522297 -279775 -847288 -1146470 -1133548 -747259 11236 1038532 2178362
14302 2178362 3259332 4130771 4711165 4991377 5017475 4864509 4580167 4156077 3531629
14293 3531629 2638830 1506576 288821 -841802 -1804710 -2632093 -3388729 -4079383 -4626227
14284 -4626227 -4918276 -4886741 -4530156 -3860692 -2874474 -1615849 -219751 1117833 2179714
14275 2179714 2773850 2822467 2416651 1754050 1062606 575399 436045 577610 792801 903776
14265 903776 831775 576722 163855 -402243 -1122880 -1949479 -2788486 -3523307 -3985304 -4029615
14255 -4029615 -3654304 -2953474 -2015251 -901208 301427 1437042 2324655 2852209 3029222
14246 3029222 2954597 2773852 2678627 2868645 3443426 4313948 5237122 5956660 6277182 6065823
$$ packed form
14311A526502j004205q02072n67513k99182J2922L86289P58495J027296J139830
14302B178362J080970Q71439N80394K80212K6098j52966k84342m24090o24448
14293C531629q92799j132254j217755j130623r62908q27383p56636o90654n46844
14284d626227k92049L1535L56585O69464R86218J258625J396098J337584J061881
14275B179714N94136M8617m05816o62601o91444m87207j39354J41565K15191J10975
14265I03776p2001k55053m12867n66098p20637q26599q39007p34821m61997m4311
14255d029615L75311P00830R38223J114043J202635J135615Q87613N27554J77013
14246C029222p4625j80745r5225J90018N74781Q70522R23174P19538L20522k11359
$$ plain form
14236 6065823 5311912 4157200 2852575 1694098 917348 551168 396162 205688 -139857
14227 -139857 -613502 -1086932 -1413512 -1540744 -1488209 -1202697 -561507 424114 1512076 2369193
14217 2369193 2775547 2728125 2403891 2023191 1729255 1570704 1510143 1426708 1194162 790028
14207 790028 295046 -202565 -670322 -1114771 -1535975 -1880327 -2033143 -1898693 -1465707 -765106
14197 -765106 208568 1457675 2814901 3923083 4501295 4584473 4468219 4491950 4869551
14188 4869551 5622632 6590698 7515225 8162255 8398098 8229332 7830883 7460393 7291371
14179 7291371 7355637 7581701 7839379 7958014 7749368 7140116 6295876 5527120 5079647 5035907
14169 5035907 5329205 5781054 6187198 6447181 6599510 6745532 6955318 7219958 7522267
$$ packed form
14236F065823p53911j154712j304625j158477p76750l66180j55006j90474l45545
14227a39857m73645m73430l26580j27232N2535K85512O41190R85621J087962Q57117
14217B369193M06354m7422l24234l80700k93936j58551o0561q3435k32546m04134
14207G90028m94982m97611m67757m44449m21204l44352j52816J34450M32986P00601
14197g65106R73674J249107J357226J108182N78212Q3178j16254K3731L77601
14188D869551P53081R68066R24527O47030K35843j68766l98449l70490j69022
14179G291371O4266K26064K57678J18635k08646o09252q44240p68756m47473m3740
14169E035907K93298M51849M06144K59983J52329J46022K09786K64640L02309
$$ plain form
14160 7522267 7920732 8452409 9005279 9400150 9538810 9399627 8954896 8192950 7181192
14151 7181192 6046617 4932264 4016206 3547492 3760574 4684246 6041630 7397974 8399452
14142 8399452 8857744 8759844 8254329 7539790 6704875 5696201 4508350 3367061 2624301
14133 2624301 2448036 2683747 3007734 3142529 3007586 2749155 2600487 2699876 3045646 3544045
14123 3544045 4067294 4550858 5022301 5444361 5607064 5327898 4690402 3944158 3246606
14114 3246606 2610302 2025771 1552061 1307325 1393703 1821691 2505503 3351283 4324970 5393050
14104 5393050 6426873 7238055 7727680 7954303 8040936 8054036 7991380 7863205 7749253 7759282
14094 7759282 7939682 8205822 8360158 8220642 7786005 7253008 6760988 6184617 5337229
$$ packed form
14160G522267L98465N31677N52870L94871J38660j39183m44731p61946j011758
14151G181192j134575j114353r16058m68714K13082R23672J357384J356344J001478
14142H399452M58292r7900n05515p14539q34915j008674j187851j141289p42760
14133B624301j76265K35711L23987J34795j34943k58431j48668R9389L45770M98399
14123C544045N23249M83564M71443M22060J62703k79166o37496p46244o97552
14114C246606o36304n84531m73710k44736Q6378M27988O83812Q45780R73687J068080
14104E393050J033823Q11182M89625K26623Q6633J3100o2656j28175j13952J0029
14094G759282J80400K66140J54336j39516m34637n32997m92020n76371q47388
$$ plain form
14085 5337229 4238740 3044387 1881134 886955 245813 54385 226059 567619 911098
14076 911098 1161276 1256544 1118268 663498 -65430 -814510 -1250095 -1164510 -545111 496980
14066 496980 1830713 3286272 4599703 5525740 5976796 6003995 5720775 5289060 4892714
14057 4892714 4687319 4771188 5161924 5823615 6707228 7680378 8473032 8797079 8540985 7872077
14047 7872077 7139075 6610288 6314270 6159026 6120630 6259029 6590618 7014774 7401961 7686029
14037 7686029 7821740 7769791 7572338 7331626 7097485 6845660 6575489 6345062 6179061 6003727
14027 6003727 5707243 5256975 4755170 4386465 4287662 4446762 4743627 5087466 5472556 5886626
14017 5886626 6229905 6399673 6417897 6377015 6266524 5963579 5413037 4754663 4268540 4162956
$$ packed form
14085E337229j098489j194353j163253r94179o41142j91428J71674L41560L43479
14076I11098K50178R5268j38276m54770p28928p49080m35585Q5585O19399J042091
14066D96980J333733J455559J313431R26037M51056K7199k83220m31715l96346
14057D892714k05395Q3869L90736O61691Q83613R73150P92654L24047k56094o68908
14047G872077p33002n28787k96018j55244l8396J38399L31589M24156L87187K84068
14037G686029J35711n1949j97453k40712k34141k51825k70171k30427j66001j75334
14027F003727k96484m50268n01805l68705r8803J59100K96865L43839L85090M14070
14017E886626L43279J69768J8224m0882j10491l02945n50542o58374m86123j05584
$$ plain form
14007 4162956 4424980 4923925 5567820 6280169 6914224 7285567 7274518 6882116 6217524 5482530
13997 5482530 4927276 4729209 4920109 5434861 6194460 7102364 8006820 8791033 9440380
13988 9440380 9950842 10292547 10453814 10432486 10238499 9949833 9727114 9734086 9985509 10293377
13978 10293377 10447972 10450542 10480274 10663936 11012905 11522254 12143748 12653067 12686005 12009013
13968 12009013 10733464 9239680 7949201 7149112 6901942 7054629 7355564 7575803 7580847
13959 7580847 7360314 7001609 6638173 6393623 6355298 6563828 6985674 7526169 8073957 8545312
13949 8545312 8898145 9122975 9287199 9545224 10015783 10672651 11371835 11962138 12338831
13940 12338831 12436054 12222726 11666966 10729590 9490925 8224743 7225196 6624848 6374405
$$ packed form
14007D162956K62024M98945O43895P12349O34055L71343j1049l92402o64592p34994
13997E482530n55254j98067J90900N14752P59599R07904R04456P84213O49347
13988I440380N10462L41705J61267k1328j93987k88666k22719O972K51423L07868
13978A0293377J54595K570K9732J83662L48969N09349O21494N09319L2938o76992
13968A2009013j275549j493784j290479q00089k47170J52687L00935K20239N044
13959G580847k20533l58705l63436k44550l8325K08530M21846N40495N47788M71355
13949H545312L52833K24830J64224K58025M70559O56868O99184N90303L76693
13940A2338831R7223k13328n55760r37376j238665j266182r99547o00348k50443
$$ plain form
13931 6374405 6276617 6094391 5716776 5205844 4699470 4346052 4305377 4668770 5356863 6170291
13921 6170291 6911738 7454548 7817360 8209278 8903711 10040086 11551547 13242434 14886382
13912 14886382 16267484 17207516 17626344 17588575 17268372 16877783 16618332 16631671 16929277
13903 16929277 17366095 17717298 17800359 17540032 16967763 16198860 15403945 14748744 14312320
13894 14312320 14044314 13799307 13433497 12894509 12229199 11531669 10915435 10515628 10444782
13885 10444782 10695841 11135900 11600428 11927209 11975822 11720089 11271409 10785779 10389679
13876 10389679 10173949 10203877 10502955 11049901 11794524 12654343 13522888 14327215 15085512
13867 15085512 15876164 16770917 17832326 19084555 20423156 21614029 22409694 22693612 22538329
$$ packed form
13931F374405r7788j82226l77615n10932n06374l53418m0675L63393O88093Q13428
13921F170291P41447N42810L62812L91918O94433J136375J511461J690887J643948
13912A4886382J381102R40032M18828l7769l20203l90589k59451J3339K97606
13903A6929277M36818L51203Q3061k60327n72269p68903p94915o55201m36424
13894A4312320k68006k45007l65810n38988o65310o97530o16234l99807p0846
13885A0444782K51059M40059M64528L26781M8613k55733m48680m85630l96100
13876A0389679k15730K9928K99078N46946P44623Q59819Q68545Q04327P58297
13867A5085512P90652Q94753J061409J252229J338601J190873P95665K83918j55283
$$ plain form
13858 22538329 22121376 21600515 21078597 20665116 20501644 20657447 21041030 21480561 21861526
13849 21861526 22171707 22457077 22762149 23098031 23425764 23679882 23857232 24029228 24258383
13840 24258383 24595467 25109273 25831704 26673923 27451842 28050710 28540910 29081748 29765949
13831 29765949 30584331 31449821 32235577 32845589 33251011 33440541 33402547 33211793 33014867
13822 33014867 32879516 32779071 32699736 32631203 32495010 32219779 31884026 31718603 31939421 32558745
13812 32558745 33367690 34098045 34607173 34959804 35347450 35912759 36666370 37539563 38467764
13803 38467764 39449862 40537405 41799652 43321357 45161489 47280727 49549817 51806817
13795 51806817 53903785 55768187 57438171 58999178 60486577 61904731 63302727 64780218
$$ packed form
13858B2538329m16953n20861n21918m13481j63472J55803L83583M39531L80965
13849B1861526L10181K85370L05072L35882L27733K54118J77350J71996K29155
13840B4258383L37084N13806P22431Q42219P77919N98868M90200N40838O84201
13831B9765949Q18382Q65490P85756O10012M05422J89530l7994j90754j96926
13822C3014867j35351j00445p9335o8533j36193k75231l35753j65423K20818O19324
13812C2558745Q08945P30355N09128L52631L87646N65309P53611Q73193R28201
13803C8467764R82098J087543J262247J521705J840132K119238K269090K257000
13795E1806817K096968J864402J669984J561007J487399J418154J397996J477491
$$ plain form
13787 64780218 66456850 68405654 70592076 72917494 75269435 77545846 79747670 81991696
13779 81991696 84379041 86964522 89823437 93023444 96536757 100231858 103945182 107550512
13771 107550512 111037416 114542416 118239610 122181524 126255090 130257565 134022393 137540104
13763 137540104 140995774 144664794 148748804 153290350 158220450 163475259 169053313 174984763
13755 174984763 181286332 187990200 195220405 203136959 211790866 221081189 230807828 240767623
13747 240767623 250837964 260990933 271271788 281757020 292493716 303471028 314642614
13740 314642614 325972348 337445668 349027597 360624921 372111374 383338607 394092883
13733 394092883 404095542 413071919 420856446 427501123 433295202 438572017 443406675 447560343
$$ packed form
13787F4780218J676632J948804K186422K325418K351941K276411K201824K244026
13779H1991696K387345K585481K858915L200007L513313L695101L713324L605330
13771A07550512L486904L505000L697194L941914M073566M002475L764828L517711
13763A37540104L455670L669020M084010M541546M930100N254809N578054N931450
13755A74984763O301569O703868P230205P916554Q653907R290323R726639R959795
13747B40767623J0070341J0152969J0280855J0485232J0736696J0977312J1171586
13740C14642614J1329734J1473320J1581929J1597324J1486453J1227233J0754276
13733C94092883J0002659Q976377P784527O644677N794079N276815M834658M153668
$$ plain form
13725 447560343 450749929 452885230 454040864 454337403 453909899 452904759 451448174 449615981
13717 449615981 447419584 444812849 441735288 438142037 433977255 429178767 423737388 417706720
13709 417706720 411113539 403893686 395956541 387283751 377960135 368127099 357881346 347209486
13701 347209486 336044004 324378532 312308963 300009769 287727408 275764341 264386620
13694 264386620 253716001 243727494 234309069 225300276 216530526 207831941 199041617 190095708
13686 190095708 181122784 172407615 164255240 156806961 149971165 143553427 137404989 131494567
13678 131494567 125881693 120635477 115784365 111279706 107050717 103099752 99478979 96195463
13670 96195463 93156184 90226290 87375687 84762398 82597401 80909455 79549678 78387702
$$ packed form
13725D47560343L189586K135301J155634K96539m27504j005140j456585j832193
13717D49615981k196397k606735l077561l593251m164782m798488n441379o030668
13709D17706720o593181p219853p937145q672790r323616r833036j0245753j0671860
13701C47209486j1165482j1665472j2069569j2299194j2282361j1963067j1377721
13694B64386620j0670619r988507r418425r008793q769750q698585q790324q945909
13686A90095708q972924q715169q152375p448279o835796o417738o148438n910422
13678A31494567n612874n246216m851112m504659m228989l950965l620773l283516
13670I6195463l039279k929894k850603k613289k164997j687946j359777j161976
$$ plain form
13662 78387702 77352604 76346440 75273278 74125789 72961130 71824333 70721832 69611735
13654 69611735 68395882 66969345 65299882 63444341 61517998 59662886 58013986 56682592
13646 56682592 55771081 55369750 55496893 56027679 56721370 57326723 57620524 57444343 56814618
13637 56814618 55956923 55164389 54608501 54353113 54490469 55090749 56050061 57094530 57919297
13628 57919297 58293297 58116238 57465287 56545998 55583899 54749731 54083853 53490705 52870300
13619 52870300 52248246 51769094 51553837 51572112 51695026 51876893 52191130 52641875 53043252
13610 53043252 53118392 52675390 51742714 50564245 49422006 48481302 47808874 47462823 47494842
13601 47494842 47839182 48266890 48522302 48490772 48244568 47967022 47827258 47900380 48160189 48492868
$$ packed form
13662G8387702j035098j006164j073162j147489j164659j136797j102501j110097
13654F9611735j215853j426537j669463j855541j926343j855112j648900j331394
13646E6682592r11511m01331J27143N30786O93691O05353K93801j76181o29725
13637E6814618q57695p92534n55888k55388J37356O00280R59312J044469Q24767
13628E7919297L74000j77059o50951r19289r62099q34168o65878n93148o20405
13619E2870300o22054m79152k15257J8275J22914J81867L14237M50745M01377
13610E3043252P5140m43002r32676j178469j142239r40704o72428l46051L2019
13601D7494842L44340M27708K55412l1530k46204k77546j39764P3122K59809L32679
$$ plain form
13591 48492868 48748522 48856584 48863480 48813975 48670439 48386583 48018512 47740794 47721615 47957031
13581 47957031 48209226 48134946 47525409 46433197 45114880 43873197 42856651 41984983 41114184
13572 41114184 40185272 39198395 38145827 37023109 35872522 34724568 33537420 32274258
13564 32274258 30952867 29550933 27968770 26184720 24349652 22681763 21385807 20635607
13556 20635607 20464830 20669677 20934708 21043493 20875065 20294265 19191075 17622642 15856096
13547 15856096 14242735 13034961 12268582 11827301 11635902 11701375 11979615 12303358 12459033
13538 12459033 12339988 12042483 11790220 11735000 11852258 12041474 12238101 12360682 12269320 11871113
13528 11871113 11230367 10563172 10089513 9866381 9805087 9812510 9843311 9873349 9856078 9681064
$$ packed form
13591D8492868K55654J08062O896m9505j43536k83856l68071k77718j9179K35416
13581D7957031K52195p4280o09537j092212j318317j241683j016546q71668q70799
13572D1114184r28912r86877j052568j122718j150587j147954j187148j263162
13564C2274258j321391j401934j582163j784050j835068j667889j295956p50200
13556B0635607j70777K04847K65031J08785j68428n80800j103190j568433j766546
13547A5856096j613361j207774p66379m41281j91399O5473K78240L23743J55675
13538A2459033j19045k97505k52263n5220J17258J89216J96627J22581r1362l98207
13528A1871113o40746o67195m73659k23132o1294P423L0801L0038j7271j75014
$$ plain form
13518 9681064 9231255 8512539 7652502 6769155 5906847 5099066 4435471 4016989 3862587
13509 3862587 3900289 4054388 4316450 4711518 5224938 5815603 6458346 7150515 7914268 8740862
13499 8740862 9522564 10075119 10215235 9837786 8973552 7785557 6474836 5198698 4089918
13490 4089918 3334017 3185320 3807499 5071348 6563431 7834253 8642264 8981921 8948088
13481 8948088 8637327 8176571 7768607 7608831 7776116 8240569 8904337 9622443 10243122
13472 10243122 10672626 10929746 11136457 11412280 11752726 12017057 12003119 11564995 10747711
13463 10747711 9812100 9077854 8724799 8731649 8982704 9376788 9795147 10068722 10075681 9859553
13453 9859553 9584766 9370741 9215772 9065751 8887215 8661696 8382087 8107181 7971794
$$ packed form
13518I681064m49809p18716q60037q83347q62308q07781o63595m18482j54402
13509C862587L7702J54099K62062L95068N13420N90665O42743O92169P63753Q26594
13499H740862P81702N52555J40116l77449q64234j187995j310721j276138j108780
13490D089918p55901j48697O22179J263849J492083J270822Q08011L39657l3833
13481H948088l10761m60756m07964j59776J67285M64453O63768P18106O20679
13472A0243122M29504K57120K06711K75823L40446K64331j3938m38124q17284
13463A0747711r35611p34246l53055O850K51055L94084M18359K73575O959k16128
13453I859553k74787k14025j54969j50021j78536k25519k79609k74906j35387
$$ plain form
13444 7971794 8075970 8384048 8737272 8921220 8789599 8396410 7954640 7663808 7616157 7808985
13434 7808985 8127963 8325808 8145564 7509730 6549065 5477965 4493459 3734769 3264779
13425 3264779 3075356 3102997 3258326 3505231 3892557 4443917 5067107 5605740 5935440 6026461
13415 6026461 5963418 5853145 5703888 5442160 5019408 4469882 3869878 3249085 2591997 1952092
13405 1952092 1475673 1302879 1475441 1915795 2457688 2922508 3251797 3558085 3991633
13396 3991633 4569145 5145325 5571237 5848774 6075773 6295818 6510087 6800949 7286038
13387 7286038 7972542 8800446 9752820 10809653 11850677 12674309 13125179 13174330 12888325
13378 12888325 12420805 12029545 11951868 12208464 12588558 12855545 12917931 12795541 12545426 12272517
$$ packed form
13444G971794J04176L08078L53224J83948j31621l93189m41770k90832m7651J92828
13434G808985L18978J97845j80244o35834r60665j071100r84506p58690m69990
13425C264779j89423K7641J55329K46905L87326N51360O23190N38633L29700R1021
13415F026461o3043j10273j49257k61728m22752n49526o00004o20793o57088o39905
13405A952092m76419j72794J72562M40354N41893M64820L29289L06288M33548
13396C991633N77512N76180M25912K77537K26999K20045K14269K90862M85089
13387G286038O86504Q27904R52374J056833J041024Q23632M50870M9151k86005
13378A2888325m67520l91260p7677K56596L80094K66987O2386j22390k50115k72909
$$ plain form
13368 12272517 12128646 12245200 12661936 13261679 13718426 13630127 12823970 11490124 10016762
13359 10016762 8759748 7917190 7517836 7497884 7780212 8270387 8861744 9497018 10183466
13350 10183466 10938716 11763747 12690316 13728056 14710498 15345262 15470654 15155711 14544779
13341 14544779 13712562 12676606 11516924 10436703 9607610 9025983 8617600 8386404 8381740
13332 8381740 8583764 8897977 9212327 9381672 9220007 8606218 7598189 6412382 5293688
13323 5293688 4404290 3792364 3413733 3165862 2919017 2553075 2020588 1432838 1065387
13314 1065387 1192984 1893037 2986222 4147002 5123542 5819224 6167647 6094591 5633064
13305 5633064 4916119 4069784 3187216 2357463 1685913 1268781 1148021 1286025 1598176
$$ packed form
13368A2272517j43871J16554M16736N99743M56747q8299q06157j333846j473362
13359A0016762j257014q42558l99354j9952K82328M90175N91357O35274O86448
13350A0183466P55250Q25031R26569J037740R82442O34764J25392l14943o10932
13341A4544779q32217j035956j159682j080221q29093n81627m08383k31196m664
13332H381740K02024L14213L14350J69345j61665o13789j008029j185807j118694
13323E293688q89398o11926l78631k47871k46845l65942n32487n87750l67451
13314A065387J27597P00053J093185J160780R76540O95682L48423p3056m61527
13305E633064p16945q46335q82568q29753o71550m17132j20760J38004L12151
$$ plain form
13296 1598176 2054760 2707756 3556468 4435548 5086804 5344517 5261676 5048466 4888137 4829246
13286 4829246 4865584 5065111 5499977 6081067 6587227 6865645 6936265 6842108 6504569 5833905
13276 5833905 4849375 3634346 2294905 964433 -243173 -1257843 -2032148 -2558317 -2874578
13267 -2874578 -3065531 -3236173 -3432758 -3609130 -3660887 -3480223 -3019131 -2356924 -1703104 -1252022
13257 -1252022 -1039826 -985957 -990874 -973417 -898270 -797712 -745943 -783581 -871402 -939682 -969678
13246 -969678 -997885 -1044053 -1084871 -1125361 -1251055 -1572211 -2142811 -2918839 -3776652 -4584620
13236 -4584620 -5233550 -5582919 -5470157 -4874369 -4006294 -3183180 -2643844 -2444032 -2453405 -2429378
13226 -2429378 -2177286 -1690532 -1140212 -789438 -865541 -1408049 -2239588 -3110555 -3896171 -4618893
$$ packed form
13296A598176M56584O52996Q48712Q79080O51256K57713q2841k13210j60329n8891
13286D829246L6338J99527M34866N81090N06160K78418P0620r4157l37539o70664
13276E833905r84530j215029j339441j330472j207606j014670p74305n26169l16261
13267b874578j90953j70642j96585j76372n1757J80664M61092O62207O53820M51082
13257a252022K12196N3869m917J7457P5147J00558N1769l7638q7821o8280k9996
13246i69678k8207m6168m0818m0490j25694l21156n70600p76028q57813q07968
13236d584620o48930l49369J12762N95788Q68075Q23114N39336J99812r373K4027
13226b429378K52092M86754N50320L50774p6103n42508q31539q70967p85616p22722
$$ plain form
13216 -4618893 -5265468 -5722497 -5936177 -5968740 -5897981 -5804776 -5819032 -6062474 -6533004 -7084541
13206 -7084541 -7551766 -7882857 -8121446 -8306758 -8455242 -8572839 -8613321 -8462584 -8029101 -7332157
13196 -7332157 -6440763 -5366112 -4093485 -2688857 -1307528 -125672 728544 1238624 1510416
13187 1510416 1720368 2042023 2553699 3169426 3673322 3870797 3737309 3418011 3048411
13178 3048411 2550229 1696365 437925 -961155 -2166724 -3019491 -3530963 -3776603 -3848871
13169 -3848871 -3818003 -3696481 -3485528 -3238495 -3034787 -2848768 -2469950 -1656163 -363490
13160 -363490 1228804 2861536 4312501 5463926 6303689 6847925 7136284 7294812 7504604
13151 7504604 7910425 8540491 9238305 9711502 9696853 9090765 7979334 6558140 5009976
$$ packed form
13216d618893o46575m57029k13680l2563P0759R3205j4256k43442m70530n51537
13206g084541m67225l31091k38589j85312j48484j17597m0482J50737M33483O96944
13196g332157Q91394J074651J272627J404628J381329J181856Q54216N10080K71792
13187A510416K09952L21655N11676O15727N03896J97475j33488l19298l69600
13178C048411m98182q53864j258440j399080j205569q52767n11472k45640p2268
13169c848871L0868J21522K10953K47033K03708J86019L78818Q13787J292673
13160c63490J592294J632732J450965J151425Q39763N44236K88359J58528K09792
13151G504604M05821O30066O97814M73197j4649o06088j111431j421194j548164
$$ plain form
13142 5009976 3477568 2124614 1153457 704562 722263 967066 1195704 1333856 1475931
13133 1475931 1732834 2122324 2566243 2929218 3091505 2987666 2589471 1910219 1029581
13124 1029581 71218 -872086 -1763767 -2547615 -3101215 -3375184 -3533874 -3835642 -4379375
13115 -4379375 -5050593 -5703102 -6247261 -6594462 -6665837 -6444583 -5950477 -5197383 -4230506 -3167882
13105 -3167882 -2159597 -1318814 -696832 -268408 34343 270025 537273 965301 1528736
13096 1528736 1983408 2101096 1875360 1455339 983582 515890 32186 -501854 -1044898
13087 -1044898 -1470696 -1676218 -1623181 -1318988 -878249 -508416 -339158 -341479 -396749 -338477
13077 -338477 -3315 616285 1307053 1790745 1936031 1834531 1694444 1656488 1723110 1860341
$$ packed form
13142E009976j532408j352954r71157m48895J7701K44803K28638J38152J42075
13133A475931K56903L89490M43919L62975J62287j03839l98195o79252q80638
13124A029581r58363r43304q91681p83848n53600k73969j58690l01768n43733
13115d379375o71218o52509n44159l47201p1375K21254M94106P53094R66877J062624
13105c167882J008285Q40783O21982M28424L02751K35682K67248M28028N63435
13096A528736M54672J17688k25736m20021m71757m67692m83704n34040n43044
13087a044898m25798k05522N3037L04193M40739L69833J69258k321n5270N8272
13077c38477L35162O19600O90768M83692J45286j01500j40087l7956O6622J37231
$$ plain form
13067 1860341 2105838 2502960 2939151 3162224 3017562 2603113 2177259 1955178 1962124 2062281
13057 2062281 2116753 2045423 1778720 1286746 675626 168655 -55134 27198 320102 682634
13047 682634 985531 1172169 1297384 1523137 2016112 2777069 3597902 4226640 4529876 4450566
13037 4450566 3910886 2896974 1614104 389635 -584475 -1307000 -1851652 -2292420 -2666536
13028 -2666536 -2906462 -2863199 -2483057 -1915937 -1365203 -876740 -363739 232750 877101 1455884
13018 1455884 1790419 1680375 1023436 -97586 -1471551 -2899614 -4231289 -5307838 -5988120
13009 -5988120 -6263164 -6292988 -6245212 -6103265 -5692864 -4856043 -3608952 -2176019 -838503
13000 -838503 232735 1025987 1633067 2133973 2518201 2703678 2594769 2115339 1269504
$$ packed form
13067A860341K45497L97122M36191K23073j44662m14449m25854k22081O946J00157
13057B062281N4472p1330k66703m91974o11120n06971k23789Q2332K92904L62532
13047F82634L02897J86638J25215K25753M92975P60957Q20833O28738L03236p9310
13037D450566n39680j013912j282870j224469r74110p22525n44652m40768l74116
13028b666536k39926M3263L80142N67120N50734M88463N13001N96489O44351N78783
13018A455884L34535j10044o56939j121022j373965j428063j331675j076549o80282
13009e988120k75044k9824M7776J41947M10401Q36821J247091J432933J337516
13000h38503J071238P93252O07080N00906L84228J85477j08909m79430q45835
$$ plain form
12991 1269504 195913 -890703 -1861691 -2788078 -3805785 -4870079 -5759622 -6314519 -6547569
12982 -6547569 -6496429 -6093484 -5256980 -4023279 -2531157 -929743 691782 2330474 4047179
12973 4047179 5893003 7800939 9549828 10916146 11856999 12487675 12912801 13126998 13092354
12964 13092354 12853835 12526928 12226990 12042954 11998583 11994738 11825158 11291435 10354554 9162324
12954 9162324 7916927 6775220 5858810 5246573 4881765 4531578 3919593 2893172 1475963
12945 1475963 -129410 -1612968 -2735537 -3425680 -3725841 -3685453 -3295108 -2548042 -1570163
12936 -1570163 -617998 79281 442712 538662 509356 464645 396304 219308 -102434 -514097
12926 -514097 -907671 -1171457 -1255560 -1191272 -1039919 -835171 -591190 -383334 -378488 -709787
$$ packed form
12991A269504j073591j086616r70988r26387j017707j064294q89543n54897k33050
12982f547569N1140M02945Q36504J233701J492122J601414J621525J638692J716705
12973D047179J845824J907936J748889J366318R40853O30676M25126K14197l4644
12964A3092354k38519l26907k99938j84036m4371l845j69580n33723r36881j192230
12954I162324j245397j141707r16410o12237l64808l50187o11985j026421j417209
12945A475963j605373j483558j122569o90143l00161M0388L90345P47066R77879
12936a570163R52165O97279L63431R5950k9306m4711o8341j76996l21742m11663
12926e14097l93574k63786q4103O4288J51353K04748K43981K07856M846l31299
$$ plain form
12916 -709787 -1332294 -2051124 -2686367 -3178778 -3549428 -3823818 -3998889 -4056776 -4011542 -3920373
12906 -3920373 -3819681 -3697090 -3577038 -3600941 -3939341 -4600385 -5373080 -5958261 -6147367 -5921010
12896 -5921010 -5396423 -4691644 -3878669 -3039016 -2295728 -1747741 -1404915 -1248585 -1303967 -1574078
12886 -1574078 -1940377 -2183572 -2114338 -1709213 -1129126 -587631 -198731 66710 322076 662084
12876 662084 1117623 1635541 2060679 2243994 2178500 1983900 1775178 1574534 1339038 1060030
12866 1060030 841648 871842 1335510 2333912 3797510 5446943 6865233 7666918 7693907
12857 7693907 7085401 6143181 5153796 4318908 3715232 3277577 2878505 2434877 1966020
12848 1966020 1578526 1363795 1297998 1297208 1346275 1490117 1711752 1919488 2007115 1836566
$$ packed form
12916g09787o22507p18830o35243m92411l70650k74390j75071n7887M5234R1169
12906c920373J00692J22591J20052k3903l38400o61044p72695n85181j89106K26357
12896e921010N24587P04779Q12975Q39653P43288N47987L42826J56330n5382k70111
12886a574078l66299k43195O9234M05125N80087N41495L88900K65441K55366L40008
12876F62084M55539N17918M25138J83315o5494j94600k08722k00644k35496k79008
12866A060030k18382L0194M63668R98402J463598J649433J418290Q01685K6989
12857G693907o08506r42220r89385q34888o03676m37655l99072m43628m68857
12848A966020l87494k14731o5797p90M9067J43842K21635K07736Q7627j70549
$$ plain form
12838 1836566 1248881 170932 -1312741 -2981934 -4563325 -5845960 -6757955 -7354339 -7734181
12829 -7734181 -7951812 -8005821 -7883026 -7588581 -7141838 -6540816 -5735760 -4648619 -3247013
12820 -3247013 -1608452 82909 1580243 2658526 3254827 3526782 3686028 3779958 3695650
12811 3695650 3397752 3087300 3056361 3436256 4104195 4769655 5143005 5106932 4768174 4344718
12801 4344718 4028627 3915174 3973061 4076763 4117263 4104914 4153907 4362669 4713422 5077890
12791 5077890 5298046 5267255 4996591 4625214 4339114 4276240 4455659 4737492 4907698 4828837
12781 4828837 4512391 4102381 3782057 3696734 3952734 4605614 5633177 6933629 8324910
12772 8324910 9595843 10637403 11478522 12156530 12650193 12984834 13283405 13622468 13914676
$$ packed form
12838A836566n87685j077949j483673j669193j581391j282635r11995n96384l79842
12829g734181k17631n4009J22795K94445M46743O01022Q05056J087141J401606
12820c247013J638561J691361J497334J078283N96301K71955J59246R3930q4308
12811C695650k97898l10452l0939L79895O67939O65460L73350l6073l38758m23456
12801D344718l16091j13453N7887J03702M0500j2349M8993K08762L50753L64468
12791E077890K20156l0791k70664l71377k86100o2874J79419K81833J70206p8861
12781D828837l16446m10010l20324q5323K56000O52880J027563J300452J391281
12772H324910J270933J041560Q41119O78008M93663L34641K98571L39063K92208
$$ plain form
12763 13914676 14034570 13987695 13907087 13912655 13980860 13979442 13786184 13345029 12688543 11948353
12753 11948353 11279137 10741338 10298850 9901909 9502635 9066142 8648095 8402851 8457216
12744 8457216 8799280 9326522 9939736 10563808 11133673 11605920 11987971 12323309 12636466
12735 12636466 12914203 13121671 13210706 13148967 12969406 12718424 12320131 11601754 10489230
12726 10489230 9113837 7753350 6687398 6005230 5541606 5053345 4439925 3796296 3300751
12717 3300751 3095086 3227766 3605649 4036552 4380665 4602721 4681342 4539479 4090380 3340444
12707 3340444 2436240 1571679 862900 342503 -8743 -253267 -448029 -599042 -701729
12698 -701729 -794448 -929258 -1099369 -1219351 -1161122 -779159 9853 1068930 2011107 2398861
$$ packed form
12763A3914676J19894m6875q0608N568O8205j418j93258m41155o56486p40190
12753A1948353o69216n37799m42488l96941l99274m36493m18047k45244N4365
12744H457216L42064N27242O13214O24072N69865M72247L82051L35338L13157
12735A2636466K77737K07468Q9035o1739j79561k50982l98293p18377j112524
12726A0489230j375393j360487j065952o82168m63624m88261o13420o43629m95545
12717C300751k05665J32680L77883M30903L44113K22056P8621j41863m49099p49936
12707C340444r04204q64561p08779n20397l51246k44524j94762j51013j02687
12698g01729r2719j34810j70111j19982N8229L81963P89012J059077R42177L87754
$$ plain form
12688 2398861 2013399 1000905 -225024 -1261471 -1925131 -2290289 -2580436 -2954134 -3377455
12679 -3377455 -3669939 -3664498 -3359849 -2895985 -2407240 -1937150 -1456403 -916909 -308211 295672
12669 295672 743562 911687 812350 573798 319764 73900 -176448 -356113 -333281 -40959
12659 -40959 492952 1223373 2124582 3113189 4023477 4737350 5317226 5924823 6633715 7369695
12649 7369695 7992893 8449000 8821844 9193652 9517393 9695876 9727245 9679126 9554795 9297268
12639 9297268 8902661 8449359 8019311 7626003 7212173 6687352 6020659 5291299 4585463
12630 4585463 3908036 3204783 2371891 1277559 -105442 -1606567 -2960045 -3975119 -4611372
12621 -4611372 -4935010 -5016632 -4870162 -4436979 -3642978 -2543682 -1326681 -164992 809764
$$ packed form
12688B398861l85462j012494j225929j036447o63660l65158k90147l73698m23321
12679c377455k92484N441L04649M63864M88745M70090M80747N39494O08698O03883
12669B95672M47890J68125r9337k38552k54034k45864k50348j79665K2832K92322
12659d0959N33911P30421R01209R88607R10288P13873N79876O07597P08892P35980
12649G369695O23198M56107L72844L71808L23741J78483L1369m8119j24331k57527
12639I297268l94607m53302m30048l93308m13830n24821o66693p29360p05836
12630D585463o77427p03253q32892j094332j383001j501125j353478j015074o36253
12621d611372l23638q1622J46470M33183P94001J099296J217001J161689R74756
$$ plain form
12612 809764 1465489 1726157 1619994 1228244 654048 51435 -381605 -474371 -189572 275380
12602 275380 592813 576658 282971 -117852 -488462 -774640 -975214 -1082577 -1044413 -784431
12592 -784431 -282096 326104 766620 822824 508022 45909 -307638 -462087 -532701 -664438
12582 -664438 -849240 -936862 -755055 -205003 691995 1780506 2832129 3672946 4238852
12573 4238852 4529974 4548873 4290040 3789314 3138324 2463847 1911422 1553654 1310336 1023272
12563 1023272 577581 -56992 -819596 -1567026 -2141762 -2454007 -2513859 -2402882 -2230060 -2092831
12553 -2092831 -2028066 -1977059 -1795930 -1348433 -676788 -11739 468353 800076 1168770 1737084
12543 1737084 2529092 3472880 4478019 5418329 6081930 6216188 5691471 4640782 3380558
$$ packed form
12612H09764O55725K60668j06163l91750n74196o02613m33040r2766K84799M64952
12602B75380L17433j6155k93687m00823l70610k86178k00574j07363L8164K59982
12592g84431N02335O08200M40516N6204l14802m62113l53547j54449p0614j31737
12582f64438j84802q7622J81807N50052Q96998J088511J051623Q40817N65906
12573D238852K91122J8899k58833n00726o50990o74477n52425l57768k43318k87064
12563A023272m45691o34573p62604p47430n74736l12245n9852J10977J72822J37229
12553b092831O4765N1007J81129M47497O71645O65049M80092L31723L68694N68314
12543A737084P92008R43788J005139R40310O63601J34258n24717j050689j260224
$$ plain form
12534 3380558 2184572 1190467 471020 73737 -16839 118474 411203 860236 1456915
12525 1456915 2114220 2789011 3609180 4712436 6028238 7384707 8730309 10091670 11408149
12516 11408149 12516569 13284120 13734535 14044335 14427148 14997231 15750319 16677667 17776089
12507 17776089 18941566 20010901 20930949 21811817 22856220 24221684 25864063 27590254
12499 27590254 29295249 31019890 32774204 34422041 35805067 36956127 38099966 39405318
12491 39405318 40822994 42202534 43471020 44651239 45781962 46889834 48032097 49302561
12483 49302561 50808000 52689190 55063482 57864922 60805250 63565513 66063034 68487373
12475 68487373 71050152 73798211 76649165 79433774 81891092 83751345 84877233 85318254
$$ packed form
12534C380558j195986r94105p19447l97283r0576J35313K92729M49033N96679
12525A456915O57305O74791Q20169J103256J315802J356469J345602J361361J316479
12516A1408149J108420P67551M50415L09800L82813N70083P53088R27348J098422
12507A7776089J165477J069335R20048Q80868J044403J365464J642379J726191
12499B7590254J704995J724641J754314J647837J383026J151060J143839J305352
12491C9405318J417676J379540J268486J180219J130723J107872J142263J270464
12483D9302561J505439J881190K374292K801440K940328K760263K497521K424339
12475F8487373K562779K748059K850954K784609K457318J860253J125888M41021
$$ plain form
12467 85318254 85266732 84993762 84742039 84598431 84447942 84046583 83169545 81756532 79980745
12458 79980745 78096857 76203612 74262532 72264278 70256493 68258225 66234267 64161715
12450 64161715 62043075 59829284 57368585 54498366 51251901 47923966 44889321 42414482
12442 42414482 40605680 39393817 38534038 37703638 36661246 35317020 33681945 31832150
12434 31832150 29939989 28249677 26960774 26114537 25609270 25368706 25432478 25816618 26379019
12425 26379019 26874942 27091747 26940512 26495500 25984415 25663217 25616056 25686637 25612008 25188334
12415 25188334 24359852 23235866 22014999 20879318 19951615 19262997 18728362 18211626 17604759
12406 17604759 16838686 15887558 14772405 13525958 12153972 10658128 9072245 7479242
$$ packed form
12467H5318254n1522k72970k51723j43608j50489m01359q77038j413013j775787
12458G9980745j883888j893245j941080j998254k007785j998268k023958k072552
12450F4161715k118640k213791k460699k870219l246465l327935l034645k474839
12442D2414482j808802j211863q59779q30400j042392j344226j635075j849795
12434C1832150j892161j690312j288903q46237n05267k40564O3772L84140N62401
12425B6379019M95923K16805j51235m45012n11085l21198m7161P0581p4629m23674
12415B5188334q28482j123986j220867j135681r27703o88618n34635n16736o06867
12406A7604759p66073r51128j115153j246447j371986j495844j585883j593003
$$ plain form
12398 7479242 6002611 4765018 3887286 3468907 3505058 3857180 4362124 4939658 5542389
12389 5542389 6058622 6297707 6081673 5373447 4298871 3067422 1914379 1081099 756994
12380 756994 988520 1640366 2492817 3356814 4087192 4626165 5059346 5500398 5952585 6378072
12370 6378072 6819285 7393553 8177677 9083002 9850936 10240747 10254383 10107172 9986226 9939883
12360 9939883 9916014 9780290 9414280 8867576 8338519 8015111 8019206 8460515 9378330 10594875
12350 10594875 11721829 12400915 12521119 12150675 11350704 10146281 8622398 6919372 5115645
12341 5115645 3217237 1329255 -231536 -1124907 -1282130 -913133 -258236 573694 1565336
12332 1565336 2618049 3451499 3780712 3551010 2933565 2150848 1330525 488426 -355382
$$ packed form
12398G479242j476631j237593q77732m18379L6151L52122N04944N77534O02731
12389E542389N16233K39085k16034p08226j074576j231449j153043q33280l24105
12380G56994K31526O51846Q52451Q63997P30378N38973M33181M41052M52187M25487
12370F378072M41213N74268P84124R05325P67934L89811J3636j47211j20946m6343
12360I939883k3869j35724l66010n46704n29057l23408M095M41309R17815J216545
12350A0594875J126954O79086J20204l70444p99971j204423j523883j703026j803727
12341E115645j898408j887982j560791q93371j57223L68997O54897Q31930R91642
12332A565336J052713Q33450L29213k29702o17445p82717q20323q42099q43808
$$ plain form
12323 -355382 -1096620 -1573326 -1653266 -1332649 -721569 78045 1051230 2213559 3481306
12314 3481306 4646338 5512453 5990073 6040078 5649633 4903998 3978191 3037617 2179918
12305 2179918 1457262 896605 486489 201795 58831 59666 76956 -75732 -428183 -819749
12295 -819749 -1110797 -1318427 -1529497 -1802323 -2167045 -2628032 -3147110 -3653418 -4066105 -4307711
12285 -4307711 -4332953 -4134507 -3733217 -3181008 -2564796 -1987230 -1487996 -1041277 -652324 -360745
12275 -360745 -131698 199533 797820 1665896 2682977 3700639 4522409 4892700 4637478
12266 4637478 3866174 2954156 2257014 1921104 1926220 2124654 2287354 2268681 2097602 1875531
12256 1875531 1658924 1444908 1203655 904471 572420 315597 230177 296417 388551 367821
$$ packed form
12323c55382p41238m76706p9940L20617O11080P99614R73185J162329J267747
12314C481306J165032Q66115M77620N0005l90445p45635r25807r40574q57699
12305B179918p22656n60657m10116k84694j42964Q35J7290j52688l52451l91566
12295h19749k91048k07630k11070k72826l64722m60987n19078n06308m12687k41606
12285d307711k5242J98446M01290N52209O16212N77566M99234M46719L88953K91579
12275c60745K29047L31231N98287Q68076J017081J017662Q21770L70291k55222
12266D637478p71304r12018o97142l35910N116J98434J62700j8673j71079k22071
12256A875531k16607k14016k41253k99184l32051k56823q5420O6240R2134k0730
$$ plain form
12246 367821 184884 -70377 -219857 -143488 135752 535012 1017683 1574212 2151748 2659734
12236 2659734 3046522 3351344 3670746 4079930 4585875 5119654 5570214 5854391 5953794 5917182
12226 5917182 5838505 5783889 5726929 5611536 5480888 5476884 5660143 5907666 6081361 6195297
12216 6195297 6300165 6270768 5843013 4923242 3774741 2784727 2151379 1868755 1837358 1941931
12206 1941931 2123382 2342885 2509712 2550549 2530353 2640811 3031116 3645171 4249817 4633013
12196 4633013 4755110 4730580 4720552 4858817 5194520 5598446 5805240 5636709 5148634 4561036
12186 4561036 4059815 3664262 3277415 2812640 2240793 1613342 1107724 918133 1070075
12177 1070075 1419044 1794348 2062956 2129080 1988029 1751654 1572307 1526357 1579254 1657438
$$ packed form
12246C67821j82937k55261j49480P6369K79240L99260M82671N56529N77536N07986
12236B659734L86788L04822L19402M09184N05945N33779M50560K84177R9403l6612
12226E917182p8677n4616n6960j15393j30648m004J83259K47523J73695J13936
12216F195297J04868k9397m27755r19771j148501r90014o33348k82624l1397J04573
12206A941931J81451K19503J66827M0837k0196J10458L90305O14055O04646L83196
12196D633013J22097k4530j0028J38265L35703M03926K06794j68531m88075n87598
12186D561036n01221l95553l86847m64775n71847o27451n05618j89591J51942
12177A070075L48969L75304K68608O6124j41051k36375j79347m5950N2897P8184
$$ plain form
12167 1657438 1661899 1401744 674167 -535588 -2004974 -3437545 -4660734 -5649186 -6395953
12158 -6395953 -6882966 -7179041 -7449406 -7818925 -8265972 -8654507 -8836420 -8769137 -8568357 -8399048
12148 -8399048 -8302206 -8157156 -7825440 -7270339 -6495697 -5508783 -4400680 -3352620 -2529049
12139 -2529049 -1955307 -1492274 -987634 -494797 -290982 -558991 -1097167 -1487979 -1490408 -1167201
12129 -1167201 -710686 -251372 181918 615094 1080792 1599236 2226562 3036219 3997735
12120 3997735 4942416 5696172 6239566 6677681 7013913 7068304 6685988 5897167 4878440
12111 4878440 3888566 3200981 2988983 3266957 3916323 4724569 5428210 5806979 5798147 5504954
12101 5504954 5122335 4863012 4862850 5131755 5584980 6090186 6504152 6672570 6439215 5746800
$$ packed form
12167A657438M461k60155p27577j209755j469386j432571j223189r88452p46767
12158f395953m87013k96075k70365l69519m47047l88535j81913O7283K00780J69309
12148h399048R6842J45050L31716N55101P74642R86914J108103J048060Q23571
12139b529049N73742M63033N04640M92837K03815k68009n38176l90812k429L23207
12129a167201M56515M59314M33290M33176M65698N18444O27326Q09657R61516
12120C997735R44681P53756N43394M38115L36232N4391l82316p88821j018727
12111D878440r89874o87585k11998K77974O49366Q08246P03641L78769q832k93193
12101E504954l82619k59323j62K68905M53225N05206M13966J68418k33355o92415
$$ plain form
12091 5746800 4781276 3938763 3550070 3657162 4042968 4389309 4442073 4111834 3436991 2553832
12081 2553832 1705775 1122629 880264 906941 1050472 1176009 1274842 1427632 1656582 1877452
12071 1877452 1998505 1997102 1879901 1677570 1499891 1526872 1924861 2753440 3906292 5128684
12061 5128684 6143346 6791169 7078313 7140655 7123575 7030440 6741978 6175745 5361376 4439723
12051 4439723 3658247 3279654 3427289 4057132 5051430 6256064 7457895 8432734 9059752
12042 9059752 9349876 9372248 9159124 8646946 7731188 6419544 4884816 3325244 1870969
12033 1870969 646423 -193961 -521465 -283042 500389 1735195 3240170 4785561 6187665
12024 6187665 7324540 8053954 8253985 7978824 7435135 6790559 6098505 5423441 4909480
$$ packed form
12091E746800r65524q42513l88693J07092L85806L46341N2764l30239o74843q83159
12081B553832q48057n83146k42365K6677J43531J25537R8833J52790K28950K20870
12071A877452J21053j403j17201k02331j77679K6981L97989Q28579J152852J222392
12061E128684J014662O47823K87144O2342j7080r3135k88462n66233q14369r21653
12051D439723p81476l78593J47635O29843R94298J204634J201831R74839O27018
12042I059752K90124K2372k13124n12178r15758j311644j534728j559572j454275
12033A870969j224546q40384l27504K38423P83431J234806J504975J545391J402104
12024F187665J136875P29414K00031k75161n43689o44576o92054o75064n13961
$$ plain form
12015 4909480 4633646 4513081 4415108 4226695 3812420 3093257 2193975 1365793 775148 430910
12005 430910 247570 126718 -40037 -396263 -1006414 -1753822 -2448415 -2925799 -3043742 -2762305
11995 -2762305 -2236618 -1739913 -1520261 -1743434 -2442378 -3477353 -4611955 -5641004 -6456012
11986 -6456012 -7018802 -7309003 -7299364 -6955573 -6293673 -5416911 -4452718 -3504275 -2693398 -2210615
11976 -2210615 -2250925 -2837085 -3737376 -4605060 -5167402 -5295354 -4954853 -4162211 -3031653
11967 -3031653 -1774261 -562097 559304 1554989 2269032 2518319 2295114 1802860 1272500
11958 1272500 784640 288176 -287756 -965464 -1709065 -2469457 -3202157 -3832464 -4284775
11949 -4284775 -4568407 -4759188 -4899120 -4961828 -4869779 -4543832 -3971625 -3203026 -2317160 -1442018
$$ packed form
12015D909480k75834j20565r7973j88413m14275p19163q99282q28182n90645l44238
12005D30910j83340j20852j66755l56226o10151p47408o94593m77384j17943K81437
11995b762305N25687M96705K19652k23173o98944j034975j134602j029049q15008
11986f456012n62790k90201R639L43791O61900Q76762R64193R48443Q10877M82783
11976b210615m0310n86160r00291q67684n62342j27952L40501P92642J130558
11967c031653J257392J212164J121401R95685P14043K49287k23205m92254n30360
11958A272500m87860m96464n75932o77708p43601p60392p32700o30307m52311
11949d284775k83632j90781j39932o2708R2049L25947N72207P68599Q85866Q75142
$$ plain form
11939 -1442018 -736854 -286118 -24130 243591 736609 1547257 2539928 3411306 3908195
11930 3908195 3997054 3847738 3696932 3678962 3781217 3949910 4174448 4482491 4885047 5319526
11920 5319526 5685821 5949877 6167008 6424933 6777918 7208718 7646733 8065531 8529965
11911 8529965 9055368 9475200 9534831 9122864 8394300 7673068 7222252 7051639 6930350 6605807
11901 6605807 5973252 5059747 3967967 2870386 1968329 1386336 1128395 1151237 1432002
11892 1432002 1945155 2567423 3047718 3131852 2715403 1887820 876636 -69120 -791598
11883 -791598 -1242670 -1426321 -1338538 -971257 -344337 498509 1506038 2601358 3643586
11874 3643586 4441336 4832009 4766525 4329397 3635173 2723081 1642528 579818 -228607
$$ packed form
11939a442018P05164M50736K61988K67721M93018Q10648R92671Q71378M96889
11930C908195Q8859j49316j50806j7970J02255J68693K24538L08043M02556M34479
11920E319526L66295K64056K17131K57925L52985M30800M38015M18798M64434
11911H529965N25403M19832N9631m11967p28564p21232m50816j70613j21289l24543
11901F605807o32555r13505j091780j097581r02057n81993k57941K2842K80765
11892A432002N13153O22268M80295Q4134m16449q27583j011184r45756p22478
11883g91598m51072j83651Q7783L67281O26920Q42846J007529J095320J042228
11874C643586P97750L90673o5484m37128o94224r12092j080553j062710q08425
$$ plain form
11865 -228607 -713874 -1001275 -1180895 -1205351 -1058381 -865904 -808577 -984940 -1361499 -1824234
11855 -1824234 -2242866 -2531367 -2711460 -2874231 -3065012 -3234352 -3286048 -3181843 -2974254 -2715181
11845 -2715181 -2414651 -2058518 -1563285 -784046 320314 1594636 2809124 3803368 4501268
11836 4501268 4875991 4915547 4642484 4195746 3788972 3534853 3413971 3385003 3389118 3338780
11826 3338780 3158959 2781537 2168539 1358438 467601 -333767 -906641 -1291705 -1753767
11817 -1753767 -2559422 -3685642 -4817623 -5611454 -5884210 -5616380 -4915452 -3961909 -2931021
11808 -2931021 -2008827 -1414715 -1296547 -1615389 -2176992 -2752774 -3190323 -3474097 -3684842
11799 -3684842 -3880472 -4032678 -4050586 -3829671 -3328083 -2621493 -1858256 -1144503 -519488 -15079
$$ packed form
11865b28607m85267k87401j79620k4456J46970J92477N7327j76363l76559m62735
11855a824234m18632k88501j80093j62771j90781j69340n1696J04205K07589K59073
11845b715181L00530L56133M95233P79239J104360J274322J214488R94244O97900
11836D501268L74723L9556k73063m46738m06774k54119j20882k8968M115n0338
11826C338780j79821l77422o12998q10101q90837q01368n72874l85064m62062
11817a753767q05655j126220j131981p93831k72756K67830P00928R53543J030888
11808b931021R22194N94112J18168l18842n61603n75782m37549k83774k10745
11799c684842j95630j52206j7908K20915N01588P06590P63237P13753O25015N04409
$$ plain form
11789 -15079 327589 483578 493364 471924 537834 720897 927752 1018725 923052 674895 341667
11778 341667 -6634 -266223 -369057 -374137 -425205 -651593 -1125681 -1861307 -2781206 -3689278
11768 -3689278 -4342145 -4595088 -4466496 -4078216 -3610766 -3253712 -3100868 -3093657 -3077860 -2917393
11758 -2917393 -2598176 -2200791 -1783323 -1406142 -1208281 -1330880 -1793094 -2484332 -3267285
11749 -3267285 -4035852 -4654304 -4960103 -4878950 -4457101 -3788480 -2951709 -2009509 -1062498 -232655
11739 -232655 422932 897682 1168644 1190931 901692 248991 -718625 -1858627 -3044614
11730 -3044614 -4197411 -5246256 -6134683 -6868632 -7513655 -8109774 -8625893 -9003456 -9176862
11721 -9176862 -9089025 -8783038 -8426471 -8163780 -7956725 -7615077 -6981324 -6043412 -4892601
$$ packed form
11789a5079L42668J55989R786k1440O5910J83063K06855R0973r5673k48157l33228
11778C41667l48301k59589j02834n080n1068k26388m74088p35626r19899r08072
11768c689278o52867k52943J28592L88280M67450L57054J52844P211J5797J60467
11758b917393L19217L97385M17468L77181J97861j22599m62214o91238p82953
11749c267285p68567o18452l05799Q1153M21849O68621Q36771R42200R47011Q29843
11739b32655O55587M74750K70962K2287k89239o52701r67616j140002j185987
11730c044614j152797j048845q88427p33949o45023n96119n16119l77563j73406
11721i176862Q7837L05987L56567K62691K07055L41648O33753R37912J150811
$$ plain form
11712 -4892601 -3641728 -2382682 -1195051 -185577 512244 805785 734382 475872 224709
11703 224709 89299 79483 119034 85959 -119511 -519005 -988340 -1260600 -1088931 -398915
11693 -398915 708643 2023701 3280433 4212006 4642523 4568515 4127147 3496348 2787975
11684 2787975 1962214 919717 -318146 -1580673 -2626703 -3241247 -3327541 -2951118 -2323072
11675 -2323072 -1728242 -1394547 -1357675 -1437008 -1411476 -1247471 -1103441 -1129787 -1327723 -1576241
11665 -1576241 -1758164 -1867057 -1952128 -2007161 -1980187 -1824334 -1521732 -1098955 -637967 -240528
11655 -240528 74481 369364 664290 908641 1051564 1088981 1034498 885444 658582 407479
11645 407479 204530 108838 98706 115802 188006 419640 874868 1487590 2045758 2283823
$$ packed form
11712d892601J250873J259046J187631J009474O97821K93541p1403k58510k51163
11703B24709j35410r816L9551l3075k05470l99494m69335k72260J71669O90016
11693c98915J107558J315058J256732R31573M30517p4008m41368o30799p08373
11684B787975q25761j042497j237863j262527j046030o14544q6294L76423O28046
11675b323072N94830L33695L6872p9333K5532J64005J44030k6346j97936k48518
11665a576241j81923j08893q5071n5033K6974J55853L02602M22777M60988L97439
11655b40528L15009K94883K94926K44351J42923L7417n4483j49054k26862k51103
11645D07479k02949r5692j0132J7096P2204K31634M55228O12722N58168K38065
$$ plain form
11635 2283823 2079027 1545776 912318 346122 -113290 -528048 -971841 -1393562 -1600287
11626 -1600287 -1457716 -1079432 -744762 -643783 -726732 -747289 -453083 221781 1141602 2112073
11616 2112073 2978370 3614982 3920446 3844156 3425999 2846268 2375054 2201075 2322654 2597646
11606 2597646 2865238 2996894 2881641 2459792 1776302 967256 157216 -632353 -1417777
11597 -1417777 -2167140 -2831959 -3361905 -3666140 -3617994 -3129254 -2230809 -1122618 -102900
11588 -102900 624391 1036435 1228389 1288716 1219913 1024386 808768 723577 852009 1216313
11578 1216313 1839145 2739227 3866109 5039205 5978707 6439346 6370122 5994443 5702430
11569 5702430 5778392 6228459 6848778 7387829 7702302 7821725 7844431 7810045 7685200 7405706
$$ packed form
11635B283823k04796n33251o33458n66196m59412m14758m43793m21721k06725
11626a600287J42571L78284L34670J00979q2949k0557K94206O74864R19821R70471
11616B112073Q66297O36612L05464p6290m18157n79731m71214j73979J21579K74992
11606B597646K67592J31656j15253m21849o83490q09046q10040p89569p85424
11597a417777p49363o64819n29946l04235M8146M88740Q98445J108191J019718
11588a02900P27291M12044J91954O0327o8803j95527k15618q5191J28432L64304
11578A216313O22832R00082J126882J173096R39502M60639o9224l75679k92013
11569E702430P5962M50067O20319N39051L14473J19423K2706l4386j24845k79494
$$ plain form
11559 7405706 6909928 6175604 5258389 4282858 3379717 2636610 2036319 1426206 660177
11550 660177 -254232 -1158877 -1810781 -1994159 -1656427 -903438 123705 1296039 2466095
11541 2466095 3445774 4027417 4062313 3566935 2739149 1837133 1033999 337722 -368460 -1199322
11531 -1199322 -2220707 -3409694 -4588369 -5496243 -5923734 -5760813 -5030324 -3911444 -2646893
11522 -2646893 -1439848 -433367 278285 637072 644476 373116 -54257 -485709 -767707
11513 -767707 -776054 -457835 136208 852570 1485449 1889237 2070876 2158470 2292972 2565593
11503 2565593 2981959 3440879 3804340 4040078 4261445 4594272 5076073 5678108 6357319
11494 6357319 7099107 7923756 8852604 9858476 10850130 11715632 12358669 12693448 12656247
$$ packed form
11559G405706m95778p34324r17215r75531r03141p43107o00291o10113p66029
11550F60177r14409r04645o51904j83378L37732P52989J027143J172334J170056
11541B466095R79679N81643L4896m95378q27786r02016q03134o96277p06182q30862
11531a199322j021385j188987j178675r07874m27491J62921P30489J118880J264551
11522b646893J207045J006481P11652L58787P404k71360m27373m31452k81998
11513g67707q347L18219N94043P16362O32879M03788J81639Q7594J34502K72621
11503B565593M16366M58920L63461K35738K21367L32827M81801O02035O79211
11494F357319P41788Q24649R28848J005872R91654Q65502O43037L34779l7201
$$ plain form
11485 12656247 12249548 11549051 10662722 9687170 8720220 7869209 7178306 6593959 6026504
11476 6026504 5412966 4712586 3871442 2853007 1716052 596204 -380978 -1132351 -1637342
11467 -1637342 -1962691 -2203406 -2369500 -2383565 -2176242 -1735323 -1111489 -420071 201772 663610
11457 663610 917698 937401 762565 536124 482285 812300 1602076 2742035 3976291 5055995
11447 5055995 5919511 6636379 7198750 7473597 7345960 6871943 6263350 5739073 5400262
11438 5400262 5209098 5049137 4840600 4623522 4507663 4567503 4799006 5136835 5535371 6037662
11428 6037662 6701556 7484140 8281276 9025579 9638024 9961575 9871495 9386614 8601126 7585249
11418 7585249 6395383 5124643 3877977 2726586 1764257 1156010 1053091 1494789 2406959
$$ packed form
11485A2656247m06699p00497q86329r75552r66950q51011o90903n84347n67455
11476F026504o13538p00380q41144j018435j136955j119848r77182p51373n04991
11467a637342l25349k40715j66094j4065K07323M40919O23834O91418O21843M61838
11457F63610K54088J9703j74836k26441n3839L30015P89776J139959J234256J079704
11447E055995Q63516P16868N62371K74847j27637m74017o08593n24277l38811
11438E400262j91164j59961k08537k17078j15859N9840K31503L37829L98536N02291
11428F037662O63894P82584P97136P44303O12445L23551r0080m84881p85488j015877
11418G585249j189866j270740j246666j151391r62329o08247j02919M41698R12170
$$ plain form
11409 2406959 3643798 5028155 6377445 7515337 8304891 8685295 8680193 8359184 7774833
11400 7774833 6978779 6079397 5229059 4577997 4210944 4089254 4090911 4121825 4165915 4230221
11390 4230221 4291893 4331733 4370405 4413647 4421230 4362123 4217632 3949324 3557839 3136435 2812251
11379 2812251 2687379 2817468 3173502 3626826 4001156 4160371 4053235 3669681 3020728
11370 3020728 2177868 1224461 172764 -1004263 -2280331 -3561010 -4763701 -5849242
11362 -5849242 -6761686 -7424222 -7836607 -8075978 -8179393 -8108841 -7794301 -7160019 -6192829 -5004561
11352 -5004561 -3771644 -2636949 -1664669 -851534 -212186 160435 157195 -251759 -965461
11343 -965461 -1769102 -2457525 -2978653 -3449832 -4006886 -4625243 -5150044 -5493634 -5712795 -5884476
$$ packed form
11409B406959J236839J384357J349290J137892P89554L80404n102l21009n84351
11400G774833p96054q99382q50338o51062l67053j21690J657L0914M4090O4306
11390D230221O1672L9840L8672M3242P583n9107j44491k68308l91485m21404l24184
11379B812251j24872J30089L56034M53324L74330J59215j07136l83554o48953
11370C020728q42860r53407j051697j177027j276068j280679j202691j085541
11362e849242r12444o62536m12385k39371j03415P0552L14540O34282R67190J188268
11352e004561J232917J134695R72280Q13135O39348L72621l240m08954p13702
11343i65461q03641o88423n21128m71179n57054o18357n24801l43590k19161j71681
$$ plain form
11333 -5884476 -5971071 -5844791 -5440987 -4843420 -4223738 -3749086 -3506499 -3477321 -3569305 -3646096
11323 -3646096 -3576878 -3306045 -2887705 -2453898 -2148250 -2070197 -2233003 -2543249 -2829178 -2904034
11313 -2904034 -2632576 -1987131 -1046832 34392 1090284 2043986 2918018 3726054 4419311
11304 4419311 4920786 5189843 5251143 5138325 4851818 4406537 3888197 3439491 3183692 3133463
11294 3133463 3170823 3137373 2958411 2685114 2406341 2141273 1834479 1419285 860124 154159
11284 154159 -634469 -1337482 -1733821 -1641971 -1009984 7010 1087388 1953570 2532779
11275 2532779 2909250 3172051 3342592 3431707 3453036 3371192 3111776 2630326 1935878 1034352
11265 1034352 -80725 -1367666 -2733790 -4094735 -5375024 -6443758 -7127153 -7365277
$$ packed form
11333e884476q6595J26280M03804N97567O19682M74652K42587K9178r1984p6791
11323c646096O9218K70833M18340M33807L05648P8053j62806l10246k85929p4856
11313b904034K71458O45445R40299J081224J055892R53702Q74032Q08036O93257
11304D419311N01475K69057O1300j12818k86507m45281n18340m48706k55799n0229
11294C133463L7360l3450j78962k73297k78773k65068l06794m15194n59161p05965
11284A54159p88628p03013l96339R1850O31987J016994J080378Q66182N79209
11275B532779L76471K62801J70541Q9115K1329q1844k59416m81450o94448r01526
11265A034352j115077j286941j366124j360945j280289j068734o83395k38124
$$ plain form
11257 -7365277 -7321807 -7275066 -7389456 -7603349 -7738406 -7714614 -7633337 -7603211 -7548820 -7279858
11247 -7279858 -6688422 -5798480 -4730479 -3715766 -3039515 -2898014 -3277517 -3928156 -4512370
11238 -4512370 -4824984 -4856889 -4685029 -4389848 -4074126 -3856127 -3794597 -3855218 -3929958 -3848382
11228 -3848382 -3425854 -2576076 -1364862 61105 1555150 3001820 4325661 5445837
11220 5445837 6231907 6557771 6417330 5949371 5321072 4578273 3586109 2191656 456413
11211 456413 -1353808 -2934532 -4030487 -4515650 -4499286 -4282194 -4158251 -4248020 -4486182
11202 -4486182 -4691547 -4638433 -4179326 -3354911 -2364508 -1437643 -709601 -193049 174333 465669
11192 465669 706418 890446 1045026 1235149 1524466 1960740 2548349 3178699 3645545 3767548
$$ packed form
11257g365277M3470M6741j14390k13893j35057K3792Q1277L0126N4391K68962
11247g279858N91436Q89942J068001J014713O76251J41501l79503o50639n84214
11238d512370l12614l1905J71860K95181L15722K17999O1530o0621p4740Q1576
11228c848382M22528Q49778J211214J425967J494045J446670J323841J120176
11220E445837P86070L25864j40441m67959o28299p42799r92164j394453j735243
11211D56413j810221j580724j095955m85163J6364K17092J23943q9769k38162
11202d486182k05365N3114M59107Q24415R90403R26865P28042N16552L67382K91336
11192D65669K40749J84028J54580J90123K89317M36274N87609O30350M66846J22003
$$ plain form
11182 3767548 3448235 2659747 1494991 231925 -770724 -1309872 -1450792 -1369750 -1139161
11173 -1139161 -752583 -264693 259499 853004 1614434 2620759 3862167 5232379 6564701
11164 6564701 7644522 8253277 8321752 8017875 7621327 7334119 7191942 7106012 6979492 6763779
11154 6763779 6427432 5953052 5377539 4810831 4396162 4211352 4222631 4322742 4356424 4183099
11144 4183099 3761689 3144675 2434594 1712124 975388 190113 -624592 -1392261 -2056556
11135 -2056556 -2630203 -3194160 -3849248 -4594448 -5302063 -5831338 -6084969 -5997966 -5552606 -4805609
11125 -4805609 -3868067 -2852219 -1849283 -924749 -126873 475744 809185 876444 777694
11116 777694 668835 700972 914244 1218991 1504474 1693657 1748550 1676867 1521592 1344807
$$ packed form
11182C767548l19313p88488j164756j263066j002649n39148j40920Q1042K30589
11173a139161L86578M87890N24192N93505P61430J006325J241408J370212J332322
11164F564701J079821O08755O8475l03877l96548k87208j42177q5930j26520k15713
11154F763779l36347m74380n75513n66708m14669j84810J1279J00111L3682j73325
11144D183099m21410o17014p10081p22470p36736p85275q14705p67669o64295
11135b056556n73647n63957o55088p45200p07615n29275k53631Q7003M45360P46997
11125d805609R37542J015848J002936R24534P97876O02617L33441O7259r8750
11116G77694j08859L2137K13272L04747K85483J89183N4893p1683j55275j76785
$$ plain form
11106 1344807 1187145 1037372 849719 580659 229513 -173230 -612349 -1080081 -1513610
11097 -1513610 -1791709 -1864928 -1831105 -1832681 -1946395 -2154405 -2307891 -2171736 -1647776 -929808
11087 -929808 -367555 -180802 -299232 -456650 -418776 -97280 512058 1380795 2405535 3466949
11077 3466949 4539453 5582353 6390956 6707374 6451962 5785901 4954963 4121357 3349583
11068 3349583 2680792 2147337 1725284 1347825 970220 578095 178115 -188934 -484404
11059 -484404 -758420 -1145982 -1730366 -2447563 -3140527 -3679636 -4040457 -4270834 -4368380 -4258054
11049 -4258054 -3879839 -3201913 -2243307 -1192486 -371796 -12452 -135111 -623458 -1328538
11040 -1328538 -2096437 -2765199 -3204316 -3390469 -3403367 -3331503 -3231465 -3136563 -3052258 -2929771
$$ packed form
11106A344807j57662j49773j87653k69060l51146m02743m39119m67732m33529
11097a513610k78099p3219L3823j576j13714k08010j53486J36155N23960P17968
11087i29808N62253J86753j18430j57418L7874L21496O09338Q68737J024740J061414
11077C466949J072504J042900Q08603L16418k55412o66061q30938q33606p71774
11068C349583o68791n33455m22053l77459l77605l92125l99980l67049k95470
11059d84404k74016l87562n84384p17197o92964n39109l60821k30377r7546J10326
11049d258054L78215O77926R58606J050821Q20690L59344j22659m88347p05080
11040a328538p67899o68762m39117j86153j2898P1864J00038R4902Q4305J22487
$$ plain form
11030 -2929771 -2666071 -2216389 -1686197 -1231670 -877388 -489962 64314 813794 1715951
11021 1715951 2718783 3786696 4882604 5918734 6765160 7304749 7468310 7262340 6760991
11012 6760991 6069091 5306077 4583988 3958956 3447553 3084258 2876470 2729112 2501597
$$ packed form
11030b929771K63700M49682N30192M54527L54282L87426N54276P49480R02157
11021A715951J002832J067913J095908J036130Q46426N39589J63561k05970n01349
11012F760991o91900p63014p22089o25032n11403l63295k07788j47358k27515
$$ [...]
##END NTUPLES=NMR SPECTRUM
##END=
