##TITLE=31P ikalashn
DE-76 rm_2h30(nlock)
12.11.2024
##JCAMPDX= 6.0         $$ Bruker NMR JCAMP-DX V2.0
##DATA TYPE= NMR SPECTRUM
##DATA CLASS= NTUPLES
##ORIGIN= UXNMR, Bruker Analytische Messtechnik GmbH
##OWNER= root
$$ TOPSPIN		Version 1.3
$$ 2024-11-12 16:15:48.734 +0400  Irina@DPX200
$$ Compression mode = diff/dup
##.OBSERVE FREQUENCY= 81.01967998063
##.OBSERVE NUCLEUS= ^31P
##.ACQUISITION MODE= SIMULTANEOUS
##.ACQUISITION SCHEME= undefined
##.AVERAGES= 64
##.DIGITISER RES= 17
##SPECTROMETER/DATA SYSTEM= spect
##.PULSE SEQUENCE= zgpg
##.SOLVENT NAME= D2O
##.SHIFT REFERENCE= INTERNAL, D2O, 1, 298.5841
##AUDIT TRAIL= $$ (NUMBER, WHEN, WHO, WHERE, WHAT)
$$ ##TITLE= Audit trail, TOPSPIN		Version 1.3
$$ ##JCAMPDX= 5.01
$$ ##ORIGIN= Bruker BioSpin GmbH
$$ ##OWNER= Irina
$$ $$ F:/spectra/data/iren/nmr/P31dec/1/pdata/1/auditp.txt
$$ ##AUDIT TRAIL=  $$ (NUMBER, WHEN, WHO, WHERE, VERSION, WHAT)
(   1,<2024-11-12 16:15:23.515 +0400>,<Irina>,<DPX200>,<TOPSPIN 1.3>,
      <created by zg
	started at 2024-11-12 16:13:40.265 +0400,
	POWCHK disabled, PULCHK disabled
       configuration hash MD5:
       BE 6D 3F 07 2A EA 11 49 91 17 2B D3 AF B3 58 0D
       data hash MD5: 32K
       A7 99 71 99 64 D7 24 AF DE 72 34 1F 80 9F 51 D0>)
(   2,<2024-11-12 16:15:23.843 +0400>,<Irina>,<DPX200>,<TOPSPIN 1.3>,
      <Start of raw data processing
       efp BC_mod = 2 LB = 15 FT_mod = 6 PKNL = 1 PHC0 = 49.53664 PHC1 = 342.8677 SI = 32K 
       data hash MD5: 32K
       57 C3 3C CB 32 78 BB 7E 63 77 91 01 89 1F 14 13>)
(   3,<2024-11-12 16:15:26.343 +0400>,<Irina>,<DPX200>,<TOPSPIN 1.3>,
      <apk 
       data hash MD5: 32K
       4A E9 2D 62 8E 0E 03 C7 BC EE 5D FC 3F 55 CB 1C>)
(   4,<2024-11-12 16:15:33.875 +0400>,<Irina>,<DPX200>,<TOPSPIN 1.3>,
      <pk fgphup PHC0 = 7.6 PHC1 = 0 
       data hash MD5: 32K
       85 CE 85 F5 15 1F 55 9F D0 57 F4 80 84 88 A4 5B>)
(   5,<2024-11-12 16:15:35.843 +0400>,<Irina>,<DPX200>,<TOPSPIN 1.3>,
      <abs n ABSG = 5 
       data hash MD5: 32K
       2F FF FC AC D5 DC 03 B6 90 FA 95 50 31 8D E9 99>)
$$ ##END=
$$ 
$$ $$ hash MD5
$$ $$ 2D 92 A7 16 3F 3A 60 EE EA BF 90 DF DB C1 14 3E
##$RELAX= 
##$RELAX= 
##$RELAX= 
##$RELAX= 
##$RELAX= 
##$RELAX= 
##$RELAX= 
##$RELAX= 
##$RELAX= 
##$RELAX= 
##$RELAX= 
$$ Bruker specific parameters
$$ --------------------------
##$DU= <F:/spectra>
##$EXPNO= 1
##$NAME= <P31dec>
##$PROCNO= 1
##$TYPE= <nmr>
##$USER= <iren>
##$AMP= (0..31)
100 100 100 100 100 100 100 100 100 100 100 100 100 100 100 100 100 100 
100 100 100 100 100 100 100 100 100 100 100 100 100 100 
##$ANAVPT= -1
##$AQSEQ= 0
##$AQ_mod= 1
##$AUNM= <au_zg>
##$AUTOPOS= <>
##$BF1= 81.014009
##$BF2= 200.13
##$BF3= 200.13
##$BF4= 200.13
##$BF5= 200.13
##$BF6= 200.13
##$BF7= 200.13
##$BF8= 200.13
##$BYTORDA= 1
##$CFDGTYP= 0
##$CFRGTYP= 5
##$CHEMSTR= <none>
##$CNST= (0..63)
1 1 145 1 1 1 1 1 1 1 1 1 1 1 1 1 1 1 1 1 1 1 1 1 1 1 1 1 1 1 1 1 1 1 
1 1 1 1 1 1 1 1 1 1 1 1 1 1 1 1 1 1 1 1 1 1 1 1 1 1 1 1 1 1 
##$CPDPRG= <waltz16>
##$CPDPRG1= <>
$$ [...]
##$SW_h= 37037.037037037
##$TD= 32768
##$TD0= 1
##$TE= 300
##$TE2= 300
##$TE3= 300
##$TEG= 300
##$TL= (0..7)
0 120 53 12 22 120 120 120 
##$TP= (0..7)
150 150 150 150 150 150 150 150 
##$TP07= 0
##$TPNAME0= <>
##$TPNAME1= <>
##$TPNAME2= <>
##$TPNAME3= <>
##$TPNAME4= <>
##$TPNAME5= <>
##$TPNAME6= <>
##$TPNAME7= <>
##$TPOAL= (0..7)
0.5 0.5 0.5 0.5 0.5 0.5 0.5 0.5 
##$TPOFFS= (0..7)
0 0 0 0 0 0 0 0 
##$TUNHIN= 0
##$TUNHOUT= 0
##$TUNXOUT= 0
##$USERA1= <user>
##$USERA2= <user>
##$USERA3= <user>
##$USERA4= <user>
##$USERA5= <user>
##$V9= 5
##$VALIST= <valist>
##$VCLIST= <CCCCCCCCCCCCCCC>
##$VD= 0
##$VDLIST= <DDDDDDDDDDDDDDD>
##$VPLIST= <PPPPPPPPPPPPPPP>
##$VTLIST= <TTTTTTTTTTTTTTT>
##$WBST= 1024
##$WBSW= 4
##$XGAIN= (0..3)
0 0 0 0 
##$XL= 0
##$YL= 0
##$YMAX_a= 5390
##$YMIN_a= -9547
##$ZGOPTNS= <>
##$ZL1= 120
##$ZL2= 120
##$ZL3= 120
##$ZL4= 120
##$ABSF1= 298.5841
##$ABSF2= -158.5842
##$ABSG= 5
##$ABSL= 5
##$ALPHA= 0
##$AQORDER= 0
##$ASSFAC= 0
##$ASSFACI= 0
##$ASSFACX= 0
##$ASSWID= 0
##$AUNMP= <proc_1d>
##$AXLEFT= 0
##$AXRIGHT= 0
##$AXTYPE= 0
##$AXUNIT= <>
##$AZFE= 0.1
##$AZFW= 0.5
##$BCFW= 0
##$BC_mod= 2
##$BYTORDP= 0
##$COROFFS= 0
##$CY= 12.5935478210449
##$DATMOD= 1
##$DC= 0
##$DFILT= <>
##$DTYPP= 0
##$F1P= 47.1127640792319
##$F2P= -24.0371245302204
##$FCOR= 0.5
##$FTSIZE= 32768
##$FT_mod= 6
##$GAMMA= 0
##$GB= 0
##$INTBC= 1
##$INTSCL= 7.269226e-011
##$ISEN= 30
##$LB= 15
##$LEV0= 0
##$LPBIN= 0
##$MAXI= 12.09355
##$MC2= 0
##$MEAN= 0
##$ME_mod= 0
##$MI= 0.7550151
##$NCOEF= 0
##$NC_proc= -11
##$NLEV= 6
##$NOISF1= 298.5841
##$NOISF2= 270.0111
##$NSP= 0
##$NTH_PI= 0
##$NZP= 0
##$OFFSET= 298.5841
##$PC= 1.4
##$PHC0= 127.839
##$PHC1= 200.8306
##$PH_mod= 1
##$PKNL= yes
##$PPARMOD= 0
##$PPDIAG= 0
##$PPIPTYP= 0
##$PPMPNUM= 100
##$PPRESOL= 1
##$PSCAL= 0
##$PSIGN= 0
##$REVERSE= no
##$SF= 81.014009
##$SI= 32768
##$SIGF1= 270.0111
##$SIGF2= -158.5842
##$SINO= 77.54984
##$SIOLD= 32768
##$SREGLST= <31P.CDCl3>
##$SSB= 0
##$STSI= 32768
##$STSR= 0
##$SW_p= 37037.037037037
##$SYMM= 0
##$S_DEV= 0
##$TDeff= 32768
##$TDoff= 0
##$TI= <>
##$TILT= no
##$TM1= 0
##$TM2= 0
##$TOPLEV= 0
##$USERP1= <user>
##$USERP2= <user>
##$USERP3= <user>
##$USERP4= <user>
##$USERP5= <user>
##$WDW= 1
##$XDIM= 32768
##$YMAX_p= 307920857
##$YMIN_p= -6359520
$$ End of Bruker specific parameters
$$ ---------------------------------
##NTUPLES= NMR SPECTRUM
##VAR_NAME=  FREQUENCY,     SPECTRUM/REAL,   SPECTRUM/IMAG
##SYMBOL=    X,             R,               I
##VAR_TYPE=  INDEPENDENT,   DEPENDENT,       DEPENDENT
##VAR_FORM=  AFFN,          ASDF,            ASDF
##VAR_DIM=   32768,         32768,           32768
##UNITS=     HZ,            ARBITRARY UNITS, ARBITRARY UNITS
##FACTOR=    1.13031516577767, 1,            1
##FIRST=     37037.037037037, -3448584,      2243519
##LAST=      0,             -2328155,        7624218
##MIN=       0,             -6359520,        0
##MAX=       37037.037037037, 307920857,     0
$$ Real data points
##PAGE= N=1
##DATA TABLE= (X++(R..R)), XYDATA
$$ [...]
20646 330741 300197 233922 134716 5660 -149122 -325011 -515708 -710136 -891350 -1040156
20636 -1040156 -1141923 -1193216 -1204850 -1198714 -1198799 -1221050 -1267662 -1328544 -1387854 -1430643 -1446047 -1428142
20624 -1428142 -1378177 -1308047 -1239331 -1194402 -1184926 -1206636 -1242406 -1269223 -1265695 -1219104 -1130010 -1011897
20612 -1011897 -885728 -772881 -690623 -651854 -667371 -746770 -896045 -1113530 -1387606 -1698617
20602 -1698617 -2024162 -2343108 -2633915 -2869850 -3018398 -3048998 -2946881 -2725828 -2430675 -2125428
20592 -2125428 -1872115 -1710568 -1648658 -1667552 -1737104 -1829655 -1925064 -2010257 -2079694 -2137630 -2198336
20581 -2198336 -2281646 -2404642 -2572384 -2772023 -2974472 -3143938 -3249735 -3273615 -3211207 -3070870
20571 -3070870 -2870789 -2632602 -2373828 -2105599 -1837640 -1583433 -1358599 -1175172 -1038720
20562 -1038720 -949442 -903774 -895339 -916279 -959330 -1019871 -1095990 -1185657 -1283130 -1376964 -1449419
20551 -1449419 -1478252 -1443928 -1340635 -1181716 -992921 -799052 -614851 -444455 -285986 -137129
20541 -137129 11 116745 201278 246697 256244 240739 211008 172461 126293 76429 36639
20530 36639 30727 82913 204136 384654 598572 816288 1015385 1183273 1312400 1394144
20520 1394144 1416786 1368509 1242466 1040368 772553 455227 107595 -249615 -595996 -915775
20510 -915775 -1203311 -1465748 -1720570 -1988762 -2285657 -2613663 -2962091 -3313860 -3651735 -3958109
20500 -3958109 -4210181 -4378459 -4435690 -4372847 -4208522 -3982798 -3741632 -3522591 -3346410 -3215237
20490 -3215237 -3118426 -3042972 -2981913 -2935983 -2909043 -2902216 -2912404 -2936565 -2977215 -3042599 -3139262
20479 -3139262 -3261807 -3388265 -3485986 -3524558 -3486405 -3368988 -3180712 -2936336 -2654380 -2354887
20469 -2354887 -2056056 -1771008 -1507032 -1267078 -1051037 -856711 -682004 -527286 -396070
20460 -396070 -294669 -231673 -215331 -247704 -319305 -409556 -494208 -555950 -591839 -611456 -625968
20449 -625968 -637205 -636091 -610172 -553609 -474419 -395259 -345607 -348703 -411866 -526566 -676711
20438 -676711 -847674 -1030178 -1219119 -1411410 -1604392 -1792785 -1964146 -2097239 -2165890 -2145838
20428 -2145838 -2022095 -1796337 -1490978 -1144736 -799713 -487147 -219944 4586 194384
20419 194384 351781 469704 537092 548551 510542 439464 353370 263536 171068 70458 -41870
20408 -41870 -160347 -270210 -355080 -406767 -429965 -437605 -439922 -435878 -414479 -365282 -289641 -204378
20396 -204378 -136360 -111905 -146167 -236935 -365353 -503740 -627757 -726705 -805936 -880268 -963276
20385 -963276 -1059421 -1162472 -1258400 -1329954 -1362608 -1351581 -1306057 -1245876 -1192086 -1159040 -1152988
20374 -1152988 -1174096 -1217070 -1270901 -1321258 -1355383 -1364509 -1340699 -1272851 -1149225 -966378 -736210
20363 -736210 -483675 -236743 -16768 165137 306643 409909 475516 497574 464301 364528
20353 364528 195535 -32773 -299098 -575230 -829874 -1030761 -1148933 -1167847 -1092094 -947519
20343 -947519 -772044 -604677 -478990 -420688 -445707 -557960 -747794 -990806 -1247956 -1471795
20333 -1471795 -1621480 -1679346 -1656681 -1584848 -1500208 -1433710 -1408291 -1439443 -1534047 -1687566 -1882961
20322 -1882961 -2093793 -2290709 -2447256 -2541637 -2556853 -2484684 -2332742 -2127358 -1907313 -1710158
20312 -1710158 -1557316 -1446137 -1354943 -1258755 -1145372 -1021719 -906592 -815732 -752539 -711801
20302 -711801 -689060 -684361 -699209 -733040 -782655 -843531 -911202 -981250 -1047618 -1101661 -1134615 -1142430
20290 -1142430 -1128528 -1101768 -1072203 -1049151 -1041763 -1058302 -1102279 -1168086 -1240224 -1297809 -1322358
20279 -1322358 -1304773 -1248286 -1167103 -1081567 -1009268 -953388 -895430 -800884 -637884 -396351 -93184
20268 -93184 237542 558352 837730 1055185 1203832 1289131 1322924 1316534 1278376 1216871 1144289
20257 1144289 1076682 1028997 1008756 1013093 1031768 1054198 1075332 1096512 1121657 1152340 1186001
20246 1186001 1219148 1252793 1293805 1348267 1411515 1464713 1482447 1445492 1349387 1204032 1025789
20235 1025789 827404 612292 376465 114454 -176834 -496612 -837665 -1184348 -1515466
20226 -1515466 -1809733 -2047645 -2210495 -2282654 -2258262 -2146996 -1974304 -1775560 -1586866 -1436011
20216 -1436011 -1335860 -1282060 -1256828 -1237755 -1206464 -1152255 -1070873 -962339 -830922 -687360
20206 -687360 -549752 -438013 -362469 -315838 -276549 -219620 -125242 17561 208973 439555
20196 439555 697874 980315 1293021 1641469 2016054 2388076 2720005 2978982 3142767 3198917
20186 3198917 3143905 2985795 2748015 2467659 2184803 1927830 1704145 1501499 1297192 1068221
20176 1068221 798062 480551 122204 -257929 -632984 -976629 -1269353 -1497796 -1649394
20167 -1649394 -1710428 -1672909 -1546783 -1366619 -1183986 -1047571 -982571 -981343 -1009856 -1024614 -989670
20156 -989670 -886037 -712607 -483187 -223512 33802 259728 440655 582971 706715 832691
20146 832691 971354 1119428 1263614 1386653 1473340 1516138 1517195 1483270 1416971 1312333 1158076
20135 1158076 944540 669232 339467 -26979 -402645 -753650 -1046275 -1255038 -1368718
20126 -1368718 -1391841 -1341035 -1236940 -1095130 -922139 -720455 -498565 -276454 -81288 62802
20116 62802 143070 161080 131845 81463 42053 41061 87852 168163 253563 320525 366388 412051
20104 412051 489542 621954 807807 1018776 1212244 1350674 1414039 1398887 1311820 1166783
20094 1166783 984553 788190 595137 412012 235474 57603 -127579 -318865 -505783
20085 -505783 -671568 -800773 -886304 -929626 -934865 -903971 -837137 -735212 -600350 -436179 -249119
20074 -249119 -49153 151419 340701 509742 652440 762228 829095 841514 793034 688235
20064 688235 543245 380818 223843 90084 -11427 -80197 -118216 -122805 -85879 692 140772
20053 140772 334259 579066 871485 1206390 1580413 1996499 2464107 2992039 3577052 4195793
20043 4195793 4806604 5360340 5812662 6132113 6303474 6327286 6216059 5989065 5668664 5280780
20033 5280780 4858052 4439252 4060777 3745151 3495782 3300871 3142666 3007392 2890607
20024 2890607 2794050 2717711 2655841 2599517 2539318 2462664 2350367 2181122 1943228 1642666
20014 1642666 1299349 934569 558980 168767 -247632 -695290 -1159692 -1605282 -1987871
20005 -1987871 -2271499 -2440337 -2504123 -2497844 -2472955 -2479203 -2544474 -2665190 -2813623 -2955810 -3067108
19994 -3067108 -3137033 -3164896 -3153035 -3103892 -3022417 -2919798 -2812901 -2717731 -2640014 -2568216 -2474757
19983 -2474757 -2328823 -2115884 -1850497 -1572184 -1328099 -1154995 -1068736 -1062751 -1114661 -1198150
19973 -1198150 -1293739 -1393213 -1497997 -1615763 -1756979 -1929861 -2133426 -2352102 -2556881 -2715417
19963 -2715417 -2806040 -2825678 -2787247 -2710740 -2613829 -2505281 -2383429 -2239636 -2063155 -1845010
19953 -1845010 -1581348 -1276921 -948490 -626202 -349647 -157651 -75881 -108236 -235767 -423799
19943 -423799 -634514 -838262 -1017568 -1164648 -1277642 -1357252 -1402917 -1411146 -1379260 -1311436 -1220114
19932 -1220114 -1120763 -1025444 -941294 -873996 -831169 -821914 -853533 -928056 -1039341 -1170765 -1295648
19921 -1295648 -1383875 -1414677 -1389819 -1338988 -1311853 -1358542 -1508297 -1758528 -2079497 -2428805
19911 -2428805 -2765435 -3058758 -3293194 -3467527 -3587288 -3654201 -3660675 -3592932 -3438560 -3193466
19901 -3193466 -2867579 -2488318 -2096871 -1735640 -1434341 -1204594 -1043910 -942575 -888655 -870451
19891 -870451 -877087 -898325 -925126 -951403 -975260 -997966 -1021229 -1044215 -1060721 -1057546 -1017485 -928623
19879 -928623 -794073 -633023 -472177 -336416 -245703 -214990 -250780 -345361 -475004 -604796
19869 -604796 -697495 -722723 -663246 -515856 -288464 2035 330622 668205 990057 1282590
19859 1282590 1542794 1771421 1965562 2115570 2207610 2229608 2177137 2056461 1882290 1670041
19849 1670041 1427420 1152129 838093 486189 112109 -254568 -579649 -835806 -1010995
19840 -1010995 -1111573 -1158633 -1178250 -1190858 -1205434 -1220299 -1228304 -1222372 -1199234 -1161367 -1115757
19829 -1115757 -1069032 -1023870 -982360 -953641 -956654 -1012904 -1133128 -1307170 -1505366 -1692389 -1845009
19818 -1845009 -1961940 -2059745 -2159538 -2275274 -2410760 -2563339 -2727920 -2897746 -3062709 -3208045
19808 -3208045 -3316482 -3374093 -3375761 -3325051 -3227861 -3085165 -2892253 -2646800 -2358352 -2048637
19798 -2048637 -1741828 -1454513 -1193805 -962234 -761935 -593897 -455444 -340360 -240757 -146590
19788 -146590 -42606 92421 280793 537419 862648 1240203 1642217 2040128 2414940 2759419
19778 2759419 3071707 3346573 3570830 3725947 3796630 3779688 3686862 3539160 3355581 3144291
19768 3144291 2903805 2632019 2333125 2016576 1692373 1370501 1065993 802452 606769
19759 606769 496341 467452 492763 529209 531588 465948 318354 96316 -176176 -466299 -741195
19748 -741195 -977258 -1165554 -1309368 -1416360 -1491896 -1537259 -1551595 -1534771 -1489435 -1422100 -1342587
19737 -1342587 -1260204 -1177925 -1089850 -984802 -852861 -690348 -501663 -297960 -93016 101880
19727 101880 280631 440874 580482 696364 787160 856851 915262 975318 1049631 1146899 1267409
19716 1267409 1399807 1522767 1611966 1648912 1626833 1550557 1431867 1284858 1123991 962949
19706 962949 812043 676299 557709 460430 393788 369835 396982 474469 591689 732742
19696 732742 883453 1036278 1189034 1339248 1481263 1609000 1719064 1809787 1878843 1923419
19686 1923419 1942086 1935595 1907108 1863318 1814068 1768090 1728456 1692531 1655118 1610469 1552682
19675 1552682 1477595 1386778 1289192 1196445 1113958 1036071 950230 846307 722241 582063 430849
19664 430849 272573 111447 -46343 -192601 -319019 -420417 -496996 -553002 -592601 -617029
19654 -617029 -625622 -619428 -603251 -583423 -563190 -540723 -513026 -483139 -463880 -474072 -529874 -636386
19642 -636386 -783269 -945487 -1088561 -1177742 -1189515 -1120502 -987941 -821244 -650775 -500226
19632 -500226 -382076 -292174 -205741 -82640 115108 401933 756745 1126950 1445332 1652340
19622 1652340 1714986 1634481 1440254 1174441 873991 558827 232344 -108341 -462194 -820925
19612 -820925 -1171560 -1500436 -1795492 -2046438 -2244634 -2384175 -2463599 -2486896 -2462934 -2403547
19602 -2403547 -2321535 -2229177 -2136991 -2052581 -1980278 -1922821 -1884508 -1872176 -1891351 -1939942 -2004706
19591 -2004706 -2063581 -2092433 -2072088 -1992594 -1854435 -1667283 -1446637 -1209705 -972467 -748923
19581 -748923 -552444 -397116 -295701 -252981 -258097 -283688 -296569 -274021 -213387 -129046 -41172
19570 -41172 35323 95959 145048 190400 238198 289728 339627 375905 383127 348769 269304 152684
19558 152684 17732 -108175 -193812 -211223 -143244 11073 234904 496509 756448 977351
19548 977351 1132319 1209370 1212885 1163262 1093527 1042275 1044530 1123043 1283162 1513262 1789760
19537 1789760 2084555 2373420 2642585 2888994 3112870 3308149 3458393 3540749 3534232 3427211
19527 3427211 3221377 2931009 2578039 2185701 1774367 1361603 964899 602675 291988
19518 291988 46224 -124954 -215982 -228213 -171926 -63784 77553 232386 377990 488871
19508 488871 542512 528187 452016 333295 195429 59510 -56383 -135890 -165452 -137649 -53304
19497 -53304 79571 247882 433735 613634 759896 845866 853028 777018 629805 436670
19487 436670 229172 36422 -123173 -245825 -338269 -408476 -459846 -492639 -507417 -505525 -487971
19476 -487971 -456153 -414376 -371475 -340204 -335562 -373112 -466422 -621630 -830901 -1071231 -1311422
19465 -1311422 -1522394 -1685353 -1794756 -1854551 -1871013 -1848864 -1793530 -1716387 -1636434 -1574252 -1543152
19454 -1543152 -1546640 -1582600 -1646380 -1729842 -1821300 -1908359 -1979522 -2023345 -2029751 -1995349 -1926383 -1833197
19442 -1833197 -1720521 -1583824 -1414323 -1206282 -962179 -696618 -438429 -226553 -98305
19433 -98305 -75738 -158379 -325920 -547541 -790724 -1024913 -1222341 -1360709 -1428348 -1429059 -1383388
19422 -1383388 -1324141 -1287053 -1299582 -1371565 -1491879 -1632919 -1759623 -1838576 -1846050 -1775191 -1639741
19411 -1639741 -1470637 -1305289 -1174264 -1092189 -1057526 -1060152 -1091086 -1148511 -1237949 -1368511 -1547913
19400 -1547913 -1777098 -2045399 -2329473 -2598011 -2820414 -2975142 -3053984 -3060831 -3006803 -2905796
19390 -2905796 -2773184 -2626314 -2483714 -2361724 -2270288 -2210983 -2178950 -2167039 -2168731 -2179066 -2195388
19379 -2195388 -2217857 -2247867 -2284978 -2324941 -2361012 -2388960 -2412280 -2442197 -2491397 -2566027 -2661246
19368 -2661246 -2762716 -2852509 -2914482 -2935150 -2902790 -2809938 -2658625 -2462185 -2240537 -2013044
19358 -2013044 -1795289 -1600298 -1439035 -1316655 -1226768 -1148625 -1049679 -892416 -643807 -286902
19348 -286902 168869 686543 1213025 1695068 2088425 2358440 2479088 2435535 2228506 1875800
19338 1875800 1408879 866832 290786 -281269 -820546 -1313175 -1761035 -2174926 -2563640
19329 -2563640 -2926461 -3253387 -3531506 -3752735 -3917986 -4034669 -4109487 -4144148 -4138105 -4093490
19319 -4093490 -4016413 -3914895 -3795134 -3656414 -3488297 -3276266 -3015110 -2719152 -2418620 -2144118
19309 -2144118 -1912174 -1722291 -1564974 -1432583 -1324566 -1245664 -1202877 -1204286 -1255612 -1352788
19299 -1352788 -1478040 -1606987 -1722278 -1821272 -1911271 -1997514 -2074896 -2130126 -2150807 -2131819 -2073639
19288 -2073639 -1976659 -1839189 -1661034 -1448824 -1219911 -1003618 -837203 -755059 -775905 -896668
19278 -896668 -1096481 -1345112 -1608594 -1851495 -2039788 -2146844 -2160554 -2085812 -1938442 -1734229
19268 -1734229 -1481925 -1185283 -851582 -499346 -159086 133492 347373 463749 477226 390844
19258 390844 210068 -59369 -409701 -828190 -1295533 -1787183 -2276978 -2741037 -3161142 -3527530
19248 -3527530 -3839487 -4102065 -4320699 -4497326 -4629157 -4709592 -4730816 -4686359 -4572860 -4393281
19238 -4393281 -4161317 -3901711 -3643753 -3412650 -3224710 -3087558 -3002241 -2963521 -2958514 -2967714
19228 -2967714 -2970301 -2950196 -2898704 -2813984 -2700305 -2567960 -2431709 -2306311 -2201641 -2120561
19218 -2120561 -2060250 -2015958 -1985937 -1974311 -1988452 -2032040 -2100145 -2180048 -2255388 -2310518 -2334378
19207 -2334378 -2322620 -2276760 -2201435 -2101989 -1982826 -1845828 -1689585 -1511199 -1310890 -1096392
19197 -1096392 -882889 -688017 -526030 -404143 -321273 -269385 -237413 -215762 -200016 -194293 -212171
19186 -212171 -271098 -381970 -542334 -739369 -959726 -1197334 -1452022 -1719895 -1984924 -2221226
19176 -2221226 -2404438 -2521092 -2569432 -2555593 -2491400 -2394670 -2288439 -2196115 -2134151 -2108175 -2115398
19165 -2115398 -2148372 -2194601 -2234663 -2244316 -2199456 -2079605 -1870900 -1572188 -1201689 -796992
19155 -796992 -405771 -71920 176018 329599 398054 401804 365099 308639 243660 171135 87880
19144 87880 -4826 -96939 -172477 -217296 -227497 -212832 -191811 -182312 -194300 -227795 -276027 -331768
19132 -331768 -392192 -459494 -539316 -639580 -769617 -938435 -1152325 -1412724 -1715796 -2054846
19122 -2054846 -2423638 -2816832 -3227449 -3645739 -4060973 -4461996 -4834162 -5156635 -5405369
19113 -5405369 -5561114 -5616357 -5576125 -5453409 -5264213 -5025210 -4751972 -4456425 -4146674 -3831706
19103 -3831706 -3527652 -3258811 -3049622 -2911672 -2836138 -2799088 -2775333 -2749089 -2715867 -2679700
19093 -2679700 -2649627 -2634173 -2633720 -2636236 -2620945 -2567024 -2460385 -2295384 -2073951 -1805102 -1504027
19082 -1504027 -1188532 -874126 -572156 -292533 -46580 154745 305696 408822 473991 515020
19072 515020 546329 579777 620347 661979 687940 678741 624489 533120 427758 335339 275627
19061 275627 256800 276607 326221 395631 477676 566976 655525 730958 780135 794682 774240
19050 774240 725524 656856 570472 458729 308248 108898 -138649 -419890 -708475 -973185
19040 -973185 -1187332 -1335293 -1413276 -1426204 -1383239 -1292988 -1160622 -989052 -782156 -546447
19030 -546447 -290996 -27710 227684 456142 639653 769188 851439 907623 962189 1028439
19020 1028439 1102579 1171451 1226502 1270449 1311530 1354391 1397952 1438900 1472401 1488624 1473459
19009 1473459 1419131 1337373 1261695 1234366 1286347 1422652 1620782 1841171 2042634 2195740
18999 2195740 2289328 2328600 2327565 2301293 2261429 2214742 2163109 2104132 2032901 1945303 1841413
18988 1841413 1727137 1614135 1519133 1462359 1463359 1534684 1677350 1881355 2130668 2409304
18978 2409304 2704879 3008355 3311789 3606284 3880291 4118346 4301459 4409881 4427543 4346794
18968 4346794 4172409 3923168 3628253 3318221 3015861 2732666 2470530 2224706 1986836
18959 1986836 1749281 1509828 1273083 1046820 836358 641696 459455 288620 135496
18950 135496 12848 -66283 -94457 -71713 -5290 89884 191527 274826 320922 323350 289435
18939 289435 238967 201452 209337 287497 445227 675155 956651 1259418 1546687 1780576
18929 1780576 1930473 1980989 1934836 1808906 1625167 1400972 1144255 855176 531285 172472
18919 172472 -216494 -626071 -1043339 -1453132 -1838458 -2180728 -2461045 -2663731 -2780694 -2812974
18909 -2812974 -2768062 -2656508 -2491448 -2289056 -2064935 -1827611 -1576484 -1307088 -1018022 -713623
18899 -713623 -402166 -92778 205131 478200 705211 860305 923994 892835 778947 601686
18889 601686 381268 139614 -95839 -293185 -424895 -479146 -464782 -405421 -326514 -244708
18879 -244708 -165966 -90579 -19411 42199 84932 101012 90822 64432 37221 24164 36321
18868 36321 79137 151069 242749 338582 421710 480789 514394 529009 531947 526078 510363 483037
18856 483037 443971 396666 349820 315683 304582 319837 358031 415140 493478 603201 756209
18845 756209 955707 1188046 1423384 1626343 1769849 1842218 1844371 1783837 1673399 1534293
18835 1534293 1397430 1297211 1259291 1289853 1372508 1472483 1545059 1546995 1449435 1248473 967856
18824 967856 650875 344370 82759 -119903 -267358 -372401 -449228 -511053 -570586 -638277
18814 -638277 -718877 -811102 -910844 -1013526 -1113731 -1204331 -1276896 -1322024 -1327860 -1279784 -1165703
18803 -1165703 -985139 -754981 -507088 -279295 -105229 -6848 9283 -48293 -159836 -299685
18793 -299685 -441277 -562199 -649440 -702592 -732160 -752963 -775789 -801725 -822367 -825299 -801827
18782 -801827 -754136 -698311 -658784 -654815 -688627 -745841 -806988 -857124 -885190 -879200 -827540 -727696
18770 -727696 -593931 -454332 -336647 -253148 -195822 -143883 -76341 18994 143757 292166
18760 292166 454595 619518 775762 917388 1048601 1182752 1333809 1506513 1692835 1876003
18750 1876003 2037433 2161747 2239054 2266371 2248002 2192653 2108089 1997002 1856497 1680604
18740 1680604 1463766 1203417 901356 564525 205600 -157685 -506358 -826429 -1111551
18731 -1111551 -1357224 -1551677 -1674605 -1707264 -1645846 -1508538 -1332431 -1162214 -1037019 -981592
18721 -981592 -1002094 -1085059 -1201708 -1318101 -1405707 -1447422 -1439198 -1388522 -1309467 -1215750 -1116035
18710 -1116035 -1014845 -917704 -834493 -776334 -749161 -751025 -773636 -803290 -821704 -811904 -768202
18699 -768202 -701757 -636103 -596576 -601472 -658696 -767132 -920283 -1109082 -1322019 -1543219 -1750870
18688 -1750870 -1918217 -2017631 -2026848 -1935523 -1749040 -1487073 -1178074 -854154 -547901 -288154
18678 -288154 -94286 26743 78918 74705 33513 -20700 -63365 -73030 -34595 56324 189499
18667 189499 341926 487391 607124 693044 744042 762971 757961 744030 739817 759913 807564
18656 807564 871522 928628 951759 919284 821222 659782 444997 188981 -96669 -398790
18646 -398790 -699112 -974317 -1201913 -1368735 -1475339 -1532106 -1550486 -1536278 -1487951 -1399449
18636 -1399449 -1266782 -1095865 -906194 -725991 -580355 -480041 -418695 -378532 -337916 -276980
18626 -276980 -181893 -47377 124239 325544 543350 755325 930173 1033964 1039049 931499
18616 931499 714616 407211 37696 -363490 -770664 -1166170 -1537906 -1873900 -2160947 -2389341
18606 -2389341 -2558402 -2676933 -2757405 -2807500 -2824259 -2794424 -2701248 -2534423 -2297336 -2007290
18596 -2007290 -1688927 -1365165 -1050309 -748164 -455627 -169082 111695 384531 646883
18587 646883 894613 1119632 1311526 1462570 1570093 1634565 1658583 1649290 1619028 1579480 1533286
18576 1533286 1470869 1375850 1236542 1057430 863991 697488 600787 601068 699140 871976 1084693
18565 1084693 1301640 1491112 1627145 1692431 1680438 1593252 1437222 1221761 962373 683624
18555 683624 417519 195933 39116 -53861 -105100 -146384 -203811 -288423 -396326 -515110
18545 -515110 -631261 -734795 -820026 -883437 -921300 -930073 -910584 -872161 -830489 -798668 -778615
18534 -778615 -760679 -731758 -684284 -618029 -535026 -435479 -320038 -194934 -72883 31865 109799
18523 109799 159931 190463 215073 244778 280949 315165 334814 328533 287707 206087 81702
18512 81702 -79622 -263875 -453441 -633474 -796138 -941588 -1076595 -1210497 -1348084 -1483908
18502 -1483908 -1605089 -1702529 -1781699 -1864331 -1980290 -2155781 -2404172 -2721054 -3082254 -3445841
18492 -3445841 -3761155 -3983635 -4087569 -4069471 -3942541 -3728053 -3448171 -3121187 -2759373 -2370333
18482 -2370333 -1960842 -1539803 -1118879 -712570 -338395 -15298 240615 421317 529900
18473 529900 578943 585037 562880 521018 460065 374906 260464 116250 -53844 -243981 -446953
18462 -446953 -653700 -854668 -1042082 -1209440 -1348105 -1445474 -1488073 -1467607 -1384989 -1249732
18452 -1249732 -1077020 -886783 -705018 -561965 -482437 -471764 -508492 -552073 -561715 -514335 -412691
18441 -412691 -282215 -159797 -79432 -61014 -107793 -213066 -370359 -579074 -842035 -1158884
18431 -1158884 -1521195 -1911428 -2305814 -2680652 -3017683 -3304237 -3530719 -3690935 -3784666 -3816945
18421 -3816945 -3792508 -3711827 -3574416 -3385733 -3160239 -2919411 -2687898 -2488561 -2336000 -2232302
18411 -2232302 -2169247 -2134595 -2116705 -2106325 -2097843 -2090558 -2089489 -2105108 -2149246 -2225994 -2323457 -2414425
18399 -2414425 -2467022 -2457741 -2378492 -2236259 -2048340 -1834879 -1611965 -1391399 -1188024 -1026549
18389 -1026549 -939199 -953418 -1076462 -1286497 -1537027 -1774216 -1958590 -2079213 -2152918 -2210425
18379 -2210425 -2277390 -2359721 -2440464 -2489374 -2478786 -2397044 -2254344 -2079822 -1912078 -1787807
18369 -1787807 -1733744 -1763487 -1875512 -2050754 -2255782 -2455011 -2623637 -2751731 -2840795 -2899274
18359 -2899274 -2937880 -2963265 -2973161 -2956891 -2900112 -2790398 -2622366 -2402285 -2150513 -1898289
18349 -1898289 -1678075 -1512618 -1410476 -1370043 -1385652 -1449113 -1547741 -1665176 -1787760 -1911207
18339 -1911207 -2040242 -2181448 -2335965 -2496788 -2650289 -2779502 -2868999 -2912424 -2918646 -2908928
18329 -2908928 -2905108 -2917989 -2943013 -2962968 -2955288 -2901004 -2789833 -2617767 -2381765 -2080064 -1719170
18318 -1719170 -1318988 -909119 -519401 -172495 117497 342675 500386 595188 639414 648084
18308 648084 630898 589016 520328 428299 326420 234919 172379 147772 157991 192219 239078
18297 239078 291217 345713 402633 463731 530895 604545 683546 765499 844956 911173 950169
18286 950169 952421 920530 869448 817970 777467 745751 710553 660501 595542 529325 483201 476566
18274 476566 518455 604087 717917 840781 956479 1054122 1125774 1163756 1163161 1128375 1075353
18263 1075353 1024588 990122 974582 972523 974789 968343 935404 857270 720831 522083 265535
18252 265535 -37220 -367989 -703974 -1023849 -1314586 -1571741 -1791401 -1961686 -2062606 -2074520
18242 -2074520 -1987568 -1804865 -1538635 -1205027 -823441 -419429 -25029 326971 611817 817968
18232 817968 945841 1003339 1001726 951564 859048 726761 560685 377627 204463 68007
18222 68007 -16238 -47854 -36878 3568 61622 126711 188131 234971 257447 248637 206228 133530
18210 133530 38346 -70132 -184122 -297844 -407437 -512368 -616624 -725227 -836189 -935424
18200 -935424 -1001388 -1016716 -977842 -897045 -798085 -709397 -657496 -661542 -730074 -861074 -1045750
18189 -1045750 -1274183 -1538136 -1828087 -2128675 -2418697 -2675393 -2878966 -3016030 -3082103 -3082199
18179 -3082199 -3029736 -2945571 -2856932 -2793517 -2779516 -2825849 -2928452 -3072395 -3235626 -3389835
18169 -3389835 -3502528 -3543880 -3496673 -3363668 -3166561 -2937085 -2707259 -2503587 -2344890 -2242220
18159 -2242220 -2199602 -2213838 -2272091 -2348846 -2407160 -2407476 -2320492 -2136333 -1864985 -1529071 -1155117
18148 -1155117 -768689 -393393 -50612 241156 467000 617068 689736 694961 655058 600647
18138 600647 560555 548531 555666 556303 524095 445089 318876 151698 -48733 -273418 -512082
18127 -512082 -757312 -1009965 -1279569 -1577716 -1908996 -2265736 -2629255 -2974906 -3276143 -3507000
18117 -3507000 -3646085 -3682674 -3621120 -3479946 -3286288 -3069994 -2859820 -2680043 -2545808 -2459370
18107 -2459370 -2410796 -2383318 -2359447 -2324759 -2269412 -2188674 -2082961 -1957299 -1820835 -1685862
18097 -1685862 -1564444 -1462361 -1373978 -1283218 -1172136 -1031953 -867889 -694199 -525447 -372084
18087 -372084 -241377 -139140 -69319 -31979 -20565 -19807 -8261 32910 110138 213545 320237
18076 320237 401535 431935 398187 304166 168786 19702 -112947 -201512 -225376 -174707 -51275
18065 -51275 134804 369793 639595 931311 1233556 1534875 1820662 2070604 2260322 2369881
18055 2369881 2394228 2344751 2238847 2086662 1885381 1623892 1294239 902736 473092 39107
18045 39107 -368133 -730477 -1044794 -1316694 -1551331 -1748945 -1907718 -2028330 -2113357 -2162002
18035 -2162002 -2166822 -2117357 -2008526 -1846020 -1644165 -1420546 -1193121 -978774 -790162 -632771
18025 -632771 -505609 -404481 -324057 -257681 -197156 -134686 -66925 1370 57270 84317 69796
18014 69796 10686 -85226 -203612 -329751 -452837 -567668 -673665 -771160 -857845 -928893 -979865
18003 -979865 -1009019 -1017091 -1004545 -968013 -898984 -786710 -623919 -411256 -157769 122555 417276
17992 417276 721931 1040317 1376057 1721882 2057141 2357219 2606861 2806143 2966452 3101062
17982 3101062 3215082 3299915 3337350 3311952 3222443 3083683 2919435 2753053 2602649 2480866
17972 2480866 2394468 2341098 2307291 2273341 2223421 2153175 2069760 1985719 1911451 1850794 1801046
17961 1801046 1754542 1698879 1617185 1492508 1316366 1095170 848777 603013 381564 199883
17951 199883 62508 -34816 -100357 -143364 -174028 -204210 -246810 -313223 -410279 -538540 -692511
17940 -692511 -861799 -1032225 -1186202 -1302073 -1354630 -1321223 -1193259 -985488 -734421 -484609
17930 -484609 -271528 -112272 -7651 48960 63037 34245 -44670 -185718 -398710 -680859
17920 -680859 -1009820 -1346689 -1647608 -1876297 -2011035 -2045069 -1983275 -1838048 -1625924 -1365167
17910 -1365167 -1074601 -774373 -486904 -233663 -27069 135552 268316 385131 490201
17901 490201 577379 635759 655906 634380 575619 490086 389782 285206 185887 101140 37026
17890 37026 -9326 -52250 -112094 -203469 -325779 -463296 -592854 -691802 -742730 -736163 -671563
17879 -671563 -555173 -395782 -202544 12832 233021 435510 596194 694472 721020 686880
17869 686880 625728 582129 591273 665101 792995 950624 1106940 1228641 1287706 1272032 1190953
17858 1190953 1068851 929443 781693 618183 426923 206457 -27844 -250305 -438066
17849 -438066 -580064 -676185 -731059 -750753 -745240 -732587 -738622 -789496 -901695 -1077071 -1305134
17838 -1305134 -1568403 -1846546 -2118783 -2364638 -2562872 -2691147 -2729675 -2668454 -2514575 -2294691
17828 -2294691 -2047459 -1807251 -1590119 -1393224 -1205942 -1020535 -836286 -661523 -515324
17819 -515324 -422943 -403854 -461334 -581812 -742468 -918635 -1085887 -1220469 -1303738 -1329826
17809 -1329826 -1310820 -1275387 -1260380 -1297301 -1399062 -1555488 -1741121 -1928882 -2099605 -2243494
17799 -2243494 -2356797 -2438564 -2489900 -2515506 -2525014 -2532030 -2551033 -2593268 -2662395 -2751944 -2847578
17788 -2847578 -2933480 -2997213 -3030186 -3028047 -2994380 -2942968 -2892994 -2859836 -2848610 -2853346 -2860176 -2852221
17776 -2852221 -2813835 -2732033 -2595957 -2397315 -2132708 -1806867 -1436011 -1048750 -680761 -363563
17766 -363563 -113607 71014 203566 296210 351678 365364 334211 262732 160958 37823
17756 37823 -102692 -259098 -427373 -600077 -770782 -938264 -1105991 -1279259 -1463910 -1664735
17746 -1664735 -1880218 -2097644 -2295522 -2452113 -2552407 -2590391 -2570053 -2507024 -2427681 -2362125
17736 -2362125 -2332282 -2341315 -2371759 -2394362 -2381521 -2317232 -2200453 -2042958 -1862837 -1675908 -1490834
17725 -1490834 -1312224 -1148105 -1013870 -928334 -904983 -945810 -1041529 -1175364 -1326912 -1475944
17715 -1475944 -1606148 -1707512 -1776418 -1813450 -1819597 -1793073 -1729764 -1627556 -1490498 -1328452
17705 -1328452 -1151895 -966510 -773906 -579212 -398130 -255858 -178358 -182890 -273046 -437463
17695 -437463 -649999 -873000 -1066051 -1197266 -1249958 -1220962 -1114366 -937596 -702244 -426364
17685 -426364 -135295 140088 369788 535481 638550 697625 736406 770430 800903 817500
17675 817500 807000 762658 688197 593654 487686 374707 260432 159998 98051 97541 165868
17664 165868 289181 437261 573970 668275 703531 681599 618604 534983 447064 365246 297821
17653 297821 255399 251358 297246 396302 540404 712964 895168 1070283 1223215 1337931
17643 1337931 1398523 1395849 1334620 1234067 1120842 1018920 941583 887151 839496 774888 673549
17632 673549 530127 357555 182669 36436 -55586 -79194 -34609 63266 189928 321181
17622 321181 441291 542667 617565 650709 622047 518361 341853 106818 -171018 -480841
17612 -480841 -814171 -1158934 -1496158 -1800765 -2045957 -2209690 -2281145 -2265949 -2187129 -2077335
17602 -2077335 -1964819 -1864092 -1778453 -1708491 -1656035 -1622039 -1604728 -1601064 -1608188 -1621983 -1635726
17591 -1635726 -1643286 -1644511 -1646040 -1656959 -1685368 -1738785 -1824270 -1944931 -2096646 -2269965 -2455175
17580 -2455175 -2644570 -2829685 -2996184 -3121256 -3177100 -3139868 -2999641 -2765635 -2463072 -2124654
17570 -2124654 -1783926 -1473445 -1223478 -1057922 -989742 -1018120 -1126896 -1285381 -1454084 -1594705
17560 -1594705 -1680826 -1704353 -1672358 -1594833 -1473634 -1302868 -1078990 -810442 -519447 -235390
17550 -235390 15541 218111 370327 480678 560312 613171 632542 608289 537071 425648
17540 425648 287560 139456 -1381 -120940 -213677 -284232 -342457 -395130 -441735 -478064 -502259
17529 -502259 -515314 -517169 -506341 -485881 -470011 -484406 -558023 -710966 -946060 -1248729 -1593391
17518 -1593391 -1951224 -2295167 -2601072 -2846831 -3012270 -3081658 -3048907 -2923235 -2729846 -2501696
17508 -2501696 -2265913 -2033568 -1798101 -1541246 -1243012 -892794 -497285 -79796 329609
17499 329609 706260 1036767 1315483 1536273 1688889 1765088 1769231 1722645 1657016 1602985 1583030
17488 1583030 1610638 1691065 1820023 1981918 2152011 2304386 2421814 2499532 2539495 2541404
17478 2541404 2499618 2408445 2271057 2104287 1934638 1788103 1680757 1614600 1577828 1547238
17468 1547238 1492776 1385776 1209943 969753 689917 404523 142275 -82631 -269357 -423042
17458 -423042 -548533 -647907 -719788 -759457 -760423 -716434 -622880 -479378 -294856 -91234 101002
17447 101002 255515 361790 426964 468733 506591 555991 624887 712048 809267 906700 995832
17436 995832 1067380 1107921 1100552 1030855 895186 706568 493682 292257 133541 36355 5905
17425 5905 37417 119749 235850 361478 466548 521701 507373 419530 269160 78471 -122226
17414 -122226 -298027 -417324 -462539 -435517 -352870 -236248 -105147 25710 146764 253725
17404 253725 346667 427601 498715 563104 626177 694490 772377 859872 953151 1045515 1127591
17393 1127591 1187628 1212578 1189787 1109901 971697 786078 574713 363083 172365 15208
17383 15208 -102730 -178576 -211013 -203841 -168748 -120632 -68061 -8532 67567 169168 298481
17372 298481 448910 606902 755018 873417 940869 938760 858536 707648 508291 288449
17362 288449 71365 -129374 -307393 -457602 -571986 -639958 -651888 -602218 -490748 -322938
17352 -322938 -109001 137939 402467 666518 912436 1131370 1330718 1531778 1757245 2017494
17342 2017494 2303977 2591524 2846140 3034412 3132387 3130994 3034229 2851648 2592370 2266383
17332 2266383 1891559 1498687 1127744 816095 585791 436177 343465 267394 164448 2920
17322 2920 -227339 -513603 -826859 -1134509 -1412826 -1650376 -1841089 -1976220 -2044184 -2037879
17312 -2037879 -1962571 -1837986 -1692996 -1556550 -1449949 -1383110 -1354941 -1357159 -1380049 -1416327 -1459363
17301 -1459363 -1498464 -1518838 -1509016 -1470259 -1420878 -1391786 -1413860 -1502390 -1647994 -1821609 -1991627
17290 -1991627 -2141482 -2274747 -2404236 -2534501 -2651982 -2730257 -2745952 -2693173 -2586809 -2454931
17280 -2454931 -2327651 -2228622 -2171533 -2160800 -2193355 -2259283 -2343712 -2433684 -2527307 -2636365 -2778418
17269 -2778418 -2964901 -3194859 -3457460 -3738871 -4027134 -4312115 -4582339 -4823926 -5025765
17260 -5025765 -5187772 -5322934 -5448353 -5572126 -5688071 -5782851 -5848419 -5888696 -5915207 -5935338
17250 -5935338 -5941852 -5911315 -5813804 -5628987 -5358652 -5027587 -4672101 -4324433 -4003298 -3713429
17240 -3713429 -3449625 -3201225 -2956172 -2704538 -2440975 -2165675 -1883655 -1603119 -1333752
17231 -1333752 -1085502 -868115 -690225 -556502 -463686 -399361 -347519 -299409 -260705 -247998
17221 -247998 -278505 -362469 -501475 -688979 -910090 -1141950 -1357022 -1527593 -1628077 -1635913
17211 -1635913 -1535221 -1323157 -1013979 -637831 -236202 144216 459994 680990 798276
17202 798276 827290 804011 772274 765581 794072 846257 903950 957996 1012701 1077944 1158135 1247839
17190 1247839 1336455 1415915 1484239 1544411 1602525 1665889 1739386 1822239 1909176 1995449 2080503
17179 2080503 2166290 2252445 2333876 2402260 2447391 2456263 2413504 2305905 2127861 1883837 1588605
17168 1588605 1268582 963304 719764 574990 535174 568056 616632 625043 560036 418764
17158 418764 223984 11896 -181517 -330405 -422438 -457073 -442781 -395995 -340383 -304045 -313990
17147 -313990 -388545 -530488 -725709 -949086 -1173805 -1379482 -1555863 -1700643 -1813119 -1888728
17137 -1888728 -1918916 -1896269 -1819958 -1696697 -1537815 -1357133 -1172533 -1008603 -894674 -856729
17127 -856729 -907976 -1042908 -1235942 -1444935 -1620325 -1718515 -1714749 -1610010 -1429119 -1211597
17117 -1211597 -999645 -826829 -709773 -645299 -614310 -591027 -553991 -494062 -415628 -330622 -249322
17106 -249322 -173555 -94941 2677 137518 322809 562557 851983 1180687 1535544 1901503
17096 1901503 2260000 2586062 2847067 3007116 3037249 2926585 2688118 2355324 1971182 1576420
17086 1576420 1202295 868184 582458 345180 150755 -10523 -151082 -283599 -418225
17077 -418225 -561813 -719870 -899199 -1108630 -1355858 -1640276 -1945999 -2242701 -2497059 -2687541
17067 -2687541 -2811919 -2883109 -2917635 -2925599 -2908763 -2866249 -2802080 -2728515 -2662675 -2618545 -2599892
17056 -2599892 -2599914 -2608829 -2623279 -2648481 -2691144 -2751387 -2822542 -2898476 -2980278 -3075684 -3192628 -3334043
17044 -3334043 -3497868 -3679724 -3873662 -4069591 -4250721 -4395519 -4484265 -4506061 -4462301 -4364256
17034 -4364256 -4225927 -4057851 -3867531 -3665423 -3468548 -3295346 -3154569 -3038152 -2924901
17025 -2924901 -2791828 -2624468 -2421353 -2193725 -1962747 -1754995 -1596873 -1509101 -1502176 -1573449
17015 -1573449 -1707112 -1878147 -2058854 -2225165 -2361356 -2462406 -2533996 -2591949 -2661048 -2769013
17005 -2769013 -2934514 -3156463 -3413075 -3670863 -3897083 -4070134 -4184280 -4246842 -4271011 -4270727
16995 -4270727 -4259821 -4251237 -4253400 -4266663 -4283403 -4290947 -4275128 -4223488 -4127244 -3981902 -3787512
16984 -3787512 -3548570 -3273004 -2971174 -2656146 -2343489 -2048056 -1778960 -1537171 -1318562
16975 -1318562 -1120365 -945292 -799466 -686487 -603343 -541327 -490228 -442253 -394488 -351430
16965 -351430 -326816 -339989 -404507 -515046 -642739 -744353 -781418 -737806 -624792 -472003
16955 -472003 -312369 -170678 -59319 20960 78509 127248 182236 255759 355694 485230 641992
16944 641992 816773 994104 1156466 1290517 1390274 1455274 1487684 1491199 1470445 1429827 1373387
16933 1373387 1306640 1239209 1185669 1163485 1189651 1278010 1436735 1664707 1948796 2265283
16923 2265283 2585223 2879805 3123312 3295258 3382498 3379110 3284334 3102079 2842161 2520069
16913 2520069 2154467 1764427 1368590 986731 640853 351938 132313 -21762 -131301
16904 -131301 -227166 -338198 -482238 -663674 -874731 -1097219 -1305843 -1474885 -1586213 -1635380
16894 -1635380 -1633450 -1602678 -1566413 -1537847 -1514246 -1480695 -1421140 -1329125 -1211206 -1080855 -946429
16883 -946429 -800951 -621502 -379440 -53842 361908 862956 1438808 2075912 2758069 3468112
16873 3468112 4190339 4911145 5618242 6301707 6956286 7579155 8161202 8678176 9089265
16864 9089265 9345571 9405693 9251984 8898989 8388368 7773215 7101832 6409889 5723159 5065810
16854 5065810 4465713 3952032 3547288 3259945 3082542 2996194 2978011 3007864 3073719 3175067
16844 3175067 3320655 3517882 3759984 4022894 4276185 4499804 4694237 4877764 5073974
16835 5073974 5299409 5558826 5846780 6150667 6454418 6744081 7013325 7265627 7513099
16826 7513099 7773451 8064829 8397036 8761060 9124406 9438126 9651556 9724929 9634544 9372423
16816 9372423 8945021 8373143 7691350 6944198 6179081 5437946 4750921 4133980 3590050
16807 3590050 3110887 2679040 2272666 1874111 1478138 1094386 743330 449374 234298
16798 234298 111962 86014 152348 303029 525799 799472 1091954 1364949 1582563 1718942
16788 1718942 1762170 1715033 1594460 1429209 1254663 1105606 1008945 978284 1012206 1096318
16778 1096318 1206891 1315102 1392886 1420317 1391999 1319044 1224563 1134394 1068301 1036200 1040258
16767 1040258 1080524 1159986 1285750 1466127 1706269 2004947 2353716 2738675 3144427 3558334
16757 3558334 3971504 4375301 4758350 5108762 5418972 5688375 5923732 6139449 6357111
16748 6357111 6601685 6893927 7242625 7640135 8061407 8467427 8814784 9067681 9204998
16739 9204998 9219635 9113885 8895616 8576797 8173220 7704576 7194908 6672759 6169273 5713716
16729 5713716 5328484 5025318 4802325 4642168 4513579 4376776 4192734 3936199 3607165
16720 3607165 3231051 2845401 2482923 2161730 1884703 1644208 1428729 1229695 1046977
16711 1046977 890877 778486 725428 738229 812134 934841 1092768 1276056 1481194 1711462
16701 1711462 1973645 2270961 2597325 2937794 3273667 3588078 3870599 4119609 4339605
16692 4339605 4534113 4700260 4829846 4914964 4952387 4943638 4892493 4803370 4682653 4541705
16682 4541705 4397700 4270199 4176157 4127602 4132698 4197775 4328281 4527211 4789346 5092972
16672 5092972 5396363 5646233 5797528 5834059 5775335 5663545 5540994 5434553 5354030 5298858
16662 5298858 5263728 5240120 5218104 5191629 5163558 5144846 5147559 5176586 5225625 5280085 5325081
16651 5325081 5353363 5367876 5377044 5385836 5388836 5370685 5314467 5212541 5071916 4910539 4748723
16640 4748723 4603468 4488595 4416661 4398338 4440167 4543848 4707976 4930010 5205456 5524561
16630 5524561 5871929 6232672 6599734 6973412 7352947 7729639 8088574 8416236 8707107
16621 8707107 8965861 9206114 9446986 9707824 10001644 10329349 10676836 11016567 11315302
16612 11315302 11547363 11706560 11807985 11878069 11940850 12010262 12090853 12181996 12281821 12391468
16602 12391468 12518947 12679231 12890230 13167972 13523782 13962244 14478113 15055012 15670577
16593 15670577 16306288 16954256 17616123 18295654 18989815 19683331 20349783 20958474 21483564
16584 21483564 21911792 22245033 22495237 22675314 22794345 22860813 22888722 22899829 22919617 22969808
16574 22969808 23063606 23207174 23404368 23660257 23983166 24386600 24889081 25509037 26257633
16565 26257633 27136389 28141099 29267339 30513238 31878935 33363297 34958100 36640462
16557 36640462 38364433 40052418 41591360 42842115 43664127 43946722 43635071 42743192 41351947
16548 41351947 39592684 37619254 35576026 33573122 31676948 29916001 28295447 26812755
16540 26812755 25468499 24268855 23219538 22316014 21538159 20853535 20225474 19619269 19005135
16531 19005135 18362317 17686161 16993132 16317428 15698620 15166344 14729698 14375150 14071438
16522 14071438 13777448 13450609 13056785 12582136 12041496 11475233 10933277 10455013 10056853
16513 10056853 9731816 9456221 9198659 8930456 8635889 8317202 7991371 7681018 7404275
16504 7404275 7168001 6966650 6785960 6609461 6426588 6239247 6061954 5914735 5814320
16495 5814320 5769667 5781771 5842914 5934270 6027568 6094445 6118096 6098030 6044281 5965809 5862588
16484 5862588 5728608 5564040 5386579 5232348 5145243 5161404 5296300 5538542 5852786 6191568
16474 6191568 6510001 6775360 6968298 7078659 7100934 7032531 6875369 6639413 6346701 6034600
16464 6034600 5755530 5569378 5527082 5650299 5919080 6279418 6668934 7042128 7379540 7683060
16454 7683060 7966615 8246102 8530653 8819734 9108048 9392957 9676764 9961730 10242970
16445 10242970 10505906 10729367 10890635 10969472 10950717 10825954 10594802 10266517 9862276 9416927
16435 9416927 8978028 8601516 8344441 8254094 8353660 8628615 9021438 9442071 9795438 10014586
16425 10014586 10079420 10010849 9849699 9637563 9408372 9188539 8999924 8861547 8788605 8789165
16415 8789165 8861317 8993594 9167663 9360012 9542255 9683222 9754918 9739994 9636912 9461275
16405 9461275 9242731 9015972 8807562 8626476 8465780 8314240 8168449 8035873 7926788
16396 7926788 7842876 7773864 7706260 7636707 7577960 7551717 7574949 7654021 7793727 8012049 8343761
16385 8343761 8824311 9463551 10232240 11075324 11939101 12787333 13598636 14357656 15052481
16376 15052481 15678993 16245699 16773452 17289267 17817685 18374484 18965417 19590017 20248605
16367 20248605 20948250 21702949 22528315 23436670 24436757 25535371 26736177 28035420 29418706
16358 29418706 30863118 32343775 33839502 35335487 36826302 38320504 39842663 41429337
16350 41429337 43120311 44949045 46936350 49090506 51413800 53910129 56586988 59448853
16342 59448853 62483394 65646507 68856238 72003233 74974176 77674163 80036538 82020794
16334 82020794 83606383 84788146 85574451 85986000 86052036 85803850 85270654 84480804 83463295
16325 83463295 82243660 80836879 79244902 77462307 75486732 73327007 71003669 68543980
16317 68543980 65977821 63336154 60647990 57933051 55194298 52419192 49594461 46728776
16309 46728776 43870178 41103427 38521800 36190033 34126533 32314013 30722572 29326297
16301 29326297 28107172 27050614 26138914 25346864 24642408 23993161 23376524 22787928 22241499
16292 22241499 21761985 21372423 21084271 20894031 20784728 20728301 20688559 20627431 20514563 20334849
16282 20334849 20087924 19780797 19421657 19019665 18587833 18143304 17702195 17272372 16851283
16273 16851283 16430882 16005457 15578655 15167444 14799851 14505738 14305664 14204859 14195054 14260830
16263 14260830 14384998 14550471 14740137 14937291 15127060 15297256 15437651 15537744 15583340
16254 15583340 15555162 15435429 15222900 14946001 14659961 14424670 14277318 14218736 14220695 14246638
16244 14246638 14270952 14284539 14286056 14269816 14221903 14126335 13974125 13767736 13519408 13246348
16234 13246348 12966728 12699024 12462973 12277765 12157259 12107234 12127257 12214168 12362798 12562261
16224 12562261 12790262 13012020 13189563 13297626 13333014 13308408 13236776 13121517 12959243 12749279
16214 12749279 12501163 12235723 11979686 11757490 11585514 11471789 11420442 11436605 11527290 11697690
16204 11697690 11947097 12267869 12645303 13054736 13458497 13809761 14064052 14190234 14174046
16195 14174046 14016328 13732433 13353803 12924872 12490591 12081068 11705040 11356349 11027429
16186 11027429 10720890 10454083 10256854 10165119 10211024 10410749 10756058 11216263 11749579 12315794
16176 12315794 12884104 13437232 13973737 14505678 15050910 15626438 16247465 16927977 17677503
16167 17677503 18495296 19366796 20265450 21159802 22023048 22840505 23609895 24332383 25000339
16158 25000339 25591607 26073461 26412247 26583636 26578991 26403851 26069479 25585285 24959452 24206490
16148 24206490 23353212 22436867 21496957 20565216 19656829 18765801 17868709 16938929 15966357
16139 15966357 14970668 13998463 13105781 12336775 11710011 11217462 10833730 10528619 10276109
16130 10276109 10057062 9858545 9673638 9501429 9344310 9202643 9071086 8940132 8802263
16121 8802263 8658851 8522843 8413220 8343152 8310453 8297191 8277445 8227674 8135354 8004246
16111 8004246 7854738 7717016 7617941 7568245 7559078 7571195 7590126 7616627 7666660 7763359 7927927
16100 7927927 8174710 8510741 8936830 9448699 10039800 10705664 11444757 12252021 13108906
16091 13108906 13978222 14808088 15541061 16120725 16493081 16608317 16430091 15951101 15204599
16082 15204599 14262342 13218448 12167446 11186819 10329129 9622140 9072595 8669903 8389246
16073 8389246 8196151 8052708 7924009 7783744 7617614 7423223 7206776 6978492 6749080
16064 6749080 6528623 6326790 6152362 6011347 5904413 5825156 5760260 5691898 5603040 5485161
16054 5485161 5343444 5193894 5053895 4933867 4836104 4760000 4707405 4682747 4689904 4732256 4817091
16043 4817091 4958457 5174254 5480002 5884013 6385245 6972012 7621573 8302646 8980968
16034 8980968 9625486 10213314 10732072 11178467 11554043 11860237 12095366 12256426 12345077 12372772
16024 12372772 12360268 12331609 12307596 12304448 12338176 12428616 12597053 12858971 13219301 13674650
16014 13674650 14219306 14848268 15555365 16331377 17167144 18060218 19019221 20061704 21205759
16005 21205759 22459983 23818494 25265030 26783339 28365753 30013069 31727372 33506476
15997 33506476 35345437 37241522 39196809 41217668 43311908 45481975 47715393 49979724
15989 49979724 52227229 54405400 56464984 58360577 60045848 61470899 62589062 63371338
15981 63371338 63817730 63957203 63836391 63501832 62982653 62281144 61375255 60231462 58821980
15972 58821980 57139534 55205730 53072604 50818045 48534603 46312386 44222136 42306822
15964 42306822 40583886 39053282 37704778 36520619 35474375 34531598 33657222 32827833
15956 32827833 32041045 31314827 30676946 30152240 29755257 29488900 29345568 29309803 29363242 29489762
15946 29489762 29676908 29913097 30184974 30478313 30780307 31079273 31362815 31617919 31833008
15937 31833008 31999292 32110238 32160440 32145292 32061372 31906880 31681692 31385882 31016033 30561687
15927 30561687 30006276 29334070 28539899 27635402 26645965 25598820 24511388 23389054 22231661
15918 22231661 21041724 19830835 18623179 17452289 16349918 15334357 14407214 13560126
15910 13560126 12784533 12075939 11431314 10846117 10315377 9836536 9410118 9037604 8718555
15901 8718555 8450147 8229664 8055990 7926461 7831598 7753605 7670548 7563126 7421541 7251051
15891 7251051 7073260 6920686 6826379 6814309 6895754 7070779 7329352 7649864 7998280 8330767
15881 8330767 8599508 8761110 8787021 8672450 8438399 8124067 7773292 7422695 7096900 6810233
15871 6810233 6570157 6377857 6225986 6097567 5968182 5810298 5599245 5322420 4989793
15862 4989793 4637663 4318992 4083794 3960784 3949633 4025796 4153673 4301167 4449519 4594991
15852 4594991 4741758 4889551 5024567 5121313 5154421 5111286 4996754 4828127 4626983 4416103
15842 4416103 4221171 4068732 3976143 3940045 3934826 3925715 3888101 3818733 3732512 3651040 3593934
15831 3593934 3578130 3620556 3735577 3925622 4174165 4451102 4728057 4991374 5245810 5511428
15821 5511428 5816305 6184687 6623938 7118775 7637580 8145977 8618800 9046051 9432897
15812 9432897 9794007 10143899 10488194 10820330 11124629 11383339 11584097 11725170 11817512 11883245
15802 11883245 11950925 12050060 12207917 12448077 12787682 13233982 13784490 14432199 15172450 16006164
15792 16006164 16935853 17957498 19056355 20211501 21406164 22636711 23914769 25262215
15784 25262215 26702832 28253786 29918043 31679234 33502210 35341115 37151693 38901248
15776 38901248 40572592 42164125 43689989 45181159 46683710 48250678 49931835 51770578
15768 51770578 53809893 56099748 58697255 61658777 65031945 68856386 73173239 78035611
15760 78035611 83514088 89697791 96692429 104615654 113591360 123745142 135200450 148071722
15752 148071722 162448054 178360423 195730115 214304718 233595333 252833256 270969380
15745 270969380 286743033 298839918 306129299 307920857 304142729 295357234 282605958
15738 282605958 267157573 250260381 232971284 216080600 200113472 185374836 172009160
15731 172009160 160056327 149494746 140270270 132312992 125545438 119887159 115259540 111590447
15723 111590447 108817047 106887770 105764602 105422220 105839673 106987518 108819150 111271381
15715 111271381 114271720 117746521 121625341 125839800 130318435 134978878 139716231 144387357
15707 144387357 148796683 152694001 155792180 157802764 158479821 157661523 155300431 151474644
15699 151474644 146375683 140276627 133489385 126320768 119036925 111843870 104885291 98253081
15691 98253081 92003645 86172419 80781610 75842200 71354232 67307554 63683667 60459636
15683 60459636 57612957 55122855 52966372 51114533 49533659 48190522 47056746 46109670
15675 46109670 45329559 44694142 44173469 43729559 43322306 42917343 42490339 42027398 41525634
15666 41525634 40995825 40463094 39960302 39515080 39138782 38825904 38563945 38345220 38173379
15657 38173379 38063490 38037308 38116100 38314490 38639007 39091893 39675350 40391764 41243030 42233792
15647 42233792 43375012 44680759 46158894 47802593 49586405 51465912 53380612 55260500
15639 55260500 57033547 58629942 59983168 61031161 61719129 62003665 61857562 61274020 60269531
15630 60269531 58886999 57199107 55305454 53315594 51321550 49376931 47497831 45682647
15622 45682647 43932832 42259527 40676054 39186788 37782823 36448232 35172292 33957379
15614 33957379 32815673 31759098 30793394 29921138 29147956 28483191 27934007 27500001 27174187
15605 27174187 26948799 26820623 26792907 26873873 27071521 27385724 27803466 28302616 28860976 29463055
15595 29463055 30102441 30782241 31513296 32308631 33176966 34120364 35136688 36222397 37372910
15586 37372910 38581958 39841403 41141563 42471817 43820802 45175448 46519306 47831982
15578 47831982 49089937 50266964 51333925 52257662 52997825 53503549 53716834 53587091 53091759
15569 53091759 52249742 51117010 49767143 48270613 46684416 45053742 43420146 41828929
15561 41828929 40330796 38976907 37809814 36855641 36123047 35608680 35301991 35184799 35229965
15552 35229965 35407042 35694910 36091985 36615706 37292699 38147262 39194514 40440250 41886166
15543 41886166 43536954 45405202 47512604 49889643 52576153 55622241 59086851 63031934
15535 63031934 67514488 72582931 78282429 84667246 91812436 99817329 108798851 118877519
15527 118877519 130158699 142709915 156532801 171525761 187434780 203800257 219923303
15520 219923303 234883100 247628048 257139347 262633721 263743017 260601161 253800242 244236227
15512 244236227 232911561 220765588 208571211 196897601 186117701 176438096 167936038
15505 167936038 160594411 154329506 149010941 144475592 140537800 136997221 133645595 130276274
15497 130276274 126701289 122774414 118411719 113601515 108400866 102920532 97302342 91694375
15489 91694375 86230309 81016595 76125959 71593974 67418086 63561834 59968148 56581075
15481 56581075 53367537 50327714 47488449 44884797 42541784 40465755 38645637 37058148
15473 37058148 35671214 34444902 33334097 32295645 31297256 30323163 29373342 28457087 27585670
15464 27585670 26769374 26020065 25354923 24795957 24364157 24072180 23921751 23908392 24028652
15455 24028652 24282115 24666842 25174777 25792578 26506207 27304934 28184028 29146731 30203939
15446 30203939 31370017 32656415 34066581 35594998 37231340 38968401 40810514 42779145
15438 42779145 44912067 47253065 49834883 52666896 55739898 59048577 62617469 66511741
15430 66511741 70825118 75654773 81080521 87154837 93896433 101280594 109226951 117586127
15422 117586127 126125678 134522805 142379091 149265022 154781909 158616879 160574399 160585125
15414 160585125 158701947 155089554 150007032 143780803 136767828 129313895 121716145 114200363
15406 114200363 106920173 99975062 93433568 87347725 81755310 76675843 72107372 68026772
15398 68026772 64393238 61154860 58258526 55661081 53336939 51278279 49488304 47971256
15390 47971256 46723220 45726503 44948248 44341635 43848555 43405903 42957216 42464961 41915629
15381 41915629 41315298 40680838 40032702 39389730 38763531 38153288 37544575 36912935 36230109
15372 36230109 35472307 34630369 33716939 32763797 31809832 30888327 30021451 29222379 28499878
15363 28499878 27861121 27312093 26856879 26497396 26234435 26069045 26001666 26028016 26135579 26306219
15353 26306219 26524456 26783489 27082530 27417894 27775637 28129654 28442908 28669252 28757595
15344 28757595 28660410 28344292 27797977 27035506 26095265 25035800 23926954 22836010 21814931
15335 21814931 20896210 20096052 19416927 18846591 18357928 17913465 17473971 17009223 16508214
15326 16508214 15984453 15472741 15017112 14653684 14396902 14236911 14148056 14101668 14075685 14057482
15316 14057482 14041542 14025695 14008372 13988381 13967271 13950882 13946141 13955338 13975063 14000958 14031103
15305 14031103 14064689 14100239 14135123 14164082 14177303 14160541 14097266 13972027 13775466 13509867
15295 13509867 13191030 12843707 12492176 12150942 11821167 11494768 11161890 10816355 10458217
15286 10458217 10095338 9743188 9420148 9138863 8898717 8685354 8478385 8260846 8023719
15277 8023719 7766179 7495137 7223881 6968940 6746555 6568905 6438893 6346299 6270621 6190469
15267 6190469 6093018 5977661 5852439 5726888 5607850 5501161 5414807 5358380 5339524 5361178
15257 5361178 5421464 5515355 5636165 5776146 5927838 6086655 6251700 6422003 6591112 6746588
15247 6746588 6875611 6969850 7024131 7031697 6982993 6870724 6696812 6473622 6218083 5945629
15237 5945629 5668980 5398867 5144084 4913445 4719239 4576675 4498264 4488790 4544831 4657442
15227 4657442 4814224 4999149 5192370 5372801 5522706 5630117 5686610 5683994 5616770 5490941
15217 5490941 5330362 5171921 5051872 4993286 5000764 5061467 5149971 5235963 5293691 5310454 5290030
15206 5290030 5248025 5201368 5159830 5125660 5099208 5082710 5077260 5075951 5061253 5011874 4915292 4775941
15194 4775941 4612393 4446146 4290973 4150672 4025360 3918344 3836119 3782161 3751645 3731976
15184 3731976 3708982 3676401 3644222 3638981 3693206 3830197 4053314 4343868 4666541 4979524
15174 4979524 5245053 5436477 5540884 5557633 5494490 5365560 5191793 4999444 4815174 4662301
15164 4662301 4560329 4524753 4563879 4673667 4835228 5018188 5188145 5314857 5379729 5380940
15154 5380940 5332554 5256097 5168920 5077550 4980340 4874864 4761319 4639749 4507208 4360262
15144 4360262 4201570 4045429 3917651 3849127 3866272 3982247 4192761 4478527 4811382 5158880
15134 5158880 5487092 5765204 5971679 6097002 6140506 6105384 5997270 5826512 5609882 5369213
15124 5369213 5128651 4913058 4746821 4650592 4636628 4705101 4842593 5025429 5229508 5440663
15114 5440663 5656183 5876812 6097656 6305501 6482908 6615468 6699310 6746005 6781133 6835533
15104 6835533 6932810 7079426 7263403 7463089 7660264 7849227 8037276 8237307 8457090 8692352
15094 8692352 8927784 9143086 9318775 9439946 9498719 9496131 9442860 9357289 9261104 9174439 9111133
15083 9111133 9074301 9055373 9039655 9016417 8987076 8965191 8967441 9001927 9061036 9121679 9152648
15072 9152648 9126593 9030403 8867771 8653417 8403829 8130443 7838626 7530987 7211057 6885790
15062 6885790 6567283 6272386 6018852 5820271 5684034 5614226 5616162 5696964 5859126 6090603
15052 6090603 6359779 6620951 6828035 6948576 6971064 6904331 6772651 6610147 6455597 6346118
15042 6346118 6307979 6346788 6443854 6562710 6661175 6702107 6661920 6537655 6348642 6128764
15032 6128764 5912870 5725502 5576671 5464500 5382183 5325014 5293587 5292554 5327419 5401596 5513953
15021 5513953 5657251 5819426 5988226 6156588 6324477 6494779 6666433 6831832 6981223
15012 6981223 7109374 7219106 7320922 7430323 7563062 7728683 7926244 8145218 8368359
15003 8368359 8573244 8734618 8829332 8841970 8769126 8621633 8423961 8209386 8011115 7852899
14993 7852899 7743660 7678409 7644608 7630230 7628581 7637532 7655406 7678001 7699082 7712542 7713573 7699704
14981 7699704 7674550 7653103 7662037 7730053 7871991 8076213 8303211 8498837 8616670 8634624
14971 8634624 8554761 8391387 8160944 7880532 7571313 7260012 6975649 6743635 6580876 6494029
14961 6494029 6480944 6534321 6646582 6813435 7032682 7298216 7593729 7890788 8153950 8352008
14951 8352008 8468972 8508566 8493030 8459394 8452322 8512615 8665374 8913112 9236776 9604302
14941 9604302 9982335 10344993 10675973 10964395 11199085 11367715 11462638 11488393 11464314 11420223
14931 11420223 11388208 11394368 11453328 11567845 11732823 11938694 12170951 12409000 12629365 12812768
14921 12812768 12950034 13044502 13110766 13168816 13235877 13322125 13432840 13573474 13753668 13989019
14911 13989019 14300767 14712931 15246189 15910331 16700675 17602226 18598421 19677700 20834278
14902 20834278 22064568 23364376 24730277 26163031 27668278 29252605 30917086 32653584
14894 32653584 34449235 36298061 38209741 40207174 42316398 44558155 46945229 49483201
14886 49483201 52169857 54989669 57904776 60849038 63732072 66455120 68934037 71119621
14878 71119621 73005925 74623870 76024766 77261356 78372963 79377586 80270852 81031653
14870 81031653 81632283 82046359 82249037 82211996 81900833 81280285 80325775 79033132 77418836
14861 77418836 75512793 73352690 70983764 68459165 65836038 63168697 60503974 57881612
14853 57881612 55338570 52914002 50651161 48593758 46777496 45220334 43915230 42829579
14845 42829579 41914179 41119365 40411004 39778432 39230462 38783231 38448256 38225530 38100640
14836 38100640 38044788 38019139 37983116 37901946 37748999 37504102 37153958 36697634 36151120 35543745
14826 35543745 34908269 34272333 33654795 33065041 32503509 31964530 31442145 30935621 30449464
14817 30449464 29987954 29551126 29137868 28753228 28412103 28134198 27931960 27800166 27716567
14808 27716567 27653745 27592366 27525434 27451378 27362645 27239082 27050438 26765429 26361330 25829496
14798 25829496 25175891 24417526 23576892 22678558 21749861 20822207 19929918 19107708 18387157
14789 18387157 17790956 17327455 16991469 16771839 16657574 16636121 16687988 16786475 16904135 17020268
14779 17020268 17125257 17221737 17321824 17440232 17588344 17774428 18007869 18300293 18660576
14770 18660576 19088833 19574918 20099852 20635469 21143623 21581186 21912369 22121678 22218626
14761 22218626 22231268 22192443 22125450 22036265 21917671 21763932 21585166 21408914 21267518 21182512
14751 21182512 21156402 21172312 21198701 21199884 21150667 21046998 20906594 20760921 20642492 20572406
14741 20572406 20554144 20575572 20615422 20649666 20656304 20619541 20533838 20405788 20251647 20091336 19942028
14730 19942028 19813390 19705483 19610763 19521454 19439756 19383944 19384628 19472746 19667779 19973727 20383136
14719 20383136 20884185 21466269 22122642 22850290 23647114 24508206 25424262 26382521 27368608
14710 27368608 28369885 29382178 30417259 31503820 32678885 33975350 35413332 36999151
14702 36999151 38731169 40608295 42636142 44828001 47201418 49774133 52561821 55575776
14694 55575776 58816940 62266567 65879066 69582376 73285831 76891410 80304496 83441882
14686 83441882 86234750 88625523 90562738 92001453 92912141 93293381 93180752 92647623 91798262
14677 91798262 90756452 89652501 88610022 87733706 87099650 86748783 86683272 86867756 87239152
14668 87239152 87724661 88259316 88791238 89271653 89641245 89827462 89754789 89357286 88585234
14659 88585234 87408816 85823650 83854980 81555563 78998156 76265700 73440999 70598155
14651 70598155 67797792 65086029 62496348 60052412 57768549 55647552 53680208 51849755
14643 51849755 50139576 48539097 47043869 45651170 44356662 43156012 42050033 41047563
14635 41047563 40161340 39399128 38757272 38220357 37764646 37362115 36984009 36604464 36204981
14626 36204981 35778536 35330096 34873233 34426734 34013638 33660429 33393277 33231568 33181750
14617 33181750 33234823 33368699 33554259 33763799 33979976 34200883 34437317 34704020 35010389
14608 35010389 35354390 35721645 36090920 36444243 36775303 37089069 37391833 37679562 37933974
14599 37933974 38128664 38239557 38253072 38170821 38012507 37815597 37628965 37500723 37465230 37536540
14589 37536540 37711222 37975003 38306357 38677673 39059351 39428026 39773647 40099637 40416748
14580 40416748 40736677 41070003 41427287 41818547 42248398 42710541 43188805 43665431 44128478
14571 44128478 44571739 44989291 45371461 45706319 45984639 46202503 46358893 46451595 46475221 46421265
14561 46421265 46279190 46038849 45694329 45247879 44711544 44105578 43454728 42783930 42115142
14552 42115142 41465807 40846934 40259123 39689676 39115947 38513787 37864478 37157642 36393118
14543 36393118 35583128 34752096 33931876 33152971 32434653 31778368 31168285 30578387 29981473
14534 29981473 29356739 28696384 28010125 27323306 26668081 26073191 25557306 25127268 24780159
14525 24780159 24507016 24295964 24134156 24010387 23918751 23859923 23837107 23848654 23883158 23921198
14515 23921198 23941810 23927940 23868487 23759138 23603567 23413862 23208748 23009484 22834452 22694043
14505 22694043 22587871 22505977 22433779 22357779 22268501 22159673 22025676 21860672 21660545 21425198
14495 21425198 21158768 20867924 20560331 20244905 19933628 19642588 19389879 19190148 19048537
14486 19048537 18957512 18898301 18846411 18778601 18678129 18537345 18358941 18155508 17945654 17748152
14476 17748152 17578824 17451636 17380503 17378481 17454662 17610875 17839683 18123767 18437135 18749500
14466 18749500 19032987 19268229 19448403 19579785 19676038 19747510 19791869 19790663 19712761 19525424
14456 19525424 19211297 18782186 18277901 17748957 17235529 16756966 16316425 15913218 15551206
14447 15551206 15238273 14981843 14786839 14655847 14588641 14582169 14632648 14737215 14892120 15089730
14437 15089730 15318429 15564292 15811847 16046231 16258446 16448572 16622065 16781870 16923167
14428 16923167 17034091 17099937 17107670 17049570 16924796 16737840 16494846 16201082 15862920 15493568
14418 15493568 15117462 14769387 14488995 14313397 14268937 14362801 14578333 14879346 15223504 15577492
14408 15577492 15924957 16264486 16602251 16944373 17291775 17639946 17983327 18319907 18652514
14399 18652514 18988324 19339505 19723385 20157731 20651972 21201826 21791081 22396055 22988091
14390 22988091 23535703 24010044 24393085 24683019 24892442 25040981 25148018 25229365 25297131 25359461
14380 25359461 25418868 25471329 25508093 25518764 25492486 25417130 25279810 25071027 24790852 24452791
14370 24452791 24081105 23701272 23329248 22967347 22609110 22249279 21892899 21557412 21264653
14361 21264653 21027738 20843237 20693678 20555710 20407028 20229960 20012938 19749662 19436374
14352 19436374 19070635 18654808 18203113 17746925 17331955 17005209 16797257 16710393 16719960 16785611
14342 16785611 16862798 16909770 16893222 16795445 16619760 16388952 16136825 15898546 15704287 15576164
14332 15576164 15527130 15561051 15672615 15846030 16053918 16259883 16425887 16521091 16527514 16441038
14322 16441038 16270061 16034382 15763763 15493762 15258938 15086885 14995400 14990637 15063603 15187752
14312 15187752 15323474 15429983 15478171 15456960 15370492 15229732 15045020 14824217 14575638 14311291
14302 14311291 14048136 13808059 13615344 13489636 13437086 13445861 13489825 13539218 13573199 13587319
14292 13587319 13591502 13601273 13629761 13684528 13766911 13871011 13983163 14084499 14156481 14185794 14165728
14281 14165728 14095157 13977314 13819018 13630493 13426090 13224057 13043388 12899187 12798889
14272 12798889 12739657 12708015 12684554 12653227 12609148 12559146 12515419 12486358 12468733 12444583 12384943
14261 12384943 12259958 12050749 11755508 11385678 10957026 10484641 9984708 9478117 8990165
14252 8990165 8545647 8163541 7855726 7629401 7489358 7437992 7474577 7596023 7798358 8076204
14242 8076204 8418966 8805869 9203993 9572586 9872423 10075126 10168901 10160635 10074140 9942650
14232 9942650 9797138 9658560 9540780 9458666 9428820 9460066 9544779 9662125 9790433 9916613
14222 9916613 10036144 10147778 10249793 10339178 10411367 10459660 10475135 10447335 10365955 10223327
14212 10223327 10016430 9747909 9427623 9074859 8718085 8389523 8115321 7905396 7749181
14203 7749181 7620854 7490447 7333552 7135774 6893481 6613895 6314176 6016555 5740142
14194 5740142 5494928 5282209 5099947 4947167 4823280 4724930 4645660 4578835 4520079 4466798
14184 4466798 4415838 4362122 4300164 4228028 4151000 4081013 4030693 4007337 4012916 4047681 4109919
14173 4109919 4190961 4273196 4336933 4371889 4383664 4389808 4408921 4451450 4517870 4602620 4698954
14162 4698954 4801777 4908300 5017262 5127495 5236733 5341535 5438135 5522619 5589419 5630047
14152 5630047 5635138 5599960 5528780 5433452 5327656 5223245 5131816 5067580 5046755 5082980 5180807
14141 5180807 5330424 5507624 5680774 5822094 5918525 5977813 6025788 6093391 6199077 6337220
14131 6337220 6479911 6591098 6645621 6643394 6610860 6588222 6609723 6689414 6819769 6979612 7144306
14120 7144306 7295609 7428396 7548783 7663918 7772581 7864562 7927507 7953733 7941138 7889117
14110 7889117 7794703 7652068 7454655 7198945 6888855 6537998 6167891 5803052 5465430 5170321
14100 5170321 4924959 4729648 4580895 4476469 4420961 4427332 4511285 4681730 4933672 5246708
14090 5246708 5588073 5917299 6190638 6366101 6410556 6307668 6062666 5700072 5255128 4764956
14080 4764956 4264493 3785611 3355386 2993947 2714312 2522424 2415010 2378447 2392097 2432582
14070 2432582 2474450 2490593 2458144 2366928 2223296 2047954 1870992 1725257 1637761 1621622
14060 1621622 1672782 1773441 1901302 2040252 2185290 2338569 2501195 2667328 2824548 2960650
14050 2960650 3071410 3161738 3239400 3308132 3365226 3402355 3407182 3366510 3271728 3123826 2934635
14039 2934635 2724561 2519582 2348275 2236162 2197365 2230357 2323311 2464413 2647634 2869879
14029 2869879 3122491 3383613 3618605 3790907 3876912 3874784 3802772 3689903 3564300 3444073
14019 3444073 3334574 3231903 3128897 3020062 2903992 2783243 2662296 2543726 2423227
14010 2423227 2287428 2119474 1911397 1673892 1434335 1223991 1063710 956434 888682 838049
14000 838049 781895 703806 597104 465446 320593 178825 57609 -27120 -62871 -41095
13990 -41095 42817 187117 378965 594366 808732 1012482 1217451 1445558 1708359 1996111
13980 1996111 2284737 2551356 2783689 2977368 3127559 3225813 3264483 3240845 3155459 3009334
13970 3009334 2806517 2560570 2297226 2049152 1845806 1703917 1622884 1587460 1577400 1579486
13960 1579486 1594657 1636295 1722222 1865508 2067602 2316098 2587811 2855358 3094136 3286826
13950 3286826 3423485 3497308 3500058 3423089 3265447 3042152 2784064 2527618 2301316 2119188
13940 2119188 1986160 1909345 1902939 1980938 2145323 2382075 2668155 2981881 3308629 3640740
13930 3640740 3974585 4306223 4626457 4918330 5159989 5332173 5426898 5452628 5431067 5384704
13920 5384704 5322623 5236025 5107286 4924914 4693465 4434042 4178552 3961693 3811688 3740773
13910 3740773 3739941 3783362 3842101 3898724 3953117 4017203 4104245 4219598 4356153 4495770 4617100
13899 4617100 4705631 4757776 4776158 4762779 4716517 4634034 4511783 4350636 4162847 3974842
13889 3974842 3820319 3726929 3705597 3748585 3835782 3944803 4059289 4170580 4272941 4358937
13879 4358937 4420496 4453808 4462294 4454885 4441196 4426242 4407171 4374220 4315853 4225259 4104739
13868 4104739 3965960 3826112 3702723 3610919 3562941 3566190 3619311 3710387 3820099 3927651
13858 3927651 4015763 4074425 4104234 4117281 4133655 4175319 4259366 4390678 4556616 4729138 4874963
13847 4874963 4966947 4989953 4941282 4829770 4675429 4507618 4358697 4252715 4193414 4159465
13837 4159465 4112814 4017241 3855626 3634393 3373160 3088142 2780784 2438615 2048338 1612729
13827 1612729 1157536 722297 344441 49947 -147061 -242821 -245405 -177095 -73227 24337
13817 24337 77695 64258 -15605 -139570 -273472 -384828 -452398 -467809 -430115 -338501 -189377
13806 -189377 19247 279712 571086 864262 1130943 1349185 1505094 1594989 1628524 1628746
13796 1628746 1626568 1650841 1717828 1824336 1948549 2060437 2137281 2173563 2178100 2163007 2134839
13785 2134839 2092185 2027343 1929994 1791918 1610906 1393226 1154913 919991 714604 560231
13775 560231 470717 453921 513162 643556 826622 1031049 1220786 1364866 1445603 1464008
13765 1464008 1438529 1394504 1350529 1311252 1268912 1209584 1120790 998192 848573 688987 544026
13754 544026 440960 402417 439699 550259 719755 926743 1147189 1356885 1532556 1654535
13744 1654535 1711633 1704740 1645551 1551375 1440579 1330592 1235784 1163883 1114081 1079358 1051254
13733 1051254 1024059 997500 977929 977179 1008851 1083334 1203306 1361733 1543986 1733528 1917999
13722 1917999 2092060 2254914 2404056 2530024 2616752 2647430 2610954 2504128 2329687 2094525
13712 2094525 1811146 1500227 1190068 910955 686757 528361 431481 378324 342024 293813
13702 293813 212637 94064 -47422 -184843 -288488 -333166 -302859 -194440 -18886 202126
13692 202126 443737 686993 925900 1168620 1430966 1724314 2043728 2363566 2644910 2851749
13682 2851749 2965935 2991209 2945655 2851075 2728024 2597527 2483843 2413632 2412003 2496753 2671304
13671 2671304 2920040 3211116 3506408 3772892 3990071 4150797 4255687 4305117 4295329 4221773
13661 4221773 4085624 3897416 3676176 3445245 3225464 3028143 2852402 2688120 2520800
13652 2520800 2335295 2119363 1868524 1590663 1306550 1044103 829096 678690 601972 605122
13642 605122 694536 874027 1138868 1471871 1844241 2221071 2569076 2862994 3088033 3238603
13632 3238603 3316231 3328649 3288190 3206850 3090772 2940564 2758598 2556589 2356739 2185595
13622 2185595 2064199 1998978 1977105 1968588 1935074 1842473 1672020 1424763 1118269 778985
13612 778985 434808 109725 -179346 -423432 -620863 -776208 -899188 -1003044 -1101169 -1201528
13602 -1201528 -1301221 -1385578 -1434124 -1431006 -1374113 -1277217 -1163629 -1055345 -964122 -889294 -823067
13591 -823067 -758999 -696833 -640686 -594257 -558110 -528102 -491890 -427638 -312568 -139183 74989
13580 74989 294474 483911 622372 706859 749537 774000 809568 882567 1009496 1196675 1443176
13569 1443176 1740813 2072341 2414319 2745379 3052737 3331187 3576932 3783291 3942699
13560 3942699 4053083 4122602 4168301 4208887 4255117 4302791 4333744 4325962 4266003 4154689 4004024
13549 4004024 3829633 3644337 3457419 3280035 3130339 3031195 3001254 3046091 3153838 3295932
13539 3295932 3433494 3529019 3558601 3517521 3416969 3276856 3120391 2970460 2844930 2750604
13529 2750604 2679561 2612500 2529409 2421140 2293922 2164655 2050342 1957481 1878285 1797418
13519 1797418 1704343 1600898 1498095 1406379 1329169 1265397 1216978 1192370 1203165 1257704 1356548
13508 1356548 1492450 1654598 1833060 2019461 2206173 2388707 2569942 2760021 2969726
13499 2969726 3202264 3449846 3696399 3922659 4110595 4247944 4333277 4377805 4400275 4417683
13489 4417683 4437806 4456823 4461890 4437054 4369768 4254577 4091911 3883829 3632092 3342205
13479 3342205 3030266 2725480 2463728 2273983 2165564 2126153 2132984 2167834 2223088 2296050
13469 2296050 2379791 2459653 2516761 2534676 2506606 2440843 2359652 2289226 2246420 2231678 2232295 2232363
13457 2232363 2222255 2202701 2183392 2177684 2194772 2233000 2279783 2318418 2335122 2321055 2272509
13446 2272509 2194861 2107113 2037384 2008273 2024002 2070188 2124815 2170213 2197424 2202359 2179788
13435 2179788 2120868 2014962 1854484 1642492 1400171 1167618 993770 919172 960749 1106257
13425 1106257 1320241 1558197 1781947 1968170 2106647 2193283 2226509 2209322 2151262 2065879
13415 2065879 1965760 1859548 1751618 1642300 1529345 1412538 1298448 1200976 1138454 1129286
13405 1129286 1185567 1306895 1479975 1684663 1899816 2104043 2274565 2389467 2432681 2396508
13395 2396508 2279528 2083086 1810335 1467754 1065846 616860 131873 -378457 -899815
13386 -899815 -1411980 -1891704 -2318279 -2677539 -2961494 -3164531 -3281849 -3314220 -3275114 -3192159
13376 -3192159 -3098845 -3019952 -2960125 -2904280 -2829435 -2718376 -2565828 -2376253 -2159187 -1926541
13366 -1926541 -1690565 -1459503 -1232004 -994989 -728455 -415608 -52188 349982 765467
13357 765467 1162076 1511403 1800364 2037078 2245076 2447351 2651321 2846668 3016531 3150313
13347 3150313 3246496 3303979 3311274 3245400 3083568 2819026 2469151 2070682 1666873 1295712
13337 1295712 983839 743463 570195 445493 345852 253493 161182 70454 -11471 -73075
13327 -73075 -101241 -87217 -31645 55668 159572 262311 343498 380098 350251 240845 53316
13316 53316 -197509 -490541 -806293 -1131368 -1456865 -1771409 -2055636 -2284649 -2435945 -2494623
13306 -2494623 -2452251 -2303787 -2047943 -1690837 -1250156 -758020 -260509 188089 535250 741186
13296 741186 788456 688677 483746 237983 20710 -114758 -146637 -87898 23760 143377
13286 143377 234891 280009 278985 246722 207691 189697 215804 297348 431953 606411 801536
13275 801536 997206 1176444 1327691 1445394 1529326 1582940 1610649 1613740 1587057 1520222 1403265
13264 1403265 1232403 1013721 765503 518423 310975 180004 150583 229769 405448 648829
13254 648829 919304 1171180 1361547 1458153 1446216 1331945 1139087 898413 636133 368406
13244 368406 102978 -157417 -414441 -674223 -943800 -1224652 -1507963 -1774983 -2002384 -2170341
13234 -2170341 -2269877 -2305891 -2294556 -2257756 -2218334 -2197403 -2212053 -2271785 -2374169 -2501952 -2624942
13223 -2624942 -2708249 -2724173 -2662308 -2533092 -2363582 -2188846 -2044573 -1963050 -1969582 -2076720
13213 -2076720 -2278232 -2546438 -2834594 -3085001 -3243165 -3273457 -3167931 -2945164 -2642813 -2308298
13203 -2308298 -1989524 -1726443 -1544211 -1448959 -1427526 -1452773 -1494800 -1533520 -1564396 -1593815 -1628950
13192 -1628950 -1669298 -1703780 -1713728 -1680561 -1595717 -1468287 -1325344 -1202894 -1130950 -1121445 -1166754
13181 -1166754 -1248405 -1347308 -1448878 -1543987 -1628540 -1702104 -1765857 -1820117 -1860970 -1877307 -1851895
13170 -1851895 -1767908 -1617973 -1410200 -1166527 -913486 -672016 -453512 -262502 -100977 29479
13160 29479 127721 193732 228699 233548 206695 143589 40251 -99914 -260692 -413867 -526105
13149 -526105 -567827 -521626 -389358 -194679 21774 212779 336976 371293 319032 207307
13139 207307 73339 -51945 -152213 -222010 -256948 -246810 -175167 -23913 219004 550889
13129 550889 950032 1380272 1802584 2187367 2520352 2798834 3022838 3189966 3297714 3349115
13119 3349115 3355152 3330998 3289240 3235421 3168171 3083123 2978126 2856366 2725130 2591620 2459537
13108 2459537 2328905 2198145 2066272 1934671 1808055 1693321 1597158 1525427 1484907 1483603
13098 1483603 1526797 1612096 1729558 1867291 2016342 2169310 2314686 2434324 2507304 2515794
13088 2515794 2448363 2301719 2082440 1807197 1499453 1183368 877566 591641 326764 79198
13078 79198 -155725 -379555 -586817 -763934 -892637 -955586 -941218 -846772 -679629 -456799
13068 -456799 -201328 65106 330306 594279 863986 1143959 1428775 1700800 1932817 2094126
13058 2094126 2159644 2120603 1991863 1811000 1628908 1495823 1448330 1502123 1651857 1876555
13048 1876555 2147713 2436702 2719646 2980934 3215373 3425860 3616139 3783898 3919162
13039 3919162 4009246 4047980 4042552 4011562 3976308 3952267 3943814 3941701 3923937 3860514 3720564 3480112
13027 3480112 3128883 2674070 2138889 1557124 967578 409781 -80623 -476947 -764980
13018 -764980 -943118 -1019436 -1008108 -927435 -798430 -640537 -465026 -272192 -56012 187285
13008 187285 452334 721875 969409 1168122 1302841 1376865 1408445 1420422 1430887 1448699
12998 1448699 1472915 1495556 1507928 1508062 1504286 1511104 1538850 1584581 1631000 1652762 1624954 1531406
12986 1531406 1373081 1173003 970749 805715 700051 654437 656829 692650 749505 819605
12976 819605 902630 1006325 1142964 1323367 1551049 1818236 2105463 2385949 2633440 2829492
12966 2829492 2967127 3050363 3090400 3099384 3084879 3049354 2994850 2926534 2850008 2765067 2663982
12955 2663982 2538716 2391933 2241436 2113125 2027695 1990095 1987177 1993886 1985158 1948189 1888499
12944 1888499 1825954 1783985 1779961 1821298 1905755 2023211 2157569 2288286 2392931 2452830 2459776
12933 2459776 2419206 2348438 2271357 2210851 2181662 2187411 2222152 2272736 2320758 2346974 2338464 2294122
12921 2294122 2224813 2147323 2073909 2002908 1916649 1787765 1589018 1301740 921525 460730
12911 460730 -52873 -580125 -1075573 -1493743 -1796543 -1960794 -1984181 -1886603 -1704563 -1480959
12901 -1480959 -1255419 -1058818 -912346 -827756 -805184 -829811 -873115 -901873 -890658 -829347 -721438
12890 -721438 -576632 -404310 -212630 -12557 179524 345419 471747 553383 592759 598559
12880 598559 585110 569969 568596 589198 631469 690355 761804 845530 943441 1057966 1194124
12869 1194124 1362255 1575194 1839511 2147209 2474127 2786154 3048830 3234911 3328126 3324323
12859 3324323 3230638 3062745 2841933 2594238 2350237 2140676 1986405 1887840 1821943 1750670
12849 1750670 1637752 1465026 1238420 979563 709083 434226 150181 -147482 -451818
12840 -451818 -744990 -1008328 -1232113 -1417826 -1572649 -1700614 -1796551 -1847018 -1836702 -1755148
12830 -1755148 -1601298 -1386232 -1132621 -868298 -616251 -388498 -189170 -23464 96552
12821 96552 155770 146803 77415 -32271 -159055 -284890 -400431 -502914 -589642 -652902 -682406
12810 -682406 -674115 -637193 -591828 -559583 -555374 -587362 -661219 -781635 -950094 -1162445 -1408038
12799 -1408038 -1670101 -1927165 -2156012 -2336707 -2458331 -2521467 -2535054 -2510850 -2461022 -2400522
12789 -2400522 -2350609 -2337622 -2384137 -2496643 -2658962 -2837678 -2996302 -3108213 -3161306 -3155499
12779 -3155499 -3099553 -3011250 -2918091 -2852984 -2845069 -2910864 -3049110 -3239861 -3448917 -3637798 -3774580
12768 -3774580 -3839542 -3825472 -3736763 -3588413 -3402949 -3205270 -3017744 -2856947 -2732068 -2645101
12758 -2645101 -2592369 -2565727 -2553094 -2540416 -2515506 -2470310 -2400217 -2304436 -2189327 -2070128 -1966859
12747 -1966859 -1896496 -1867738 -1881706 -1935626 -2024954 -2143329 -2281727 -2428116 -2568627 -2690119
12737 -2690119 -2781374 -2830932 -2825142 -2752326 -2611359 -2416220 -2191437 -1962059 -1745478 -1548974
12727 -1548974 -1371974 -1211033 -1065420 -939944 -842191 -776032 -737994 -719673 -711627 -705081 -694008
12716 -694008 -679333 -672013 -691936 -762178 -898597 -1097798 -1331929 -1556870 -1729830 -1825851 -1846171
12705 -1846171 -1818185 -1788050 -1804783 -1899122 -2069037 -2281507 -2487350 -2638676 -2701805 -2663832
12695 -2663832 -2531939 -2326117 -2069817 -1783925 -1485011 -1185891 -897452 -631435 -401719
12686 -401719 -220707 -92249 -8037 48349 93950 142041 201243 274117 354360 426504 470138
12675 470138 466468 404793 288029 134981 -22980 -150165 -216790 -207192 -121656 28445 227886
12664 227886 463114 724004 1001211 1282015 1549608 1786500 1977426 2109955 2175891 2174082
12654 2174082 2110241 1992280 1826400 1619102 1383014 1139484 914220 729226 596698 517602
12644 517602 484634 488071 522326 590121 700484 859767 1061858 1285999 1502986 1682949
12634 1682949 1800448 1838106 1789374 1657789 1451609 1177618 839444 441627 -4568 -478664
12624 -478664 -953692 -1401801 -1799154 -2128701 -2380508 -2549738 -2633779 -2630497 -2539020 -2363266
12614 -2363266 -2115520 -1815835 -1487458 -1152587 -830788 -538744 -289489 -90509 58605
12605 58605 166510 245371 302071 332340 324873 273749 189180 98318 35153 24687 70696 155832
12593 155832 254504 348808 436292 526437 630809 753787 888726 1021449 1138322 1232235
12583 1232235 1302348 1350418 1378795 1391115 1392356 1385743 1369813 1341272 1302434 1265594 1248905 1265727
12571 1265727 1315572 1383728 1448632 1489967 1493082 1449908 1357695 1216830 1029780 801984 542718
12560 542718 264021 -22145 -307236 -587100 -857917 -1109775 -1325796 -1490002 -1597674 -1659634
12550 -1659634 -1697577 -1732888 -1774734 -1815849 -1840825 -1841085 -1823854 -1808259 -1813409 -1848299 -1909126 -1983025
12538 -1983025 -2054226 -2109087 -2137775 -2131924 -2080673 -1970615 -1793027 -1553759 -1277160 -1000023
12528 -1000023 -757998 -570329 -430942 -312079 -179055 -7703 204348 437271 657679
12519 657679 830713 931404 952830 907828 822354 723840 630793 547220 462452 357136 214807
12508 214807 33718 -168872 -363438 -522983 -637533 -718204 -787984 -867354 -964778 -1075413
12498 -1075413 -1186252 -1285850 -1374955 -1470434 -1597323 -1772963 -1994349 -2237991 -2472346 -2673622
12488 -2673622 -2834322 -2960083 -3059129 -3133028 -3173938 -3166931 -3094494 -2941903 -2701953 -2377657
12478 -2377657 -1982912 -1540651 -1077896 -619788 -185253 215701 583714 930257 1274992
12469 1274992 1637908 2025930 2421275 2783446 3068290 3251741 3340852 3366921 3369924 3384861
12459 3384861 3433588 3521826 3640130 3767162 3875449 3940335 3948445 3900303 3807004 3684887 3550881
12448 3550881 3419382 3300305 3197346 3108020 3028270 2958724 2904835 2869984 2851171 2844385 2853682
12437 2853682 2892772 2975881 3104734 3261584 3413952 3528544 3585126 3581589 3529067 3443710 3341985
12426 3341985 3240460 3156341 3105767 3100236 3143354 3229788 3347718 3484771 3633794 3793141
12416 3793141 3960541 4126425 4273893 4386265 4455289 4482081 4471300 4426691 4352843 4259236
12406 4259236 4160546 4072181 4004254 3957572 3924505 3895935 3870229 3855950 3864412 3898711 3950075
12395 3950075 4005643 4060586 4122226 4200839 4296134 4393602 4473973 4525738 4549910 4555068 4548714 4532894
12383 4532894 4507422 4476594 4452153 4449412 4479239 4540533 4617012 4680728 4701390 4655856 4532216
12372 4532216 4329250 4056033 3733569 3395169 3081216 2827973 2655576 2561877 2524833 2512014
12362 2512014 2493374 2451370 2382587 2291443 2184264 2069471 1959916 1870414 1810391 1777599 1758025
12351 1758025 1731989 1680918 1589640 1446075 1243533 985308 687316 376676 86206 -154487
12341 -154487 -328395 -436024 -492838 -520436 -536107 -546346 -547657 -533280 -499904 -449100 -383339
12330 -383339 -299945 -186932 -25053 202126 495227 832925 1178310 1493168 1749898 1935809
12320 1935809 2052666 2115352 2148319 2176928 2216581 2266920 2315379 2346920 2352408 2331315 2290512
12309 2290512 2241973 2198983 2170018 2152307 2129661 2078595 1981695 1839961 1674373 1515259 1387133
12298 1387133 1297610 1234296 1169982 1073852 923329 710406 440346 126481 -214241 -564346
12288 -564346 -908530 -1235383 -1537498 -1810553 -2051865 -2257691 -2419087 -2519289 -2537229 -2457562
12278 -2457562 -2281026 -2027773 -1731434 -1427370 -1141316 -884350 -655726 -449012 -255419
12269 -255419 -64551 132566 338334 546555 744751 917528 1049555 1129363 1153853 1130396
12259 1130396 1073748 999883 921620 847658 783339 731948 696309 679424 683194 706837 748277
12248 748277 808536 893189 1005534 1135827 1257522 1335837 1342291 1264600 1108722 897107 664046
12237 664046 445324 265740 134126 48764 5701 3065 41535 122903 247242 409658 598481
12226 598481 795462 978189 1126054 1228893 1292519 1336161 1383865 1456950 1571607 1739230
12216 1739230 1964728 2241461 2546351 2841121 3081980 3232586 3272609 3199314 3024694 2771881
12206 2771881 2472249 2161523 1872870 1629255 1440495 1307346 1228997 1207948 1248944 1353844
12196 1353844 1517798 1729987 1975974 2236968 2486829 2692627 2821946 2853548 2784874 2632027
12186 2632027 2422670 2186284 1947001 1721530 1520492 1350498 1216424 1123754 1079308 1088650
12176 1088650 1151733 1260702 1401053 1553714 1696636 1807635 1870119 1879292 1844702 1788517
12166 1788517 1742000 1740036 1811954 1971179 2210058 2502510 2811666 3098529 3329307 3480028
12156 3480028 3538527 3504587 3388500 3208747 2991209 2770350 2587291 2480070 2470355 2555690
12146 2555690 2711295 2899584 3083465 3239008 3363318 3473359 3593960 3741546 3915834
12137 3915834 4104948 4296796 4486301 4674759 4863580 5047078 5209721 5331210 5396702 5404385
12127 5404385 5364296 5290752 5195914 5088432 4974814 4859726 4744752 4627670 4503517 4367542
12117 4367542 4219653 4067892 3926540 3807817 3712683 3628072 3532580 3407057 3244706 3056381
12107 3056381 2869371 2720537 2645881 2669733 2796947 3011266 3281207 3570931 3851305 4107591
12097 4107591 4340785 4560259 4771522 4968735 5136895 5258475 5318296 5306640 5222657 5076944
12087 5076944 4890294 4687808 4492495 4323621 4199464 4138984 4159194 4270505 4472372 4750177
12077 4750177 5076227 5416625 5739682 6019127 6230905 6349378 6348226 6205940 5912884 5476959
12067 5476959 4924785 4296928 3638889 2991411 2383739 1832647 1347344 935485 603364
12058 603364 348964 156056 -2106 -151200 -305439 -464253 -614973 -738364 -814678 -827738
12048 -827738 -767079 -631895 -436939 -212153 9239 205478 370311 504563 605754 665230
12038 665230 673042 625246 528655 400957 266703 150940 72988 42956 61914 124773 223600
12027 223600 348207 483488 607615 694780 721655 674662 554671 375933 159654 -72686
12017 -72686 -301976 -511321 -687480 -824700 -926683 -1003879 -1067764 -1125415 -1176212 -1211063 -1214882
12006 -1214882 -1172341 -1073346 -914172 -694890 -417309 -86826 282217 662767 1018250 1312048
11996 1312048 1517356 1623009 1634339 1569533 1452705 1307531 1154808 1011698 889196 789545
11986 789545 707084 632271 556311 475311 393115 320372 269150 248392 265126 328233 447790
11975 447790 628501 862353 1126908 1392125 1632249 1834367 1997791 2127272 2227937 2305171
11965 2305171 2366240 2420251 2476628 2543859 2628833 2735402 2861721 2998988 3133883 3252608
11955 3252608 3343391 3397460 3409869 3380061 3311837 3213193 3095398 2969306 2840742 2710524
11945 2710524 2579307 2450266 2325799 2202522 2070634 1918676 1739322 1531443 1298867
11936 1298867 1050077 800047 569524 378618 239411 154654 122154 137424 191094 266085
11926 266085 340310 392910 408043 374859 287645 148813 -27774 -217113 -388259 -512800
11916 -512800 -573161 -567628 -510915 -430212 -358033 -324530 -350845 -443346 -589745 -760034 -914427
11905 -914427 -1016606 -1046705 -1006705 -914762 -793196 -658715 -518415 -369539 -201099 1352
11895 1352 247037 531815 837491 1139781 1419172 1667682 1888123 2087813 2272962 2447667
11885 2447667 2614073 2768625 2896796 2975192 2985570 2931922 2845181 2769086 2736429 2753203 2801465
11874 2801465 2855620 2897726 2922725 2934001 2933524 2912391 2848824 2716593 2499201 2201419 1851507
11863 1851507 1492484 1166790 902622 709219 582506 515244 502664 539896 616356 714553
11853 714553 815890 909754 998648 1094175 1205766 1330845 1454171 1556827 1627980 1669569
11843 1669569 1689173 1688266 1658843 1593592 1500579 1406907 1345980 1340264 1394233 1498725 1637970
11832 1637970 1794024 1950224 2095450 2227570 2353573 2485845 2636465 2812637 3014986
11823 3014986 3238195 3472065 3701768 3908568 4072854 4178973 4219486 4197111 4123272 4013652
11813 4013652 3883471 3745675 3612094 3494184 3402841 3350173 3351299 3419669 3556762 3746405
11803 3746405 3960352 4170063 4354791 4502521 4607693 4669279 4689280 4671625 4622155 4549134
11793 4549134 4463701 4380914 4319613 4297691 4324519 4397497 4506043 4638197 4783338 4931172
11783 4931172 5071029 5192238 5284153 5336419 5341072 5296033 5207122 5087368 4955477 4833248
11773 4833248 4739294 4681223 4653114 4641213 4633194 4623553 4611582 4594792 4564475 4507359 4411180 4269439
11761 4269439 4082964 3859578 3613159 3361059 3119758 2902569 2722186 2594527 2537637 2564975
11751 2564975 2678762 2868632 3114787 3392268 3676011 3947591 4200401 4438117 4666783
11742 4666783 4886781 5090085 5262501 5387639 5450933 5443566 5365814 5228252 5048939 4846792
11732 4846792 4634378 4414643 4184104 3940536 3690224 3450860 3249062 3113693 3066915 3114978
11722 3114978 3242591 3415495 3591974 3738377 3840845 3906603 3953803 3997392 4041024 4078391
11712 4078391 4100285 4102074 4087253 4064594 4041124 4016911 3985274 3936289 3860143 3750975 3612606
11701 3612606 3462205 3326450 3232208 3199480 3239795 3356931 3547919 3804340 4112030 4448551
11691 4448551 4782847 5081455 5318615 5482555 5573533 5596619 5556235 5456962 5307991 5123264
11681 5123264 4913959 4680814 4416155 4115234 3786950 3455995 3155436 2913289 2740773
11672 2740773 2630767 2566118 2528275 2499587 2462889 2404420 2318985 2211973 2096982 1991945
11662 1991945 1915251 1881215 1896074 1957544 2058691 2192867 2355776 2542789 2742543 2931490
11652 2931490 3075512 3140094 3104280 2971381 2770658 2548401 2352911 2220982 2171924 2211308
11642 2211308 2339641 2555695 2850585 3201779 3577797 3950400 4301544 4619491 4890841
11633 4890841 5097843 5223755 5260905 5213718 5095020 4920846 4707248 4467775 4211040 3940102
11623 3940102 3654330 3353158 3041387 2733766 2454435 2229441 2076072 1995309 1972083 1983325
11613 1983325 2008738 2038384 2074026 2124890 2201339 2309783 2449902 2613831 2787782 2957036
11603 2957036 3113053 3258581 3406354 3571549 3763341 3980102 4208759 4428315 4618149
11594 4618149 4768143 4883512 4979790 5072199 5168569 5270322 5377314 5488644 5597003 5684074
11584 5684074 5726242 5709372 5640375 5544513 5449787 5370189 5298272 5209805 5077141 4884472 4637484
11573 4637484 4362936 4098500 3878005 3719547 3621673 3567766 3534930 3504103 3468878 3439146
11563 3439146 3435453 3475324 3560883 3677203 3800906 3910816 3994203 4046512 4066021 4048858 3990126
11552 3990126 3889610 3754773 3598373 3435924 3288089 3184003 3155535 3220884 3370021 3565308
11542 3565308 3757601 3907035 3996356 4030894 4028317 4006600 3977312 3945786 3915016 3889287 3875686
11531 3875686 3884156 3926226 4010909 4137995 4292697 4446363 4565176 4624243 4618927 4564229 4481816
11520 4481816 4385351 4275539 4146189 3993058 3817554 3624503 3418975 3207007 2999346 2813416
11510 2813416 2670769 2590395 2580061 2630850 2719673 2818347 2902973 2958576 2978797 2964065 2920701
11499 2920701 2859859 2794526 2735252 2686615 2645462 2601267 2539048 2444490 2309645 2137265 1941578
11488 1941578 1743775 1563730 1413461 1296200 1208708 1143029 1088150 1034859 983420 948776
11478 948776 957806 1037664 1200970 1437742 1719306 2009407 2274095 2486931 2630696 2697173
11468 2697173 2686521 2607172 2475295 2312977 2145835 2000065 1897636 1850129 1855358 1901020
11458 1901020 1973581 2065711 2177447 2311267 2465142 2628009 2779899 2896181 2954758 2944735
11448 2944735 2873363 2766603 2660740 2587929 2563807 2584949 2636536 2701638 2762878 2797070 2773162
11437 2773162 2660251 2439963 2114076 1705213 1252499 803365 404347 94403 -98697
11428 -98697 -160422 -90695 95282 366816 680143 986128 1242372 1424738 1533417 1592296
11418 1592296 1642203 1727573 1878980 2100887 2374165 2671775 2974458 3274530 3568816 3850970
11408 3850970 4109766 4331843 4505398 4624103 4690857 4718318 4723765 4720742 4712702 4691994 4643946
11397 4643946 4553851 4414785 4233972 4035134 3854486 3730085 3688701 3737227 3862475 4036934
11387 4036934 4226039 4394681 4511910 4553352 4503316 4359257 4135961 3862648 3572063 3289939
11377 3289939 3031234 2801152 2597759 2416093 2251851 2101198 1957832 1812866 1659835
11368 1659835 1499382 1337700 1181417 1036574 911524 816703 759600 740776 755468 798180
11358 798180 864911 950936 1046344 1133657 1191461 1203770 1168764 1098849 1010483 912374 802655
11347 802655 676114 532509 377698 218157 55761 -111695 -284702 -456267 -611180 -730186
11337 -730186 -795792 -797497 -736096 -625226 -486230 -336079 -175966 10201 245445 544093
11327 544093 901027 1291539 1679439 2027578 2307263 2504826 2623274 2677950 2687655 2665700
11317 2665700 2616591 2540297 2439910 2326543 2218594 2137061 2100693 2123245 2212054 2366347
11307 2366347 2575773 2821058 3077860 3322966 3539765 3719898 3861627 3967781 4044128 4096956
11297 4096956 4129778 4141719 4129028 4087657 4014515 3907974 3769659 3607881 3440115 3289896
11287 3289896 3176809 3106307 3067872 3042399 3012165 2966536 2901763 2818019 2717484 2605681 2495213
11276 2495213 2407052 2364545 2381249 2451103 2549431 2644779 2712979 2743942 2738724 2702746 2642641
11265 2642641 2567753 2491469 2428347 2387860 2368886 2358425 2336128 2283708 2193816 2071773 1929671
11254 1929671 1778731 1626024 1475540 1328718 1182612 1030277 867176 700119 550268
11245 550268 444771 402037 422935 493383 591557 692266 769549 802518 784616 729384 665958
11234 665958 626019 631313 688346 789495 917999 1055739 1190501 1317810 1437033 1547432
11224 1547432 1648671 1743750 1838937 1939010 2041903 2138124 2215896 2267872 2294518 2303257 2304832
11213 2304832 2307111 2307665 2290483 2231594 2111338 1924945 1685661 1421475 1168552 962840 831061
11202 831061 783493 810913 886425 971944 1029301 1033740 982679 891342 776085 639744 472471
11191 472471 264622 16574 -261862 -555760 -845765 -1106561 -1308652 -1426266 -1448161 -1384025
11181 -1384025 -1261666 -1116934 -982056 -877464 -809114 -769978 -743392 -707646 -641172 -525423
11171 -525423 -344484 -86243 250403 646185 1059182 1433337 1712588 1853498 1833183 1652906
11161 1652906 1337390 928341 474020 21033 -388919 -721550 -955362 -1087007 -1130998 -1111354
11151 -1111354 -1049257 -955670 -834565 -693699 -553805 -447737 -408424 -453375 -575187 -741919
11141 -741919 -905720 -1015592 -1030627 -931338 -725908 -447327 -141234 149971 399212 597938
11131 597938 750787 868158 963670 1055427 1164840 1311601 1508910 1760537 2058315 2381172
11121 2381172 2699165 2982960 3213727 3387011 3508541 3586052 3623244 3618467 3566826 3464145
11111 3464145 3311249 3116025 2892460 2657829 2428161 2212602 2010976 1818624 1636196
11102 1636196 1475954 1357783 1296779 1291488 1321558 1356772 1371100 1352508 1303945 1237270 1164285
11091 1164285 1089386 1008242 913707 804017 685873 570611 468402 384573 317823 260173
11081 260173 199765 125460 30732 -84188 -212096 -340314 -453327 -537351 -586801 -607829 -614065
11070 -614065 -617003 -618599 -610893 -582038 -523400 -432038 -308973 -159086 5987 168223 310319
11059 310319 423890 511544 582319 645323 706463 769632 838494 913851 987856 1042207 1054355
11048 1054355 1007638 899375 744169 570566 409930 282580 191119 125798 75372 32754
11038 32754 -6845 -48143 -92958 -135668 -163205 -161219 -122076 -48550 49642 163665 291657
11027 291657 437873 604626 784379 961058 1120672 1261206 1392731 1528963 1678055 1838090
11017 1838090 1997283 2137259 2239213 2292678 2303034 2291425 2285577 2308411 2371542 2473772 2600650
11006 2600650 2725048 2812985 2835558 2780798 2658151 2492889 2313349 2138565 1974545 1820668
10996 1820668 1678029 1550997 1443292 1356403 1292486 1257015 1257471 1299112 1380963 1494206 1624189
10985 1624189 1756607 1884501 2009074 2132338 2249616 2350396 2425104 2468567 2476583 2441141
10975 2441141 2350870 2197049 1979742 1708866 1399647 1066379 719594 368812 27789 -283456
10965 -283456 -542001 -726395 -818035 -803075 -679179 -462326 -184284 119679 421913 703545
10955 703545 949466 1146571 1288030 1378013 1430623 1462846 1487378 1511249 1539964 1580543 1638722
10944 1638722 1713796 1797592 1878999 1949763 2006790 2050153 2080691 2100359 2113479 2124810 2134687
10933 2134687 2136432 2119704 2077244 2008695 1917577 1804599 1664941 1492261 1284215 1044475
10923 1044475 781068 502330 212785 -86593 -391838 -688276 -949951 -1147951 -1260861
10914 -1260861 -1281021 -1215630 -1083654 -909551 -716616 -523604 -345115 -192828 -75904 -1536
10904 -1536 24595 475 -66726 -155276 -229312 -248076 -181282 -23043 203887 456284 685727
$$ [...]
##END NTUPLES=NMR SPECTRUM
##END=
