##TITLE=31P ikalashn
DE-76 rm_1h(nlock)
12.11.2024
##JCAMPDX= 6.0         $$ Bruker NMR JCAMP-DX V2.0
##DATA TYPE= NMR SPECTRUM
##DATA CLASS= NTUPLES
##ORIGIN= UXNMR, Bruker Analytische Messtechnik GmbH
##OWNER= root
$$ TOPSPIN		Version 1.3
$$ 2024-11-12 15:12:49.234 +0400  Irina@DPX200
$$ Compression mode = diff/dup
##.OBSERVE FREQUENCY= 81.01967998063
##.OBSERVE NUCLEUS= ^31P
##.ACQUISITION MODE= SIMULTANEOUS
##.ACQUISITION SCHEME= undefined
##.AVERAGES= 64
##.DIGITISER RES= 17
##SPECTROMETER/DATA SYSTEM= spect
##.PULSE SEQUENCE= zgpg
##.SOLVENT NAME= D2O
##.SHIFT REFERENCE= INTERNAL, D2O, 1, 298.5841
##AUDIT TRAIL= $$ (NUMBER, WHEN, WHO, WHERE, WHAT)
$$ ##TITLE= Audit trail, TOPSPIN		Version 1.3
$$ ##JCAMPDX= 5.01
$$ ##ORIGIN= Bruker BioSpin GmbH
$$ ##OWNER= Irina
$$ $$ F:/spectra/data/iren/nmr/P31dec/1/pdata/1/auditp.txt
$$ ##AUDIT TRAIL=  $$ (NUMBER, WHEN, WHO, WHERE, VERSION, WHAT)
(   1,<2024-11-12 15:10:46.109 +0400>,<Irina>,<DPX200>,<TOPSPIN 1.3>,
      <acquisition in progress>)
(   2,<2024-11-12 15:12:28.359 +0400>,<Irina>,<DPX200>,<TOPSPIN 1.3>,
      <Start of raw data processing
       efp BC_mod = 2 LB = 15 FT_mod = 6 PKNL = 1 PHC0 = 9.529949 PHC1 = 359.2318 SI = 32K 
       data hash MD5: 32K
       7B E3 96 B3 CE C8 13 82 7C 18 26 DC 5A B4 4E EE>)
(   3,<2024-11-12 15:12:30.546 +0400>,<Irina>,<DPX200>,<TOPSPIN 1.3>,
      <apk 
       data hash MD5: 32K
       72 D4 C9 C1 11 6E 1A BF 2A 2D 98 68 3F B9 12 8D>)
(   4,<2024-11-12 15:12:32.875 +0400>,<Irina>,<DPX200>,<TOPSPIN 1.3>,
      <abs n ABSG = 5 
       data hash MD5: 32K
       57 9B 2D C9 00 31 32 39 4F AE 4A 25 98 B6 5E 8A>)
$$ ##END=
$$ 
$$ $$ hash MD5
$$ $$ F1 AE D3 28 E1 0B 55 C2 59 48 F3 E6 31 37 30 7A
##$RELAX= 
##$RELAX= 
##$RELAX= 
##$RELAX= 
##$RELAX= 
##$RELAX= 
##$RELAX= 
##$RELAX= 
##$RELAX= 
##$RELAX= 
##$RELAX= 
$$ Bruker specific parameters
$$ --------------------------
##$DU= <F:/spectra>
##$EXPNO= 1
##$NAME= <P31dec>
##$PROCNO= 1
##$TYPE= <nmr>
##$USER= <iren>
##$AMP= (0..31)
100 100 100 100 100 100 100 100 100 100 100 100 100 100 100 100 100 100 
100 100 100 100 100 100 100 100 100 100 100 100 100 100 
##$ANAVPT= -1
##$AQSEQ= 0
##$AQ_mod= 1
##$AUNM= <au_zg>
##$AUTOPOS= <>
##$BF1= 81.014009
##$BF2= 200.13
##$BF3= 200.13
##$BF4= 200.13
##$BF5= 200.13
##$BF6= 200.13
##$BF7= 200.13
##$BF8= 200.13
##$BYTORDA= 1
##$CFDGTYP= 0
##$CFRGTYP= 5
##$CHEMSTR= <none>
##$CNST= (0..63)
1 1 145 1 1 1 1 1 1 1 1 1 1 1 1 1 1 1 1 1 1 1 1 1 1 1 1 1 1 1 1 1 1 1 
1 1 1 1 1 1 1 1 1 1 1 1 1 1 1 1 1 1 1 1 1 1 1 1 1 1 1 1 1 1 
##$CPDPRG= <waltz16>
##$CPDPRG1= <>
##$CPDPRG2= <waltz16>
##$CPDPRG3= <>
##$CPDPRG4= <mlev>
##$CPDPRG5= <mlev>
##$CPDPRG6= <mlev>
##$CPDPRG7= <mlev>
##$CPDPRG8= <mlev>
##$CPDPRGB= <>
##$CPDPRGT= <>
##$D= (0..63)
0 1 0 0 0 0 0 0 0 0.06 0 0.03 2e-005 3e-006 0 0 0.0002 0 0 0 0 0 0 0 0 
0 0 0 0 0 0 0 0 0 0 0 0 0 0 0 0 0 0 0 0 0 0 0 0 0 0 0 0 0 0 0 0 0 0 0 
0 0 0 0 
##$DATE= 1731409945
##$DBL= (0..7)
120 120 120 11 120 120 24 19 
##$DBP= (0..7)
$$ [...]
##$SW_h= 37037.037037037
##$TD= 32768
##$TD0= 1
##$TE= 300
##$TE2= 300
##$TE3= 300
##$TEG= 300
##$TL= (0..7)
0 120 53 12 22 120 120 120 
##$TP= (0..7)
150 150 150 150 150 150 150 150 
##$TP07= 0
##$TPNAME0= <>
##$TPNAME1= <>
##$TPNAME2= <>
##$TPNAME3= <>
##$TPNAME4= <>
##$TPNAME5= <>
##$TPNAME6= <>
##$TPNAME7= <>
##$TPOAL= (0..7)
0.5 0.5 0.5 0.5 0.5 0.5 0.5 0.5 
##$TPOFFS= (0..7)
0 0 0 0 0 0 0 0 
##$TUNHIN= 0
##$TUNHOUT= 0
##$TUNXOUT= 0
##$USERA1= <user>
##$USERA2= <user>
##$USERA3= <user>
##$USERA4= <user>
##$USERA5= <user>
##$V9= 5
##$VALIST= <valist>
##$VCLIST= <CCCCCCCCCCCCCCC>
##$VD= 0
##$VDLIST= <DDDDDDDDDDDDDDD>
##$VPLIST= <PPPPPPPPPPPPPPP>
##$VTLIST= <TTTTTTTTTTTTTTT>
##$WBST= 1024
##$WBSW= 4
##$XGAIN= (0..3)
0 0 0 0 
##$XL= 0
##$YL= 0
##$YMAX_a= 4461
##$YMIN_a= -11474
##$ZGOPTNS= <>
##$ZL1= 120
##$ZL2= 120
##$ZL3= 120
##$ZL4= 120
##$ABSF1= 298.5841
##$ABSF2= -158.5842
##$ABSG= 5
##$ABSL= 5
##$ALPHA= 0
##$AQORDER= 0
##$ASSFAC= 0
##$ASSFACI= 0
##$ASSFACX= 0
##$ASSWID= 0
##$AUNMP= <proc_1d>
##$AXLEFT= 0
##$AXRIGHT= 0
##$AXTYPE= 0
##$AXUNIT= <>
##$AZFE= 0.1
##$AZFW= 0.5
##$BCFW= 0
##$BC_mod= 2
##$BYTORDP= 0
##$COROFFS= 0
##$CY= 12.5935478210449
##$DATMOD= 1
##$DC= 0
##$DFILT= <>
##$DTYPP= 0
##$F1P= 47.1127640792319
##$F2P= -24.0371245302204
##$FCOR= 0.5
##$FTSIZE= 32768
##$FT_mod= 6
##$GAMMA= 0
##$GB= 0
##$INTBC= 1
##$INTSCL= 7.269226e-011
##$ISEN= 30
##$LB= 15
##$LEV0= 0
##$LPBIN= 0
##$MAXI= 12.09355
##$MC2= 0
##$MEAN= 0
##$ME_mod= 0
##$MI= 0.7550151
##$NCOEF= 0
##$NC_proc= -11
##$NLEV= 6
##$NOISF1= 298.5841
##$NOISF2= 270.0111
##$NSP= 0
##$NTH_PI= 0
##$NZP= 0
##$OFFSET= 298.5841
##$PC= 1.4
##$PHC0= 49.53664
##$PHC1= 342.8677
##$PH_mod= 1
##$PKNL= yes
##$PPARMOD= 0
##$PPDIAG= 0
##$PPIPTYP= 0
##$PPMPNUM= 100
##$PPRESOL= 1
##$PSCAL= 0
##$PSIGN= 0
##$REVERSE= no
##$SF= 81.014009
##$SI= 32768
##$SIGF1= 270.0111
##$SIGF2= -158.5842
##$SINO= 77.54984
##$SIOLD= 32768
##$SREGLST= <31P.CDCl3>
##$SSB= 0
##$STSI= 32768
##$STSR= 0
##$SW_p= 37037.037037037
##$SYMM= 0
##$S_DEV= 0
##$TDeff= 32768
##$TDoff= 0
##$TI= <>
##$TILT= no
##$TM1= 0
##$TM2= 0
##$TOPLEV= 0
##$USERP1= <user>
##$USERP2= <user>
##$USERP3= <user>
##$USERP4= <user>
##$USERP5= <user>
##$WDW= 1
##$XDIM= 32768
##$YMAX_p= 290645865
##$YMIN_p= -9607266
$$ End of Bruker specific parameters
$$ ---------------------------------
##NTUPLES= NMR SPECTRUM
##VAR_NAME=  FREQUENCY,     SPECTRUM/REAL,   SPECTRUM/IMAG
##SYMBOL=    X,             R,               I
##VAR_TYPE=  INDEPENDENT,   DEPENDENT,       DEPENDENT
##VAR_FORM=  AFFN,          ASDF,            ASDF
##VAR_DIM=   32768,         32768,           32768
##UNITS=     HZ,            ARBITRARY UNITS, ARBITRARY UNITS
##FACTOR=    1.13031516577767, 1,            1
##FIRST=     37037.037037037, -3608737,      -2916643
##LAST=      0,             1015985,         -1014907
##MIN=       0,             -9607266,        0
##MAX=       37037.037037037, 290645865,     0
$$ Real data points
##PAGE= N=1
##DATA TABLE= (X++(R..R)), XYDATA
$$ [...]
18707D30792j01968o1285q612L8827O8645P6477O4841M0354J0105k1079n0585
$$ 430792 328824 267539 258927 297754 366399 442876 507717 548071 558176 537097 486512
18696D86512p6748r8543j15745j28083j34152j31273j15767q3041k9047M6167
$$ 486512 409764 311221 195476 67393 -66759 -198032 -313799 -396840 -425887 -379720
18686c79720J36150K29716L15042L82660M24963M34433M04733L33706K24756Q7219
$$ -379720 -243570 -13854 301188 683848 1108811 1543244 1947977 2281683 2506439 2593658
18676B593658o3530k09315l35231m33228n01357n41976n59400n55656n28389m74568
$$ 2593658 2530128 2320813 1985582 1552354 1050997 509021 -50379 -606035 -1134424 -1608992
18666a608992l95708k98165j88947p3376M2298J48258K34333K96486L38470L66189
$$ -1608992 -2004700 -2302865 -2491812 -2565188 -2522890 -2374632 -2140299 -1843813 -1505343 -1139154
18656a139154L81042L78819L53761L03325K31522J49276P0256M553m3999p5513
$$ -1139154 -758112 -379293 -25532 277793 509315 658591 728847 733400 689401 613888
18646F13888r1582r5473r3006r1048r3952j01569j10062j12231r7520n6167J2491
$$ 613888 522306 426833 333827 242779 148827 47258 -62804 -175035 -272555 -328722 -316231
18635c16231R6196J76191K37862K76025K92249K88753K64529K16892J46815O2364
$$ -316231 -220035 -43844 194018 470043 762292 1051045 1315574 1532466 1679281 1741645
18625A741645k3535r8288j52971j82958j87215j67237j26821p3376j8232K6795
$$ 1741645 1718110 1619822 1466851 1283893 1096678 929441 802620 729244 711012 737807
18615G37807N4510O3922N6833L3449q513o9768j43802k14681k61864k70232k38657
$$ 737807 792317 856239 913072 946521 938008 868240 724438 509757 247893 -22339 -260996
18604b60996j80709j16347o0766j9539P253J8531J0617j8138o2124j09741j50091
$$ -260996 -441705 -558052 -618818 -638357 -631104 -612573 -601956 -620094 -682218 -791959 -942050
18593i42050j77086j88128j81572j56970j17690p2713l5082j6286j9028l4630
$$ -942050 -1119136 -1307264 -1488836 -1645806 -1763496 -1836209 -1871291 -1887577 -1906605 -1941235
18583a941235m9293n3379m4071k1676J2483N4680R8346J35989J60764J67373J54342
$$ -1941235 -1990528 -2043907 -2087978 -2109654 -2097171 -2042491 -1944145 -1808156 -1647392 -1480019 -1325677
18572a325677J25946R0801N8714L7741L0265L0715L0454K7589L1291N4865J03966
$$ -1325677 -1199731 -1108930 -1050216 -1012475 -982210 -951495 -921041 -893452 -862161 -807296 -703330
18561g03330J70930K38930K91789L22083L31900L26908L10498K83418K46946K04448
$$ -703330 -532400 -293470 -1681 320402 652302 979210 1289708 1573126 1820072 2024520
18551B024520J60208J18112Q1999N6181M3353M0757L8718K4112j2550p0894j38762
$$ 2024520 2184728 2302840 2384839 2441020 2484373 2525130 2563848 2587960 2575410 2504516 2365754
18540B365754j94924k16550j90425j21520l0487N9623J35938J97135K45521K79964
$$ 2365754 2170830 1954280 1763855 1642335 1611848 1671471 1807409 2004544 2250065 2530029
18530B530029K95640K88088K56223K02472J32388N5228j7184p5529j17828j47983
$$ 2530029 2825669 3113757 3369980 3572452 3704840 3760068 3742884 3667355 3549527 3401544
18520C401544j68962j78620j72611j49959j14542p2401k9528Q814L9005O0555
$$ 3401544 3232582 3053962 2881351 2731392 2616850 2544449 2514921 2523735 2562740 2623295
18510B623295P6141Q8891R8480J00171Q8297O0217J6945l7347r3525j37286j55468
$$ 2623295 2699436 2788327 2886807 2986978 3075275 3135492 3152437 3115090 3021565 2884279 2728811
18499B728811j43972j09085o2906j9571P146Q224j6829o0894j13166j62929k02398
$$ 2728811 2584839 2475754 2412848 2393277 2400423 2408647 2391818 2330924 2217758 2054829 1852431
18488A852431k27964k39261k37078k22336j97061j65271j31606r9149o8586l8076
$$ 1852431 1624467 1385206 1148128 925792 728731 563460 431854 332705 264119 226043
18478B26043m581L1709O4019Q3160Q6551Q2009Q1778R2863J11809J26752J24881
$$ 226043 221462 253171 317190 400350 486901 568910 650688 743551 855360 982112 1106993
18467A106993J00819O0328J7434j1717j4307J5033P0269J32039J73938J77737
$$ 1106993 1207812 1268140 1285574 1273857 1259550 1274583 1344852 1476891 1650829 1828566
18457A828566J45245R4811M6874J1499j5624m9004j02735j80108k72624l66817
$$ 1828566 1973811 2068622 2115496 2126995 2111371 2062367 1959632 1779524 1506900 1140083
18447A140083m48714n03606n17617m83875m07804l05384j95453r2490m363O5535
$$ 1140083 691369 187763 -329854 -813729 -1221533 -1526917 -1722370 -1814860 -1819223 -1753688
18437a753688J15790J46907J61733J63913J56193J41160J23647J11536J12846
$$ -1753688 -1637898 -1490991 -1329258 -1165345 -1009152 -867992 -744345 -632809 -519963
18428e19963J30760J60356J88848K00222J83659J40678Q4104K8653j8102n6930
$$ -519963 -389203 -228847 -39999 160223 343882 484560 568664 597317 579215 522285
18418E22285r2141j26800j60847j91374k13819k23249k15169j85545j32236n9380
$$ 522285 430144 303344 142497 -48877 -262696 -485945 -701114 -886659 -1018895 -1078275
18408a078275J9654Q6625J27259J36901J20900R2216O6826N7182O7897R5876J31200
$$ -1078275 -1058621 -971996 -844737 -707836 -586936 -494720 -427894 -370712 -302815 -206939 -75739
18397g5739J58330J61689J33990P9820J3558m3953p0309n0869J2437J00660J86172
$$ -75739 82591 244280 378270 458090 471648 427695 357386 306517 318954 419614 605786
18386F05786K43745K59585K35483J84966J22688N5584j5882q8788j52381j93016
$$ 605786 849531 1109116 1344599 1529565 1652253 1707837 1691955 1603167 1450786 1257770
18376A257770k03570j87521j54968j16002p6894m0451q926J4229K6356K8872K7554
$$ 1257770 1054200 866679 711711 595709 518815 478364 469438 483667 510023 538895 566449
18365E66449K9275L7959N2818P0207Q6891J00536J06725R7481O6765J9255k9224
$$ 566449 595724 633683 686501 756708 843599 944135 1050860 1148341 1215106 1234361 1205137
18354A205137o3483q1085r1717j06111j26650j46879j58544j59633j56440j58480
$$ 1205137 1141654 1060569 968852 862741 736091 589212 430668 271035 114595 -43885
18344d3885j71932j97686k33823k77695l24691l65763l88626l83747l50633k98643
$$ -43885 -215817 -413503 -647326 -925021 -1249712 -1615475 -2004101 -2387848 -2738481 -3037124
18334c037124k42058j93912j62001j46804j42078j39674j34516j24204j05918
$$ -3037124 -3279182 -3473094 -3635095 -3781899 -3923977 -4063651 -4198167 -4322371 -4428289
18325d428289p6399l4465J7797P6220J36143J92655K40223K72475K82200K63342
$$ -4428289 -4504688 -4539153 -4521356 -4445136 -4308993 -4116338 -3876115 -3603640 -3321440 -3058098
18315c058098K15919J49272P8845J8904k2623m5007n3265n5927o0958p0108p7243
$$ -3058098 -2842179 -2692907 -2614062 -2595158 -2617781 -2662788 -2716053 -2771980 -2832938 -2903046 -2980289
18304b980289p4527o0660m1724k4631j1870k464M523Q422P760K322o308j7286
$$ -2980289 -3054816 -3115476 -3157200 -3181831 -3193701 -3196165 -3191642 -3183220 -3175460 -3173138 -3179446 -3196732
18292c196732l1672m8578o1798o3405n1473l4395k7328m1129p0435r2267q0645
$$ -3196732 -3228404 -3276982 -3338780 -3402185 -3453658 -3488053 -3515381 -3556510 -3626945 -3719212 -3799857
18281c799857k7410M9868J20589J61591J66870J41980R3777K7659m7012j13132
$$ -3799857 -3827267 -3777399 -3656810 -3495219 -3328349 -3186369 -3092592 -3064933 -3111945 -3225077
18271c225077j50532j45089r3511j990J16361K43136L58086M44760M94854N09131
$$ -3225077 -3375609 -3520698 -3614209 -3616199 -3499838 -3256702 -2898616 -2453856 -1959002 -1449871
18261a449871M95818M66721M31185L91674L45593K91245K31540J73127J23155
$$ -1449871 -954053 -487332 -56147 335527 681120 972365 1203905 1377032 1500187
18252A500187Q6487O5364O0552P0870R1500J14249J29235J26136R7057M2356k6491
$$ 1500187 1586674 1652038 1712590 1783460 1874960 1989209 2118444 2244580 2341637 2383993 2357502
18241B357502r2038j39504j61579j58489j36327j04480p2232m6825l4038l8231
$$ 2357502 2265464 2125960 1964381 1805892 1669565 1565085 1492853 1446028 1411990 1373759
18231A373759n9265q8855j11886j14555r3639n8609k5215o629q529l0063o7864
$$ 1373759 1314494 1225639 1113753 999198 905559 846950 821735 815106 806577 776514 708650
18220G08650j18313j76673k35597k85276l15594l19092k93740k44551j82618j21457
$$ 708650 590337 413664 178067 -107209 -422803 -741895 -1035635 -1280186 -1462804 -1584261
18210a584261p2717m3670l7045n1550q2290j21100j56742j75684j65212j18627
$$ -1584261 -1656978 -1700648 -1737693 -1789243 -1871533 -1992633 -2149375 -2325059 -2490271 -2608898
18200b608898m0103N4137J40807J98783K16697J95706J48062R2396M6150J8341
$$ -2608898 -2649001 -2594864 -2454057 -2255274 -2038577 -1842871 -1694809 -1602413 -1556263 -1537922
18190a537922O918J788r069l3389p0605j11956j44241j55022j38736j01634n9930
$$ -1537922 -1531004 -1529216 -1538285 -1571674 -1642279 -1754235 -1898476 -2053498 -2192234 -2293868 -2353798
18179b353798l0812k4433m2089p7548j18529j49938j59882j45429j14136p9566
$$ -2353798 -2384610 -2409043 -2451132 -2528680 -2647209 -2797147 -2957029 -3102458 -3216594 -3296160
18169c296160n2282l2786j2642J7514O0208J09019J52768J83412K01944K16788
$$ -3296160 -3348442 -3381228 -3393870 -3376356 -3316148 -3207129 -3054361 -2870949 -2669005 -2452217
18159b452217K35573K57387K72865K72403K54085K24273J93196J70596J61985
$$ -2452217 -2216644 -1959257 -1686392 -1413989 -1159904 -935631 -742435 -571839 -409854
18150d09854J65810J74743J81297J81773J75102J60687J39537J16312R7549Q6543
$$ -409854 -244044 -69301 111996 293769 468871 629558 769095 885407 982956 1069499
18140A069499P9889O8688M3635J519n0665r7467j22620j18231q9126m8653j0064
$$ 1069499 1149388 1218076 1261711 1263230 1212565 1115098 992478 874247 785121 736468 726404
18129G26404J8050L0331K3884J008l0253o0388q1953q9100p8241n3305k8007j7876
$$ 726404 744454 774785 798669 799677 769424 709036 627083 537983 459742 406437 378430 360554
18117C60554k8282n0105o5527n8909k6210K2592O9172R5389Q9506N0228j0816
$$ 360554 332272 282167 216640 157731 131521 154113 223285 318674 408180 458408 447592
18106D47592p2125j12438j20588r7647n3330k349L9298O0206N9072M4241K6393
$$ 447592 375467 263029 142441 44794 -8536 -10885 28413 88619 147691 191932 218325
18095B18325J0424o882l2128o8132j10049j47266j69197j70591j52484j18701
$$ 218325 228749 221867 189739 121607 11558 -135708 -304905 -475496 -627980 -746681
18085g46681p2316j6104M5018J03749J52303J84115J96192J92283J82622J77987
$$ -746681 -818997 -835101 -790083 -686334 -534031 -349916 -153724 38559 221181 399168
18075C99168J83424J97559K15715K30484K29951K00378J35446M3355n6348j42742
$$ 399168 582592 780151 995866 1226350 1456301 1656679 1792125 1835480 1779132 1636390
18065A636390k01393k27500k26760k13801k05877k13661k35308k57772k63435
$$ 1636390 1434997 1207497 980737 766936 561059 347398 112090 -145682 -409117
18056d09117k38257j78282r1670M074Q6808J35437J37465R5199K4811n1432j13908
$$ -409117 -647374 -825656 -917326 -913252 -826444 -691007 -553542 -458343 -433532 -484964 -598872
18045e98872j51763j65386j64078j59431j58103j57907j50345j29286r8640p0768
$$ -598872 -750635 -916021 -1080099 -1239530 -1397633 -1555540 -1705885 -1835171 -1933811 -2004579
18035b004579n7316o2165q1472j07855j33835j52026j52663j23323n5664M4768
$$ -2004579 -2061895 -2124060 -2205532 -2313387 -2447222 -2599248 -2751911 -2875234 -2930898 -2886130
18025b886130J56250K50701L08595L27036L16069K88855K55162K20650J87637
$$ -2886130 -2729880 -2479179 -2170584 -1843548 -1527479 -1238624 -983462 -762812 -575175
18016e75175J54822J18811P8397L7208K242j9921k6854k1661j0972j824J05r291
$$ -575175 -420353 -301542 -223145 -185937 -183695 -203616 -230470 -252131 -263103 -264927 -264822 -274113
18004b74113l2624p0078j17299j64164j96896k03056j75758j15019k7856P1441
$$ -274113 -306737 -376815 -494114 -658278 -855174 -1058230 -1233988 -1349007 -1376863 -1305422
17994a305422J62917K26164K45907K14214J31336Q730j28676k47855l21179l38683
$$ -1305422 -1142505 -916341 -670434 -456220 -324884 -316154 -444830 -692685 -1013864 -1352547
17984a352547l09168k51012j82120j15170n7448j2621J8376L8323N4279P4705
$$ -1352547 -1661715 -1912727 -2094847 -2210017 -2267465 -2280086 -2261710 -2223387 -2169108 -2094403
17974b094403J04483J42434J81731K10190K12334J78539J17403N7468L0894N0744
$$ -2094403 -1989920 -1847486 -1665755 -1455565 -1243231 -1064692 -947289 -889821 -858927 -808183
17964h08183J00519J43683J44764Q6226k6787j70474l10633m14610m63455m56653
$$ -808183 -707664 -563981 -419217 -332991 -359778 -530252 -840885 -1255495 -1718950 -2175603
17954b175603m06428l27508k31070j25366j7898Q4814J77556K55370L14167L52939
$$ -2175603 -2582031 -2909539 -3140609 -3265975 -3283873 -3199059 -3021503 -2766133 -2451966 -2099027
17944b099027L72906L74140L55288L17040K64089K03989J45660R7353O2447L5797
$$ -2099027 -1726121 -1351981 -996693 -679653 -415564 -211575 -65915 31438 93885 129682
17934A29682N909l6656r1224j46866j89680k10022k05411j80146j43266j05902
$$ 129682 135591 98935 7711 -139155 -328835 -538857 -744268 -924414 -1067680 -1173582
17924a173582p8380o6979p1931q8441j08803j24102j26647j12279q0146l1770
$$ -1173582 -1251962 -1318941 -1390872 -1479313 -1588116 -1712218 -1838865 -1951144 -2031290 -2063060
17914b063060K7099Q4452J25441J40245J29507J03363P5796N9589O4581R5865
$$ -2063060 -2035961 -1951509 -1826068 -1685823 -1556316 -1452953 -1377157 -1317568 -1252987 -1157122
17904a157122J49923K13103K66178K93101K88518K58709K14743J63804J06080
$$ -1157122 -1007199 -794096 -527918 -234817 53701 312410 527153 690957 797037
17895G97037L9015l5812j10502j75860k27371k65612k92728l09951l17025l12113
$$ 797037 836052 800240 689738 513878 286507 20895 -271833 -581784 -898809 -1210922
17885a210922k92230k54679j99058j29175n3166J9566Q2640J34559J77258K13967
$$ -1210922 -1503152 -1757831 -1956889 -2086064 -2139230 -2119664 -2037024 -1902465 -1725207 -1511240
17875a511240K47142K75238K91258K86896K59039K12045J54476R4003L4996j9832
$$ -1511240 -1264098 -988860 -697602 -410706 -151667 60378 214854 308857 343853 324021
17865C24021o6867j01377j18691j15095q8893m1625K0769Q7211J43996J81664
$$ 324021 257154 155777 37086 -78009 -166902 -208527 -187758 -100547 43449 225113
17855B25113K00181K05917K02795J86552J48625Q7023J3071n4185j01005j26413
$$ 225113 425294 631211 834006 1020558 1169183 1256206 1269277 1215092 1114087 987674
17845I87674j38411j45189j50300j53852j55341j53749j46307j30718j09820r2606
$$ 987674 849263 704074 553774 399922 244581 90832 -55475 -186193 -296013 -388619
17835c88619q9540j06100j38605j74140j95114j86981j45464p9472o828N5942
$$ -388619 -478159 -584259 -722864 -897004 -1092118 -1279099 -1424563 -1504035 -1510863 -1454921
17825a454921J02141J34327J56605J68361J63928J36661Q5554K1528l2676n3165
$$ -1454921 -1352780 -1218453 -1061848 -893487 -729559 -592898 -507344 -485816 -518492 -571657
17815e71657k9880K6688R2627J44234J67647J61368J34141R9662O9372M7925L4814
$$ -571657 -601537 -574849 -482222 -337988 -170341 -8973 125168 224830 294202 342127 376941
17804C76941K8811L0248M0671O0680Q7581J16390J43828J69947J95120K16550
$$ 376941 405752 436000 476671 537351 624932 741322 885150 1055097 1250217 1466767
17794A466767K27931K21662J92483J40881P4005L574n7561r9811j21088j27555
$$ 1466767 1694698 1916360 2108843 2249724 2323729 2327303 2269742 2169931 2048843 1921288
17784A921288j29133j32602j37893j40484j37030j28757j19949j12329r9942p1605
$$ 1921288 1792155 1659553 1521660 1381176 1244146 1115389 995440 883111 783169 711564
17774G11564k1972M0049R5135J24398J17170P4025P246o3161j19534j55667j75859
$$ 711564 689592 729641 824776 949174 1066344 1140369 1147615 1084454 964920 809253 633394
17763F33394j86270j88571j80562j60309j29163r1898n3583j4701L0239Q7334
$$ 633394 447124 258553 77991 -82318 -211481 -303379 -356962 -371663 -341424 -254090
17753b54090J56065K27925K91821L39737L67340L71024L46865K94629K23192J49330
$$ -254090 -98025 129900 421721 761458 1128798 1499822 1846687 2141316 2364508 2513838
17743B513838Q7846M1692J893m3477r9813j62876k23131k72792l09027l31744
$$ 2513838 2601684 2643376 2645269 2601792 2501979 2339103 2115972 1843180 1534153 1202409
17733A202409l39680l29075k97071k46669j86933j27976p6289l3787L72K7725
$$ 1202409 862729 533654 236583 -10086 -197019 -324995 -401284 -435071 -434699 -406974
17723d06974M9633O7141Q0882R1714J01854J13736J26595J35277J33624J19145
$$ -406974 -357341 -290200 -209318 -117604 -15750 97986 224581 359858 493482 612627
17713F12627R5385P0669N2473M0532K5883k148m7448j04283j61355k08139k38090
$$ 612627 708012 778681 831154 871686 897569 895421 847973 743690 582335 374196 136106
17702A36106k48409k39765k16367j84062j47306j07903o5117j6038M2286J08520
$$ 136106 -112303 -352068 -568435 -752497 -899803 -1007706 -1072823 -1088861 -1046575 -938055
17692i38055J74407K27364K56807K58892K36106J93032J34485O9869J7252l557
$$ -938055 -763648 -536284 -279477 -20585 215521 408553 543038 612907 630159 626602
17682F26602J4081N7157J02702J33732J47360J50032J46845J36048J12435P3930
$$ 626602 640683 697840 800542 934274 1081634 1231666 1378511 1514559 1626994 1700924
17672A700924K4932k5527o9147j03244j31683j61036j94653k29253k56569k67821
$$ 1700924 1725856 1700329 1631182 1527938 1396255 1235219 1040566 811313 554744 286923
17662B86923k56858k21134j63020r1481k0762L5776P2162R1133J00331J07358
$$ 286923 30065 -191069 -354089 -445570 -466332 -430556 -358394 -267261 -166930 -59572
17652e9572J16748J28878J40096J44418J36642J15002Q1806M1330l917n4192j08619
$$ -59572 57176 186054 326150 470568 607210 722212 804018 845348 841431 787239 678620
17641F78620j61194k03074k29432k42417k46115k40244k21604j92043j62116j44458
$$ 678620 517426 314352 84920 -157497 -403612 -643856 -865460 -1057503 -1219619 -1364077
17631a364077j44016j55756j70418j81198j86829j90289j93417j91304j73111
$$ -1364077 -1508093 -1663849 -1834267 -2015465 -2202294 -2392583 -2586000 -2777304 -2950415
17622b950415j29663o0022K8472J23999K13225K83264L24913L36692L25100K99494
$$ -2950415 -3080078 -3140100 -3111628 -2987629 -2774404 -2491140 -2166227 -1829535 -1504435 -1204941
17612a204941K66884K31012J93047J52009J07521O3506K7333M533m229j737Q205
$$ -1204941 -938057 -707045 -513998 -361989 -254468 -190962 -163629 -159096 -163325 -165062 -156857
17601a56857K2259L7935N1967N8258M9167K0700k2714o8785j04108j21945j24809
$$ -156857 -134598 -96663 -44696 13562 62729 83429 60715 -8070 -112178 -234123 -358932
17590c58932j21418j21648j32172j53798j80849k03356k11480j99707j68813j25431
$$ -358932 -480350 -601998 -734170 -887968 -1068817 -1272173 -1483653 -1683360 -1852173 -1977604
17580a977604p9913m1944j4767P742L6562P7307J24380J66614J97436K17485K28985
$$ -1977604 -2057517 -2099461 -2114228 -2106486 -2069924 -1992617 -1868237 -1701623 -1504187 -1286702 -1057717
17569a057717K31155K21480J98739J63913J19639O9784J9379k5305n7211p0864
$$ -1057717 -826562 -605082 -406343 -242430 -122791 -53007 -33628 -58933 -116144 -187008
17559a87008o6482n2575m3312m9978p2317r8509j15138j17618j10946j01769r2040
$$ -187008 -253490 -306065 -349377 -399355 -471672 -570181 -685319 -802937 -913883 -1015652 -1107692
17548a107692p9248n9296k9292Q208M1814N5566M0525L163l8168o5316p0157n5220
$$ -1107692 -1186940 -1246236 -1275528 -1267320 -1225506 -1169940 -1129415 -1126252 -1164420 -1229736 -1299893 -1355113
17536a355113k7319Q360M9487R4696J41632J86648K26067K56463K72912K68329
$$ -1355113 -1382432 -1374072 -1324585 -1229889 -1088257 -901609 -675542 -419079 -146167 122162
17526A22162K37151J81595J13910N0748L747k5856m5448o4695q8710j13535j27190
$$ 122162 359313 540908 654818 705566 709313 683457 638009 573314 484604 371069 243879
17515B43879j17792q4007l9571p114m660l4767q4645j36524j78782k08675k27347
$$ 243879 126087 42080 2509 -4605 -9265 -44032 -128677 -265201 -443983 -652658 -880005
17504h80005k34862k29527k09170j72396j21163o3937j5557Q632J639k9633o6865
$$ -880005 -1114867 -1344394 -1553564 -1725960 -1847123 -1911060 -1926617 -1917985 -1916346 -1945979 -2012844
17493b012844r0004q6853n5723k293O3337J27722J76859K01918K02544J83959
$$ -2012844 -2102848 -2189701 -2245424 -2247717 -2184380 -2056658 -1879799 -1677881 -1475337 -1291378
17483a291378J51888J11219O7929K9141p53k3315m3186o1511p2339o4919l0840
$$ -1291378 -1139490 -1028271 -960342 -931201 -931954 -955269 -998455 -1059966 -1132305 -1197224 -1228064
17472a228064K7773R5903J52834J83566J85369J65328J33422R7835O2715K7151
$$ -1228064 -1200291 -1104388 -951554 -767988 -582619 -417291 -283869 -186034 -123319 -96168
17462i6168j2073n4132r1075j12258j11477r0355n6675j9859J3784M4401P8337
$$ -96168 -108241 -162373 -253448 -365706 -477183 -567538 -624213 -644072 -630288 -585887 -507550
17451e07550J22908J80481K47544L17295L81039M28316M48603M34960L86713L09576
$$ -507550 -384642 -204161 43383 360678 741717 1170033 1618636 2053596 2440309 2749885
17441B749885K14778J18280L7023j8603n0114o7702q0356q8474q6071o9983m5993
$$ 2749885 2964663 3082943 3119966 3101363 3051249 2983547 2903191 2814717 2728646 2658663 2612670
17430B612670k5836j9362k9822n5170r2024j37619j88300k38438k83180l21920
$$ 2612670 2586834 2567472 2537650 2482480 2390456 2252837 2064537 1826099 1542919 1220999
17420A220999l57175l89773m15188m23547m03318l46652k53423j33074l925J11315
$$ 1220999 863824 474051 58863 -364684 -768002 -1114654 -1368077 -1501151 -1505076 -1393761
17410a393761J92916K31215K30329K06923J83729J79034J97240K27791K53489
$$ -1393761 -1200845 -969630 -739301 -532378 -348649 -169615 27625 255416 508905
17401E08905K61187K47845K19879J87290J57711J34511J17090J00066P3704K9073
$$ 508905 770092 1017937 1237816 1425106 1582817 1717328 1834418 1934484 2008188 2037261
17391B037261l5646j13660j92505k58698l02168l17847l03991k61004j93285j11503
$$ 2037261 2001615 1887955 1695450 1436752 1134584 816737 512746 251742 58457 -53046
17381e3046l1191L2793P2196Q7951Q8180Q3956Q5902J00942J27416J52673J58074
$$ -53046 -84237 -51444 20752 108703 196883 280839 366741 467683 595099 747772 905846
17370I05846J29483O6520j5674r3609j46950j67073j58088j30654r4044n3190
$$ 905846 1035329 1101849 1086175 992566 845616 678543 520455 389801 295757 242567
17360B42567j1626K5056M8916N1592K7165k3782r0748j54857j96906k06539j85450
$$ 242567 230941 255997 304913 356505 383670 359888 269140 114283 -82623 -289162 -474612
17349d74612j43715r3958m6634o395K9085O5630J05855J45333J75751J91916J96176
$$ -474612 -618327 -712285 -758919 -765314 -736229 -670599 -564744 -419411 -243660 -51744 144432
17338A44432J96837K02690K18359K42180K65819K76548K62782K19469J49433O0703
$$ 144432 341269 543959 762318 1004498 1270317 1546865 1809647 2029116 2178549 2239252
17328B239252l6474j30330k08448k61366k84966k79009k46695j96781j41694q9796
$$ 2239252 2202778 2072448 1864000 1602634 1317668 1038659 791964 595183 453489 363693
17318C63693m1498M157M0010N0643K3147m0870j22800j95503k35130k28761j76796
$$ 363693 322195 326352 366362 417005 440152 399282 276482 80979 -154151 -382912 -559708
17307e59708r1991N002R2999J57177J92734K04628K03695K00754K01775K06567
$$ -559708 -651699 -646697 -553698 -396521 -203787 841 204536 405290 607065 813632
17297H13632K10142K04147J78129J22546L4122p9921k03453l17976m08320m65040
$$ 813632 1023774 1227921 1406050 1528596 1562718 1482797 1279344 961368 553048 88008
17287H8008m85605m74371m39097l85829l17614k37493j51190o7043N971O1017
$$ 88008 -397597 -871968 -1311065 -1696894 -2014508 -2252001 -2403191 -2470234 -2464263 -2403246
17277b403246R5194J09082J05602R0111P0354N4374M7573N1415O4315Q3000J02264
$$ -2403246 -2308052 -2198970 -2093368 -2003257 -1932903 -1878529 -1830956 -1779541 -1715226 -1632226 -1529962
17266a529962J15377J17934J11864J03701R8122R3554Q3600O2001K7255j6918
$$ -1529962 -1414585 -1296651 -1184787 -1081086 -982964 -889410 -805810 -743809 -716554 -733472
17256g33472o5091j12154j51461j74205j73209j46999r9426l6369L6660J14830
$$ -733472 -798563 -910717 -1062178 -1236383 -1409592 -1556591 -1656017 -1692386 -1655726 -1540896
17246a540896J91937K57098K95716K97752K66500K18799J75828J51653J47176
$$ -1540896 -1348959 -1091861 -796145 -498393 -231893 -13094 162734 314387 461563
17237D61563J51956J51677J37182J09753P9086N5175M0114K6421K798l7759r2367
$$ 461563 613519 765196 902378 1012131 1091217 1146392 1186506 1212927 1215725 1177966 1085599
17226A085599j47187j82100j79830j33226m6120O8531J89065K88002L41189L37538
$$ 1085599 938412 756312 576482 443256 397136 465667 654732 942734 1283923 1621461
17216A621461K81552J88522P7976l0900j22852j89748k30743k49677k53697k52312
$$ 1621461 1903013 2091535 2169511 2138611 2015759 1826011 1595268 1345591 1091894 839582
17206H39582k53094k56894k58503k50791k26408j78613j06767k2806N1963J00143
$$ 839582 586488 329594 71091 -179700 -406108 -584721 -691488 -714294 -662331 -562188
17196e62188J19457J21900J23548J34728J56320J81077J98033J99421J85978J65161
$$ -562188 -442731 -320831 -197283 -62555 93765 274842 472875 672296 858274 1023435
17186A023435J44074J25462J09991R9572R6599R9479J00161Q9180O5174L8126
$$ 1023435 1167509 1292971 1402962 1502534 1599133 1698612 1798773 1887953 1953127 1991253
17176A991253K2275K6528N0583Q7360J27750J64055J91271K06683K08148J93402
$$ 1991253 2013528 2040056 2090639 2177999 2305749 2469804 2661075 2867758 3075906 3269308
17166C269308J61792J15898O1205M719m5958q3004r9901r4429p0608l8382j1063
$$ 3269308 3431100 3546998 3608203 3612922 3566964 3483960 3384059 3289630 3219022 3180640 3169577
17155C169577m33j1295l8863p0416r0152q5316n0963Q758Q2500J55197K12246
$$ 3169577 3169144 3157849 3118986 3048570 2958418 2873102 2822139 2830897 2913397 3068594 3280840
17144C280840K43671K45804K19342J67657R8252K3331m4445r7272j32726j51115
$$ 3280840 3524511 3770315 3989657 4157314 4255566 4278897 4234452 4137180 4004454 3853339
17134C853339j55212j52398j54074j69845k00619k37078k65143k73785k59382
$$ 3853339 3698127 3545729 3391655 3221810 3021191 2784113 2518970 2245185 1985803
17125A985803k24108j71448j04144k6104N4841J27073J78644K02302J99637J81506
$$ 1985803 1761695 1590247 1486103 1459999 1514840 1641913 1820557 2022859 2222496 2404002
17115B404002J63848J61812J84416K29760K83762L26024L39049L13909K51944
$$ 2404002 2567850 2729662 2914078 3143838 3427600 3753624 4092673 4406582 4658526
17106D658526J64678P1403o336n2785o6250o2037o4695r3408j51809k28311l03331
$$ 4658526 4823204 4894607 4888271 4835486 4769236 4707199 4642504 4549096 4397287 4168976 3865645
17095C865645l57380l76515l54627k93823k03809r9208N938J02349J84406K47304
$$ 3865645 3508265 3131750 2777123 2483300 2279491 2180283 2186221 2288570 2472976 2720280
17085B720280K87955L07940L12774L07714K96054K80299K61819K39182K09249
$$ 2720280 3008235 3316175 3628949 3936663 4232717 4513016 4774835 5014017 5223266
17076E223266J70447J24886P8250L8840J6049J7507M4963R1596J43287J83262
$$ 5223266 5393713 5518599 5596849 5635689 5651738 5669245 5714208 5805804 5949091 6132353
17066F132353J98162J84180J49636J10035P8743O1609N8933P0613R8708J43797
$$ 6132353 6330515 6514695 6664331 6774366 6853109 6914718 6973651 7044264 7142972 7286769
17056G286769J97613K41632K57125K37843J92243J34958P8955L4569J0632J2274
$$ 7286769 7484382 7726014 7983139 8220982 8413225 8548183 8627138 8661707 8672339 8684613
17046H684613L7319P7040J22843J72323K27316K86346L40070L73557L72633L29450
$$ 8684613 8721932 8798972 8921815 9094138 9321454 9607800 9947870 10321427 10694060 11023510
17036A1023510K44783J27636o894j41617k61457l55346m15813m38713m23526l73497
$$ 11023510 11268293 11395929 11389035 11247418 10985961 10630615 10214802 9776089 9352563 8979066
17026H979066k96216k05288j20194o0596l7709n0450q9168j41732j97094k46813
$$ 8979066 8682850 8477562 8357368 8296772 8259063 8208613 8119445 7977713 7780619 7533806
17016G533806k85862l12050l24076l19456k93396k40466j59684n8133N2229J61916
$$ 7533806 7247944 6935894 6611818 6292362 5998966 5758500 5598816 5540683 5592912 5754828
17006E754828K67595L69170M64747N48043O08392O33916O19000N71348N10869
$$ 5754828 6022423 6391593 6856340 7404383 8012775 8646691 9265691 9837039 10347908
16997A0347908M58946M26001M07372L88327L51181K79999J64013L85k04127m32419
$$ 10347908 10806854 11232855 11640227 12028554 12379735 12659734 12823747 12824132 12620005 12187586
16987A2187586o57423q46437r71829j023634j012734r60057q83049p91985o94045
$$ 12187586 11530163 10683726 9711897 8688263 7675529 6715472 5832423 5040438 4346393
16978D346393n95928n02599m15545l32595k49975j66595q6897j8322L4652P3433
$$ 4346393 3750465 3247866 2832321 2499726 2249751 2083156 1996259 1977937 2012589 2086022
16968B086022J02269J24210J41268J55834J68860J78251J81820J81450J82307
$$ 2086022 2188291 2312501 2453769 2609603 2778463 2956714 3138534 3319984 3502291
16959C502291J86354J86758J70535J28246O1711j6568q9674j42117j63244j50571
$$ 3502291 3688645 3875403 4045938 4174184 4235895 4219327 4129653 3987536 3824292 3673721
16949C673721j13638p3208n1348n7633q2374j02299r5240n4046J1015Q2978J50805
$$ 3673721 3560083 3486875 3435527 3377894 3295520 3193221 3097981 3043935 3054950 3137928 3288733
16938C288733K13163K73922L35422L93745M38321M55880M35760L74403K78802
$$ 3288733 3501896 3775818 4111240 4504985 4943306 5399186 5834946 6209349 6488151
16929F488151J66716O0983j9156o2420o4605k7926L8077J18190J96709K62181
$$ 6488151 6654867 6715850 6696694 6634274 6569669 6541743 6579820 6698010 6894719 7156900
16919G156900L08990L36268L45725L40122L22419K93777K51282J90247J10649
$$ 7156900 7465890 7802158 8147883 8488005 8810424 9104201 9355483 9545730 9656379
16910I656379K0502o7433j40788j89651k07371j93588j56855j11968p3786n3211
$$ 9656379 9676881 9609448 9468660 9279009 9071638 8878050 8721195 8609227 8535441 8482230
16900H482230n6355q3717j29114j81392k29132k64059k81335k79491k60753k29615
$$ 8482230 8425875 8342158 8213044 8031652 7802520 7538461 7257126 6977635 6716882 6487267
16890F487267j90128j45019r6818m9345r001J5013J3935j4696o3879j18731j59936
$$ 6487267 6297139 6152120 6055302 6005957 5996956 6011969 6025904 6011208 5947329 5828598 5668662
16879E668662j68814j35037o1512L9445J54248K70713L74126M45724M68535M34779
$$ 5668662 5499848 5364811 5303299 5342744 5496992 5767705 6141831 6587555 7056090 7490869
16869G490869L49015K27869R6407k0798j09702j70124k11158k43222k71983k97282
$$ 7490869 7839884 8067753 8164160 8143362 8033660 7863536 7652378 7409156 7137173 6839891
16859F839891l16041l25482l24792l15342k99346k77487k47166k03372j42374
$$ 6839891 6523850 6198368 5873576 5558234 5258888 4981401 4734235 4530863 4388489
16850D388489o5113K2072J08694J81999K29552K41972K14908J50074N5952n2793
$$ 4388489 4323376 4345448 4454142 4636141 4865693 5107665 5322573 5472647 5528599 5475806
16840E475806j59225k49778l16558l54924l59638l23693k42625j22924J4312J41880
$$ 5475806 5316581 5066803 4750245 4395321 4035683 3711990 3469365 3346441 3360753 3502633
16830C502633K40942L07783L49162L73897L87238L89316L77765L52813L20353
$$ 3502633 3743575 4051358 4400520 4774417 5161655 5550971 5928736 6281549 6601902
16821F601902K89641K68143K58845K61135K72110K87055L01105L11450L16460
$$ 6601902 6891543 7159686 7418531 7679666 7951776 8238831 8539936 8851386 9167846
16812I167846L11442K86623K31828J45602M1616n4963j21196j50203j53331j48822
$$ 9167846 9479288 9765911 9997739 10143341 10184957 10129994 10008798 9858595 9705264 9556442
16802I556442j46901j43016j22700p2776R567J15411K29256L35195M20854M80177
$$ 9556442 9409541 9266525 9143825 9071049 9080616 9196027 9425283 9760478 10181332 10661509
16792A0661509N15190N33601N41201N35128N05655M46270L63219K75781K06693
$$ 10661509 11176699 11710300 12251501 12786629 13292284 13738554 14101773 14377554 14584247
16783A4584247J69999J64484J76292J88638J91945J87665J84540J91905K15752
$$ 14584247 14754246 14918730 15095022 15283660 15475605 15663270 15847810 16039715 16255467
16774A6255467K58131L16277L80888M37008M69145M68047M35305L83789L33461
$$ 16255467 16513598 16829875 17210763 17647771 18116916 18584963 19020268 19404057 19737518
16765A9737518L03123L02645L31110L79492M32600M70343M72459M25179L25191
$$ 19737518 20040641 20343286 20674396 21053888 21486488 21956831 22429290 22854469 23179660
16756B3179660J80911J1930j56521l03763m20829n08685n70279o04967o10325
$$ 23179660 23360571 23372501 23215980 22912217 22491388 21982703 21412424 20807457 20197132
16747B0197132n86943n38900m69907l80551k70063j41151l993J23857K22462K76891
$$ 20197132 19610189 19071289 18601382 18220831 17950768 17809617 17805624 17929481 18151943 18428834
16737A8428834K82061K43049J73353R2461K1082k5986m4938m1580k5196l012K2361
$$ 18428834 18710895 18953944 19127297 19219758 19240840 19214854 19169916 19128336 19103140 19100128 19122489
16726A9122489N2262Q8821J32554J83109K41867L13383M03447N14598O42395P74376
$$ 19122489 19174751 19263572 19396126 19579235 19821102 20134485 20537932 21052530 21694925 22469301
16716B2469301Q92962R82266J034799J053848J050466J037217J022767J010991
$$ 22469301 23362263 24344529 25379328 26433176 27483642 28520859 29543626 30554617
16708C0554617J003353R99205R91274R61530Q84600P37931N11054K08886j49797
$$ 30554617 31557970 32557175 33548449 34509979 35394579 36132510 36643564 36852450 36702653
16699C6702653n35863r14730j251554j514847j680149j736721j693174j574646
$$ 36702653 36166790 35252060 34000506 32485659 30805510 29068789 27375615 25800969
16691B5800969j412191j233630j061968r17235q13596p52647p21505o99289o67320
$$ 25800969 24388778 23155148 22093180 21175945 20362349 19609702 18888197 18188908 17521588
16682A7521588o16321n47564m69498l92868l26525k75256k39571k16633k02864
$$ 17521588 16905267 16357703 15888205 15495337 15168812 14893556 14653985 14437352 14234488
16673A4234488j97720k04778k27956k66827l15411l63423l97956m06379l81509
$$ 14234488 14036768 13831990 13604034 13337207 13021796 12658373 12260417 11854038 11472529
16664A1472529l26800k56943j92078j49177j34720j42594j59447j73723j80455
$$ 11472529 11145729 10888786 10696708 10547531 10412811 10270217 10110770 9937047 9756592
16655I756592j78903j67655j42494r8209l3236M4834J17753J63844J70280J39999
$$ 9756592 9577689 9410034 9267540 9169331 9136095 9180929 9298682 9462526 9632806 9772805
16645I772805Q8160L2971j1751l8836m6960m0277k8413k4009l6713o7666j09301
$$ 9772805 9860965 9893936 9882185 9843349 9796389 9756112 9727699 9703690 9666977 9599311 9490010
16634I490010j49696j76854j81131j57107j05249l2638M7820J20834J75064K08309
$$ 9490010 9340314 9163460 8982329 8825222 8719973 8687335 8735155 8855989 9031053 9239362
16624I239362K27036K41106K57280K75106K88238K90497K81498K67167K55186
$$ 9239362 9466398 9707504 9964784 10239890 10528128 10818625 11100123 11367290 11622476
16615A1622476K49239K45536K33427K01475J46171P5278L022n6747r4029j03411
$$ 11622476 11871715 12117251 12350678 12552153 12698324 12773602 12776624 12719877 12625848 12522437
16605A2522437q4864m5058K660M2083O2132O3769N8592N9221O9815Q4229R2138
$$ 12522437 12437573 12392515 12395175 12437258 12499390 12563159 12621751 12680972 12750787 12835016 12927154
16594A2927154Q7427P2199N3736L7946K5346J1701q774m0018q1140j24701j58942
$$ 12927154 13014581 13086780 13140516 13178462 13203808 13215509 13206735 13166717 13085577 12960876 12801934
16583A2801934j73580j64475j34554r2386m9069j3238J3459L6590O4926J06379
$$ 12801934 12628354 12463879 12329325 12236939 12187870 12174632 12188091 12224681 12289607 12395986
16573A2395986J65811K42520L27675M05600M59619M78541M60218M11750L47822
$$ 12395986 12561797 12804317 13131992 13537592 13997211 14475752 14935970 15347720 15695542
16564A5695542K87379K48085K40333K63919L09356L62788M11202M46507M69221
$$ 15695542 15982921 16231006 16471339 16735258 17044614 17407402 17818604 18265111 18734332
16555A8734332M89272N20166N70656O41419P27008Q18216R03228R70459J013984
$$ 18734332 19223604 19743770 20314426 20955845 21682853 22501069 23404297 24374756 25388740
16546B5388740J036672J046012J046616J036962J011825R67295R05884Q38944
$$ 25388740 26425412 27471424 28518040 29555002 30566827 31534122 32440006 33278950
16538C3278950P84808P62840P85076Q50661R48022J062333J182423J304545J432047
$$ 33278950 34063758 34826598 35611674 36462335 37410357 38472690 39655113 40959658 42391705
16529D2391705J570563J720405J871223K004929K107193K178442K233775K292222
$$ 42391705 43962268 45682673 47553896 49558825 51666018 53844460 56078235 58370457
16521E8370457K365788K455302K552400K645318K726205K795027K855040K903612
$$ 58370457 60736245 63191547 65743947 68389265 71115470 73910497 76765537 79669149
16513G9669149K928933K915290K847840K710699K486208K164810J758457J302859
$$ 79669149 82598082 85513372 88361212 91071911 93558119 95722929 97481386 98784245
16505I8784245Q45479M28794P7783k05390m39718o57820q94683j176520j514021
$$ 98784245 99629724 100058518 100136301 99930911 99491193 98833373 97938690 96762170 95248149
16496I5248149j901148k318268k738043l131067l469030l727196l889196l952982
$$ 95248149 93347001 91028733 88290690 85159623 81690593 77963397 74074201 70121219
16488G0121219l932499l852269l738188l610133l479454l350045l219254l078953
$$ 70121219 66188720 62336451 58598263 54988130 51508676 48158631 44939377 41860424
16480D1860424k920085k739727k544273k344459k146267j945509j731142j496311
$$ 41860424 38940339 36200612 33656339 31311880 29165613 27220104 25488962 23992651
16472B3992651j248661j010077q05265o49210n42714m75856m33783m02786l75985
$$ 23992651 22743990 21733913 20928648 20279438 19736724 19260868 18827085 18424299 18048314
16463A8048314l54641l43441l43441l46650l36447k97458k27240j37467m6187
$$ 18048314 17693673 17350232 17006791 16660141 16323694 16026236 15798996 15661529 15615342
16454A5615342K8849P4117Q3737N9884Q220o6934j61938k68457l69943m45289
$$ 15615342 15644191 15718308 15802045 15861929 15870149 15803215 15641277 15372820 15002877 14557588
16444A4557588m78851m69014m26763l65333k92389k11872j29436n2870J3260P1473
$$ 14557588 14078737 13609723 13182960 12817627 12525238 12313366 12183930 12131060 12144320 12215793
16434A2215793J27250J80009K20105K35498K19417J71102R2492j1989j32191k51146
$$ 12215793 12343043 12523052 12743157 12978655 13198072 13369174 13461666 13449677 13317486 13066340
16424A3066340l49682m12709m31871m04877l33973k24883q7647O1079J99362L07639
$$ 13066340 12716658 12303949 11872078 11467201 11133228 10908345 10820698 10881777 11081139 11388778
16414A1388778L75798M02315L90059L46335K83786K16002J51296R1445L4847k0835
$$ 11388778 11764576 12166891 12556950 12903285 13187071 13403073 13554369 13645814 13680661 13659826
16404A3659826p7760j36920j96240k49616k88785l06016k95524k54923j87616
$$ 13659826 13582066 13445146 13248906 12999290 12710505 12404489 12108965 11854042 11666426
16395A1666426j03903j8703N4158J08072J45457J72938J93881K04183J93484J52028
$$ 11666426 11562523 11543820 11597978 11706050 11851507 12024445 12218326 12422509 12615993 12768021
16385A2768021Q1874M479m7600n2538j2674N3627J26934J90561K28321K28384
$$ 12768021 12849895 12854374 12806774 12754236 12741562 12795189 12922123 13112684 13341005 13569389
16375A3569389J89876J22463M0394m2106j11970j56801j65709j34483p2031N72
$$ 13569389 13759265 13881728 13922122 13880016 13768046 13611245 13445536 13311053 13239022 13239594
16365A3239594O0388R3589R8622Q0610M3475j1213p7040j37239j70400j63421
$$ 13239594 13299982 13393571 13492193 13572803 13616278 13605065 13528025 13390786 13220386 13056965
16355A3056965j18861n0363K7611J06412J83025K55427L19007L68226M01201M21395
$$ 13056965 12938104 12887741 12915352 13021764 13204789 13460216 13779223 14147449 14548650 14970045
16345A4970045M35043M47335M60037M71690M80778M89520N03613N27182N58723
$$ 14970045 15405088 15852423 16312460 16784150 17264928 17754448 18258061 18785243 19343966
16336A9343966N92724O23867O48286O61527O57307O28243N66917M67907L31052
$$ 19343966 19936690 20560557 21208843 21870370 22527677 23155920 23722837 24190744 24521796
16327B4521796J63372k1111k02902l60808m79113n55424o02415o39742o82200
$$ 24521796 24685168 24664057 24461155 24100347 23621234 23065810 22463395 21823653 21141453
16318B1141453p33301p86680q32127q63215q83132r04554r42133r99719j058450
$$ 21141453 20408152 19621472 18789345 17926130 17042998 16138444 15196311 14196592 13138142
16309A3138142j077098j014046q60269o50762m40015k69910j58297j03709r2200
$$ 13138142 12061044 11046998 10186729 9535967 9095952 8826042 8667745 8564036 8471836
16300H471836j02941j14333j10053q2737l4822K3521Q0089J26616J59386J75977
$$ 8471836 8368895 8254562 8144509 8061772 8026950 8050471 8130560 8257176 8416562 8592539
16290H592539J73967J52340J12719O0529O618l4153m9918l9183j1337J9476M0673
$$ 8592539 8766506 8918846 9031565 9092094 9098712 9064559 9014641 8975458 8964121 8983597 9024270
16279I024270M4371K9034N12k9065m5752m1159j8502R769L2888N1561P7722J24727
$$ 9024270 9068641 9097675 9098187 9069122 9023370 8982211 8963709 8973478 9006366 9057927 9135649 9260376
16267I260376J96196K83100L71844M54767N31127N99157O50712O73863O58980
$$ 9260376 9456572 9739672 10111516 10566283 11097410 11696567 12347279 13021142 13680122
16258A3680122O03006N08316L76881K08150O173k11861m16410n75618o66924o84081
$$ 13680122 14283128 14791444 15168325 15376475 15382648 15170787 14754377 14178759 13511835 12827754
16248A2827754o37407n48861m45734l54609k94678k71512k75713k88718k92193
$$ 12827754 12190347 11641486 11195752 10841143 10546465 10274953 9999240 9710522 9418329
16239I418329k75189k36161j80412j14821m3123L3866J13028J85139K36912K56262
$$ 9418329 9143140 8906979 8726567 8611746 8568623 8602489 8715517 8900656 9137568 9393830
16229I393830K37000J81662J02046J6629n5355j00033j10625q5471k7576N3500
$$ 9393830 9630830 9812492 9914538 9931167 9875812 9775779 9665154 9579683 9552107 9605607
16219I605607J42619K24950K92003L42299L76316L90417L76412L28680K52915
$$ 9605607 9748226 9973176 10265179 10607478 10983794 11374211 11750623 12079303 12332218
16210A2332218J67385R4836N2221M6056P3975J27631J94394K59663L11067L42902
$$ 12332218 12499603 12594439 12646660 12692716 12766691 12894322 13088716 13348379 13659446 14002348
16200A4002348L57296L60252L55402L40930L12665K70629K23507J87299J78168
$$ 14002348 14359644 14719896 15075298 15416228 15728893 15999522 16223029 16410328 16588496
16191A6588496K03211K55491L17707L72627M13076M44971M82464N38438O16184
$$ 16588496 16791707 17047198 17364905 17737532 18150608 18595579 19078043 19616481 20232665
16182B0232665P08198Q02109Q87720R60785J024040J086626J161132J257565J377588
$$ 20232665 20940863 21742972 22630692 23591477 24615517 25702143 26863275 28120840 29498428
16173B9498428J514204J657304J798872J932913K053134K154199K234021K290102
$$ 29498428 31012632 32669936 34468808 36401721 38454855 40609054 42843075 45133177
16165D5133177K311706K278081K167365J968773J687527J340791R50136N35207
$$ 45133177 47444883 49722964 51890329 53859102 55546629 56887420 57837556 58372763
16157E8372763J11412l06345o98244j041710j321359j534580j685702j777068
$$ 58372763 58484175 58177830 57479586 56437876 55116517 53581937 51896235 50119167
16149E0119167j808166j782206j711073j613834j511196j418723j340127j265056
$$ 50119167 48311001 46528795 44817722 43203888 41692692 40273969 38933842 37668786
16141C7668786j175856j060643r23783p85244o68600n87382n39480n10129m78189
$$ 37668786 36492930 35432287 34508504 33723260 33054660 32467278 31927798 31417669 30939480
16132C0939480m22822l30084j97820l6059J37787L05758M54598N78499O79168
$$ 30939480 30516658 30186574 29988754 29952695 30090482 30396240 30850838 31429337 32108505
16123C2108505P62620Q33964Q94026R40260R71211R90031J002847J013892J023701
$$ 32108505 32871125 33705089 34599115 35539375 36510586 37500617 38503464 39517356 40541057
16114D0541057J032000J039710J045058J037426R98047R10330P71205N93516L98278
$$ 40541057 41573057 42612767 43657825 44695251 45693298 46603628 47374833 47968349 48366627
16105D8366627K03404J6899j62323l39510n19749p06068q98911j095834j291201
$$ 48366627 48570031 48586930 48424607 48085097 47565348 46859280 45960369 44864535 43573334
16096D3573334j476394j640971j774524j869154j922445j939243j930140j906747
$$ 43573334 42096940 40455969 38681445 36812291 34889846 32950603 31020463 29113716
16088B9113716j875661j833959j770335j673719j542580j385926j217573j052297
$$ 29113716 27238055 25404096 23633761 21960042 20417462 19031536 17813963 16761666
16080A6761666r05619p91052p13984o68785o42311o19516n87649n40369m81441
$$ 16761666 15856047 15064995 14351011 13682226 13039915 12420399 11832750 11292381 10810940
16071A0810940m23106l76898l44560l18957k94269k73615k65766k75453k97612
$$ 10810940 10387834 10010936 9666376 9347419 9053150 8779535 8513769 8238316 7940704
16062G940704l19568l28346l18492k94946k67614k42297k17048j86182j46170
$$ 7940704 7621136 7292790 6974298 6679352 6411738 6169441 5952393 5766211 5620041
16053E620041r7751m4141J0808O1189R6371J02113O7180q150j07626k02999k65715
$$ 5620041 5522290 5478149 5488957 5550146 5646517 5748630 5815810 5807660 5700034 5497035 5231320
16042E231320k79246k44321j75138r0750p984O1886J14390J51241J76149J88825
$$ 5231320 4952074 4707753 4532615 4441865 4433881 4495767 4610157 4761398 4937547 5126372
16032E126372J83557J55348J08199N7251K2638K0000N4411J20532K06753K98376
$$ 5126372 5309929 5465277 5573476 5630727 5653365 5673365 5727776 5848308 6055061 6353437
16022F353437L77552M24152M22942L73165K90626K00116J24231P4275M7429L2640
$$ 6353437 6730989 7155141 7578083 7951248 8241874 8441990 8566221 8640496 8687925 8720565
16012H720565K0948J1072O514R107J5697K0308J9189J3565P697N650J1206K9499
$$ 8720565 8741513 8752585 8759099 8768206 8783903 8804211 8823400 8836965 8844662 8850312 8861518 8891017
16000H891017O5167J17396J78188K37520K91030L42189L96307M51822M97095N16542
$$ 8891017 8956184 9073580 9251768 9489288 9780318 10122507 10518814 10970636 11467731 11984273
15990A1984273N02019M59794M06792L60015L28749L14234L13075L19474L26487
$$ 11984273 12486292 12946086 13352878 13712893 14041642 14355876 14668951 14988425 15314912
15981A5314912L28576L23379L10402K90086K65547K43120K29608K30163K49486
$$ 15314912 15643488 15966867 16277269 16567355 16832902 17076022 17305630 17535793 17785279
15972A7785279K93633L68274M72752N95907P20469Q32878R28326J008168J075354
$$ 17785279 18078912 18447186 18919938 19515845 20236314 21069192 21997518 23005686 24081040
15963B4081040J132128J179930J220130J254547J285795J318031J356910J407831
$$ 24081040 25213168 26393098 27613228 28867775 30153570 31471601 32828511 34236342
15955C4236342J473944J555906J652650J760864J872010J969722K032924K045357
$$ 34236342 35710286 37266192 38918842 40679706 42551716 44521438 46554362 48599719
15947D8599719K004112J920266J814223J712070J643087J634731J705617J861687
$$ 48599719 50603831 52524097 54338320 56050390 57693477 59328208 61033825 62895512
15939F2895512K098509K407108K778697L206985L688727M222209M805365N436807
$$ 62895512 64994021 67401129 70179826 73386811 77075538 81297747 86103112 91539919
15931I1539919O119699O864960P690612Q616918R659046J0820660J2089093J3427826
$$ 91539919 97659618 104524578 112215190 120832108 130491154 141311814 153400907 166828733
15923A66828733J4764184J5977800J6896180J7299038J6933976J5551493J2967024
$$ 166828733 181592917 197570717 214466897 231765935 248699911 264251404 277218428
15916B77218428R145712M281725j178171o609566j1373645j4995372j7268400
$$ 277218428 286364140 290645865 289467694 282858128 271484483 256489111 239220711
15909B39220711j8248814j8168421j7328257j6016696j4464682j2831901j1213874
$$ 239220711 220971897 202803476 185475219 169458523 154993841 142161940 130948066
15902A30948066r660433q195728o830784n566433m393032l294754k258163j278173
$$ 130948066 121287633 113091905 106261121 100694688 96301656 93006902 90748739 89470566
15894H9470566l56829N01297J291152K006228K638153L178625L622757L971361
$$ 89470566 89113737 89615034 90906186 92912414 95550567 98729192 102351949 106323310
15886A06323310M230265M406973M505802M520883M427550M179662L719888K999384
$$ 106323310 110553575 114960548 119466350 123987233 128414783 132594445 136314333 139313717
15878A39313717J997682P37207p10932k234094l700192m987351o007766o718524
$$ 139313717 141311399 142048606 141337674 139103580 135403388 130416037 124408271 117689747
15870A17689747p120077p245879p148957o889949o526479o103942n651440n184981
$$ 117689747 110569670 103323791 96174834 89284885 82758406 76654464 71003024 65818043
15862F5818043m714470m248456l795189l362891k959769k592272k262720j968657
$$ 65818043 61103573 56855117 53059928 49697037 46737268 44144996 41882276 39913619
15854C9913619j704743j466022j249766j054553q78479p19259n75554m47753l38781
$$ 39913619 38208876 36742854 35493088 34438535 33560056 32840797 32265243 31817490 31478709
15845C1478709k55463k07377k00596k29286k73089l05467l07459k75142k16667
$$ 31478709 31223246 31015869 30815273 30585987 30312898 30007431 29699972 29424830 29208163
15836B9208163j44473o8408Q061Q7365J73259K65450L57301M38756N03018N51732
$$ 29208163 29063690 28995282 29003343 29090708 29263967 29529417 29886718 30325474 30828492 31380224
15826C1380224N94489O44622P15115Q14624R43559J092296J244233J384034J505669
$$ 31380224 31974713 32619335 33334450 34149074 35092633 36184929 37429162 38813196 40318865
15817D0318865J611452J701823J766285J784022J732640J597925J378170J081608
$$ 40318865 41930317 43632140 45398425 47182447 48915087 50513012 51891182 52972790
15809E2972790P21976L17448j08635n29626r19779j257632j527337j719176j831243
$$ 52972790 53694766 54012214 53903579 53373953 52454174 51196542 49669205 47950029 46118786
15800D6118786j871788j858038j809620j741204j659338j563625j451154j322901
$$ 46118786 44246998 42388960 40579340 38838136 37178798 35615173 34164019 32841118
15792C2841118j187531j058056r44225q47988p64074o83276n96342m97769l89013
$$ 32841118 31653587 30595531 29651306 28803318 28039244 27355968 26759626 26261857 25872844
15783B5872844k78468j75797q5382o386O1942J17978J60905J94320K26803K69619
$$ 25872844 25594376 25418579 25333197 25326811 25388753 25506731 25667636 25861956 26088759 26358378
15773B6358378L32015M15586N11839O05123O78535P19440P22778O92201O40523
$$ 26358378 26690393 27105979 27617818 28222941 28901476 29620916 30343694 31035895 31676418
15764C1676418N87589N51398N35932N28314N11149M78833M42131M18139M16586
$$ 31676418 32264007 32815405 33351337 33879651 34390800 34869633 35311764 35729903 36146489
15755C6146489M34204M58680M76997M83800M85441M95709N25850N77653O44513
$$ 36146489 36580693 37039373 37516370 38000170 38485611 38981320 39507170 40084823 40729336
15746D0729336P15878P78172Q12117P91947O90842M92648K03337j46543n10160
$$ 40729336 41445214 42223386 43035503 43827450 44518292 45010940 45214277 45067734 44557574
15737D4557574q38218j092594j254784j325759j318822j251482j140901j002173
$$ 44557574 43719356 42626762 41371978 40046219 38727397 37475915 36335014 35332841
15729C5332841q47651o87227n28788l77801k36774j05389J8856J39712K62141
$$ 35332841 34485190 33797963 33269175 32891374 32654600 32549211 32568067 32707779 32969920
15720C2969920L93193N41083P10455Q96449J083671J253782J397872J523559J650438
$$ 32969920 33363113 33904196 34614651 35511100 36594771 37848553 39246425 40769984 42420422
15711D2420422J797787J974608K178465K400140K628424K855443L084406L334822
$$ 42420422 44218209 46192817 48371282 50771422 53399846 56255289 59339695 62674517
15703F2674517L639325M032631M538822N165062N905970O753682P704249Q757058
$$ 62674517 66313842 70346473 74885295 80050357 85956327 92710009 100414258 109171316
15695A09171316R909227J1146324J2431075J3693950J4828512J5690006J6096123
$$ 109171316 119080543 130226867 142657942 156351892 171180404 186870410 202966533
15688B02966533J5836591J4704304J2556812R398223N441794J102233l101581
$$ 202966533 218803124 233507428 246064240 255462463 260904257 262006490 258904909
15681B58904909o694994r373058j1047807j1815926j1885145j1500295j0890175
$$ 258904909 252209915 242836857 231789050 219973124 208087979 196587684 185697509
15674A85697509j0237358r665137r236115q958950q801366q707591q616141q473680
$$ 185697509 175460151 165795014 156558899 147599949 138798583 130090992 121474851 113001171
15666A13001171q244857p918806p508595p041093o543489o035371n528504n030075
$$ 113001171 104756314 96837508 89328913 82287820 75744331 69708960 64180456 59150381
15658E9150381m545571m081744l649629l262401k927539k641948k395089k175318
$$ 59150381 54604810 50523066 46873437 43611036 40683497 38041549 35646460 33471142
15650C3471142j973705j784643j605156j433567j268447j108344r51723p97726
$$ 33471142 31497437 29712794 28107638 26674071 25405624 24297280 23345557 22547831
15642B2547831o48954n13134l99875l14583k54913k12245j77247j46121j22261
$$ 22547831 21898877 21385743 20985868 20671285 20416372 20204127 20026880 19880759 19758498
15633A9758498j11559j16546j35135j63886k01102k44976k87760l13580l04831
$$ 19758498 19646939 19530393 19395258 19231372 19030270 18785294 18497534 18183954 17879123
15624A7879123k52947j63759n2386O6777J86054L04129M23018N46218O79155Q29676
$$ 17879123 17626176 17462417 17410031 17476808 17662862 17966991 18390009 18936227 19615382 20445058
15614B0445058J005640J208232J425039J631855J805939J939817K042576K128985
$$ 20445058 21450698 22658930 24083969 25715824 27521763 29461580 31504156 33633141
15606C3633141K208165K281254K347546K411148K481538K569441K683718K830123
$$ 33633141 35841306 38122560 40470106 42881254 45362792 47932233 50615951 53446074
15598E3446074L010350L222777L465486L738350M042004M375451M734002N106402
$$ 53446074 56456424 59679201 63144687 66883037 70925041 75300492 80034494 85140896
15590H5140896N470605N790925O019121O097974N965062N558162M826316L748392
$$ 85140896 90611501 96402426 102421547 108519521 114484583 120042745 124869061 128617453
15582A28617453K353930P33664r72146k608020m043608n198038o040429o575656
$$ 128617453 130971383 131705047 130732901 128124881 124081273 118883235 112842806 106267150
15574A06267150o828308o832758o631556o276844n826880n337008m851040m396282
$$ 106267150 99438842 92606084 85974528 79697684 73870804 68533796 63682756 59286474
15566E9286474l982127l603662l251350k920699k613451k331428k073140j837190
$$ 59286474 55304347 51700685 48449335 45528636 42915185 40583757 38510617 36673427
15558C6673427j627191j451676j318794j231094j184518j169946j174043j181105
$$ 36673427 35046236 33594560 32275766 31044672 29860154 28690208 27516165 26335060
15550B6335060j178706j163142j137667j104073j057248r90029r02672q04453
$$ 26335060 25156354 23993212 22855545 21751472 20694224 19704195 18801523 17997070
15542A7997070p05179o07810n10244m11458l15246k30626j69218j39510j41314
$$ 17997070 17291891 16684081 16173837 15762379 15447133 15216507 15047289 14907779 14766465
15533A4766465j64112j90197k01985j90276j57505j13458o8008k7137O184K9316
$$ 14766465 14602353 14412156 14210171 14019895 13862390 13748932 13680924 13653787 13659971 13689287
15523A3689287L9153L4567K0526R350J6133N0908J12954J90913K68817L32908
$$ 13689287 13728440 13763007 13783533 13792883 13809016 13859924 13972878 14163791 14432608 14765516
15513A4765516L73439L82559L53468K81772J66078Q315j83571l92073n91069p53603
$$ 14765516 15138955 15521514 15874982 16156754 16322832 16331147 16147576 15755503 15164434 14410831
15503A4410831q61875r12126r12083q75027q14979p42961o64615n83266n06837
$$ 14410831 13548956 12636830 11724747 10849720 10034741 9291780 8627165 8043899 7537062
15494G537062m49047m21514m24385m44297m61472m59419m29975l73690k99013
$$ 7537062 7088015 6666501 6242116 5797819 5336347 4876928 4446953 4073263 3774250
15485C774250k20335j52465j02478o5673l1379O271M3184O8849P2986N0589M895
$$ 3774250 3553915 3401450 3298972 3233299 3201920 3208191 3251375 3320224 3393210 3443799 3448694
15474C448694n2267j05651j45491j71944j90522k05026k15635k20420k15845j97632
$$ 3448694 3396427 3290776 3145285 2973341 2782819 2577793 2362158 2141738 1925893 1728261
15464A728261j64289j19771p1529k5783J5098N0925P9708R4901Q7059M9996j3972
$$ 1728261 1563972 1444201 1372672 1346889 1361987 1412912 1492620 1587521 1674580 1724576 1710604
15453A710604r5107j82112k66803l44737m12153m61667m82298m66032m14000l35666
$$ 1710604 1615497 1433385 1166582 821845 409692 -51975 -534273 -1000305 -1414305 -1749971
15443a749971k43884j51317o8831l567M3083P5267R9916J23234J48888J78419
$$ -1749971 -1993855 -2145172 -2214003 -2217570 -2174487 -2099220 -1999304 -1876070 -1727182 -1548763
15433a548763K11525K45207K73567K88899K83170K50557J91334J14929L9159j6352
$$ -1548763 -1337238 -1092031 -818464 -529565 -246395 4162 195496 310425 349584 333232
15423C33232m0699l8808k8388k8889n1329r4616j47791j95496k24998k32832k26333
$$ 333232 292533 253725 225337 196448 145119 50503 -97288 -292784 -517782 -750614 -976947
15412i76947k17609k15476k21994k33134k41144k38364k20913j89757j49110j04026
$$ -976947 -1194556 -1410032 -1632026 -1865160 -2106304 -2344668 -2565581 -2755338 -2904448 -3008474
15402c008474n8915j7969J4275L4036L9775L3123K0097J0508J2946K9390N6711
$$ -3008474 -3067389 -3085358 -3071083 -3037047 -2997272 -2964149 -2944052 -2933544 -2920598 -2891208 -2834497
15391b834497R3710J44198K11575K91355L70842M36165M78707M96362M91889M70821
$$ -2834497 -2740787 -2596589 -2385014 -2093659 -1722817 -1286652 -807945 -311583 180306 651127
15381F51127M38888L99701L54475L03600K47852J88671J28183O8280Q650n2896
$$ 651127 1090015 1489716 1844191 2147791 2395643 2584314 2712497 2780777 2789427 2736531
15371B736531j16571j77278k25724k53383k56972k38593k03172j57256j09066
$$ 2736531 2619960 2442682 2216958 1963575 1706603 1468010 1264838 1107582 998516
15362I98516o7115l7414k1738j8060k3105l5821n8782r5657j47141k08575k69585
$$ 998516 931401 893987 872249 854189 831084 795263 736481 640824 493683 285108 15523
15351A5523l15304l30521l06301k45004j60314p3013n091K6269J4146l5231j03884
$$ 15523 -299781 -630302 -936603 -1181607 -1341921 -1414934 -1420025 -1393756 -1379610 -1414841 -1518725
15340a518725j68851k12244k28365k22517k03355j76184j42324j02348n7794r853
$$ -1518725 -1687576 -1899820 -2128185 -2350702 -2554057 -2730241 -2872565 -2974913 -3032707 -3042560
15330c042560M1757R7272J54177K05864K42875K57705K51126K33091K15892K06977
$$ -3042560 -3000803 -2903531 -2749354 -2543490 -2300615 -2042910 -1791784 -1558693 -1342801 -1135824
15320a135824K07632K14998K23493K26703K21058K08226J93271J80364J70362
$$ -1135824 -928192 -713194 -489701 -262998 -41940 166286 359557 539921 710283
15311G10283J60983J48780J32553J15944J06240J09902J28264J57342J92159K29575
$$ 710283 871266 1020046 1152599 1268543 1374783 1484685 1612949 1770291 1962450 2192025
15301B192025K64263K84122K75011K32030J64856R0854K3676l1883p7482j16841
$$ 2192025 2456288 2740410 3015421 3247451 3412307 3503161 3526837 3494954 3417472 3300631
15291C300631j52371j83729k09019k26409k33885k28892k09929j78716j40763
$$ 3300631 3148260 2964531 2755512 2529103 2295218 2066326 1856397 1677681 1536918
15282A536918j04324p8349o9591p9440j02758j30250j53016j66541j72189j74928
$$ 1536918 1432594 1354245 1284654 1205214 1102456 972206 819190 652649 480460 305532
15272C05532j78678j83026j84119j77959j61911j34030r3058l8734K9561J14592
$$ 305532 126854 -56172 -240291 -418250 -580161 -714191 -807249 -845983 -816422 -701830
15262g01830K19460L40284M59264N48415N84913N64761N01949M16137L22239K28809
$$ -701830 -482370 -142086 317178 865593 1450506 2015267 2517216 2933353 3255592 3484401
15252C484401J40411N8149j9890r5310j65959k25740k66716k83002k76604k59758
$$ 3484401 3624812 3682961 3663071 3567761 3401802 3176062 2909346 2626344 2349740 2089982
15242B089982k47704k46803k49994k42954k14347j62546r4833k1555M9022J12596
$$ 2089982 1842278 1595475 1345481 1102527 888180 725634 630801 609246 658268 770864
15232G70864J67197K09297K32340K31663K11119J82974J60441J49118J43636J32124
$$ 770864 938061 1147358 1379698 1611361 1822480 2005454 2165895 2315013 2458649 2590773
15222B590773J05289O3173J4820k6969n1176n2918l5848r823J5863L7559N5759
$$ 2590773 2696062 2759235 2774055 2747086 2695910 2642992 2607144 2597321 2613184 2650743 2706502
15211B706502O9620P4321O4335L9249O773k0219l0975k2947j568K4833M8825O4040
$$ 2706502 2776122 2850443 2914778 2954027 2960800 2940581 2909606 2886659 2885091 2909924 2958749 3022789
15199C022789O5096M9782K0952j4677m9492p6646q9782q2629n0923L524P0295
$$ 3022789 3087885 3137667 3158619 3143942 3094450 3017804 2928022 2845393 2794470 2797994 2868289
15188B868289J32058J69318J66143J15869K4734q8895j99886k84249l26930l26134
$$ 2868289 3000347 3169665 3335808 3451677 3476411 3387516 3187630 2903381 2576451 2250317
15178B250317k90561k31565j58165p8138O26P2364J34996J87432K26194K46858
$$ 2250317 1959756 1728191 1570026 1491888 1492514 1564878 1699874 1887306 2113500 2360358
15168B360358K48771K36676K17424J96322J76679J60470J47475J35112J21447
$$ 2360358 2609129 2845805 3063229 3259551 3436230 3596700 3744175 3879287 4000734
15159D000734J07835R6668Q7322P7654P0383P4868R8933J38316J76108J94063
$$ 4000734 4108569 4205237 4292559 4370213 4440596 4515464 4614397 4752713 4928821 5122884
15149E122884J84614J53207J12200P4105M8475M0861N1375P4466J01571J23505
$$ 5122884 5307498 5460705 5572905 5647010 5695485 5736346 5787721 5862187 5963758 6087263
15139F087263J30743J16239Q1991M0397N804j4550k1349j9286j4480j2188j3839
$$ 6087263 6218006 6334245 6416236 6456633 6462437 6447887 6426538 6407252 6392772 6380584 6366745
15128F366745j7223k0688k5522l3329m3026n1747n6354n2466l4913l021L3797
$$ 6366745 6349522 6328834 6303312 6269983 6226957 6175210 6118856 6066390 6031477 6028456 6062253
15117F062253N9004O1792M8775M1757O1760J13361J82924K48344K89207K93731
$$ 6062253 6121257 6183049 6231824 6273581 6335341 6448702 6631626 6879970 7169177 7462908
15107G462908K63123K09119J44620P7821J6291k8524m5985l3646J777M7961R0726
$$ 7462908 7726031 7935150 8079770 8157591 8173882 8145358 8099373 8065727 8067504 8115465 8206191
15096H206191J18744J28228J24003J16630J16557J26754J39177J40272J21809
$$ 8206191 8324935 8453163 8577166 8693796 8810353 8937107 9076284 9216556 9338365
15087I338365Q6329M2891N92l2760m8511l7361N694P6394J63651K58170L57423
$$ 9338365 9424694 9467585 9468177 9435417 9386906 9349545 9355239 9431633 9595284 9853454 10210877
15076A0210877M63325N77967P01897Q33928R70314J103632J224378J326185J410122
$$ 10210877 10674202 11252169 11954066 12787994 13758308 14861940 16086318 17412503 18822625
15067A8822625J483369J554968J634326J730978J851313J994299K150856K307259
$$ 18822625 20305994 21860962 23495288 25226266 27077579 29071878 31222734 33529993
15059C3529993K450868K575303K681284K772615K851234K915549K961880K984938
$$ 33529993 35980861 38556164 41237448 44010063 46861297 49776846 52738726 55723664
15051E5723664K976318K924032K814936K640268K402845K121375J827466J555401
$$ 55723664 58699982 61624014 64438950 67079218 69482063 71603438 73430904 74986305
15043G4986305J330224J159953J034397R29201Q11504O46730M08473Q8706k99154
$$ 74986305 76316529 77476482 78510879 79440080 80251584 80898314 81306787 81395493 81096339
15034H1096339p27393j166592j595556k002641k379310k713658k989969l193746
$$ 81096339 80368946 79202354 77606798 75604157 73224847 70511189 67521220 64327474
15026F4327474l317227l360113l326550l224617l068850k878892k672347k458621
$$ 64327474 61010247 57650134 54323584 51098967 48030117 45151225 42478878 40020257
15018D0020257k238158k005121j752351j478642j193916r17192o68623m61794
$$ 40020257 37782099 35776978 34024627 32545985 31352069 30434877 29766254 29304460
15010B9304460l00813j80723q8329o423P6001J56023K20654K57162K58973K24974
$$ 29304460 29003647 28822924 28734595 28728172 28804173 28960196 29180850 29438012 29696985 29921959
15000B9921959J56874N6901p3364k30576m04374n76003p24968q37666r09977r43855
$$ 29921959 30078833 30135734 30062370 29831794 29427420 28851417 28126449 27288783 26378806 25434951
14990B5434951r42742r08841q43042p47730o31169n08932l98778l11941k48736
$$ 25434951 24492209 23583368 22740326 21992596 21361427 20852495 20453717 20141776 19893040
14981A9893040k02651j68983j48595j43314j50221j61508j68340j64595j48804
$$ 19893040 19690389 19521406 19372811 19229497 19079276 18917768 18749428 18584833 18436029
14972A8436029j23677r4176o5812m2669k4910q722R700L0240N0012O7229Q2067
$$ 18436029 18312352 18218176 18152364 18109695 18084785 18076063 18085763 18116003 18166015 18233244 18315311
14961A8315311R3800R8611R1229O8911L3614r932n7440j05587j49669j81722j91759
$$ 18315311 18409111 18507722 18598951 18667862 18701476 18691544 18634104 18528517 18378848 18197126 18005367
14950A8005367j72256j23116n3107K4516R8620J63431K16945K57417K81389K85999
$$ 18005367 17833111 17709995 17656888 17681404 17780024 17943455 18160400 18417817 18699206 18985205
14940A8985205K74376K58104K52050K64202K87853L02939K87087K29248J35892
$$ 18985205 19259581 19517685 19769735 20033937 20321790 20624729 20911816 21141064 21276956
14931B1276956K5546q2795j78105k58196l25086l79627m18831m36542m26664l87257
$$ 21276956 21302502 21219707 21041602 20783406 20458320 20078693 19659862 19223320 18796656 18409399
14921A8409399l22644k42483j60498r3773n8669o2412r7478j44970j84093k00316
$$ 18409399 18086755 17844272 17683774 17590001 17531332 17468920 17371442 17226472 17042379 16842063
14911A6842063j89127j55298j08711n9458j4819K2542N6036R2935J36954J82467
$$ 16842063 16652936 16497638 16388927 16329469 16314650 16337192 16393228 16486163 16623117 16805584
14901A6805584K17331K32510K30412K24877K33033K65608L20830L84565M38292
$$ 16805584 17022915 17255425 17485837 17710714 17943747 18209355 18530185 18914750 19353042
14892A9353042M70198M80120M76742M72918M81877N12419N64326O28984O96409
$$ 19353042 19823240 20303360 20780102 21253020 21734897 22247316 22811642 23440626 24137035
14883B4137035P62770Q32240R12976J012397J136656J292544J485782J715337
$$ 24137035 24899805 25732045 26645021 27657418 28794074 30086618 31572400 33287737
14875C3287737J969570K229389K478000K710435K934067L159201L389470L619825
$$ 33287737 35257307 37486696 39964696 42675131 45609198 48768399 52157869 55777694
14867E5777694L839117M030817M172952M241177M212945M069497L798094L396722
$$ 55777694 59616811 63647628 67820580 72061757 76274702 80344199 84142293 87539015
14859H7539015K877113K261987J580291Q66194J60678m90517j043660j461939
$$ 87539015 90416128 92678115 94258406 95124600 95285278 94794761 93751101 92289162
14851I2289162j714749j776608j634587j305282q45894l38961J42175N53722Q75346
$$ 92289162 90574413 88797805 87163218 85857936 85012042 84673081 84815256 85368978 86244324
14842H6244324J096594J210100J210644J097120Q74896N55795J56309l04060q03934
$$ 86244324 87340918 88551018 89761662 90858782 91733678 92289473 92445782 92141722 91337788
14833I1337788j320580j828853k299712k702811l014724l226694l344159l379107
$$ 91337788 90017208 88188355 85888643 83185832 80171108 76944414 73600255 70221148
14825G0221148l343866l250455l111798k941155k749378k542666k324334k099669
$$ 70221148 66877282 63626827 60515029 57573874 54824496 52281830 49957496 47857827
14817D7857827j877683j667397j473805j298715j145176j019700r28512q70816
$$ 47857827 45980144 44312747 42838942 41540227 40395051 39375351 38446839 37576023
14809C7576023q35727q06683p70911p25882o76460o27152n79324n34161m93112
$$ 37576023 36740296 35933613 35162702 34436820 33760360 33133208 32553884 32019723 31526611
14800C1526611m53731m08023l47112k66785j67969n3840P0423J93295K93782L46834
$$ 31526611 31072880 30664857 30317745 30050960 29882991 29829151 29899574 30092869 30386651 30733485
14790C0733485L36273K65501J57904M6788l8230q0623p9203m4164J0329P1508
$$ 30733485 31069758 31335259 31493163 31539951 31501721 31421098 31341895 31297731 31308060 31379568
14780C1379568J28423J72669K02990K27208K56382K96802L45907L92267M18989
$$ 31379568 31507991 31680660 31883650 32110858 32367240 32664042 33009949 33402216 33821205
14771C3821205M10722L60967K74904J67496N9205k9820q5440j02613q6161n0357
$$ 33821205 34231927 34592894 34867798 35035294 35094499 35064679 34979239 34876626 34790465 34740108
14761C4740108j5022L266m11j7964l3799l1969j775N7861J36079K14510K78640
$$ 34740108 34725086 34728352 34727941 34709977 34676178 34644209 34642434 34700295 34836374 35050884 35329524
14750C5329524L25793L61083L87796M03581M03465L83722L43944K88448K25990
$$ 35329524 35655317 36016400 36404196 36807777 37211242 37594964 37938908 38227356 38453346
14741C8453346J66919J19872Q9616P5564P1400O7937N8613M3264K6396J1743j070
$$ 38453346 38620265 38740137 38829753 38905317 38976717 39044654 39103267 39146531 39172927 39184670 39183600
14730C9183600j4744l0540m7351o4570q5871j19570j73140k45651l25956l99222
$$ 39183600 39168856 39138316 39090965 39026395 38940524 38820954 38647814 38402163 38076207 37676985
14720C7676985m55855m96271n29526n67014o14906o70899p26787p73867q09150
$$ 37676985 37221130 36724859 36195333 35628319 35013413 34342514 33615727 32841860 32032710
14711C2032710q39362q76613r26870r82597j027381j046959j035106r91816r20463
$$ 32032710 31193348 30316735 29389865 28407268 27379887 26332928 25297822 24306006 23385543
14702B3385543q27977p25019o23295n32197m57983m04213l70852l53182l42815
$$ 23385543 22557566 21832547 21209252 20677055 20219072 19814859 19444007 19090825 18748010
14693A8748010l31228l13789k90461k61824k25064j75715j13376m3754K6173R2950
$$ 18748010 18416782 18102993 17812532 17550708 17325644 17149929 17036553 16992799 17018972 17111922
14683A7111922J53754J99831K17616J98459J45777P2395p387q3004j47306j93512
$$ 17111922 17265676 17465507 17683123 17881582 18027359 18099754 18092367 18009363 17862057 17668545
14673A7668545k14355k05536j69773j16929o1644k0931r601l2666q0246j31277
$$ 17668545 17454190 17248654 17078881 16961952 16900308 16879377 16869776 16837110 16756864 16625587
14663A6625587j65623j76026j69961j60501j55031j50456j37039j07018o1005
$$ 16625587 16459964 16283938 16113977 15953476 15798445 15647989 15510950 15403932 15342927
14654A5342927p407M3353Q3791J09564J17265J05099P7166M5631K5363K4549M0578
$$ 15342927 15335520 15378873 15462664 15572228 15689493 15794592 15871758 15917389 15942752 15967301 16007879
14643A6007879O4499Q7415J02579J04532Q9733N9134J8940k2063n5076p1521o3413
$$ 16007879 16072378 16159793 16262372 16366904 16456637 16515771 16534711 16512648 16457572 16386051 16322638
14632A6322638k6515L5561J10984J84429K42443K75488K77875K48693J92939J19855
$$ 16322638 16296123 16331684 16442668 16627097 16869540 17145028 17422903 17671596 17864535 17984390
14622A7984390L8360m6547j32684k15955k86696l30589l35143k99505k39618j82540
$$ 17984390 18022750 17976203 17843519 17627564 17340868 17010279 16675136 16375631 16136013 15953473
14612A5953473j53785j66767k18723k92165l60353l96404l83791l23139k30930
$$ 15953473 15799688 15632921 15414198 15122033 14761680 14365276 13981485 13658346 13427416
14603A3427416j30573m2864J7974M4330L5265l529o0831j22093j72388j99420
$$ 13427416 13296843 13253979 13271953 13316283 13351548 13348019 13287188 13165095 12992707 12793287
14593A2793287j95917j60954j00002k4407M9973J07003J37404J43664J37193J30140
$$ 12793287 12597370 12436416 12336414 12312007 12361980 12468983 12606387 12750051 12887244 13017384
14583A3017384J30043J39729J58717J84843K16437K52298K88281L16319L30128
$$ 13017384 13147427 13287156 13445873 13630716 13847153 14099451 14387732 14704051 15034179
14574A5034179L30864L24725L16498L06673K93397K77527K66202K69002K88933
$$ 15034179 15365043 15689768 16006266 16312939 16606336 16883863 17150065 17419067 17708000
14565A7708000L16964L35342L28158K92624K42688K01088J85023J96354K22753
$$ 17708000 18024964 18360306 18688464 18981088 19223776 19424864 19609887 19806241 20028994
14556B0028994K46541K52767K32378J82723J07836J6957p8833j68607k42751k95991
$$ 20028994 20275535 20528302 20760680 20943403 21051239 21068196 20989363 20820756 20578005 20282014
14546B0282014l30200l52162l67613l77935l81056l72779l49045l11299k69278
$$ 20282014 19951814 19599652 19232039 18854104 18473048 18100269 17751224 17439925 17170647
14537A7170647k35826k19473k21542k37517k60037k81218k93262k89404k67048
$$ 17170647 16934821 16715348 16493806 16256289 15996252 15715034 15421772 15132368 14865320
14528A4865320k30516j90523j60557j51006j62481j84118k00364k00277j81256
$$ 14865320 14634804 14444281 14283724 14132718 13970237 13786119 13585755 13385478 13204222
14519A3204222j46626j01603n1373j487M2036P4508R4136J01132R5130P3612L3532
$$ 13204222 13057596 12955993 12904620 12903133 12945169 13019677 13113813 13214945 13310075 13383687 13417219
14508A3417219k4797r5571j69529k37822k93894l32835l50680l45373l18644k77874
$$ 13417219 13392422 13296851 13127322 12889500 12595606 12262771 11912091 11566718 11248074 10970200
14498A0970200k36583k09787k04695k15525k28339k30460k15974j85388j43186
$$ 10970200 10733617 10523830 10319135 10103610 9875271 9644811 9428837 9243449 9100263
14489I100263r6649n5138k7381j7775k5026m3776o7572r1116j09554j15504r8751
$$ 9100263 9003614 8948476 8921095 8903320 8878294 8834518 8766946 8675830 8566276 8450772 8352021
14478H352021n1393K5390J18665K07639K71696K97628K83647K39770J82947J27974
$$ 8352021 8300628 8326018 8444683 8652322 8924018 9221646 9505293 9745063 9928010 10055984
14468A0055984Q1139M1430O038k6019n4427q0545j08843j45303j93826k52633
$$ 10055984 10137123 10178553 10184591 10158572 10104145 10023600 9914757 9769454 9575628 9322995
14458I322995l13445l65394m00568m15894m10224l80648l22140k31009j10496
$$ 9322995 9009550 8644156 8243588 7827694 7417470 7036822 6714682 6483673 6373177
14449F373177K4879J51908K49053L06037L24896L14797K88211K60220K45261K48996
$$ 6373177 6398056 6549964 6799017 7105054 7429950 7744747 8032958 8293178 8538439 8787435
14439H787435K63617K74075K69632K49605K20377J88912J57901J24551Q3350L0506
$$ 8787435 9051052 9325127 9594759 9844364 10064741 10253653 10411554 10536105 10619455 10649961
14429A0649961l4391j10911j99428k96845l89778m54737m69893m30780l55232
$$ 10649961 10615570 10504659 10305231 10008386 9618608 9163871 8693978 8263198 7907966
14420G907966k72312k06349j69240j61256j73535j91603k01369j93616j64314
$$ 7907966 7635654 7429305 7260065 7098809 6925274 6733671 6532302 6338686 6174372
14411F174372j14675n2692Q197N5155Q1696Q8105P7959N4963K1609k1048p2050
$$ 6174372 6059697 6007005 6015202 6070357 6152053 6240158 6318117 6373080 6394689 6373641 6301591
14400F301591j27551j79407k17894k36161k32006k06726j63836j09307n1936q23
$$ 6301591 6174040 5994633 5776739 5540578 5308572 5101846 4938010 4828703 4776767 4775944
14390D775944L9908P3303J05088J36942J63471J74546J60837J18681N2056k7633
$$ 4775944 4815852 4889155 4994243 5131185 5294656 5469202 5630039 5748720 5800776 5773143
14380E773143j03965j60815j89075j89500j69136j36010r6443n3940r571L4749
$$ 5773143 5669178 5508363 5319288 5129788 4960652 4824642 4728199 4674259 4664688 4699437
14370D699437P2675R3943Q9604N7804N249n6231j15472j66293k07374k38964k60564
$$ 4699437 4772112 4866055 4955659 5013463 5018712 4962481 4847009 4680716 4473342 4234378 3973814
14359C973814k70215k63713k34801j79098j00266j2122O7048J23297J51427J53476
$$ 3973814 3703599 3439886 3205085 3025987 2925721 2913599 2980647 3103944 3255371 3408847
14349C408847J35390J04626O8877L5195R434l986l572O282J5204J2636m956l2356
$$ 3408847 3544237 3648863 3717740 3752935 3762369 3758383 3754811 3761093 3776297 3788933 3783977 3751621
14337C751621n9584p6152p3213m6111K674O2999J20142J60385J76480J69332J44568
$$ 3751621 3692037 3615885 3542672 3496561 3499235 3562234 3682376 3842761 4019241 4188573 4333141
14326D333141J07721O2889J4426l1561o7543q6958q7955p6264o3076n7696o2438
$$ 4333141 4440862 4503751 4518177 4486616 4419073 4332115 4244160 4167896 4104820 4047124 3984686
14315C984686p6058r9839j35995j79712k15906k25946j98330j35129n1250L2308
$$ 3984686 3908628 3808789 3672794 3493082 3277176 3051230 2852900 2717771 2666521 2698829
14305B698829R7772J37314J53017J51335J37770J15464Q6423N2738J7160j6395
$$ 2698829 2796601 2933915 3086932 3238267 3376037 3491501 3577924 3630662 3647822 3631427
14295C631427m2929n7913n9459n0047l6393k6199k3832k9349m0850n5350o7571
$$ 3631427 3588498 3530585 3471126 3421079 3384686 3358487 3334655 3305306 3264456 3209106 3141535
14284C141535p1084o2870m6239k7850j1402N645K9662O4886J07415J43120J52945
$$ 3141535 3070451 3007581 2961342 2933492 2922090 2927735 2957397 3022283 3129698 3272818 3425763
14273C425763J23529N4934l9624j38989k20111k65072k68176k37751j88989j34192
$$ 3425763 3549292 3604226 3564602 3425613 3205502 2940430 2672254 2434503 2245514 2111322
14263B111322q0834l6508j0633r866l2871o9700j06422j31795j41469j37051j21115
$$ 2111322 2030488 1993980 1983347 1973481 1940610 1870910 1764488 1632693 1491224 1354173 1233058
14252A233058r3670n3747l683M8867R3438J22500J35927J39706J40002J38992
$$ 1233058 1139388 1085641 1081958 1130825 1224263 1346763 1482690 1622396 1762398 1901390
14242A901390J35164J24848J03650O9366K5599j7391m6118n0796l2054j336K7093
$$ 1901390 2036554 2161402 2265052 2334418 2360017 2342626 2296508 2245712 2213658 2212322 2239415
14231B239415M4861N0580M5258K9956P571j6197l5628m8985n9192p0147q2432
$$ 2239415 2284276 2334856 2380114 2410070 2417641 2401444 2365816 2316831 2257639 2187492 2105060
14220B105060r2115r3560q4722p0703o2076o9494r8697j48340k11145k76525l32754
$$ 2105060 2012945 1919385 1834663 1763960 1701884 1632390 1533693 1385353 1174208 897683 564929
14209E64929l69106l79286l64568l32280k89267k36786j72891r9402k5342L5588
$$ 564929 195823 -183463 -548031 -880311 -1169578 -1406364 -1579255 -1678657 -1703999 -1668411
14199a668411P0252P2193M6855J0710j7509k7676k3414j8033k4385m7388q4319
$$ -1668411 -1598159 -1525966 -1479111 -1468401 -1485910 -1513586 -1537000 -1555033 -1579418 -1626806 -1711125
14188a711125j28790j72489k05307k17363k02427j60391r7031k0812O0545J40831
$$ -1711125 -1839915 -2012404 -2217711 -2435074 -2637501 -2797892 -2894923 -2915735 -2855190 -2714359
14178b714359K14277K75401L20391L48017L59123L55971L41994L21911L02138
$$ -2714359 -2500082 -2224681 -1904290 -1556273 -1197150 -841179 -499185 -177274 124864
14169A24864K88622K80738K67928K35046J72100Q0129k9315j39246k33769l02287
$$ 124864 413486 694224 962152 1197198 1369298 1449427 1420112 1280866 1047097 744810
14159G44810l39950l46319l23154k71321j89681p9666M7705J70579K64671L15362
$$ 744810 404860 58541 -264613 -535934 -725615 -805281 -757576 -586997 -322326 -6964
14149f964L23825L02552K64508K15027J52578P6484o490q3216j41854j78585j97553
$$ -6964 316861 619413 883921 1098948 1251526 1328010 1321520 1238304 1096450 917865 720312
14138G20312k05059k03989j93204j70897j37314r5096m9501r750J1524M562k8739
$$ 720312 515253 311264 118060 -52837 -190151 -285247 -334748 -344498 -332974 -328412 -357151
14127c57151p2831j07371j18894j04501o6063l657Q3477J89875K99388L89297
$$ -357151 -429982 -537353 -656247 -760748 -826811 -830468 -746991 -557116 -257728 131569
14117A31569M40855M47619M15929L60401K98630K45136K05651J75999J46625J08223
$$ 131569 572424 1020043 1435972 1796373 2095003 2340139 2545790 2721789 2868414 2976637
14107B976637N4570j6827j03987j99108k88335l54889l86363l82388l55705l24241
$$ 2976637 3031207 3014380 2910393 2711285 2422950 2068061 1681698 1299310 943605 619364
14097F19364l00501k86582k77196k66307k51082k31444k07454j77302j38273q9837
$$ 619364 318863 32281 -244915 -511222 -762304 -993748 -1201202 -1378504 -1516777 -1606614
14087a606614l5677J6473N7156P9750Q4481P9041P4894P9849R1593R9389R4646
$$ -1606614 -1642291 -1625818 -1568662 -1488912 -1404431 -1325390 -1250496 -1170647 -1079054 -979665 -885019
14076h85019Q0906P2178P9218R7019J06150Q6137K8708n7113j48051k15860k40259
$$ -885019 -804113 -731935 -652717 -555698 -449548 -363411 -334703 -391816 -539867 -755727 -995986
14065i95986k18788j66804j09333p1329o9429j05626j65965k26318k62514k59751
$$ -995986 -1214774 -1381578 -1490911 -1562240 -1631669 -1737295 -1903260 -2129578 -2392092 -2651843
14055b651843k17519j48628p2880q156L6661O3976Q4380J09314J43584J81991
$$ -2651843 -2869362 -3017990 -3090870 -3099026 -3062365 -2998389 -2914009 -2804695 -2661111 -2479120
14045b479120K11609K19027J98054J50820Q2068m368j01992j96686k67791k95804
$$ -2479120 -2267511 -2048484 -1850430 -1699610 -1617542 -1621910 -1723902 -1920588 -2188379 -2484183
14035b484183k71608k01222j02887J571R4563J65106K07447K19315K00945J55777
$$ -2484183 -2755791 -2957013 -3059900 -3058329 -2963766 -2798660 -2591213 -2371898 -2170953 -2015176
14025b015176R2410K4364l4457p5358r6449r9728q7149n8397j1729N1067J19410
$$ -2015176 -1922766 -1898402 -1932859 -2008217 -2104666 -2204394 -2291543 -2349940 -2361669 -2310602 -2191192
14014b191192J76325K08889K15449K01902J73002J28270O5033j4829j00841j77047
$$ -2191192 -2014867 -1805978 -1590529 -1388627 -1215625 -1087355 -1022322 -1037151 -1137992 -1315039
14004a315039k28634k45407k21942j57770n8561O3065J89478L03240L92184M50712
$$ -1315039 -1543673 -1789080 -2011022 -2168792 -2227353 -2164288 -1974810 -1671570 -1279386 -828674
13994h28674M76809M69113M28546L61785K79505J90208R7865N835p9267j49228
$$ -828674 -351865 117248 545794 907579 1187084 1377292 1475157 1480992 1401725 1252497
13984A252497j99068k28175k37672k30751k14916j99156j88053j80370j72538
$$ 1252497 1053429 825254 587582 356831 141915 -57241 -245294 -425664 -598202
13975e98202j61588j45961j25892j03538q1353n9201l3391R84M6697J01806J58673
$$ -598202 -759790 -905751 -1031643 -1135181 -1216534 -1275735 -1309126 -1308142 -1261445 -1159639 -1000966
13964a000966K05876K32394K30654J97401J34725N1835l4681j04377j41201j42387
$$ -1000966 -795090 -562696 -332042 -134641 84 51919 17238 -87139 -228340 -370727
13954c70727j19156q6757n3922k1987R724M1669P4862J08887J39712J63077J79267
$$ -370727 -489883 -576640 -630562 -652549 -642825 -601156 -526294 -417407 -277695 -114618 64649
13943F4649J91618K01921K09820K15107K18390K19938K18307K09026J85479J43924
$$ 64649 256267 458188 668008 883115 1101505 1321443 1539750 1748776 1934255 2078179
13933B078179Q8753L2123j2504l8533n0836o3298r0623j40101k08426k83902l51009
$$ 2078179 2166932 2199055 2186551 2148018 2097182 2033884 1943261 1803160 1594734 1310832 959823
13922I59823l95486m09035l91302l48389k90031k27711j73310j35220j12237r2754
$$ 959823 564337 155302 -236000 -584389 -874420 -1102131 -1275441 -1410661 -1522898 -1615652
13912a615652o4432k6920O430K0693J2689o559j9562j2402J9114O9114J25897
$$ -1615652 -1680084 -1707004 -1700574 -1679881 -1667192 -1673751 -1693313 -1705715 -1686601 -1617487 -1491590
13901a491590J77195K12529K22839K01919J50561P8215o12p2405j29920j73899
$$ -1491590 -1314395 -1101866 -879027 -677108 -526547 -448332 -448944 -521349 -651269 -825168
13891h25168k09002k36842k53218k52087k31041j92048j37773o9723Q098Q4276
$$ -825168 -1034170 -1271012 -1524230 -1776317 -2007358 -2199406 -2337179 -2406902 -2398804 -2314528
13881b314528J40638J59702J34230P1481j1819r9030j77671k35924k59392k35303
$$ -2314528 -2173890 -2014188 -1879958 -1808477 -1820296 -1919326 -2096997 -2332921 -2592313 -2827616
13871b827616j61959n4636N8621J49336K00789K13082J99065J74406J48062J18723
$$ -2827616 -2989575 -3044211 -2985590 -2836254 -2635465 -2422383 -2223318 -2048912 -1900850 -1782127
13861a782127P8892K2564n0240j33536k16056k81669l13332l00876k46126j61007
$$ -1782127 -1703235 -1680671 -1730911 -1864447 -2080503 -2362172 -2675504 -2976380 -3222506 -3383513
13851c383513o2130L3189J09442J56328J72819J67682J53584J38173J19751R1309
$$ -3383513 -3445643 -3412454 -3303012 -3146684 -2973865 -2806183 -2652599 -2514426 -2394675 -2303366
13841b303366M9056k601n3893r6186j23848j30322j05980m3674N2043J62442K63139
$$ -2303366 -2254310 -2256911 -2310804 -2406990 -2530838 -2661160 -2767140 -2810814 -2758771 -2596329 -2333190
13830b333190L35612L72159L74905L53325L19940K83581K45302K01265J48911
$$ -2333190 -1997578 -1625419 -1250514 -897189 -577249 -293668 -48366 152899 301810
13821C01810R0137L0389k4433p1236j10661j44354j70972j84664j77889j46829
$$ 301810 391947 422336 397903 326667 216006 71652 -99320 -283984 -461873 -608702
13811f08702r5585l6449J3634L9333L2986k448n4367j05205j39640j51006j42869
$$ -608702 -704287 -740736 -727102 -687769 -654783 -657231 -711598 -816803 -956443 -1107449 -1250318
13800a250318j25096j08099r8615r7840j01893j04181r8825q4536o5871m9084
$$ -1250318 -1375414 -1483513 -1582128 -1679968 -1781861 -1886042 -1984867 -2069403 -2135274 -2184358
13790b184358l6325k4228p672J4573L5460M0374J4838m5912j33068k28197l10691
$$ -2184358 -2220683 -2244911 -2252583 -2238010 -2202550 -2162176 -2147338 -2193250 -2326318 -2554515 -2865206
13779b865206l63729l76942l47235k78904j81879o7683N3517J72636K82223L80079
$$ -2865206 -3228935 -3605877 -3953112 -4232016 -4413895 -4481578 -4428061 -4255425 -3973202 -3593123
13769c593123M69683N52819O20901O55093O36433N58754M35681K96674J74225
$$ -3593123 -3123440 -2570621 -1949720 -1294627 -658194 -99440 336241 632915 807140
13760H07140Q9677M5701L0281K8412L0407L0501K2209m82l7247p9696j16207j36756
$$ 807140 896817 942518 972799 1001211 1031618 1062119 1084328 1083846 1046599 966903 850696 713940
13748G13940j33436j00373l7115M6820J32664K00436K39477K53325K54196K51000
$$ 713940 580504 480131 443016 489836 622500 822936 1062413 1315738 1569934 1820934
13738A820934K41750K17506J73152J13926N2623K496k7587l5931l0647k7040l6899
$$ 1820934 2062684 2280190 2453342 2567268 2619891 2622387 2594800 2558869 2528222 2501182 2464283
13727B464283n8972q1006r0752q5999p7146q1563j13630j76961k62996l55220
$$ 2464283 2405311 2324305 2233553 2147554 2070408 1988845 1875215 1698254 1435258 1080038
13717A080038m35436m88583n05205m82646m25539l45105k56828j75991j12029
$$ 1080038 644602 156019 -349186 -831832 -1257371 -1602476 -1859304 -2035295 -2147324
13708b147324o6153l5082j5850n809mR015K8623O3172J11413J65080K11077K38435
$$ -2147324 -2213477 -2248559 -2264409 -2270218 -2270222 -2261207 -2232584 -2169412 -2057999 -1892919 -1681842 -1443407
13696a443407K45704K41667K37911K39881K44742K46304K40041K23968J97346
$$ -1443407 -1197703 -956036 -718125 -478244 -233502 12802 252843 476811 674157
13687F74157J60390J14900O4158J2191l6682p8806j13026j41421j66737j88638
$$ 674157 834547 949447 1013605 1025796 989114 910308 797282 655861 489124 300486
13677C00486k02766k03366j87530j59339j31128j19180j35283j79722k40219k97109
$$ 300486 97720 -105646 -293176 -452515 -583643 -702823 -838106 -1017828 -1258047 -1555156
13667a555156l32002l35648l11333k71859k31782j99962j77457j61145j47996
$$ -1555156 -1887158 -2222806 -2534139 -2805998 -3037780 -3237742 -3415199 -3576344 -3724340
13658c724340j35050j17530q9577m7039R528P2007J24593J49214J33764P7496
$$ -3724340 -3859390 -3976920 -4066497 -4113536 -4104008 -4032001 -3907408 -3758194 -3624430 -3546934
13648c546934q702j06366j95353k58428k84301k70425k24056j59034q9931k6856
$$ -3546934 -3555636 -3662002 -3857355 -4115783 -4400084 -4670509 -4894565 -5053599 -5143530 -5170386
13638e170386K7853P9997J39246K12739L00664L95745M86140N59863O08315O28002
$$ -5170386 -5142533 -5062536 -4923290 -4710551 -4409887 -4014142 -3528002 -2968139 -2359824 -1731822
13628a731822O19973N87320N32410M55719L57626K42561J21391Q709q3224j49057
$$ -1731822 -1111849 -524529 7881 463600 821226 1063787 1185178 1193887 1110663 961606
13618I61606j89998k09228k08475j89745j58652j23880r4280p7666q0077j02410
$$ 961606 771608 562380 353905 164160 5508 -118372 -212652 -290318 -370395 -472805
13608d72805j37910j75785k07357k27469k32996k23469k01010j65869j13095l7066
$$ -472805 -610715 -786500 -993857 -1221326 -1454322 -1677791 -1878801 -2044670 -2157765 -2194831
13598b194831N9760J63376K52921L08694L19090K85406K21898J48642Q1458K7191
$$ -2194831 -2135071 -1971695 -1718774 -1410080 -1090990 -805584 -583686 -435044 -353586 -326395
13588c26395j3367m0205n2737n3454n1504o0190q8442j33079j79511k12180k25895
$$ -326395 -339762 -379967 -432704 -486158 -537662 -597852 -686294 -819373 -998884 -1211064 -1436959
13577a436959k26912k23452k16451j99247j63351j02732j6239Q8784J94773K79191
$$ -1436959 -1663871 -1887323 -2103774 -2303021 -2466372 -2569104 -2585343 -2496559 -2301786 -2022595
13567b022595L24776L27074K94542K42990J89094J45238J16408J00906R3723Q8451
$$ -2022595 -1697819 -1370745 -1076203 -833213 -644119 -498881 -382473 -281567 -187844 -99393
13557i9393P7388N3256J2922m0250r7838j50097j88713k07577k03820j80059j44543
$$ -99393 -22005 31251 44173 3923 -93915 -244012 -432725 -640302 -844122 -1024181 -1168724
13546a168724j06481o9982l1872J4677P3675J41905K09037K61787K90642K95463
$$ -1168724 -1275205 -1345187 -1377059 -1362382 -1288707 -1146802 -937765 -675978 -385336 -89873
13536h9873K85993K76633K78182K91555L08525L18402L13374K88622K40412J66573
$$ -89873 196120 472753 750935 1042490 1351015 1669417 1982791 2271413 2511825 2678398
13526B678398O9472m1630j51496k42795l01164l20068l04118k67975k29694k02150
$$ 2678398 2747870 2706240 2554744 2311949 2010785 1690717 1386599 1118624 888930 686780
13516F86780j87388j76844j57906j22821p3314j8486L0932O7591Q9015R5239Q5680
$$ 686780 499392 322548 164642 41821 -31493 -49979 -19047 48544 137559 232798 318478
13505C18478N9841K1171k1779n8934q2313q6256o6583k2505M0647J11782J77531
$$ 318478 378319 399490 377711 318777 236464 150208 83625 61120 101767 213549 391080
13494C91080K26576K53466K59753K51010K32465K07091J76781J44362J13526Q6997
$$ 391080 617656 871122 1130875 1381885 1614350 1821441 1998222 2142584 2256110 2343107
13484B343107O5946N1264M4206M4991N0519N3450M3951J3865l9151j09359j83107
$$ 2343107 2409053 2460317 2504523 2549514 2600033 2653483 2697434 2711299 2672148 2562789 2379682
13473B379682k42880k75374k78505k61646k38802k20450k09865k03868j95397
$$ 2379682 2136802 1861428 1582923 1321277 1082475 862025 652160 448292 252895
13464B52895j77516j47471j07910o5170k6861j55R916L406j2485k6638l1569k8467
$$ 252895 75379 -72092 -180002 -245172 -272033 -272188 -262272 -258866 -271351 -297989 -329558 -358025
13452c58025k6006l4336n7569r0731j24402j51800j71503j85514j96751k07663
$$ -358025 -384031 -418367 -475936 -566667 -691069 -842869 -1014372 -1199886 -1396637 -1604300
13442a604300k17916k21215k06045j62712r1500n352P4197J25490J36388J10932
$$ -1604300 -1822216 -2043431 -2249476 -2412188 -2503688 -2509040 -2434843 -2309353 -2172965 -2062033
13432b062033O8961L7824L9362P8302J39598J97785K31719K33708K09085J70587
$$ -2062033 -1993072 -1955248 -1915886 -1837584 -1697986 -1500201 -1268482 -1034774 -825689 -655102
13422f55102J32507J07039J03132J25215J70132K26090K76945L08919L14553K92251
$$ -655102 -522595 -415556 -312424 -187209 -17077 209013 485958 794877 1109430 1401681
13412A401681K44467J77721J03331L5440j3866l9563m6218m5487m7936n5219o0770
$$ 1401681 1646148 1823869 1927200 1962640 1948774 1909211 1862993 1817506 1769570 1714351 1653581
13401A653581n8639n1011m7383n7725q6073j28565j76974k24417k66515k97797
$$ 1653581 1594942 1543931 1496548 1438823 1352750 1224185 1047211 822794 556279 258482
13391B58482l10831l00967k70986k31084j94678j72300j66664j72591j82203j90202
$$ 258482 -52349 -353316 -624302 -855386 -1050064 -1222364 -1389028 -1561619 -1743822 -1934024
13381a934024j94156j91740j80891j63224j44800j32140j27732j28590j28224
$$ -1934024 -2128180 -2319920 -2500811 -2664035 -2808835 -2940975 -3068707 -3197297 -3325521
13372c325521j20377j01191o8218j9422M4532J16793J83839K29807K44052K26701
$$ -3325521 -3445898 -3547089 -3615307 -3634729 -3590197 -3473404 -3289565 -3059758 -2815706 -2589005
13362b589005J87667J40629R7133O3430L9197J8998k424k5248m5015n6643n7905
$$ -2589005 -2401338 -2260709 -2163576 -2100146 -2060949 -2041951 -2044375 -2069623 -2114638 -2171281 -2229186
13351b229186n0448l7812k2234l591J8995M4557O8072Q0139P0252L2888k7853
$$ -2229186 -2279634 -2317446 -2339680 -2343271 -2324276 -2279719 -2211647 -2131508 -2061256 -2028368 -2056221
13340b056221r8630j61880k02090k09831j82206j22004l7909N5758J42369K08744
$$ -2056221 -2154851 -2316731 -2518821 -2728652 -2910858 -3032862 -3070771 -3015013 -2872644 -2663900
13330b663900K49757K69312K77632K85749K98943L12834L15881K96731K50522
$$ -2663900 -2414143 -2144831 -1867199 -1581450 -1282507 -969673 -653792 -357061 -106539
13321a06539J80468R5256N006q1608j58352k20902k65593k89537k93430k83789
$$ -106539 73929 169185 174191 92583 -65769 -286671 -552264 -841801 -1135231 -1419020
13311a419020k69704k55790k38952k11935j68822j07622l1635M9018J20336J73233
$$ -1419020 -1688724 -1944514 -2183466 -2395401 -2564223 -2671845 -2703480 -2654462 -2534126 -2360893
13301b360893K08579K31686K43295K36523K01116J30872K9306q9547k04179k90260
$$ -2360893 -2152314 -1920628 -1677333 -1440810 -1239694 -1108822 -1079516 -1169063 -1373242 -1663502
13291a663502l27231l06029k33070j27621j4879Q2076J49434J86464K03556K14481
$$ -1663502 -1990733 -2296762 -2529832 -2657453 -2672332 -2590256 -2440822 -2254358 -2050802 -1836321
13281a836321K27124K40206K47772K44955K29855K03289J69330J34770J05353
$$ -1836321 -1609197 -1368991 -1121219 -876264 -646409 -443120 -273790 -139020 -33667
13272c3667Q1715N9755L4989N887k5930n6254p9478r2194r6494r7371r5434q4639
$$ -33667 48048 107803 142792 148679 122749 66495 -12983 -105177 -201671 -299042 -394476 -479115
13260d79115n9898k6060K705J2778J35k9427o6681j04395j37982j63327j75564
$$ -479115 -539013 -565073 -562368 -549590 -549455 -578882 -645563 -749958 -887940 -1051267 -1226831
13249a226831j70238j45566j03767n0464O601N8547R7455J20114J29466J31080
$$ -1226831 -1397069 -1542635 -1646402 -1696866 -1690265 -1631718 -1534263 -1414149 -1284683 -1153603
13239a153603J28515J22192J10785R2228O3992K3963k7276q4035j35670j70266
$$ -1153603 -1025088 -902896 -792111 -699883 -635891 -611928 -639204 -723239 -858909 -1029175
13229a029175j79284j59768j14313n1264J5356O9345R8738J00800Q2762N8108
$$ -1029175 -1208459 -1368227 -1482540 -1533804 -1518448 -1449103 -1350365 -1249565 -1166803 -1108695
13219a108695L9509L2436L4812M1205M5548M2644L2005K0396J7515K8569N2185
$$ -1108695 -1069186 -1036750 -1001938 -960733 -915185 -872541 -840536 -820140 -802625 -774056 -721871
13208g21871Q3685J17905J49948J75876J92322J94889J79136J44713R7868M9712
$$ -721871 -638186 -520281 -370333 -194457 -2135 192754 371890 516603 614471 664183
13198F64183J2359m985P06K4667N5605P9836Q6343P0092L2284k1462q2956j42964
$$ 664183 676542 671557 672263 696930 752535 832371 918714 988806 1021090 999628 916672 773708
13186G73708j93645k31270k57344k77311k97025l18594l39057l53005l55270l40752
$$ 773708 580063 348793 91449 -185862 -482887 -801481 -1140538 -1493543 -1848813 -2189565
13176b189565l04422k45589j72309r8409l4330J8231O1991R6388J16689J20530
$$ -2189565 -2493987 -2739576 -2911885 -3010294 -3044624 -3026393 -2964402 -2868014 -2751325 -2630795
13166b630795J13179J05691J08988J29030J64548K07563K47266K74854K86077
$$ -2630795 -2517616 -2411925 -2302937 -2173907 -2009359 -1801796 -1554530 -1279676 -993599
13157i93599K80730K60769K29962J95088J64502J43545J32388J29245J34081J47404
$$ -993599 -712869 -452100 -222138 -27050 137452 280997 413385 542630 676711 824115
$$ [...]
##END NTUPLES=NMR SPECTRUM
##END=
