##TITLE=31P ikalashn
DE-76 
13.11.2024
##JCAMPDX= 6.0         $$ Bruker NMR JCAMP-DX V2.0
##DATA TYPE= NMR SPECTRUM
##DATA CLASS= NTUPLES
##ORIGIN= UXNMR, Bruker Analytische Messtechnik GmbH
##OWNER= root
$$ TOPSPIN		Version 1.3
$$ 2024-11-13 13:41:46.062 +0400  Irina@DPX200
$$ Compression mode = diff/dup
##.OBSERVE FREQUENCY= 81.01967998063
##.OBSERVE NUCLEUS= ^31P
##.ACQUISITION MODE= SIMULTANEOUS
##.ACQUISITION SCHEME= undefined
##.AVERAGES= 64
##.DIGITISER RES= 17
##SPECTROMETER/DATA SYSTEM= spect
##.PULSE SEQUENCE= zgpg
##.SOLVENT NAME= D2O
##.SHIFT REFERENCE= INTERNAL, D2O, 1, 298.5841
##AUDIT TRAIL= $$ (NUMBER, WHEN, WHO, WHERE, WHAT)
$$ ##TITLE= Audit trail, TOPSPIN		Version 1.3
$$ ##JCAMPDX= 5.01
$$ ##ORIGIN= Bruker BioSpin GmbH
$$ ##OWNER= Irina
$$ $$ F:/spectra/data/iren/nmr/P31dec/1/pdata/1/auditp.txt
$$ ##AUDIT TRAIL=  $$ (NUMBER, WHEN, WHO, WHERE, VERSION, WHAT)
(   1,<2024-11-13 13:41:26.312 +0400>,<Irina>,<DPX200>,<TOPSPIN 1.3>,
      <created by zg
	started at 2024-11-13 13:39:42.906 +0400,
	POWCHK disabled, PULCHK disabled
       configuration hash MD5:
       BE 6D 3F 07 2A EA 11 49 91 17 2B D3 AF B3 58 0D
       data hash MD5: 32K
       E7 94 D8 F1 3B 62 0A 8A 5E EF BD 9D 7A F4 C1 D6>)
(   2,<2024-11-13 13:41:26.765 +0400>,<Irina>,<DPX200>,<TOPSPIN 1.3>,
      <Start of raw data processing
       efp BC_mod = 2 LB = 15 FT_mod = 6 PKNL = 1 PHC0 = 127.839 PHC1 = 200.8306 SI = 32K 
       data hash MD5: 32K
       86 C7 58 D8 C5 83 3A E1 01 5B 22 1F 9F 3F 17 62>)
(   3,<2024-11-13 13:41:29.046 +0400>,<Irina>,<DPX200>,<TOPSPIN 1.3>,
      <apk 
       data hash MD5: 32K
       8E C8 C0 14 17 47 B4 00 B1 42 3D 00 5D AE 0F 32>)
(   4,<2024-11-13 13:41:31.062 +0400>,<Irina>,<DPX200>,<TOPSPIN 1.3>,
      <abs n ABSG = 5 
       data hash MD5: 32K
       0D FA D7 E0 AD 3E AE B2 78 A6 61 3F 20 33 1C B6>)
$$ ##END=
$$ 
$$ $$ hash MD5
$$ $$ 03 D7 B6 18 1B 2E E3 50 68 4F AE 92 9C F0 AF 67
##$RELAX= 
##$RELAX= 
##$RELAX= 
##$RELAX= 
##$RELAX= 
##$RELAX= 
##$RELAX= 
##$RELAX= 
##$RELAX= 
##$RELAX= 
##$RELAX= 
$$ Bruker specific parameters
$$ --------------------------
##$DU= <F:/spectra>
##$EXPNO= 1
##$NAME= <P31dec>
##$PROCNO= 1
##$TYPE= <nmr>
##$USER= <iren>
##$AMP= (0..31)
100 100 100 100 100 100 100 100 100 100 100 100 100 100 100 100 100 100 
100 100 100 100 100 100 100 100 100 100 100 100 100 100 
##$ANAVPT= -1
##$AQSEQ= 0
##$AQ_mod= 1
##$AUNM= <au_zg>
##$AUTOPOS= <>
##$BF1= 81.014009
##$BF2= 200.13
##$BF3= 200.13
##$BF4= 200.13
##$BF5= 200.13
##$BF6= 200.13
##$BF7= 200.13
##$BF8= 200.13
##$BYTORDA= 1
##$CFDGTYP= 0
##$CFRGTYP= 5
##$CHEMSTR= <none>
##$CNST= (0..63)
1 1 145 1 1 1 1 1 1 1 1 1 1 1 1 1 1 1 1 1 1 1 1 1 1 1 1 1 1 1 1 1 1 1 
1 1 1 1 1 1 1 1 1 1 1 1 1 1 1 1 1 1 1 1 1 1 1 1 1 1 1 1 1 1 
##$CPDPRG= <waltz16>
##$CPDPRG1= <>
##$CPDPRG2= <waltz16>
##$CPDPRG3= <>
##$CPDPRG4= <mlev>
##$CPDPRG5= <mlev>
##$CPDPRG6= <mlev>
##$CPDPRG7= <mlev>
##$CPDPRG8= <mlev>
##$CPDPRGB= <>
##$CPDPRGT= <>
##$D= (0..63)
$$ [...]
##$SW_h= 37037.037037037
##$TD= 32768
##$TD0= 1
##$TE= 300
##$TE2= 300
##$TE3= 300
##$TEG= 300
##$TL= (0..7)
0 120 53 12 22 120 120 120 
##$TP= (0..7)
150 150 150 150 150 150 150 150 
##$TP07= 0
##$TPNAME0= <>
##$TPNAME1= <>
##$TPNAME2= <>
##$TPNAME3= <>
##$TPNAME4= <>
##$TPNAME5= <>
##$TPNAME6= <>
##$TPNAME7= <>
##$TPOAL= (0..7)
0.5 0.5 0.5 0.5 0.5 0.5 0.5 0.5 
##$TPOFFS= (0..7)
0 0 0 0 0 0 0 0 
##$TUNHIN= 0
##$TUNHOUT= 0
##$TUNXOUT= 0
##$USERA1= <user>
##$USERA2= <user>
##$USERA3= <user>
##$USERA4= <user>
##$USERA5= <user>
##$V9= 5
##$VALIST= <valist>
##$VCLIST= <CCCCCCCCCCCCCCC>
##$VD= 0
##$VDLIST= <DDDDDDDDDDDDDDD>
##$VPLIST= <PPPPPPPPPPPPPPP>
##$VTLIST= <TTTTTTTTTTTTTTT>
##$WBST= 1024
##$WBSW= 4
##$XGAIN= (0..3)
0 0 0 0 
##$XL= 0
##$YL= 0
##$YMAX_a= 1609
##$YMIN_a= -2281
##$ZGOPTNS= <>
##$ZL1= 120
##$ZL2= 120
##$ZL3= 120
##$ZL4= 120
##$ABSF1= 298.5841
##$ABSF2= -158.5842
##$ABSG= 5
##$ABSL= 5
##$ALPHA= 0
##$AQORDER= 0
##$ASSFAC= 0
##$ASSFACI= 0
##$ASSFACX= 0
##$ASSWID= 0
##$AUNMP= <proc_1d>
##$AXLEFT= 0
##$AXRIGHT= 0
##$AXTYPE= 0
##$AXUNIT= <>
##$AZFE= 0.1
##$AZFW= 0.5
##$BCFW= 0
##$BC_mod= 2
##$BYTORDP= 0
##$COROFFS= 0
##$CY= 12.5935478210449
##$DATMOD= 1
##$DC= 0
##$DFILT= <>
##$DTYPP= 0
##$F1P= 47.1127640792319
##$F2P= -24.0371245302204
##$FCOR= 0.5
##$FTSIZE= 32768
##$FT_mod= 6
##$GAMMA= 0
##$GB= 0
##$INTBC= 1
##$INTSCL= 7.269226e-011
##$ISEN= 30
##$LB= 15
##$LEV0= 0
##$LPBIN= 0
##$MAXI= 12.09355
##$MC2= 0
##$MEAN= 0
##$ME_mod= 0
##$MI= 0.7550151
##$NCOEF= 0
##$NC_proc= -15
##$NLEV= 6
##$NOISF1= 298.5841
##$NOISF2= 270.0111
##$NSP= 0
##$NTH_PI= 0
##$NZP= 0
##$OFFSET= 298.5841
##$PC= 1.4
##$PHC0= 29.70907
##$PHC1= 392.8707
##$PH_mod= 1
##$PKNL= yes
##$PPARMOD= 0
##$PPDIAG= 0
##$PPIPTYP= 0
##$PPMPNUM= 100
##$PPRESOL= 1
##$PSCAL= 0
##$PSIGN= 0
##$REVERSE= no
##$SF= 81.014009
##$SI= 32768
##$SIGF1= 270.0111
##$SIGF2= -158.5842
##$SINO= 77.54984
##$SIOLD= 32768
##$SREGLST= <31P.CDCl3>
##$SSB= 0
##$STSI= 32768
##$STSR= 0
##$SW_p= 37037.037037037
##$SYMM= 0
##$S_DEV= 0
##$TDeff= 32768
##$TDoff= 0
##$TI= <>
##$TILT= no
##$TM1= 0
##$TM2= 0
##$TOPLEV= 0
##$USERP1= <user>
##$USERP2= <user>
##$USERP3= <user>
##$USERP4= <user>
##$USERP5= <user>
##$WDW= 1
##$XDIM= 32768
##$YMAX_p= 492140114
##$YMIN_p= -121807000
$$ End of Bruker specific parameters
$$ ---------------------------------
##NTUPLES= NMR SPECTRUM
##VAR_NAME=  FREQUENCY,     SPECTRUM/REAL,   SPECTRUM/IMAG
##SYMBOL=    X,             R,               I
##VAR_TYPE=  INDEPENDENT,   DEPENDENT,       DEPENDENT
##VAR_FORM=  AFFN,          ASDF,            ASDF
##VAR_DIM=   32768,         32768,           32768
##UNITS=     HZ,            ARBITRARY UNITS, ARBITRARY UNITS
##FACTOR=    1.13031516577767, 1,            1
##FIRST=     37037.037037037, 39318116,      54546980
##LAST=      0,             34721860,        -15726102
##MIN=       0,             -121807000,      0
##MAX=       37037.037037037, 492140114,     0
$$ Real data points
##PAGE= N=1
##DATA TABLE= (X++(R..R)), XYDATA
$$ [...]
$$ plain form
17453 -4225944 -1604297 556235 1822473 1900827 735961 -1473069 -4346261 -7414029
17445 -7414029 -10143625 -11924474 -12133983 -10340755 -6542755 -1263144 4594988 10073362
17437 10073362 14491046 17622853 19667630 21066764 22273957 23565618 24959826 26264613
17429 26264613 27222102 27672603 27648937 27368063 27151782 27302830 27959656 28993513 30014706
17420 30014706 30503764 30026844 28432620 25901563 22818800 19582600 16468595 13576957
17412 13576957 10836583 8045389 4936917 1275398 -3022791 -7792706 -12630019 -17023156
17404 -17023156 -20527334 -22874688 -23985397 -23927018 -22883332 -21149314 -19115239 -17185431
17396 -17185431 -15630802 -14461343 -13420010 -12108818 -10161382 -7375358 -3776525 391945
$$ packed form
17453d225944K621647K160532J266238P8354j164866k209030k873192l067768
17445g414029k729596j780849k09509J793228L798000N279611N858132N478374
17437A0073362M417684L131807K044777J399134J207193J291661J394208J304787
17429B6264613R57489M50501k3666k80874k16281J51048O56826J033857J021193
17420C0014706M89058m76920j594224k531057l082763l236200l114005k891638
17412A3576957k740374k791194l108472l661519m298189m769915m837313m393137
17404a7023156l504178k347354j110709N8379J043686J734018K034075J929808
17396a7185431J554629J169459J041333J311192J947436K786024L598833M168470
$$ plain form
17388 391945 4765228 9005024 12918472 16493026 19855217 23186460 26620804 30151454
17380 30151454 33599781 36689192 39184023 40986535 42112096 42572417 42293466 41152841
17372 41152841 39077753 36086520 32246843 27623177 22270676 16267180 9754196 2967054
17364 2967054 -3755739 -9994464 -15329522 -19479351 -22402430 -24273288 -25372376 -26000157
17356 -26000157 -26448546 -26985175 -27834988 -29173943 -31100052 -33530490 -36080278 -38082509
17348 -38082509 -38836353 -37957380 -35587631 -32323472 -28920635 -25965092 -23691363 -22019630
17340 -22019630 -20736233 -19664652 -18736507 -17976500 -17444722 -17169904 -17112640 -17181183 -17268736
17331 -17268736 -17265442 -17042974 -16440136 -15275701 -13415756 -10894481 -8011303 -5298134 -3338208
$$ packed form
17388C91945M373283M239796L913448L574554L362191L331243L434344L530650
17380C0151454L448327L089411K494831J802512J125561M60321k78951j140625
17372D1152841k075088k991233l839677m623666n352501o003496o512984o787142
17364B967054o722793o238725n335058m149829k923079j870858j099088o27781
17356b6000157m48389n36629q49813j338955j926109k430438k549788k002231
17348c8082509p53844Q78973K369749L264159L402837K955543K273729J671733
17340b2019630J283397J071581R28145P60007N31778K74818N7264o8543q7553
17331a7268736L294K22468O02838J164435J859945K521275K883178K713169J959926
$$ plain form
17322 -3338208 -2542661 -3022025 -4603135 -6922868 -9506207 -11828989 -13425381 -14039407 -13729185
17313 -13729185 -12822149 -11722872 -10711281 -9880711 -9217180 -8685940 -8239707 -7803817 -7319426
17304 -7319426 -6837669 -6580990 -6879518 -7969540 -9775414 -11860397 -13612632 -14519864 -14336856
17295 -14336856 -13098228 -11049364 -8564853 -6069561 -3947825 -2463846 -1747168 -1844919
17287 -1844919 -2771416 -4484268 -6796035 -9323147 -11566932 -13095673 -13697019 -13411847 -12460632
17278 -12460632 -11118438 -9588961 -7924533 -6049030 -3893363 -1554516 633385 2162591
17270 2162591 2526278 1415405 -1168787 -4912529 -9256720 -13528918 -17142445 -19774368
17262 -19774368 -21401687 -22179282 -22266780 -21732395 -20565971 -18737752 -16250018 -13176543 -9688789
$$ packed form
17322c338208P95547m79364j581110k319733k583339k322782j596392o14026L10222
17313a3729185R07036J099277J011591Q30570O63531N31240M46233M35890M84391
17304g319426M81757K56679k98528j090022j805874k084983j752235r07232J83008
17295a4336856J238628K048864K484511K495292K121736J483979P16678r7751
17287a844919r26497j712852k311767k527112k243785j528741o01346K85172R51215
17278a2460632J342194J529477J664428J875503K155667K338847K187901J529206
17270B162591L63687j110873k584192l743742m344191m272198l613527k631923
17262a9774368j627319p77595q7498N34385J166424J828219K487734L073475L487754
$$ plain form
17253 -9688789 -6060110 -2644522 172654 2062445 2871257 2703081 1874328 753706 -379054
17244 -379054 -1356770 -2077822 -2503983 -2733474 -3039438 -3754513 -5055484 -6841679 -8805823
17235 -8805823 -10598099 -11938244 -12638303 -12595528 -11811578 -10419575 -8655938 -6760164 -4870736
17226 -4870736 -3012857 -1205069 394460 1434961 1500034 359760 -1840949 -4611166
17218 -4611166 -7318719 -9410583 -10554108 -10683467 -9933353 -8492485 -6516456 -4187234
17210 -4187234 -1812513 198677 1499404 1969789 1741263 1058821 91742 -1157662 -2781729
17201 -2781729 -4802388 -7049441 -9164675 -10722862 -11404755 -11128300 -10060743 -8511404
17193 -8511404 -6775795 -5019515 -3266155 -1494396 230376 1699876 2624503 2739692
$$ packed form
17253i688789L628679L415588K817176J889791Q08812j68176q28753j120622j132760
17244c79054r77716p21052m26161k29491l05964p15075j300971j786195j964144
17235h805823j792276j340145p00059M2775P83950J392003J763637J895774J889428
17226d870736J857879J807788J599529J040501O5073j140274k200709k770217
17218d611166k707553k091864j143525j29359P50114J440868J976029K329222
17210d187234K374721K011190J300727M70385k28526o82442r67079j249404j624067
17201b781729k020659k247053k115234j558187o81893K76455J067557J549339
17193h511404J735609J756280J753360J771759J724772J469500R24627J15189
$$ plain form
17185 2739692 1852423 -180300 -3440816 -7838837 -12992318 -18271178 -23029623 -26864366
17177 -26864366 -29706438 -31690930 -32940852 -33471008 -33268928 -32417627 -31119483 -29616114
17169 -29616114 -28090626 -26623344 -25199978 -23734050 -22103114 -20223991 -18144266 -16090891
17161 -16090891 -14450898 -13693083 -14241610 -16337573 -19957820 -24828732 -30508391 -36487735
17153 -36487735 -42268352 -47393715 -51457285 -54136570 -55255963 -54838392 -53121438 -50521003
17145 -50521003 -47524539 -44544281 -41808017 -39343971 -37051943 -34808218 -32553039 -30321515
17137 -30321515 -28201771 -26270751 -24590519 -23258779 -22413518 -22149226 -22434777 -23133640 -24102356
17128 -24102356 -25264279 -26603084 -28093259 -29621631 -30968861 -31888046 -32229220 -31998646
$$ packed form
17185B739692q87269k032723l260516m398021n153481n278860m758445l834743
17177b6864366k842072j984492j249922n30156K02080Q51301J298144J503369
17169b9616114J525488J467282J423366J465928J630936J879123K079725K053375
17161a6090891J639993P57815n48527k095963l620247m870912n679659n979344
17153c6487735n780617n125363m063570k679285j119393M17571J716954K600435
17145e0521003K996464K980258K736264K464046K292028K243725K255179K231524
17137c0321515K119744J931020J680232J331740Q45261K64292k85551o98863r68716
17128b4102356j161923j338805j490175j528372j347230r19185l41174K30574
$$ plain form
17120 -31998646 -31296367 -30197469 -28691516 -26721021 -24266084 -21399017 -18262824 -14977815
17112 -14977815 -11551438 -7903952 -4034796 -197809 3082090 5182594 5625652 4234754
17104 4234754 1141274 -3324484 -8769403 -14820441 -21131120 -27352471 -33124433 -38104893
17096 -38104893 -42014510 -44675560 -46035550 -46162523 -45200946 -43296674 -40524902 -36876881
17088 -36876881 -32341715 -27042353 -21319130 -15680651 -10652115 -6625797 -3784892 -2109818
17080 -2109818 -1435920 -1502220 -1970344 -2472233 -2719395 -2598292 -2161424 -1526735 -774719 89149
17070 89149 1090816 2183639 3155981 3643376 3265180 1806907 -664497 -3822737 -7219229
17061 -7219229 -10442521 -13218436 -15426316 -17054687 -18141483 -18723776 -18789865 -18248220 -16966788
$$ packed form
17120c1998646P02279J098898J505953J970495K454937K867067L136193L285009
17112a4977815L426377L647486L869156L836987L279899K100504M43058j390898
17104D234754l093480m465758n444919o051038o310679o221351n771962m980460
17096c8104893l909617k661050j359990j26973R61577J904272K771772L648021
17088c6876881M535166N299362N723223N638479N028536M026318K840905J675074
17080b109818O73898o6300m68124n01889k47162J21103M36868O34689P52016Q63868
17070H9149J001667J092823R72342M87395l78196j458273k471404l158240l396492
17061g219229l223292k775915k207880j628371j086796n82293o6089N41645J281432
$$ plain form
17052 -16966788 -14888457 -12122446 -8906731 -5460504 -1845539 2059085 6446733 11403814
17044 11403814 16781181 22201074 27175327 31249581 34113407 35638346 35827067 34729641
17036 34729641 32413151 28991838 24661617 19711707 14515391 9474594 4902883 918612
17028 918612 -2550860 -5654551 -8493557 -11076524 -13371384 -15394610 -17237894 -18993676
17020 -18993676 -20666482 -22178027 -23456156 -24510177 -25433561 -26353216 -27374723 -28551133
17012 -28551133 -29875067 -31299062 -32786834 -34351394 -36027206 -37803688 -39595950 -41273920
17004 -41273920 -42712141 -43818497 -44519359 -44708601 -44206476 -42794188 -40353488 -37043544
16996 -37043544 -33360107 -29973055 -27433104 -25964344 -25469764 -25690520 -26358945 -27234526 -28056566
$$ packed form
17052a6966788K078331K766011L215715L446227L614965L904624M387648M957081
17044A1403814N377367N419893M974253M074254K863826J524939J88721j097426
17036C4729641k316490l421313m330221m949910n196316n040797m571711l984271
17028I18612l469472l103691k839006k582967k294860k023226j843284j755782
17020a8993676j672806j511545j278129j054021r23384r19655j021507j176410
17012b8551133j323934j423995j487772j564560j675812j776482j792262j677970
17004d1273920j438221j106356p00862j89242N02125J412288K440700L309944
16996c7043544L683437L387052K539951J468760M94580k20756o68425q75581q22040
$$ plain form
16987 -28056566 -28541597 -28492195 -27931183 -27101960 -26294575 -25656719 -25165426 -24734701 -24303234
16978 -24303234 -23836592 -23301562 -22667682 -21939353 -21188833 -20543142 -20122319 -19995090 -20192579
16969 -20192579 -20738344 -21641368 -22851121 -24221483 -25533996 -26569727 -27162713 -27187784 -26499000
16960 -26499000 -24896444 -22196588 -18375258 -13660620 -8507579 -3497299 778365 3835426
16952 3835426 5412991 5543723 4536586 2883882 1139299 -213854 -897014 -915216 -504415
16943 -504415 37786 523590 949699 1465589 2281435 3576189 5460548 8003328 11284783
16934 11284783 15430940 20578378 26757449 33774834 41192784 48405456 54749361 59612782
16926 59612782 62537569 63303020 61974800 58898593 54622763 49758801 44830920 40191149
$$ packed form
16987b8056566m85031M9402N61012Q29223Q07385O37856M91293M30725M31467
16978b4303234M66642N35030O33880P28329P50520O45691M20823J27229j97489
16969b0192579n45765r03024j209753j370362j312513j035731n92986k5071O88784
16960b6499000J602556K699856L821330M714638N153041N010280M275664L057061
16952C835426J577565J30732j007137j652704j744583j353153o83160j8202M10801
16943e04415N42201M85804M26109N15890Q15846J294754J884359K542780L281455
16934A1284783M146157N147438O179071P017385P417950P212672O343905M863421
16926E9612782K924787P65451j328220l076207m275830m863962m927881m639771
$$ plain form
16918 40191149 36031338 32438273 29421110 26902818 24709506 22574931 20161907 17126670
16910 17126670 13242383 8520509 3241573 -2121779 -7046528 -11126932 -14223771 -16506493
16902 -16506493 -18312282 -19882893 -21174578 -21883518 -21641407 -20235257 -17740384 -14513180
16894 -14513180 -11051259 -7803512 -5028125 -2739305 -738122 1284564 3598744 6290193
16886 6290193 9189328 11928362 14115535 15542924 16308206 16761866 17304507 18178097 19402464
16877 19402464 20879414 22549442 24481611 26860436 29881852 33602172 37838830 42202376
16869 42202376 46232567 49550373 51955384 53432461 54071113 53960285 53148971 51690476
16861 51690476 49682043 47222810 44331339 40920898 36866417 32109819 26722619 20888475
$$ packed form
16918D0191149m159811l593065l017163k518292k193312k134575k413024l035237
16910A7126670l884287m721874n278936n363352m924749m080404l096839k282722
16902a6506493j805789j570611j291685p08940K42111J406150K494873L227204
16894a4513180L461921L247747K775387K288820K001183K022686K314180K691449
16886F290193K899135K739034K187173J427389P65282M53660N42641Q73590J224367
16877A9402464J476950J670028J932169K378825L021416L720320M236658M363546
16869D2202376M030191L317806K405011J477077O38652j10828q11314j458495
16861E1690476k008433k459233k891471l410441m054481m756598n387200n834144
$$ plain form
16853 20888475 14841331 8819641 3057723 -2197456 -6657059 -9976205 -11793348 -11835383
16845 -11835383 -10055824 -6719915 -2353087 2421621 7037016 11042659 14099809 15979696
16837 15979696 16572854 15880298 14003281 11164129 7726878 4153602 899439 -1679837
16829 -1679837 -3350166 -3962249 -3410473 -1633717 1328939 5251695 9671274 13943861
16821 13943861 17414949 19633541 20518856 20381032 19742107 19052203 18499618 18030009 17522481
16812 17522481 16970025 16533606 16458026 16937079 18014659 19558609 21308345 22973899 24353280
16803 24353280 25432857 26413472 27596415 29146405 30888380 32323387 32888672 32286383
16795 32286383 30661708 28544871 26632359 25542161 25640345 26975168 29313995 32248063
$$ packed form
16853B0888475o047144o021690n761918n255179m459603l319146j817143m2035
16845a1835383J779559L335909M366828M774708M615395M005643L057150J879887
16837A5979696N93158o92556j877017k839152l437251l573276l254163k579276
16829a679837j670329o12083N51776J776756K962656L922756M419579M272587
16821A3943861L471088K218592Q85315j37824o38925o89904n52585m69609n07528
16812A7522481n52456m36419p5580M79053J077580J543950J749736J665554J379381
16803B4353280J079577R80615J182943J549990J741975J435007N65285o02289
16795C2286383j624675k116837j912512j090198R8184J334823K338827K934068
$$ plain form
16787 32248063 35303216 38020793 40035625 41167763 41479824 41245944 40838841 40596048 40720886
16778 40720886 41223949 41891258 42293628 41872016 40107203 36713736 31751368 25598737 18830598
16769 18830598 12067263 5840781 512525 -3725484 -6765590 -8480641 -8692855 -7246005
16761 -7246005 -4132125 403200 5846168 11516134 16725207 20913864 23743705 25156925
16753 25156925 25366886 24743670 23641594 22276783 20728901 19039046 17298723 15649833
16745 15649833 14216921 13052279 12127896 11341515 10511532 9391629 7749922 5489951
16737 5489951 2719389 -304385 -3315750 -6155743 -8782091 -11194620 -13352572 -15132139
16729 -15132139 -16321895 -16660495 -15938208 -14124984 -11422150 -8183861 -4766207 -1398927
$$ packed form
16787C2248063L055153K717577K014832J132138L12061k33880m07103k42793J24838
16778D0720886N03063O67309M02370m21612j764813l393467m962368o152631o768139
16769A8830598o763335o226482n328256m238009l040106j715051k12214J446850
16761g246005L113880M535325N442968N669966N209073M188657K829841J413220
16753B5156925K09961o23216j102076j364811j547882j689855j740323j648890
16745A5649833j432912j164642r24383p86381q29983j119903j641707k259971
16737E489951k770562l023774l011365k839993k626348k412529k157952j779567
16729a5132139j189756l38600P22287J813224K702834L238289L417654L367280
$$ plain form
16721 -1398927 1874885 5196915 8846300 13163116 18455821 24890116 32378376 40540193
16713 40540193 48770087 56361862 62646524 67148262 69714427 70510934 69850548 67979408
16705 67979408 64999751 60983575 56148029 50910809 45784292 41223517 37530264 34812216
16697 34812216 32968502 31707112 30603736 29191575 27067423 23984594 19894091 14937984
16689 14937984 9424722 3783417 -1510820 -6021332 -9432431 -11620004 -12665451 -12780995
16681 -12780995 -12195688 -11086299 -9576067 -7757663 -5693268 -3399510 -862161 1916335
16673 1916335 4873357 7866990 10691813 13133987 15028746 16265590 16749800 16388284
16665 16388284 15126688 13000721 10174571 6957652 3765973 1007527 -1051123 -2342881
$$ packed form
16721a398927L273812L322030L649385M316816N292705O434295P488260Q161817
16713D0540193Q229894P591775O284662M501738K566165P96507o60386j871140
16705F7979408k979657m016176m835546n237220n126517m560775l693253k718048
16697C4812216j843714j261390j103376j412161k124152l082829m090503m956107
16689A4937984n513262n641305n294237m510512l411099k187573j045447j15544
16681a2780995N85307J109389J510232J818404K064395K293758K537349K778496
16673A916335K957022K993633K824823K442174J894759J236844M84210l61516
16665A6388284j261596k125967k826150l216919l191679k758446k058650j291758
$$ plain form
16657 -2342881 -2955752 -3049084 -2797285 -2365458 -1889999 -1452781 -1051147 -574806 173692 1381433
16647 1381433 3086861 5098691 7053600 8604210 9609212 10176853 10548212 10932140 11400410
16638 11400410 11886254 12260123 12413070 12297463 11928858 11374537 10737433 10139569 9715026
16629 9715026 9593803 9843719 10414646 11185257 12088190 13139885 14297537 15295730 15662042
16620 15662042 14939034 12951718 9919401 6334747 2703287 -670228 -3709749 -6428050
16612 -6428050 -8761708 -10518809 -11476304 -11550080 -10905796 -9913970 -8961496 -8252457 -7760311
16603 -7760311 -7354773 -6950693 -6539432 -6124458 -5666649 -5088575 -4309842 -3283094 -2033328
16594 -2033328 -692142 513095 1336592 1618288 1341276 615131 -366716 -1354738 -2082986
$$ packed form
16657b342881o12871r3332K51799M31827M75459M37218M01634M76341P48498J207741
16647A381433J705428K011830J954909J550610J005002N67641L71359L83928M68270
16638A1400410M85844L73869J52947j15607l68605n54321o37104n97864m24543
16629I715026j21223K49916N70927P70611R02933J051695J157652R98193L66312
16620A5662042p23008j987316l032317l584654l631460l373515l039521k718301
16612f428050k333658j757101r57495p3776O44284R91826R52474P09039M92146
16603g760311M05538M04080M11261M14974M57809N78074P78733J026748J249766
16594b033328J341186J205237Q23497K81696k77012p26145r81847r88022p28248
$$ plain form
16585 -2082986 -2349033 -2100449 -1474142 -759669 -289595 -309656 -896962 -1944469 -3197712
16576 -3197712 -4338421 -5091427 -5299964 -4927056 -3981518 -2417231 -107348 3030361 6837630
16567 6837630 10851783 14471342 17225633 18946866 19763744 19973534 19889718 19742153 19662887
16558 19662887 19723813 19954357 20318270 20717102 21081545 21484436 22132340 23200716 24641690
16549 24641690 26109408 27037120 26824328 25071910 21765934 17300324 12319183 7485721
16541 7485721 3318172 151173 -1818639 -2480516 -1819071 139 2558393 5250640
16533 5250640 7494820 8949157 9611840 9772419 9868901 10343115 11535763 13596547 16413984
16524 16413984 19631270 22785703 25498112 27584238 29039769 29952048 30402603 30399280 29864043
$$ packed form
16585b082986k66047K48584O26307P14473M70074k0061n87306j047507j253243
16576c197712j140709p53006k08537L72908R45538J564287K309883L137709L807269
16567F837630M014153L619559K754291J721233Q16878K09790q3816j47565p9266
16558A9662887O0926K30544L63913L98832L64443M02891O47904J068376J440974
16549B4641690J467718R27712k12792j752418l305976m465610m981141m833462
16541G485721m167549l166999j969812o61877O61445J819210K558254K692247
16533E250640K244180J454337O62683J60579R6482M74214J192648K060784K817437
16524A6413984L217286L154433K712409K086126J455531R12279M50555l323n35237
$$ plain form
16515 29864043 28669157 26686682 23837812 20151243 15821338 11228311 6879611 3272073
16507 3272073 739004 -632381 -985224 -620782 91670 812985 1309249 1465970 1258906
16498 1258906 723391 -81404 -1132142 -2496021 -4320537 -6741418 -9763466 -13182788
16490 -13182788 -16594504 -19507022 -21515581 -22418566 -22206800 -20982960 -18912202 -16219458
16482 -16219458 -13169823 -9998941 -6836459 -3678900 -426407 3033762 6731922 10559873
16474 10559873 14286384 17628990 20348430 22336685 23667049 24583264 25432596 26584870
16466 26584870 28390021 31164539 35119431 40171709 45720081 50588476 53326008 52817176
16458 52817176 48812091 41972625 33485854 24634345 16568560 10241617 6380007 5440144
$$ packed form
16515B9864043j194886j982475k848870l686569m329905m593027m348700l607538
16507C272073k533069j371385l52843L64442P12452P21315M96264J56721k07064
16498A258906n35515q04795j050738j363879j824516k420881l022048l419322
16490a3182788l411716k912518k008559r02985K11766J223840K070758K692744
16482a6219458L049635L170882L162482L157559L252493L460169L698160L827951
16474A0559873L726511L342606K719440J988255J330364R16215Q49332J152274
16466B6584870J805151K774518L954892N052278N548372M868395K737532n08832
16458E2817176m005085o839466q486771q851509q065785o326943l861610r39863
$$ plain form
16450 5440144 7562815 12539090 19808852 28528306 37714586 46430200 53951979 59873644
16442 59873644 64123635 66917742 68661006 69799948 70663362 71377955 71897300 72079049 71741916
16433 71741916 70708627 68858708 66174533 62741872 58683039 54042990 48699010 42385409
16425 42385409 34859608 26105724 16427822 6391135 -3323238 -12082354 -19441706 -25212040
16417 -25212040 -29409915 -32109927 -33302392 -32873588 -30721734 -26902915 -21682951 -15466872
16409 -15466872 -8687565 -1741422 5025130 11320955 16927003 21732720 25794467 29358219
16401 29358219 32766464 36284639 39990904 43809501 47629084 51391597 55088011 58694260
16393 58694260 62120704 65213405 67812703 69838684 71314993 72253215 72442600 71308903
$$ packed form
16450E440144K122671M976275P269762Q719454R186280Q715614P521779N921665
16442E9873644M249991K794107J743264J138942Q63414P14593N19345J81749l37133
16433G1741916j033289j849919k684175l432661m058833m640049n343980o313601
16425D2385409p525801q753884r677902j0036687r714373q759116p359352n770334
16417b5212040m197875k700012j192465M28804K151854L818819N219964O216079
16409a5466872O779307O946143O766552O295825N606048M805717M061747L563752
16401B9358219L408245L518175L706265L818597L819583L762513L696414L606249
16393E8694260L426444L092701K599298K025981J476309R38222J89385j133697
$$ plain form
16385 71308903 68008403 61790687 52448006 40540817 27238079 13915878 1769700
16378 1769700 -8427339 -16391065 -22214533 -26142658 -28382985 -29073857 -28386991 -26644169
16370 -26644169 -24367021 -22244357 -21012674 -21266893 -23262026 -26786588 -31185505 -35564221
16362 -35564221 -39107801 -41366935 -42361696 -42448697 -42045247 -41390802 -40479062 -39163275 -37329189
16353 -37329189 -35018664 -32451146 -29959740 -27882418 -26435581 -25615215 -25202839 -24894147
16345 -24894147 -24460708 -23845087 -23169159 -22685115 -22699953 -23509114 -25361236 -28411577 -32606590
16336 -32606590 -37565394 -42626021 -47104241 -50594346 -53107629 -55006662 -56824687 -59064433
16328 -59064433 -62039781 -65802364 -70160064 -74756487 -79173731 -83042831 -86158039 -88568449
$$ packed form
16385G1308903l300500o217716r342681j1907189j3302738j3322201j2146178
16378A769700j0197039p963726n823468l928125k240327o90872O86866J742822
16370b6644169K277148K122664J231683k54219j995133l524562m398917m378716
16362c5564221l543580k259134r94761q7001M03450O54445R11740J315787J834086
16353c7329189K310525K567518K491406K077322J446837Q20366M12376L08692
16345b4894147M33439O15621O75928M84044j4838q09161j852122l050341m195013
16336c2606590m958804n060627m478220l490105k513283j899033j818025k239746
16328e9064433k975348l762583m357700m596423m417244l869100l115208k410410
$$ plain form
16320 -88568449 -90591289 -92711487 -95404558 -98974489 -103473176 -108685485 -114109657 -118897415
16312 -118897415 -121807000 -121284997 -115807070 -104523534 -87965588 -68231326 -48245922
16305 -48245922 -30513864 -16285415 -5563389 2367157 8384795 13205415 17285181 20858616
16297 20858616 24030286 26872811 29489944 32001654 34457619 36764812 38722767 40161287
16289 40161287 41060519 41540834 41744615 41726489 41434365 40791591 39824906 38737106 37876254
16280 37876254 37642724 38368814 40180071 42904027 46108850 49253923 51867905 53701280
16272 53701280 54812427 55523222 56226191 57140163 58168445 58945039 59023192 58075012 55990904
16263 55990904 52865852 48945045 44588853 40229362 36251268 32808581 29703105 26449350
$$ packed form
16320h8568449k022840k120198k693071l569931m498687n212309n424172m787758
16312a18897415k909585N22003N477927J1283536J6557946J9734262J9985404
16305d8245922J7732058J4228449J0722026P930546O017638M820620M079766L573435
16297B0858616L171670K842525K617133K511710K455965K307193J957955J438520
16289D0161287Q99232M80315K03781j8126k92124o42774r66685j087800q60852
16280C7876254k33530P26090J811257K723956L204823L145073K613982J833375
16272E3701280J111147P10795P02969R13972J028282P76594P8153r48180k084108
16263E5990904l125052l920807m356192m359491l978094l442687l105476l253755
$$ plain form
16255 26449350 22509076 17552630 11603534 4995279 -1827530 -8513888 -14857631 -20698248
16247 -20698248 -25819613 -29956990 -32898301 -34595270 -35206718 -35059218 -34567812 -34138444 -34041835
16238 -34041835 -34300037 -34673051 -34774298 -34242897 -32855814 -30518453 -27195145 -22895551 -17753009
16229 -17753009 -12121187 -6588756 -1873056 1367918 2727569 2163645 -23140 -3334568
16221 -3334568 -7270274 -11470647 -15740614 -19982131 -24126911 -28121847 -31927575 -35474344
16213 -35474344 -38601666 -41054868 -42553012 -42875695 -41937484 -39867643 -37071789 -34175254
16205 -34175254 -31797525 -30269862 -29493643 -29038734 -28394848 -27199233 -25332560 -22892988
16197 -22892988 -20123114 -17350254 -14944908 -13276317 -12656088 -13266408 -15075949 -17780554
$$ packed form
16255B6449350l940274m956446n949096o608255o822809o686358o343743n840617
16247b0698248n121365m137377k941311j696969o11448J47500M91406M29368R6609
16238c4041835k58202l73014j01247N31401J387083K337361L323308M299594N142542
16229a7753009N631822N532431M715700L240974J359651n63924k186785l311428
16221c334568l935706m200373m269967m241517m144780l994936l805728l546769
16213c5474344l127322k453202j498144l22683R38211K069841K795854K896535
16205c4175254K377729J527663P76219M54909O43886J195615J866673K439572
16197b2892988K769874K772860K405346J668591O20229o10320j809541k704605
$$ plain form
16189 -17780554 -20833920 -23597270 -25537778 -26365171 -26092008 -25064547 -23917989 -23365898
16181 -23365898 -23887546 -25523974 -27920570 -30545335 -32883941 -34483920 -34915387 -33806518
16173 -33806518 -30989317 -26626580 -21192898 -15323723 -9648272 -4688376 -806056 1851442
16165 1851442 3406315 4245627 4904559 5863667 7371326 9386642 11636108 13713508 15186339
16156 15186339 15722462 15213212 13806532 11807222 9502163 7020913 4329818 1364647
16148 1364647 -1817534 -4994965 -7857139 -10124025 -11643117 -12442151 -12738361 -12903391 -13378546
16139 -13378546 -14558592 -16697416 -19865142 -23919570 -28470603 -32908763 -36566708 -38947759
16131 -38947759 -39868380 -39442612 -37969261 -35814242 -33326635 -30780948 -28336882 -26033940
$$ packed form
16189a7780554l053366k763350j940508q27393K73163J027461J146558N52091
16181b3365898n21648j636428k396596k624765k338606j599979m31467J108869
16173c3806518K817201M362737N433682N869175N675451M959896L882320K657498
16165A851442J554873Q39312O58932R59108J507659K015316K249466K077400J472831
16156A5186339N36123n09250j406680j999310k305059k481250k691095k965171
16148A364647l182181l177431k862174k266886j519092p99034k96210j65030m75155
16139a3378546j180046k138824l167726m054428m551033m438160l657945k381051
16131c8947759r20621M25768J473351K155019K487607K545687K444066K302942
$$ plain form
16123 -26033940 -23842317 -21735109 -19697163 -17648664 -15390185 -12688555 -9468848 -5943918
16115 -5943918 -2561633 192045 2002243 2838975 2939072 2687019 2480065 2661839 3527218
16106 3527218 5319931 8177233 12077714 16851898 22231057 27893154 33507558 38775309
16098 38775309 43436945 47244544 49928411 51186484 50715154 48289239 43869831 37696478
16090 37696478 30317875 22522853 15170800 8987772 4419602 1581046 284978 129826
16082 129826 632452 1387596 2202064 3114112 4258322 5673802 7214823 8623752 9679931
16073 9679931 10297429 10523399 10470703 10241343 9894414 9486463 9138050 9016509 9193746 9505743
16063 9505743 9576713 9000350 7513069 5026976 1545783 -2906591 -8255449 -14285785 -20616377
$$ packed form
16123b6033940K191623K107208K037946K048499K258479K701630L219707L524930
16115e943918L382285K753678J810198Q36732J00097k52053k06954J81774Q65379
16106C527218J792713K857302L900481M774184N379159N662097N614404N267751
16098C8775309M661636L807599K683867J258073m71330k425915m419408o173353
16090C7696478p378603p795022p352053o183028m568170k838556j296068j55152
16082A29826N02626P55144Q14468R12048J144210J415480J541021J408929J056179
16073I679931O17498K25970n2696k29360l46929m07951l48413j21541J77237L11997
16063I505743P0970n76363j487281k486093l481193m452374n348858o030336o330592
$$ plain form
16054 -20616377 -26795558 -32436354 -37269450 -41114669 -43885535 -45667390 -46759106 -47583801
16046 -47583801 -48513505 -49718748 -51115238 -52409975 -53213438 -53180716 -52126597 -50057316 -47110766
16037 -47110766 -43455235 -39210626 -34421350 -29073111 -23135661 -16617672 -9624435 -2402931
16029 -2402931 4650986 11046567 16321589 20201451 22704429 24112241 24825937 25214234
16021 25214234 25540080 25969114 26603703 27493439 28636884 30007855 31575846 33271161 34931802
16012 34931802 36317832 37205165 37494099 37267816 36762113 36244706 35872651 35633583 35403737
16003 35403737 35050891 34499562 33735722 32763042 31550508 30055299 28337331 26625767 25220048
15994 25220048 24313311 23906506 23850925 23935921 23962623 23808475 23469994 23026880 22510899 21776876
$$ packed form
16054b0616377o179181n640796m833096l845219k770866j781855j091716q24695
16046d7583801r29704j205243j396490j294737q03463L2722J054119K069281K946550
16037d7110766L655531M244609M789276N348239N937450O517989O993237P221504
16029b402931P053917O395581N275022L879862K502978J407812P13696L88297
16021B5214234L25846M29034O34589Q89736J143445J370971J567991J695315J660641
16012C4931802J386030Q87333K88934k26283n05703n17407l72055k39068k29846
16003C5403737l52846n51329p63840r72680j212534j495209j717968j711564j405719
15994B5220048r06737m06805n5581Q4996K6702j54148l38481m43114n15981p34023
$$ plain form
15984 21776876 20529545 18534925 15832529 12742212 9670317 6900554 4533815 2585709
15976 2585709 1111220 223494 -1377 365222 1078832 1809365 2288355 2420150 2274023
15967 2274023 1951373 1435122 557302 -883450 -2948652 -5473385 -8145051 -10679221 -12938077
15958 -12938077 -14918461 -16675979 -18270605 -19735473 -21041787 -22083493 -22716874 -22841110
15950 -22841110 -22472892 -21767999 -20967569 -20301946 -19921451 -19888219 -20201949 -20818987 -21655411
15941 -21655411 -22587026 -23451864 -24056313 -24195064 -23690064 -22434722 -20421985 -17739856 -14541870
15932 -14541870 -11025356 -7428222 -4015709 -1025662 1424166 3404824 5150231 6944287
15924 6944287 9001154 11408728 14142248 17102319 20134047 23039260 25621936 27759487
$$ packed form
15984B1776876j247331j994620k702396l090317l071895k769763k366739j948106
15976B585709j474489q87726k24871L66599P13610P30533M78990J31795j46127
15967B274023l22650n16251q77820j440752k065202k524733k671666k534170k258856
15958a2938077j980384j757518j594626j464868j306314j041706o33381j24236
15950b2841110L68218P04893Q00430O65623L80495L3232l13730o17038q36424
15941b1655411r31615q64838o04449j38751N05000J255342K012737K682129L197986
15932a4541870L516514L597134L412513K990047K449828J980658J745407J794056
15924F944287K056867K407574K733520K960071L031728K905213K582676K137551
$$ plain form
15916 27759487 29446798 30780928 31900129 32902352 33760907 34278458 34148692 33135687
15908 33135687 31244910 28722923 25878754 22890256 19757524 16433659 13019594 9845736
15900 9845736 7355834 5890479 5536847 6113339 7251759 8525730 9590962 10309497 10827515
15891 10827515 11560390 13047534 15702433 19557997 24141476 28581396 31930916 33539533
15883 33539533 33261021 31413496 28576282 25365005 22285011 19692884 17816753 16758131
15875 16758131 16467387 16755165 17362431 18034470 18559798 18796294 18702623 18346459 17856770
15866 17856770 17333736 16786207 16165003 15459290 14730320 14020440 13237121 12154959 10547044
15857 10547044 8326708 5589944 2559314 -482651 -3221977 -5360755 -6727670 -7373537
$$ packed form
15916B7759487J687311J334130J119201J002223Q58555N17551j29766j013005
15908C3135687j890777k521987k844169k988498l132732l323865l414065l173858
15900I845736k489902j465355l53632N76492J138420J273971J065232P18535N18018
15891A0827515P32875J487144K654899L855564M583479M439920L349520J608617
15883C3539533k78512j847525k837214l211277l079994k592127j876131j058622
15875A6758131k90744K87778O07266O72039N25328K36496r3671l56164m89689
15866A7856770n23034n47529o21204p05713p28970p09880p83319j082162j607915
15857A0547044k220336k736764l030630l041965k739326k138778j366915o45867
$$ plain form
15849 -7373537 -7545210 -7540840 -7557669 -7643270 -7756613 -7843063 -7838117 -7623523 -7033925 -5955062
15839 -5955062 -4451440 -2832759 -1594738 -1226439 -1972478 -3700523 -5961721 -8179397
15831 -8179397 -9820071 -10471752 -9855034 -7818693 -4344066 458831 6377800 13121930
15823 13121930 20330765 27598114 34520196 40747735 46032305 50258490 53431076 55610133
15815 55610133 56850273 57201478 56758626 55700950 54276785 52728803 51207634 49739944
15807 49739944 48255116 46624662 44705770 42408101 39752862 36863594 33890548 30938827
15799 30938827 28062637 25331515 22907997 21044717 19981073 19823712 20492670 21741545
15791 21741545 23227654 24617148 25693543 26411507 26868818 27237461 27718871 28540081 29950679
$$ packed form
15849g373537j71673M370j6829q5601j13343q6450M946K14594N89598J078863
15839e955062J503622J618681J238021L68299p46039j728045k261198k217676
15831h179397j640674o51681O16718K036341L474627M802897N918969O744130
15823A3121930P208835P267349O922082O227539N284570M226185L172586K179057
15815E5610133J240140L51205m42852j057676j424165j547982j521169j467690
15807D9739944j484828j630454j918892k297669k655239k889268k973046k951721
15799C0938827k876190k731122k423518j863280j063644j57361O68958J248875
15791B1741545J486109J389494J076395P17964M57311L68643M81410Q21210J410598
$$ plain form
15782 29950679 32182380 35370994 39469912 44196907 49048602 53399176 56670955 58510713
15774 58510713 58874831 57980661 56174530 53796929 51084009 48115762 44838828 41182122
15766 41182122 37205484 33165401 29449006 26449973 24467698 23619360 23744858 24378476
15758 24378476 24883854 24728957 23742614 22177368 20534744 19293028 18720043 18814107 19311993
15749 19311993 19757522 19670593 18767499 17093704 14975680 12835459 11003165 9634408 8757791
15740 8757791 8389991 8585772 9360174 10593062 12059158 13573924 15115520 16825149 18915207
15731 18915207 21547668 24693299 28003835 30811697 32330821 31960922 29519669 25307913
15723 25307913 20001664 14430106 9361512 5392251 2927332 2187403 3207591 5826541
$$ packed form
15782B9950679K231701L188614M098918M726995M851695M350574L271779J839758
15774E8510713L64118q94170j806131k377601k712920k968247l276934l656706
15766D1182122l976638m040083l716395k999033j982275q48338J25498O33618
15758B4378476N05378j54897r86343j565246j642624j241716n72985R4064M97886
15749A9311993M45529q6929r03094j673795k118024k140221j832294j368757q76617
15740H757791l67800J95781P74402J232888J466096J514766J541596J709629K090058
15731A8915207K632461L145631L310536K807862J519124l69899k441253m211756
15723B5307913n306249n571558n068594l969261k464919p39929J020188K618950
$$ plain form
15715 5826541 9673864 14180975 18657436 22453897 25155002 26680495 27224464 27089071
15707 27089071 26527673 25674724 24583777 23341007 22164802 21395142 21348463 22118512 23455643
15698 23455643 24812204 25551546 25241415 23885082 21923468 19964751 18414162 17269841
15690 17269841 16208107 14845706 12968887 10615577 8029571 5548417 3474586 1969985
15682 1969985 1020280 495423 254595 201592 267085 375560 439125 368413 89009 -424578
15672 -424578 -1091268 -1678201 -1834820 -1228472 302512 2698519 5740836 9132390 12548808
15663 12548808 15686978 18312543 20265849 21432413 21742344 21227825 20091492 18716939
15655 18716939 17588051 17144716 17648596 19114334 21306829 23790164 26026914 27518041
$$ packed form
15715E826541L847323M507111M476461L796461K701105J525493N43969j35393
15707B7089071n61398q52949j090947j242770j176205p69660m6679P70049J337131
15698B3455643J356561P39342l10131j356333j961614j958717j550589j144321
15690A7269841j061734j362401j876819k353310k586006k481154k073831j504601
15682A969985r49705n24857k40828n3003O5493J08475O3565p0712k79404n13587
15672d24578o66690n86933j56619O06348J530984K396007L042317L391554L416418
15663A2548808L138170K625565J953306J166564L09931n14519j136333j374553
15655A8716939j128888m43335N03880J465738K192495K483335K236750J491127
$$ plain form
15647 27518041 27947961 27267723 25656860 23390591 20714117 17795418 14747034 11674835
15639 11674835 8727798 6119662 4079224 2730269 1972357 1450404 654941 -892094
15631 -892094 -3463727 -7024140 -11207113 -15405083 -18981412 -21526884 -23029952 -23879650
15623 -23879650 -24699385 -26079121 -28329984 -31380792 -34845389 -38198033 -40969393 -42881450
15615 -42881450 -43868625 -44000392 -43381192 -42108201 -40306980 -38180308 -35976496 -33860845
15607 -33860845 -31797281 -29570720 -26957570 -23905553 -20567269 -17165307 -13810951 -10421625
15599 -10421625 -6798177 -2808592 1462427 5722181 9620888 12906021 15476047 17350137
15591 17350137 18621714 19428496 19927309 20254614 20468122 20479759 20018343 18669788 16001571
$$ packed form
15647B7518041M29920o80238j610863k266269k676474k918699l048384l072199
15639A1674835k947037k608136k040438j348955p57912n21953p95463j547035
15631h92094k571633l560413m182973m197970l576329k545472j503068q49698
15623b3879650q19735j379736k250863l050808l464597l352644k771360j912057
15615d2881450r87175j31767O19200J272991J801221K126672K203812K115651
15607c3860845K063564K226561K613150L052017L338284L401962L354356L389326
15599a0421625L623448L989585M271019M259754L898707L285133K570026J874090
15591A7350137J271577Q06782M98813L27305K13508J1637m61416j348555k668217
$$ plain form
15582 16001571 11737089 5921285 -1011465 -8342384 -15316162 -21376613 -26234053 -29771605
15574 -29771605 -31951806 -32837257 -32657689 -31787567 -30611471 -29378247 -28149013 -26855887
15566 -26855887 -25396259 -23679548 -21631278 -19211952 -16445111 -13406536 -10189301 -6904229
15558 -6904229 -3722211 -894187 1296430 2617574 2964556 2417371 1262582 -45619
15550 -45619 -984691 -1090779 -61706 2200493 5595235 9840681 14497655 19030648 22912330
15541 22912330 25732102 27273447 27553272 26814058 25442616 23814330 22133065 20369436
15533 20369436 18336970 15843614 12814599 9320965 5512782 1513700 -2645230 -6999209
15525 -6999209 -11533475 -16065227 -20250369 -23734538 -26323149 -28032877 -28992859 -29287440
$$ packed form
15582A6001571m264482n815804o932750p330919o973778o060451m857440l537552
15574b9771605k180201q85451J79568Q70122J176096J233224J229234J293126
15566b6855887J459628J716711K048270K419326K766841L038575L217235L285072
15558f904229L182018K828024K190617J321144L46982n47185j154789j308201
15550d5619r39072j06088J029073K262199L394742M245446M656974M532993L881682
15541B2912330K819772J541345K79825p39214j371442j628286j681265j763629
15533B0369436k032466k493356l029015l493634l808183l999082m158930m353979
15525f999209m534266m531752m185142l484169k588611j709728r59982k94581
$$ plain form
15517 -29287440 -28870555 -27601640 -25361767 -22178946 -18281591 -14015182 -9654116 -5254186
15509 -5254186 -673768 4255106 9543542 14985138 20251626 25054092 29245170 32817693
15501 32817693 35840845 38395999 40536388 42247998 43406745 43789501 43192945 41616362
15493 41616362 39382038 37092980 35427119 34868058 35523823 37135614 39245715 41387898
15485 41387898 43184524 44360398 44768847 44464589 43737545 43010826 42632647 42710700 43097178
15476 43097178 43490575 43562708 43061199 41865585 39983191 37501150 34532727 31180707 27518475
15467 27518475 23585922 19402013 14991269 10404569 5714881 996312 -3690079 -8288589
15459 -8288589 -12725435 -16907102 -20762603 -24286165 -27533769 -30591902 -33556035 -36520606
$$ packed form
15517b9287440M16885J268915K239873L182821L897355M266409M361066M399930
15509e254186M580418M928874N288436N441596N266488M802466M191078L572523
15501C2817693L023152K555154K140389J711610J158747L82756n96556j576583
15493D1616362k234324k289058j665861n59061O55765J611791K110101K142183
15485D1387898J796626J175874M08449l04258p27044p26719l78179P8053L86478
15476D3097178L93397P2133n01509j195614j882394k482041k968423l352020l662232
15467B7518475l932553m183909m410744m586700m689688m718569m686391m598510
15459h288589m436846m181667l855501l523562l247604l058133k964133k964571
$$ plain form
15451 -36520606 -39561337 -42702437 -45883230 -48948895 -51676692 -53829917 -55214896 -55700733
15443 -55700733 -55193446 -53628634 -51029491 -47561279 -43489714 -39062735 -34412557 -29536458
15435 -29536458 -24342765 -18727534 -12656437 -6215217 406428 6978722 13276801 19076443
15427 19076443 24144014 28262509 31274135 33111333 33827871 33633746 32897076 32075173 31579766
15418 31579766 31630953 32172298 32898893 33404506 33389616 32819951 31938314 31115227 30623367 30485425
15408 30485425 30517344 30535807 30532625 30647268 30990616 31515138 32034186 32325128 32210717 31583002
15398 31583002 30392147 28636602 26373192 23735394 20945437 18313432 16199678 14921934
15390 14921934 14644188 15315323 16698467 18477168 20365346 22138459 23593593 24542567
$$ packed form
15451c6520606l040731l141100l180793l065665k727797k153225j384979m85837
15443e5700733N07287J564812K599143L468212M071565M426979M650178M876099
15435b9536458N193693N615231O071097O441220O621645O572294O298079N799642
15427A9076443N067571M118495L011626J837198P16538j94125p36670q21903m95407
15418C1579766N1187N41345P26595N05613j4890n69665q81637q23087m91860j37942
15408C0485425L1919J8463l182J14643L43348N24522N19048K90942j14411o27715
15398C1583002j190855j755545k263410k637798k789957k632005k113754j277744
15390A4921934k77746O71135J383144J778701J888178J773113J455134R48974
$$ plain form
15382 24542567 24895205 24753150 24398578 24159685 24240492 24622243 25084776 25325286 25102045
15373 25102045 24307078 22929845 20990968 18542302 15721290 12779859 10055947 7920016
15365 7920016 6727078 6767536 8202830 11010602 14986471 19799035 25042207 30257381
15357 30257381 34955539 38674760 41077921 42062947 41823978 40804835 39550779 38531282
15349 38531282 38018974 38063273 38527027 39135257 39526438 39312008 38131671 35720857 32024713
15340 32024713 27305836 22119012 17121425 12862564 9717415 7951223 7765250 9234036
15332 9234036 12201444 16257696 20830287 25316912 29190132 32081647 33863847 34677294
15324 34677294 34855415 34786593 34792832 35067679 35675903 36592938 37758329 39127180 40692716
$$ packed form
15382B4542567L52638j42055l54572k38893Q0807L81751M62533K40510k23241
15373B5102045p94967j377233j938877k448666k821012k941431k723912k135931
15365G920016j192938M0458J435294K807772L975869M812564N243172N215174
15357C0257381M698158L719221K403161R85026k38969j019143j254056j019497
15349C8531282n12308M4299M63754O08230L91181k14430j180337k410814l696144
15340C2024713m718877n186824m997587m258861l145149j766192j85973J468786
15332I234036K967408M056252M572591M486625L873220K891515J782200Q13447
15324C4677294J78121o8822O239K74847O08224R17035J165391J368851J565536
$$ plain form
15315 40692716 42441388 44242754 45756726 46475104 45932760 43968883 40844526 37126493
15307 37126493 33427018 30162027 27441374 25133678 23058104 21153663 19489765 18135755
15299 18135755 17032641 15976835 14712703 13061406 10997961 8632788 6141842 3717147
15291 3717147 1557389 -132511 -1178467 -1513688 -1219245 -463815 608938 1942164 3542699
15282 3542699 5418699 7530778 9782317 12050798 14242201 16337435 18388241 20442079
15274 20442079 22454629 24277895 25726326 26663581 27082120 27142691 27116494 27247029 27636671
15265 27636671 28236477 28928479 29627935 30325305 31038244 31733896 32329369 32798355 33267774
15256 33267774 33972035 35083376 36562998 38151293 39495952 40321945 40546057 40301718 39887659
$$ packed form
15315D0692716J748672J801366J513972P18378n42344j963877l124357l718033
15307C7126493l699475l264991k720653k307696k075574j904441j663898j354010
15299A8135755j103114j055806j264132j651297k063445k365173k490946k424695
15291C717147k159758j689900j045956l35221K94443P55430J072753J333226J600535
15282C542699J876000K112079K251539K268481K191403K095234K050806K053838
15274B0442079K012550J823266J448431R37255M18539O0571k6197J30535L89642
15265B7636671N99806O92002O99456O97370P12939O95652N95473M68986M69419
15256C3267774P04261J111341J479622J588295J344659Q25993K24112k44339m14059
$$ plain form
15247 39887659 39661836 39907033 40711399 41911758 43124100 43853247 43663638 42372241 40164999
15238 40164999 37533029 35042386 33090356 31804282 31093867 30743806 30460557 29896553 28719825
15229 28719825 26736175 23978294 20666143 17056684 13306752 9439609 5406700 1189242
15221 1189242 -3116083 -7257897 -10842073 -13405869 -14557964 -14127008 -12223162 -9185729
15213 -9185729 -5484698 -1629529 1931876 4924046 7298007 9181268 10771235 12269150
15205 12269150 13890277 15876521 18425379 21556317 25025954 28385926 31169279 33086340
15197 33086340 34110891 34423640 34261488 33766609 32927756 31638441 29818158 27535822 25097878
15188 25097878 23050417 22053120 22649454 25021544 28846201 33351455 37586114 40778771
$$ packed form
15247C9887659k25823K45197Q04366J200359J212342P29147j89609j291397k207242
15238D0164999k631970k490643j952030j286074p10415l50061k83249n64004j176728
15229B8719825j983650k757881l312151l609459l749932l867143m032909m217458
15221A189242m305325m141814l584176k563796j152095M30956J903846L037433
15213i185729L701031L855169L561405K992170K373961J883261J589967J497915
15205A2269150J621127J986244K548858L130938L469637L359972K783353J917061
15197C3086340J024551L12749j62152m94879q38853j289315j820283k282336k437944
15188B5097878k047461r97297N96334K372090L824657M505254M234659L192657
$$ plain form
15180 40778771 42586973 43122227 42795736 42091179 41352716 40676932 39961116 39040959 37789582
15171 37789582 36140458 34093596 31742603 29303022 27101980 25492353 24705942 24734935
15163 24734935 25339876 26202114 27113313 28035672 28982891 29867043 30485423 30645621 30289734
15154 30289734 29523829 28562744 27644465 26966723 26676317 26892927 27715285 29199484 31353248
15145 31353248 34158876 37580200 41522170 45774838 50004743 53827058 56939517 59254197
15137 59254197 60937019 62301758 63624078 65025127 66498431 68010991 69574205 71241317
15129 71241317 73049494 74961405 76864478 78645838 80299366 81980808 83950738 86444764
15121 86444764 89594476 93458620 98068545 103370562 109105959 114786018 119837149 123824575
$$ packed form
15180D0778771J808202N35254l26491p04557p38463o75784p15816r20157j251377
15171C7789582j649124k046862k350993k439581k201042j609627p86411K8993
15163B4734935O04941Q62238R11199R22359R47219Q84152O18380J60198l55887
15154C0289734p65905r61085r18279o77742k90406K16610Q22358J484199K153764
15145C1353248K805628L421324L941970M252668M229905L822315L112459K314680
15137E9254197J682822J364739J322320J401049J473304J512560J563214J667112
15129G1241317J808177J911911J903073J781360J653528J681442J969930K494026
15121H6444764L149712L864144M609925N302017N735397N680059N051131L987426
$$ plain form
15113 123824575 126597598 128271077 129093049 129329790 129233274 129024139 128816953 128540005 127961401
15104 127961401 126829958 125018847 122586402 119771789 116958866 114584719 112980777 112226055
15096 112226055 112123268 112314934 112449151 112300187 111818416 111133855 110536449 110426462 111216594
15087 111216594 113212590 116542770 121163880 126903032 133498755 140643756 148048818 155514888
15079 155514888 162939960 170221470 177152801 183443983 188851993 193281548 196763804 199363311
15071 199363311 201130175 202149026 202629057 202926194 203434890 204410635 205864827 207614273
15063 207614273 209433658 211198824 212950905 214877004 217245097 220327534 224323687 229309861
15055 229309861 235267162 242187429 250180195 259493147 270413291 283087326 297357800
$$ packed form
15113A23824575K773023J673479Q21972K36741r6516k09135k07186k76948n78604
15104A27961401j131443j811111k432445k814613k812923k374147j603942p54722
15096A12226055j02787J91666J34217j48964m81771o84561n97406j09987P90132
15087A11216594J995996L330180M621110N739152O595723P145001P405062P466070
15079A55514888P425072P281510O931331O291182N408010M429555L482256K599507
15071A99363311J766864J018851M80031K97137N08696R75745J454192J749446
15063B07614273J819385J765166J752081J926099K368093L082437L996153M986174
15055B29309861N957301O920267P992766R312952J0920144J2674035J4270474
$$ plain form
15048 297357800 312709946 328352085 343385458 357005266 368680748 378266073 386005286
15041 386005286 392426211 398173245 403865930 410028595 417047556 425098614 434071924 443566045
15033 443566045 452971240 461612781 468921394 474588686 478644113 481400782 483276393 484588330
15025 484588330 485469997 485957241 486119784 486075858 485879126 485416904 484434055 482651154 479872361
15016 479872361 476043290 471290127 465934982 460424985 455171188 450393005 446050555 441864375
15008 441864375 437397775 432203475 426019317 418928962 411376525 404013418 397481102 392245545
15000 392245545 388517394 386236469 385100075 384639106 384356644 383907922 383237492 382574116 382258944
14991 382258944 382516710 383348072 384602452 386105346 387696239 389179409 390303461 390844119
$$ packed form
15048B97357800J5352146J5642139J5033373J3619808J1675482R585325P739213
15041C86005286O420925N747034N692685O162665P018961Q051058Q973310R494121
15033D43566045R405195Q641541P308613N667292M055427K756669J875611J311937
15025D84588330Q81667M87244J62543m3926j96732m62222r82849j782901k778793
15016D79872361l829071m753163n355145n509997n253797m778183m342450m186180
15008D41864375m466600n194300o184158p090355p552437p363107o532316n235557
15000C92245545l728151k280925j136394m60969k82462m48722o70430o63376l15172
14991C82258944K57766Q31362J254380J502894J590893J483170J124052N40658
$$ plain form
14983 390844119 390735576 390145316 389451042 389141220 389679575 391378067 394316571 398332493 403076175
14974 403076175 408108775 413028733 417592863 421751055 425556240 429034294 432135358 434789799
14966 434789799 436999240 438894597 440727176 442780223 445236789 448099371 451227860 454447072
14958 454447072 457621867 460675354 463597775 466461032 469412439 472633530 476265329 480304774
14950 480304774 484502003 488330127 491091270 492140114 491114365 488038106 483244156 477191521
14942 477191521 470311062 462952653 455409325 447946598 440800049 434162460 428180100 422958587
14934 422958587 418594617 415215719 412944739 411767153 411414648 411384503 411086298 409998612
14926 409998612 407734074 404025970 398726390 391858353 383665057 374581730 365128122 355763900
$$ packed form
14983C90844119j08543n90260o94274l09822N38355J698492K938504M015922M743682
14974D03076175N032600M919958M564130M158192L805185L478054L101064K654441
14966D34789799K209441J895357J832579K053047K456566K862582L128489L219212
14958D54447072L174795L053487K922421K863257K951407L221091L631799M039445
14950D80304774M197229L828124K761143J048844j025749l076259m793950o052635
14942D77191521o880459p358409p543328p462727p146549o637589n982360n221513
14934D22958587m363970l378898k270980j177586l52505l0145k98205j087686
14926D09998612k264538l708104n299580o868037q193296r083327r453608r364222
$$ plain form
14918 355763900 346747172 338069163 329549861 321058033 312679795 304699242 297422440 290983542
14910 290983542 285263216 279964476 274778352 269520768 264169912 258811022 253541014 248398692
14902 248398692 243369914 238458710 233751088 229402178 225554979 222256584 219424089 216877959
14894 216877959 214427700 211946356 209370475 206651637 203728554 200527851 196973987 193019132
14886 193019132 188693245 184142394 179640526 175567750 172324063 170193292 169241462 169296768
14878 169296768 169993741 170873858 171532151 171750153 171554013 171172350 170885885 170813881 170774110
14869 170774110 170347053 169116687 166906450 163854951 160330081 156766924 153490804 150572530
14861 150572530 147792844 144763965 141133507 136727582 131580596 125908623 120061182 114424649
$$ packed form
14918C55763900r016728q678009q519302q491828q378238p980553p276802o438898
14910B90983542n720326n298740n186124n257584n350856n358890n270008n142322
14902B48398692n028778m911204m707622m348910l847199l298395k832495k546130
14894B16877959k450259k481344k575881k718838k923083l200703l553864l954855
14886A93019132m325887m550851m501868m072776l243687k130771r51830N5306
14878A69296768O96973Q80117O58293K18002j96140l81663k86465p2004l9771
14869A70774110m27057j230366k210237l051499l524870l563157l276120k918274
14861A50572530k779686l028879l630458m405925n146986n671973n847441n636533
$$ plain form
14853 114424649 109290332 104767946 100801132 97268739 94098137 91299406 88898631 86850122
14845 86850122 85005568 83145728 81053355 78601437 75813770 72867586 70043957 67637120
14837 67637120 65829811 64584104 63628892 62567169 61041020 58865111 56072098 52874215
14829 52874215 49596356 46636575 44451885 43506280 44137474 46395200 49966875 54250530
14821 54250530 58531472 62189987 64877143 66586085 67580216 68224215 68808923 69447585 70084161
14812 70084161 70598683 70935756 71158084 71369826 71569820 71578195 71111178 69935363 67974160
14803 67974160 65290981 61982719 58099435 53669086 48788633 43680967 38669574 34107277
14795 34107277 30300739 27433784 25503825 24317483 23568931 22953721 22242755 21298466 20080965
$$ packed form
14853A14424649n134317m522386l966814l532393l170602k798731k400775k048509
14845H6850122j844554j859840k092373k451918k787667k946184k823629k406837
14837F7637120j807309j245707r55212j061723j526149k175909k793013l197883
14829E2874215l277859k959781k184690r45605O31194K257726L571675M283655
14821E4250530M280942L658515K687156J708942R94131O43999N84708O38662O36576
14812G0084161N14522L37073K22328K11742J99994Q375m67017j175815j961203
14803F7974160k683179l308262l883284m430349m880453n107666n011393m562297
14795C4107277l806538k866955j929959j186342p48552o15210p10966r44289j217501
$$ plain form
14786 20080965 18683960 17377794 16602480 16870788 18591459 21891591 26537693 31990178
14778 31990178 37557796 42595499 46675686 49662106 51658392 52876474 53520888 53750543
14770 53750543 53681600 53356353 52675761 51383832 49183019 45934146 41792760 37190571 32703370
14761 32703370 28901838 26237266 24947390 24967054 25900093 27139072 28125605 28603754 28695052
14752 28695052 28770517 29249858 30448468 32481359 35202268 38226854 41086215 43425395
14744 43425395 45100069 46133773 46617067 46636670 46262262 45562616 44609911 43471615 42217817
14735 42217817 40931231 39675687 38431176 37068632 35419616 33404612 31110301 28742013
14727 28742013 26502428 24514344 22829096 21464253 20417750 19655330 19091467 18591144
$$ packed form
14786B0080965j397005j306166p75314K68308J720671L300132M646102N452485
14778C1990178N567618N037703M080187K986420J996286J218082O44414K29655
14770E3750543o8943l25247o80592j291929k200813l248873m141386m602189m487201
14761C2703370l801532k664572j289876J9664R33039J238979R86533M78149R1298
14752B8695052P5465M79341J198610K032891K720909L024586K859361K339180
14744D3425395J674674J033704M83294J9603l74408o99646r52705j138296j253798
14735D2217817j286586j255544j244511j362544j649016k015004k294311k368288
14727B8742013k239585j988084j685248j364843j046503p62420n63863n00323
$$ plain form
14719 18591144 18009256 17249725 16289624 15127837 13714422 11977636 9959725 7912439
14711 7912439 6213486 5151376 4760777 4827601 5024624 5055230 4728688 3991202 2960227
14702 2960227 1926758 1256113 1212315 1815905 2819893 3815013 4405723 4352922 3604086
14693 3604086 2222729 304365 -2057629 -4777019 -7793548 -11101550 -14745666 -18753939
14685 -18753939 -23044898 -27392446 -31482579 -35015699 -37803016 -39835071 -41286167 -42413391
14677 -42413391 -43395669 -44244125 -44846099 -45070217 -44835186 -44109323 -42872671 -41102731 -38814018
14668 -38814018 -36118793 -33257695 -30577336 -28442991 -27083148 -26422325 -26015893 -25161497
14660 -25161497 -23149981 -19535774 -14300334 -7845065 -843948 5955990 11919483 16673127
$$ packed form
14719A8591144n81888p59531r60101j161787j413415j736786k017911k047286
14711G912439j698953j062110l90599O6824J97023L0606l26542p37486j030975
14702B960227j033469o70645m3798O03590J003988R95120N90710n2801p48836
14693C604086j381357j918364k361994k719390l016529l308002l644116m008273
14685a8753939m290959m347548m090133l533120k787317k032055j451096j127224
14677d2413391r82278q48456o01974k24118K35031P25863J236652J769940K288713
14668c8814018K695225K861098K680359K134345J359843O60823M06432Q54396
14660b5161497K011516L614207N235440O455269P001117O799938N963493M753644
$$ plain form
14652 16673127 20190575 22755400 24792371 26656794 28513688 30367608 32182834 33983929
14644 33983929 35880351 38026530 40544642 43441284 46572560 49699089 52600533 55173578
14636 55173578 57464755 59630812 61836075 64114845 66267275 67871779 68437954 67626963
14628 67626963 65402746 62007881 57791024 53035779 47912040 42530081 36999835 31441265
14620 31441265 25962866 20646692 15563748 10818300 6583415 3073665 459564 -1195275
14612 -1195275 -1928258 -1853171 -1169081 -176720 756186 1288229 1197421 409028 -1039929 -3040456
14602 -3040456 -5416138 -7903453 -10149361 -11771541 -12481062 -12186584 -10995666 -9132544
14594 -9132544 -6850506 -4375060 -1877585 530247 2801924 4964090 7103161 9331355
$$ packed form
14652A6673127L517448K564825K036971J864423J856894J853920J815226J801095
14644C3983929J896422K146179K518112K896642L131276L126529K901444K573045
14636E5173578K291177K166057K205263K278770K152430J604504N66175q10991
14628F7626963k224217l394865m216857m755245n123739n381959n530246n558570
14620C1441265n478399n316174n082944m745448m234885l509750k614101j654839
14612a195275p32983P5087O84090R92361R32906N32043r0808p88393j448957k000527
14602c040456k375682k487315k245908j622180p09521K94478J190918J863122
14594i132544K282038K475446K497475K407832K271677K162166K139071K228194
$$ plain form
14586 9331355 11774059 14597323 18030667 22319138 27591249 33727964 40356251 46985656
14578 46985656 53172043 58596932 63058664 66437698 68682166 69808553 69882481 68974820
14570 68974820 67144595 64496326 61267078 57824840 54530550 51564819 48866805 46222951
14562 46222951 43409270 40281170 36795872 33017080 29126624 25416429 22233327 19884116
14554 19884116 18536585 18166874 18599145 19637855 21215834 23436467 26442898 30184229
14546 30184229 34247617 37897124 40333797 41038388 39979047 37554378 34335031 30786355
14538 30786355 27127193 23369312 19468793 15460564 11490800 7781294 4600028 2220516
14530 2220516 815219 344200 574162 1243478 2239010 3658528 5738906 8699556 12573794
$$ packed form
14586I331355K442704K823264L433344M288471N272111O136715O628287O629405
14578D6985656O186387N424889M461732L379034K244468J126387P3928r07661
14570F8974820j830225k648269l229248l442238l294290k965731k698014k643854
14562D6222951k813681l128100l485298l778792l890456l710195l183102k349211
14554A9884116j347531l69711M32271J038710J577979K220633L006431L741331
14546C0184229M063388L649507K436673P04591j059341k424669l219347l548676
14538C0786355l659162l757881l900519m008229l969764l709506l181266k379512
14530B220516j405297m71019K29962O69316R95532J419518K080378K960650L874238
$$ plain form
14521 12573794 17118188 21868274 26314186 30071031 32931283 34799894 35612158 35352429
14513 35352429 34199905 32669273 31557060 31650856 33376514 36623248 40843490 45329797
14505 45329797 49492200 53002789 55766677 57776352 58975356 59242105 58490753 56781250
14497 56781250 54345609 51521157 48638381 45920525 43432994 41093761 38728062 36133816
14489 36133816 33131061 29581588 25388661 20516851 15045511 9205179 3350326 -2112146
14481 -2112146 -6790456 -10350034 -12534390 -13178011 -12228371 -9781306 -6113612 -1685136
14473 -1685136 2923716 7146713 10578415 13048447 14604393 15450842 15883940 16220659 16721658
14464 16721658 17533262 18666134 19992915 21248134 22061256 22070214 21079823 19138912 16468773
$$ packed form
14521A2573794M544394M750086M445912L756845K860252J868611Q12264k59729
14513C5352429j152524j530632j112213R3796J725658L246734M220242M486307
14505D5329797M162403L510589K763888K009675J199004K66749p51352j709503
14497E6781250k435641k824452k882776k717856k487531k339233k365699k594246
14489C6133816l002755l549473m192927m871810n471340n840332n854853n462472
14481b112146m678310l559578k184356o43621R49640K447065L667694M428476
14473a685136M608852M222997L431702K470032J555946Q46449M33098L36719N00999
14464A6721658Q11604J132872J326781J255219Q13122Q958r90391j940911k670139
$$ plain form
14455 16468773 13319153 9864343 6185928 2341083 -1530539 -5160277 -8220721 -10458412
14447 -10458412 -11789083 -12297818 -12151033 -11474694 -10275448 -8466482 -5995233 -2983612
14439 -2983612 236131 3238502 5714207 7642048 9301574 11097539 13314272 15986320
14431 15986320 18958489 22029962 25030418 27795422 30130272 31833640 32759322 32861284
14423 32861284 32212973 31023011 29622387 28362588 27451038 26862336 26409797 25899069 25236777
14414 25236777 24458954 23720097 23262029 23329602 24024360 25184104 26399559 27166139 27070702
14405 27070702 25931555 23867650 21284004 18742234 16735972 15503081 15001965 15029208
14397 15029208 15361695 15840483 16367432 16821371 16955619 16377583 14662265 11544014 7067702
$$ packed form
14455A6468773l149620l454810l678415l844845l871622l629738l060444k237691
14447a0458412j330671n08735J46785O76339J199246J808966K471249L011621
14439b983612L219743L002371K475705J927841J659526J795965K216733K672048
14431A5986320K972169L071473L000456K765004K334850J703368R25682J01962
14423C2861284o48311j189962j400624j259799r11550n88702m52539n10728o62292
14414B5236777p77823p38857m58068O7573O94758J159744J215455P66580r5437
14405B7070702j139147k063905k583646k541770k006262j232891n01116K7243
14397A5029208L32487M78788N26949M53939J34248n78036j715318l118251m476312
$$ plain form
14388 7067702 1600637 -4325632 -10265572 -16025871 -21628549 -27134679 -32489319 -37487458
14380 -37487458 -41841361 -45262029 -47498572 -48362441 -47789166 -45914511 -43079234 -39735554
14372 -39735554 -36308507 -33053530 -29942866 -26668987 -22845249 -18323437 -13383038 -8626009
14364 -8626009 -4683303 -1972174 -625457 -545935 -1487036 -3111702 -5046346 -6957227 -8621558
14355 -8621558 -9934318 -10854128 -11358059 -11450208 -11202115 -10767639 -10325143 -9969237 -9658214
14346 -9658214 -9285363 -8794079 -8222295 -7686054 -7369644 -7506016 -8292599 -9768699 -11748389
14337 -11748389 -13868488 -15716142 -16942945 -17328179 -16842047 -15724197 -14500001 -13870039
14329 -13870039 -14492705 -16742252 -20550135 -25407775 -30528471 -35094012 -38481888 -40386099
$$ packed form
14388G067702n467065n926269n939940n760299n602678n506130n354640m998139
14380c7487458m353903l420668k236543q63869N73275J874655K835277L343680
14372c9735554L427047L254977L110664L273879L823738M521812M940399M757029
14364h626009L942706K711129J346717P9522r41101j624666j934644j910881j664331
14355h621558j312760r19810n03931r2149K48093M34476M42496L55906L11023
14346i658214L72851M91284N71784N36241L16410j36372p86583j476100j979690
14337a1748389k120099j847654j226803l85234M86132J117850J224196O29962
14329a3870039o22666k249547l807883m857640n120696m565541l387876j904211
$$ plain form
14321 -40386099 -40809072 -39964112 -38141202 -35587551 -32448736 -28779823 -24598855 -19947617
14313 -19947617 -14940047 -9800977 -4888439 -662053 2421617 4044661 4127589 2847232
14305 2847232 549767 -2418095 -5871258 -9841393 -14482680 -19878055 -25887364 -32175881
14297 -32175881 -38407087 -44423374 -50262189 -56018896 -61675835 -67017107 -71689438 -75362269
14289 -75362269 -77865496 -79236132 -79687797 -79522128 -79011871 -78317117 -77456042 -76308293 -74658580
14280 -74658580 -72291464 -69108005 -65221717 -60977542 -56844774 -53215336 -50213676 -47621392
14272 -47621392 -44968614 -41771635 -37802057 -33225317 -28527758 -24288942 -20923587 -18514088
14264 -18514088 -16818469 -15445472 -14069341 -12541753 -10863747 -9085524 -7233161 -5316666
$$ packed form
14321d0386099m22973Q44960J822910K553651L138815L668913M180968M651238
14313a9947617N007570N139070M912538M226386L083670J623044Q2928j280357
14305B847232k297465k967862l453163l970135m641287n395375o009309o288517
14297c2175881o231206o016287n838815n756707n656939n341272m672331l672831
14289g5362269k503227j370636m51665J65669N10257O94754Q61075J147749J649713
14280g4658580K367116L183459L886288M244175M132768L629438L001660K592284
14272d7621392K652778L196979L969578M576740M697559M238816L365355K409499
14264a8514088J695619J372997J376131J527588J678006J778223J852363J916495
$$ plain form
14256 -5316666 -3391576 -1594292 -99796 960208 1541365 1670346 1404480 811191 -24548
14247 -24548 -992976 -1963492 -2790166 -3346351 -3610236 -3727386 -3964181 -4594263 -5821765 -7761173
14237 -7761173 -10431483 -13752673 -17560300 -21643926 -25800556 -29874320 -33743281 -37260204
14229 -37260204 -40216999 -42393802 -43669780 -44088056 -43791825 -42883755 -41338720 -39042458
14221 -39042458 -35925748 -32093900 -27850000 -23588226 -19631225 -16125564 -13076960 -10517183
14213 -10517183 -8681819 -8035044 -9081235 -12077943 -16830308 -22671216 -28631376 -33733498
14205 -33733498 -37294301 -39103205 -39401885 -38695264 -37510276 -36225965 -35025849 -33949424
14197 -33949424 -32996203 -32213910 -31690255 -31446554 -31344373 -31118357 -30524126 -29484464 -28136781
$$ packed form
14256e316666J925090J797284J494496J060004N81157J28981k65866n93289q35739
14247b4548r68428r70516q26674n56185k63885j17150k36795o30082j227502j939408
14237g761173k670310l321190l807627m083626m156630m073764l868961l516923
14229c7260204k956795k176803j275978m18276K96231R08070J545035K296262
14221c9042458L116710L831848M243900M261774L957001L505661L048604K559777
14213a0517183J835364O46775j046191k996708m752365n840908n960160n102122
14205c3733498l560803j808904k98680P06621J184988J284311J200116J076425
14197c3949424R53221P82293N23655K43701J02181K26016N94231J039662J347683
$$ plain form
14188 -28136781 -26763917 -25653600 -24979726 -24777809 -24974219 -25369073 -25574959 -25039225 -23228363
14179 -23228363 -19872792 -15083849 -9264474 -2911845 3525152 9673380 15246317 20144235
14171 20144235 24576895 29036303 34072413 40015237 46824681 54137397 61434958 68193205
14163 68193205 73938209 78249802 80791112 81371375 79986783 76819485 72206682 66558487
14155 66558487 60227378 53424931 46268301 38905232 31595576 24690609 18538143 13365895
14147 13365895 9193253 5822488 2936875 277540 -2198421 -4296084 -5714451 -6212901
14139 -6212901 -5689103 -4161980 -1732984 1426256 5068423 8872656 12478280 15560582
14131 15560582 17909220 19447170 20188564 20190994 19539993 18364939 16863744 15290666 13870183
$$ packed form
14188b8136781J372864J110317O73874K01917j96410l94854k05886N35734J810862
14179b3228363L355571M788943N819375O352629O436997O148228N572937M897918
14171B0144235M432660M459408N036110N942824O809444P312716P297561O758247
14163F8193205N745004M311593K541310N80263j384592l167298m612803n648195
14155F6558487o331109o802447p156630p363069p309656o904967o152466n172248
14147A3365895m172642l370765k885613k659335k475961k097663j418367m98450
14139f212901N23798J527123K428996L159240L642167L804233L605624L082302
14131A5560582K348638J537950P41394K430o51001j175054j501195j573078j420483
$$ plain form
14122 13870183 12670594 11545087 10226967 8533278 6517749 4453084 2674115 1419155
14114 1419155 766924 656763 948180 1510047 2305704 3389118 4785619 6362152 7828464
14105 7828464 8899125 9493218 9810589 10239767 11179845 12876883 15324973 18244183 21141020
14096 21141020 23449539 24715869 24747411 23649295 21737118 19393662 16951531 14644122
14088 14644122 12622599 10997868 9857143 9239201 9097065 9293314 9641308 9958942 10100363
14079 10100363 9968738 9528052 8801669 7837237 6658294 5238166 3511693 1427693 -984393
14070 -984393 -3596582 -6227752 -8687172 -10784548 -12345167 -13243172 -13421907 -12891542 -11732136
14061 -11732136 -10109428 -8249969 -6342456 -4432362 -2409097 -103870 2579265 5588093
$$ packed form
14122A3870183j199589j125507j318120j693689k015529k064665j778969j254960
14114A419155o52231j10161K91417N61867P95657J083414J396501J576533J466312
14105G828464J070661N94093L17371M29178R40078J697038K448090K919210K896837
14096B1141020K308519J266330L1542j098116j912177k343456k442131k307409
14088A4644122k021523j624731j140725o17942j42136J96249L47994L17634J41421
14079A0100363j31625m40686p26383r64432j178943j420128j726473k084000k412086
14070i84393k612189k631170k459420k097376j560619q98005j78735N30365J159406
14061a1732136J622708J859459J907513J910094K023265K305227K683135L008828
$$ plain form
14053 5588093 8718181 11641345 13958032 15299267 15453187 14415774 12305228 9221862
14045 9221862 5195722 265500 -5393925 -11403655 -17227393 -22322270 -26319999 -29131125
14037 -29131125 -30920009 -31999605 -32718146 -33351024 -33995646 -34521393 -34641640 -34096503 -32841750
14028 -32841750 -31130123 -29439666 -28278873 -27954918 -28422676 -29308014 -30100582 -30392478 -30022456
14019 -30022456 -29080600 -27804280 -26425644 -25052338 -23634383 -22003123 -19948844 -17314101
14011 -17314101 -14061333 -10276889 -6130455 -1839819 2336022 6094698 9109172 11048531
14003 11048531 11567167 10312768 7026053 1690664 -5377872 -13556202 -22031158 -29963936
13995 -29963936 -36643119 -41583309 -44556145 -45569424 -44825934 -42680000 -39592356 -36083443
$$ packed form
14053E588093L130088K923164K316687J341235J53920j037413k110546l083366
14045I221862m026140m930222n659425o009730n823738n094877l997729k811126
14037b9131125j788884j079596p18541o32878o44622n25747j20247N45137J254753
14028c2841750J711627J690457J160793L23955m67758q85338p92568k91896L70022
14019c0022456R41856J276320J378636J373306J417955J631260K054279K634743
14011a7314101L252768L784444M146434M290636M175841L758676L014474J939359
14003A1048531N18636j254399l286715n335389p068536q178330q474956p932778
13995b9963936o679183m940190k972836j013279P43490K145934L087644L508913
$$ plain form
13987 -36083443 -32670990 -29775579 -27624423 -26227122 -25470812 -25278810 -25698122 -26851749
13979 -26851749 -28832394 -31640233 -35178568 -39260282 -43608816 -47880534 -51716160 -54799529
13971 -54799529 -56904632 -57906657 -57754593 -56465521 -54167705 -51113687 -47602953 -43868766
13963 -43868766 -40025996 -36112311 -32157795 -28193543 -24191052 -20014566 -15463988 -10393321
13955 -10393321 -4817073 1069280 6961354 12548478 17571306 21825983 25172854 27565343
13947 27565343 29038107 29636175 29356609 28158382 26027446 23048686 19428069 15451353
13939 15451353 11436861 7722652 4641188 2433737 1152020 631085 553931 566251 390035
13930 390035 -94125 -810975 -1519071 -1915553 -1791088 -1155835 -245824 598356 1079938 1017595
$$ packed form
13987c6083443L412453K895411K151156J397301P56310J92002m19312j153627
13979b6851749j980645k807839l538335m081714m348534m271718l835626l083369
13971e4799529k105103j002025J52064J289072K297816L054018L510734L734187
13963d3868766L842770L913685L954516L964252M002491M176486M550578N070667
13955a0393321N576248N886353N892074N587124N022828M254677L346871K392489
13947B7565343J472764N98068k79566j198227k130936k978760l620617l976716
13939A5451353m014492l714209l081464k207451j281717n20935p7154J2320j76216
13930C90035m84160p16850p08096l96482J24465O35253R10011Q44180M81582o2343
$$ plain form
13920 1017595 334966 -958233 -2747167 -4794599 -6776869 -8371026 -9377436 -9846684
13912 -9846684 -10110969 -10629124 -11713218 -13337787 -15165057 -16731313 -17641503 -17681221 -16853604
13903 -16853604 -15358703 -13505930 -11596299 -9859961 -8478885 -7650302 -7626438 -8669260
13895 -8669260 -10914930 -14234356 -18189212 -22110852 -25271280 -27097103 -27357171 -26231417
13887 -26231417 -24198754 -21795409 -19394721 -17120543 -14885447 -12485419 -9700764 -6389562
13879 -6389562 -2574411 1507323 5443277 8770355 11085399 12058847 11402106 8911699
13871 8911699 4601034 -1216338 -7991646 -15101644 -22001626 -28308967 -33781925 -38209606
13863 -38209606 -41325935 -42858709 -42679262 -40918378 -37967661 -34379584 -30718730 -27419837
$$ packed form
13920A017595o82629j293199j788934k047432j982270j594157j006410m69248
13912i846684k64285n18155j084094j624569j827270j566256r10190l9718Q27617
13903a6853604J494901J852773J909631J736338J381076Q28583K3864j042822
13895h669260k245670l319426l954856l921640l160428j825823k60068J125754
13887b6231417K032663K403345K400688K274178K235096K400028K784655L311202
13879f389562L815151M081734L935954L327078K315044R73448o56741k490407
13871H911699m310665n817372o775308p109998o899982o307341n472958m427681
13863c8209606l116329j532774J79447J760884K950717L588077L660854L298893
$$ plain form
13855 -27419837 -24701789 -22566937 -20888036 -19549582 -18560269 -18057148 -18221562 -19196015 -21036576
13846 -21036576 -23660812 -26782024 -29904314 -32444544 -33946674 -34277105 -33691337 -32731658
13838 -32731658 -32007294 -31957523 -32696585 -34013578 -35524824 -36863973 -37772508 -38066627 -37571365
13829 -37571365 -36119340 -33635532 -30246469 -26322652 -22403245 -19028098 -16562256 -15107680
13821 -15107680 -14540856 -14634575 -15187617 -16098835 -17365175 -19033345 -21138154 -23635670 -26352216
13812 -26352216 -28995780 -31242512 -32844134 -33692140 -33825694 -33412839 -32729728 -32122127 -31917355
13803 -31917355 -32306540 -33278407 -34658553 -36214250 -37749451 -39163939 -40478776 -41813428
13795 -41813428 -43313201 -45065165 -47043095 -49092868 -50957236 -52334632 -52943669 -52544931
$$ packed form
13855b7419837K718048K134852J678901J338454R89313N03121j64414r74453j840561
13846b1036576k624236l121212l122290k540230j502130l30431N85768R59679
13838c2731658P24364M9771p39062j316993j511246j339149r08535k94119M95262
13829c7571365J452025K483808L389063L923817L919407L375147K465842J454576
13821a5107680N66824r3719n53042r11218j266340j668170k104809k497516k716546
13812b6352216k643564k246732j601622q48006j33554M12855O83111O07601K04772
13803c1917355l89185r71867j380146j555697j535201j414488j314837j334652
13795d1813428j499773j751964j977930k049773j864368j377396o09037L98738
$$ plain form
13787 -52544931 -50906232 -47777866 -42961977 -36457717 -28561378 -19831526 -10942108 -2519553
13779 -2519553 4953281 11160283 15954392 19362165 21557231 22783984 23273099 23198029 22675813
13770 22675813 21787347 20593469 19133382 17418397 15466745 13403718 11552494 10379541
13762 10379541 10264225 11259532 13058959 15195542 17282272 19100179 20524411 21431640
13754 21431640 21708630 21340376 20480602 19440951 18579151 18130535 18110594 18375962 18764805
13745 18764805 19162144 19452710 19473496 19070664 18223834 17105541 15999686 15136298 14566695
13736 14566695 14154812 13671704 12923127 11830926 10431214 8812293 7047312 5180903
13728 5180903 3298251 1627967 572651 594682 1992199 4707496 8311832 12172089
$$ packed form
13787e2544931J638699L128366M815889O504260P896339Q729852Q889418Q422555
13779b519553P472834O207002M794109L407773K195066J226753M89115p5070n22216
13770B2675813q88466j193878j460087j714985j951652k063027j851224j172953
13762A0379541j15316R95307J799427K136583K086730J817907J424232R07229
13754B1431640K76990l68254q59774j039651q61800m48616j9941K65368L88843
13745A8764805L97339K90566K0786m02832q46830j118293j105855q63388n69603
13736A4566695m11883m83108p48577j092201j399712j618921j764981j866409
13728E180903j882652j670284j055316K2031J397517K715297L604336L860257
$$ plain form
13720 12172089 15664811 18310585 19814294 20066752 19132483 17196157 14472033 11142839
13712 11142839 7361816 3278688 -959438 -5235058 -9463005 -13527024 -17194666 -20109978
13704 -20109978 -21915161 -22439784 -21818802 -20443209 -18767447 -17079176 -15363238 -13364522
13696 -13364522 -10823246 -7703074 -4241323 -814181 2262707 4877187 7140342 9275610
13688 9275610 11443656 13614356 15558540 16953423 17537159 17217806 16067891 14224558
13680 14224558 11784437 8757515 5071154 606052 -4705864 -10726517 -17014086 -22878905
13672 -22878905 -27553132 -30390101 -31051351 -29643145 -26738254 -23225628 -20011948 -17722775
13664 -17722775 -16582751 -16516259 -17319731 -18730345 -20395336 -21890940 -22856833 -23140954 -22821494
$$ packed form
13720A2172089L492722K645774J503709K52458r34269j936326k724124l329194
13712A1142839l781023m083128m238126m275620m227947m064019l667642k915312
13704b0109978j805183n24623O20982J375593J675762J688271J715938J998716
13696a3364522K541276L120172L461751L427142L076888K614480K263155K135268
13688I275610K168046K170700J944184J394883N83736l19353j149915j843333
13680A4224558k440121l026922l686361m465102n311916o020653o287569n864819
13672b2878905m674227k836969o61250J408206K904891L512626L213680K289173
13664a7722775J140024O6492q03472j410614j664991j495604r65893k84121L19460
$$ plain form
13655 -22821494 -22102182 -21188440 -20228340 -19318984 -18545603 -18024375 -17914019 -18379488 -19535823
13646 -19535823 -21402374 -23870863 -26695506 -29527069 -31990418 -33775041 -34709687 -34789952
13638 -34789952 -34119154 -32786278 -30794285 -28116307 -24824777 -21170780 -17546196 -14373150
13630 -14373150 -11999617 -10618399 -10212862 -10579070 -11438060 -12560554 -13846580 -15382397
13622 -15382397 -17459036 -20475055 -24736347 -30279919 -36818862 -43824238 -50711642 -57042013
13614 -57042013 -62615431 -67409730 -71441346 -74665941 -76948434 -78066373 -77752637 -75796093
13606 -75796093 -72145801 -66934280 -60411064 -52863753 -44587655 -35890073 -27091649 -18519196
13598 -18519196 -10513559 -3451775 2269133 6313795 8503534 8871310 7676568 5375396
$$ packed form
13655b2821494P19312R13742R60100R09356P73381N21228J10356m65469j156335
13646a9535823j866551k468489k824643k831563k463349j784623r34646q0265
13638c4789952O70798J332876J991993K677978L291530L653997L624584L173046
13630a4373150K373533J381218M05537l66208q58990j122494j286026j535817
13622a5382397k076639l016019m261292n543572o538943p005376o887404o330371
13614e7042013n573418m794299m031616l224595k282493j117939L13736J956544
13606g5796093L650292N211521O523216P547311Q276098Q697582Q798424Q572453
13598a8519196Q005637P061784N720908M044662K189739L67776j194742k301172
$$ plain form
13590 5375396 2521383 -365116 -2870367 -4694563 -5670300 -5810480 -5308677 -4439363 -3406913
13581 -3406913 -2254302 -914198 630709 2217355 3513474 4156317 3922783 2844233
13573 2844233 1210645 -547044 -2025043 -2968130 -3314776 -3180322 -2786095 -2363563 -2096401
13564 -2096401 -2128371 -2581627 -3521938 -4903537 -6576753 -8354416 -10047286 -11429030 -12207351
13555 -12207351 -12105731 -11043214 -9258548 -7239579 -5496167 -4351604 -3878508 -3957578 -4368604
13546 -4368604 -4876386 -5321445 -5698236 -6183515 -7098996 -8809236 -11563920 -15336353 -19769407
13537 -19769407 -24294499 -28329572 -31409896 -33243089 -33773544 -33252077 -32202143 -31238211
13529 -31238211 -30846619 -31259417 -32432112 -34080728 -35782641 -37154188 -38030222 -38515462 -38873490
$$ packed form
13590E375396k854013k886499k505251j824196r75737j40180N01803Q69314J032450
13581c406913J152611J340104J544907J586646J296119O42843k33534j078550
13573B844233j633588j757689j477999r43087l46646J34454L94227M22532K67162
13564b096401l1970m53256r40311j381599j673216j777663j692870j381744p78321
13555a2207351J01620J062517J784666K018969J743412J144563M73096p9070m11026
13546d368604n07782m45059l76791m85279r15481j710240k754684l772433m433054
13537a9769407m525092m035073l080324j833193n30455N21467J049934R63932
13529c1238211L91592m12798j172695j648616j701913j371547q76034m85240l58028
$$ plain form
13520 -38873490 -39359098 -40108369 -41113754 -42263777 -43426602 -44536783 -45620920 -46742103
13512 -46742103 -47908923 -48990827 -49672464 -49512615 -48124969 -45370279 -41422855 -36681537
13504 -36681537 -31599625 -26533238 -21667554 -17019131 -12495786 -8005067 -3563479 668584
13496 668584 4450737 7585647 10015282 11807301 13057474 13828874 14180663 14216075 14079385
13487 14079385 13913248 13814413 13802235 13804780 13678571 13282116 12586306 11744686 11047431 10777508
13477 10777508 11085554 11977254 13371358 15122895 17014220 18796032 20261587 21257521
13469 21257521 21625460 21167729 19695150 17124321 13554524 9279158 4737005 434888
13461 434888 -3142870 -5633485 -6872360 -6900383 -5900675 -4131259 -1907236 408488 2481669
$$ packed form
13520c8873490m85608p49271j005385j150023j162825j110181j084137j121183
13512d6742103j166820j081904o81637J59849J387646K754690L947424M741318
13504c6681537N081912N066387M865684M648423M523345M490719M441588M232063
13496F68584L782153L134910K429635J792019J250173P71400L51789L5412j36690
13487A4079385j66137r8835j2178K545j26209l96455o95810q41620o97255k69923
13477A0777508L08046Q91700J394104J751537J891325J781812J465555R95934
13469B1257521L67939m57731j472579k570829l569797m275366m542153m302117
13461D34888l577758k490615j238875k8023R99708J769416K224023K315724K073181
$$ plain form
13452 2481669 4118944 5283366 5962716 6014767 5157011 3130432 -92789 -4204044 -8597058
13443 -8597058 -12509143 -15215360 -16231131 -15446394 -13104425 -9630133 -5434540 -829295
13435 -829295 3938933 8638873 13065513 17076537 20603690 23664051 26395344 29050719
13427 29050719 31877339 34921246 37911667 40343920 41713473 41722885 40331580 37675850
13419 37675850 33973858 29485068 24511613 19395837 14473342 9986546 6032228 2603702
13411 2603702 -316279 -2703478 -4504331 -5674366 -6221661 -6245646 -5923166 -5409358 -4722683
13402 -4722683 -3727623 -2243606 -191219 2339943 5126491 7872463 10226836 11790101
13394 11790101 12193404 11246215 9049727 5991269 2619750 -529057 -3072168 -4845974
$$ packed form
13452B481669J637275J164422O79350N2051q57756k026579l223221m111255m393014
13443h597058l912085k706217j015771P84737K341969L474292M195593M605245
13435h29295M768228M699940M426640M011024L527153L060361K731293K655375
13427B9050719K826620L043907K990421K432253J369553R412j391305k655730
13419C7675850l701992m488790m973455n115776m922495m486796l954318l428526
13411B603702k919981k387199j800853j170035n47295k3985L22480N13808O86675
13402d722683R95060J484017K052387K531162K786548K745972K354373J563265
13394A1790101M03303r47189k196488l058458l371519l148807k543111j773806
$$ plain form
13386 -4845974 -5914065 -6527906 -7037535 -7776230 -8968601 -10685767 -12835111 -15175079 -17368138
13377 -17368138 -19087624 -20157519 -20659140 -20921428 -21355923 -22227584 -23546221 -25157519 -26901817
13368 -26901817 -28659560 -30273784 -31500775 -32080738 -31846886 -30768397 -28939906 -26568418
13360 -26568418 -23942214 -21345673 -18958243 -16822665 -14895257 -13105446 -11376697 -9641529
13352 -9641529 -7894129 -6243719 -4887724 -4012249 -3717565 -4015686 -4849337 -6082091 -7490362
13343 -7490362 -8813237 -9837702 -10441819 -10570586 -10186966 -9239106 -7664867 -5453572 -2742126
13334 -2742126 148817 2806502 4890090 6242644 6877419 6868312 6245712 4998594 3198265
13325 3198265 1130820 -700495 -1719483 -1475528 203557 3171273 7040642 11318704
$$ packed form
13386d845974j068091o13841n09629p38695j192371j717166k149344k339968k193059
13377a7368138j719486j069895n01621k62288m34495q71661j318637j611298j744298
13368b6901817j757743j614224j226991n79963K33852J078489J828491K371488
13360b6568418K626204K596541K387430K135578J927408J789811J728749J735168
13352i641529J747400J650410J355995Q75475K94684k98121q33651j232754j408271
13343g490362j322875j024465o04117j28767L83620R47860J574239K211295K711446
13334b742126K890943K657685K083588J352554O34775r107o22600j247118j800329
13325C198265k067445j831315j018988K43955J679085K967716L869369M278062
$$ plain form
13317 11318704 15534425 19336595 22538534 25095349 27055638 28533093 29673827 30589706
13309 30589706 31298424 31721203 31736760 31268209 30375658 29306140 28459820 28275112 29059172
13300 29059172 30812938 33150729 35402061 36857336 37009892 35676637 32984989 29288069
13292 29288069 25078945 20923763 17377036 14852864 13497952 13153916 13448768 13967448
13284 13967448 14409700 14667927 14805734 14965571 15261547 15702990 16158543 16363200 15999829
13275 15999829 14856487 12965534 10621702 8277163 6384359 5263295 5043674 5677969
13267 5677969 6980876 8662186 10357786 11691389 12383551 12363666 11815576 11132805 10803520
13258 10803520 11250888 12670878 14955672 17770473 20726836 23528643 26032355 28222167
$$ packed form
13317A1318704M215721L802170L201939K556815J960289J477455J140734R15879
13309C0589706P08718M22779J5557m68551q92551j069518q46320j84708P84060
13300B9059172J753766K337791K251332J455275J52556j333255k691648l696920
13292B9288069m209124m155182l546727k524172j354912l44036K94852N18680
13284A3967448M42252K58227J37807J59837K95976M41443M55553K04657l63371
13275A5999829j143342j890953k343832k344539j892804j121064k19621O34295
13267E677969J302907J681310J695600J333603O92162j9885n48090o82771l29285
13258A0803520M47368J419990K284794K814801K956363K801807K503712K189812
$$ plain form
13250 28222167 30116754 31673025 32770900 33282344 33147315 32399146 31153178 29591470
13242 29591470 27935161 26381362 25029181 23851532 22724133 21461815 19827863 17557439
13234 17557439 14448416 10485047 5897700 1096335 -3498142 -7609857 -11133278 -14036457
13226 -14036457 -16272077 -17804387 -18715751 -19254999 -19757022 -20503006 -21637135 -23181758 -25090952
13217 -25090952 -27267167 -29546647 -31711831 -33556654 -34976928 -36011889 -36766476 -37260981
13209 -37260981 -37361926 -36876161 -35720739 -34010056 -31992126 -29922176 -28004676 -26403991
13201 -26403991 -25224078 -24444855 -23908443 -23402883 -22777578 -21988156 -21045338 -19945126 -18662809
13192 -18662809 -17202822 -15625469 -13992562 -12266808 -10276365 -7813830 -4798675 -1365380
$$ packed form
13250B8222167J894587J556271J097875N11444j35029p48169j245968j561708
13242B9591470j656309j553799j352181j177649j127399j262318j633952k270424
13234A7557439l109023l963369m587347m801365m594477m111715l523421k903179
13226a4036457k235620j532310r11364n39248n02023p45984j134129j544623j909194
13217b5090952k176215k279480k165184j844823j420274j034961p54587m94505
13209c7260981j00945M85765J155422J710683K017930K069950J917500J600685
13201b6403991J179913P79223N36412N05560O25305P89422R42818J100212J282317
13192a8662809J459987J577353J632907J725754J990443K462535L015155L433295
$$ plain form
13184 -1365380 2180192 5488551 8298154 10504580 12134514 13252815 13885856 14026669
13176 14026669 13698608 12999877 12101764 11234116 10673666 10709904 11569083 13320121 15822886
13167 15822886 18765569 21773586 24523216 26804631 28523950 29669667 30279415 30432156
13159 30432156 30256383 29912466 29527440 29117922 28565983 27678164 26292601 24375288 22067999
13150 22067999 19666942 17521747 15894194 14870082 14382126 14302012 14517024 14956360 15580233
13141 15580233 16340041 17118931 17693413 17766936 17082703 15560619 13392253 11060089 9254939
13132 9254939 8674313 9758428 12506996 16500538 21103655 25695491 29792190 33055912
13124 33055912 35270978 36337215 36262312 35133125 33078799 30234212 26706033 22550381
$$ packed form
13184a365380L545572L308359K809603K206426J629934J118301O33041J40813
13176A4026669l28061o98731q98113q67648n60450L6238Q59179J751038K502765
13167A5822886K942683L008017K749630K281415J719319J145717O09748J52741
13159C0432156j75773l43917l85026m09518n51939q87819j385563j917313k307289
13150B2067999k401057k145195j627553j024112m87956q0114K15012M39336O23873
13141A5580233P59808P78890N74482P3523o84233j522084k168366k332164j805150
13132I254939n80626J084115K748568L993542M603117M591836M096699L263722
13124C3055912K215066J066237p4903j129187k054326k844587l528179m155652
$$ plain form
13116 22550381 17758382 12250928 5909047 -1342807 -9420990 -17991327 -26474430 -34175119
13108 -34175119 -40475704 -44988699 -47603091 -48445322 -47819332 -46140276 -43837171 -41253016
13100 -41253016 -38616803 -36093575 -33815433 -31824473 -30005340 -28135988 -26058113 -23838939
13092 -23838939 -21799823 -20370447 -19831895 -20110186 -20778366 -21280650 -21225828 -20552431 -19474356
13083 -19474356 -18284137 -17178497 -16206588 -15322572 -14476602 -13688101 -13063807 -12755932 -12894655
13074 -12894655 -13541156 -14675344 -16193388 -17907537 -19577499 -20972078 -21910318 -22259883
13066 -22259883 -21930916 -20893020 -19180077 -16843539 -13891921 -10290397 -6021715 -1143515
13058 -1143515 4206799 9869788 15749118 21841771 28156799 34568242 40719346 46075503
$$ packed form
13116B2550381m791999n507454o341881p251854q078183q570337q483103p700689
13108c4175119o300585m512995k614392q42231O25990J679056K303105K584155
13100d1253016K636213K523228K278142J990960J819133J869352K077875K219174
13092b3838939K039116J429376N38552k78291o68180n02284N4822O73397J078075
13083a9474356J190219J105640R71909Q84016Q45970P88501O24294L07875j38723
13074a2894655o46501j134188j518044j714149j669962j394579r38240l49565
13066b2259883L28967J037896J712943K336538K951618L601524M268682M878200
13058a143515N350314N662989N879330O092653O315028O411443O151104N356157
$$ plain form
13050 46075503 50124468 52593685 53523768 53166733 51827689 49771574 47205311 44286073
13042 44286073 41136390 37863459 34561863 31290005 28044483 24760494 21346514 17759753
13034 17759753 14107808 10692557 7919881 6130391 5475656 5886984 7106825 8758234
13026 8758234 10443141 11844767 12798112 13304481 13487930 13514662 13517967 13575430 13739549 14052193
13016 14052193 14483423 14848253 14820078 14070213 12429460 9952742 6865108 3450643 -52358
13007 -52358 -3514670 -6901581 -10173709 -13190790 -15730603 -17621406 -18875178 -19711080 -20447925
12998 -20447925 -21339735 -22453406 -23652228 -24699259 -25426724 -25859772 -26206699 -26725247 -27568273
12989 -27568273 -28720842 -30054838 -31434355 -32786111 -34103063 -35402105 -36672272 -37857963
$$ packed form
13050D6075503M048965K469217R30083l57035j339044k056115k566263k919238
13042D4286073l149683l272931l301596l271858l245522l283989l413980l586761
13034A7759753l651945l415251k772676j789490o54735M11328J219841J651409
13026H758234J684907J401626R53345N06369J83449K6732L305N7463J64119L12644
13016A4052193M31230L64830k8175p49865j640753k476718l087634l414465l503001
13007e2358l462312l386911l272128l017081k539813j890803j253772q35902p36845
12998b0447925q91810j113671j198822j047031p27465m33048l46927n18548q43026
12989b7568273j152569j333996j379517j351756j316952j299042j270167j185691
$$ plain form
12981 -37857963 -38898914 -39788438 -40590511 -41399490 -42286365 -43290821 -44451254 -45793973 -47253515
12972 -47253515 -48608865 -49525677 -49687842 -48923341 -47247851 -44818640 -41853725 -38575266
12964 -38575266 -35181410 -31817512 -28549370 -25385813 -22371253 -19668848 -17524988 -16128982
12956 -16128982 -15499110 -15483054 -15840372 -16328449 -16754991 -17008031 -17071613 -16998771 -16821491 -16455399
12946 -16455399 -15692639 -14302769 -12181862 -9475280 -6599222 -4107633 -2457131 -1833441
12938 -1833441 -2160481 -3232215 -4794148 -6510460 -7945099 -8683214 -8524408 -7562403 -6076326
12929 -6076326 -4355079 -2611170 -997565 359090 1355217 1924170 2058764 1836659 1416085
12920 1416085 979387 656128 483722 424222 408141 377621 317123 251772 196247 94462
$$ packed form
12981c7857963j040951q89524q02073q08979q86875j004456j160433j342719j459542
12972d7253515j355350r16812j62165P64501J675490K429211K964915L278459
12964c8575266L393856L363898L268142L163557L014560K702405K143860J396006
12956a6128982O29872J6056l57318m88077m26542k53040o3582P2842J77280L66092
12946a6455399P62760J389870K120907K706582K876058K491589J650502O23690
12938a833441l27040j071734j561933j716312j434639p38115J58806R62005J486077
12929f076326J721247J743909J613605J356655R96127N68953J34594k22105m20574
12920A416085m36698l23259j72406n9500j6081l0520o0498o5351n5525j01785
$$ plain form
12910 94462 -157031 -575413 -968620 -987874 -366534 844566 2243185 3260167 3424147
12901 3424147 2553532 792542 -1509013 -3994551 -6453235 -8829839 -11114469 -13241275
12893 -13241275 -15075750 -16444250 -17156051 -17051093 -16089335 -14399085 -12212987 -9737148
12885 -9737148 -7044015 -4044550 -558735 3559625 8332594 13628468 19158463 24512519
12877 24512519 29265826 33100859 35855223 37484341 37995720 37412515 35790614 33272476
12869 33272476 30139133 26815613 23791891 21481003 20106691 19685283 20073977 21032470
12861 21032470 22285981 23595815 24818728 25918278 26924514 27883585 28828652 29749110
12853 29749110 30523369 30866563 30410954 28922136 26475768 23429119 20206477 17061611
$$ packed form
12910I4462k51493m18382l93207j9254O21340J211100J398619J016982J63980
12901C424147q70615j760990k301555k485538k458684k376604k284630k126806
12893a3241275j834475j368500p11801J04958R61758J690250K186098K475839
12885i737148K693133K999465L485815M118360M772969N295874N529995N354056
12877B4512519M753307L835033K754364J629118N11379n83205j621901k518138
12869C3272476l133343l323520l023722k310888j374312m21408L88694R58493
12861B1032470J253511J309834J222913J099550J006236R59071R45067R20458
12853B9749110P74259L43194m55609j488818k446368l046649l222642l144866
$$ plain form
12845 17061611 13972361 10719491 7088921 3055433 -1174433 -5247723 -8769823 -11372097
12837 -11372097 -12767540 -12820828 -11620499 -9499915 -6956656 -4503853 -2543784 -1306816
12829 -1306816 -854480 -1140393 -2101298 -3740083 -6168403 -9573332 -14092578 -19644579 -25825112
12820 -25825112 -31970402 -37361058 -41426501 -43843622 -44539277 -43644533 -41417194 -38157276
12812 -38157276 -34163477 -29749790 -25288606 -21215748 -17961113 -15837804 -14951785 -15181090
12804 -15181090 -16240636 -17788487 -19510882 -21174778 -22674512 -24080098 -25636196 -27638267
12796 -27638267 -30224435 -33261473 -36439129 -39473505 -42233158 -44705815 -46864008 -48564502
12788 -48564502 -49591000 -49806803 -49264142 -48187471 -46896485 -45728945 -44935919 -44568311 -44455373
$$ packed form
12845A7061611l089250l252870l630570m033488m229866m073290l522100k602274
12837a1372097j395443n3288J200329K120584K543259K452803J960069J236968
12829a306816M52336k85913r60905j638785k428320l404929m519246n552001o180533
12820b5825112o145290n390656m065443k417121o95655Q94744K227339L259918
12812c8157276L993799M413687M461184M072858L254635K123309Q86019k29305
12804a5181090j059546j547851j722395j663896j499734j405586j556098k002071
12796b7638267k586168l037038l177656l034376k759653k472657k158193j700494
12788d8564502j026498k15803N42661J076671J290986J167540P93026L67608J12938
$$ plain form
12779 -44455373 -44297470 -43783067 -42675156 -40889976 -38571193 -36102771 -34004931 -32738433
12771 -32738433 -32524377 -33268863 -34600279 -35985775 -36889377 -36924800 -35949499 -34059530 -31490969
12762 -31490969 -28490958 -25228280 -21777846 -18181722 -14548364 -11104472 -8130874 -5828486
12754 -5828486 -4249603 -3351224 -3078061 -3359406 -4012922 -4665155 -4817400 -4059637 -2272898
12745 -2272898 341111 3397892 6497436 9305219 11535019 12902933 13144752 12136363
12737 12136363 10046812 7383062 4842303 3035077 2246075 2370391 3037010 3812630 4360078
12728 4360078 4503135 4217543 3567486 2613444 1352717 -276921 -2365667 -4988986 -8131304
12719 -8131304 -11598678 -14997574 -17820306 -19585952 -19955494 -18807915 -16303394 -12892374
$$ packed form
12779d4455373J57903N14403J107911J785180K318783K468422K097840J266498
12771c2738433K14056p44486j331416j385496r03602l5423R75301J889969K568561
12762c1490969L000011L262678L450434L596124L633358L443892K973598K302388
12754e828486J578883Q98379K73163k81345o53516o52233j52245P57763J786739
12745b272898K614009L056781L099544K807783K229800J367914K41819j008389
12737A2136363k089551k663750k540759j807226p89002J24316O66619P75620N47448
12728D360078J43057k85592o50057r54042j260727j629638k088746k623319l142318
12719h131304l467374l398896k822732j765646l69542J147579K504521L411020
$$ plain form
12711 -12892374 -9207666 -5882840 -3398462 -1988836 -1588326 -1834789 -2176961 -2063501 -1115136
12702 -1115136 795523 3565096 6952149 10685358 14517392 18203050 21456203 23953311
12694 23953311 25392601 25565965 24406645 22002099 18574960 14436240 9912831 5271459
12686 5271459 684524 -3751376 -7991404 -12052770 -16041813 -20137730 -24490442 -29073404
12678 -29073404 -33600713 -37592879 -40576169 -42304540 -42865604 -42602708 -41923268 -41136728 -40393586
12669 -40393586 -39700905 -38982610 -38169649 -37280747 -36440233 -35819471 -35546895 -35654582 -36089377
12660 -36089377 -36750472 -37508493 -38207238 -38672691 -38746925 -38337695 -37456366 -36247953 -35023532
12651 -35023532 -34241105 -34372115 -35692925 -38134004 -41300216 -44655033 -47737541 -50265461
$$ packed form
12711a2892374L684708L324826K484378J409626M00510k46463l42172J13460R48365
12702a115136J910659K769573L387053L733209L832034L685658L253153K497108
12694B3953311J439290J73364j159320k404546l427139m138720m523409m641372
12686E271459m586935m435900m240028m061366l989043m095917m352712m582962
12678b9073404m527309l992166k983290j728371n61064K62896O79440P86540P43142
12669d0393586O92681P18295Q12961Q88902Q40514O20762K72576j07687m34795
12660c6089377o61095p58021o98745m65453p4234M09230Q81329J208413J224421
12651c5023532P82427j31010j320810k441079l166212l354817l082508k527920
$$ plain form
12643 -50265461 -52079555 -53015946 -52857858 -51439890 -48811885 -45295317 -41348808 -37330090
12635 -37330090 -33347002 -29290766 -24968720 -20231604 -15078148 -9736140 -4659924 -392964
12627 -392964 2647079 4325991 4795648 4359246 3322149 1940904 459098 -866308 -1801594
12618 -1801594 -2199074 -2029372 -1380360 -443272 532654 1336659 1901338 2337082 2845611
12609 2845611 3538928 4276966 4647339 4112966 2239307 -1120762 -5755150 -11133981 -16536890
12600 -16536890 -21238090 -24698992 -26687879 -27259051 -26609415 -24933101 -22382328 -19100015
12592 -19100015 -15205620 -10717967 -5535599 442465 7141999 14247731 21299169 27840511
$$ packed form
12643e0265461j814094r36391J58088J417968K628005L516568L946509M018718
12635c7330090L983088M056236M322046M737116N153456N342008N076216M266960
12627c92964L040043J678912M69657m36402j037097j381245j481806j325406r35286
12618a801594l97480J69702O49012R37088R75926Q04005N64679M35744N08529
12609B845611O93317P38038L70373n34373j873659l360069m634388n378831n402909
12600a6536890m701200l460902j988887n71172O49636J676314K550773L282313
12592a9100015L894395M487653N182368N978064O699534P105732P051438O541342
$$ [...]
##END NTUPLES=NMR SPECTRUM
##END=
