##TITLE=31P ikalashn
DE-75rm_1h(nlock)
11.11.2024
##JCAMPDX= 6.0         $$ Bruker NMR JCAMP-DX V2.0
##DATA TYPE= NMR SPECTRUM
##DATA CLASS= NTUPLES
##ORIGIN= UXNMR, Bruker Analytische Messtechnik GmbH
##OWNER= root
$$ TOPSPIN		Version 1.3
$$ 2024-11-11 14:15:32.312 +0400  Irina@DPX200
$$ Compression mode = diff/dup
##.OBSERVE FREQUENCY= 81.01967998063
##.OBSERVE NUCLEUS= ^31P
##.ACQUISITION MODE= SIMULTANEOUS
##.ACQUISITION SCHEME= undefined
##.AVERAGES= 64
##.DIGITISER RES= 17
##SPECTROMETER/DATA SYSTEM= spect
##.PULSE SEQUENCE= zgpg
##.SOLVENT NAME= D2O
##.SHIFT REFERENCE= INTERNAL, D2O, 1, 298.5841
##AUDIT TRAIL= $$ (NUMBER, WHEN, WHO, WHERE, WHAT)
$$ ##TITLE= Audit trail, TOPSPIN		Version 1.3
$$ ##JCAMPDX= 5.01
$$ ##ORIGIN= Bruker BioSpin GmbH
$$ ##OWNER= Irina
$$ $$ F:/spectra/data/iren/nmr/P31dec/1/pdata/1/auditp.txt
$$ ##AUDIT TRAIL=  $$ (NUMBER, WHEN, WHO, WHERE, VERSION, WHAT)
(   1,<2024-11-11 14:08:51.703 +0400>,<Irina>,<DPX200>,<TOPSPIN 1.3>,
      <created by zg
	started at 2024-11-11 14:07:08.359 +0400,
	POWCHK disabled, PULCHK disabled
       configuration hash MD5:
       BE 6D 3F 07 2A EA 11 49 91 17 2B D3 AF B3 58 0D
       data hash MD5: 32K
       DB 57 35 71 C6 66 8A 93 F9 61 7F 6E 6A D7 01 6C>)
(   2,<2024-11-11 14:14:35.906 +0400>,<Irina>,<DPX200>,<TOPSPIN 1.3>,
      <Start of raw data processing
       efp BC_mod = 2 LB = 15 FT_mod = 6 PKNL = 1 PHC0 = 110.3792 PHC1 = 228.3749 SI = 32K 
       data hash MD5: 32K
       68 3C AF 1B 46 BB 4E 96 43 71 58 63 C3 BF 62 7B>)
(   3,<2024-11-11 14:14:38.015 +0400>,<Irina>,<DPX200>,<TOPSPIN 1.3>,
      <apk 
       data hash MD5: 32K
       80 BD E0 B1 74 9D 6B 86 46 D7 32 B1 CE 79 48 0B>)
(   4,<2024-11-11 14:14:40.093 +0400>,<Irina>,<DPX200>,<TOPSPIN 1.3>,
      <abs n ABSG = 5 
       data hash MD5: 32K
       FB E6 55 5F 93 C5 F9 C8 70 44 84 E9 DC 25 A3 35>)
(   5,<2024-11-11 14:15:18.781 +0400>,<Irina>,<DPX200>,<TOPSPIN 1.3>,
      <abs n ABSG = 5 
       data hash MD5: 32K
       B4 D6 71 C5 63 87 F4 CA 48 CE 0A 6E A1 5F 52 4A>)
$$ ##END=
$$ 
$$ $$ hash MD5
$$ $$ 79 13 B7 6E 98 29 A8 43 55 E4 F4 68 4E 12 8C B9
##$RELAX= 
##$RELAX= 
##$RELAX= 
##$RELAX= 
##$RELAX= 
##$RELAX= 
##$RELAX= 
##$RELAX= 
##$RELAX= 
##$RELAX= 
##$RELAX= 
$$ Bruker specific parameters
$$ --------------------------
##$DU= <F:/spectra>
##$EXPNO= 1
##$NAME= <P31dec>
##$PROCNO= 1
##$TYPE= <nmr>
##$USER= <iren>
##$AMP= (0..31)
100 100 100 100 100 100 100 100 100 100 100 100 100 100 100 100 100 100 
100 100 100 100 100 100 100 100 100 100 100 100 100 100 
##$ANAVPT= -1
##$AQSEQ= 0
##$AQ_mod= 1
##$AUNM= <au_zg>
##$AUTOPOS= <>
##$BF1= 81.014009
##$BF2= 200.13
##$BF3= 200.13
##$BF4= 200.13
##$BF5= 200.13
##$BF6= 200.13
##$BF7= 200.13
##$BF8= 200.13
##$BYTORDA= 1
##$CFDGTYP= 0
##$CFRGTYP= 5
##$CHEMSTR= <none>
##$CNST= (0..63)
1 1 145 1 1 1 1 1 1 1 1 1 1 1 1 1 1 1 1 1 1 1 1 1 1 1 1 1 1 1 1 1 1 1 
1 1 1 1 1 1 1 1 1 1 1 1 1 1 1 1 1 1 1 1 1 1 1 1 1 1 1 1 1 1 
##$CPDPRG= <waltz16>
##$CPDPRG1= <>
$$ [...]
##$SW_h= 37037.037037037
##$TD= 32768
##$TD0= 1
##$TE= 300
##$TE2= 300
##$TE3= 300
##$TEG= 300
##$TL= (0..7)
0 120 53 12 22 120 120 120 
##$TP= (0..7)
150 150 150 150 150 150 150 150 
##$TP07= 0
##$TPNAME0= <>
##$TPNAME1= <>
##$TPNAME2= <>
##$TPNAME3= <>
##$TPNAME4= <>
##$TPNAME5= <>
##$TPNAME6= <>
##$TPNAME7= <>
##$TPOAL= (0..7)
0.5 0.5 0.5 0.5 0.5 0.5 0.5 0.5 
##$TPOFFS= (0..7)
0 0 0 0 0 0 0 0 
##$TUNHIN= 0
##$TUNHOUT= 0
##$TUNXOUT= 0
##$USERA1= <user>
##$USERA2= <user>
##$USERA3= <user>
##$USERA4= <user>
##$USERA5= <user>
##$V9= 5
##$VALIST= <valist>
##$VCLIST= <CCCCCCCCCCCCCCC>
##$VD= 0
##$VDLIST= <DDDDDDDDDDDDDDD>
##$VPLIST= <PPPPPPPPPPPPPPP>
##$VTLIST= <TTTTTTTTTTTTTTT>
##$WBST= 1024
##$WBSW= 4
##$XGAIN= (0..3)
0 0 0 0 
##$XL= 0
##$YL= 0
##$YMAX_a= 3444
##$YMIN_a= -10602
##$ZGOPTNS= <>
##$ZL1= 120
##$ZL2= 120
##$ZL3= 120
##$ZL4= 120
##$ABSF1= 298.5841
##$ABSF2= -158.5842
##$ABSG= 5
##$ABSL= 5
##$ALPHA= 0
##$AQORDER= 0
##$ASSFAC= 0
##$ASSFACI= 0
##$ASSFACX= 0
##$ASSWID= 0
##$AUNMP= <proc_1d>
##$AXLEFT= 0
##$AXRIGHT= 0
##$AXTYPE= 0
##$AXUNIT= <>
##$AZFE= 0.1
##$AZFW= 0.5
##$BCFW= 0
##$BC_mod= 2
##$BYTORDP= 0
##$COROFFS= 0
##$CY= 12.5935478210449
##$DATMOD= 1
##$DC= 0
##$DFILT= <>
##$DTYPP= 0
##$F1P= 47.1127640792319
##$F2P= -24.0371245302204
##$FCOR= 0.5
##$FTSIZE= 32768
##$FT_mod= 6
##$GAMMA= 0
##$GB= 0
##$INTBC= 1
##$INTSCL= 7.269226e-011
##$ISEN= 30
##$LB= 15
##$LEV0= 0
##$LPBIN= 0
##$MAXI= 12.09355
##$MC2= 0
##$MEAN= 0
##$ME_mod= 0
##$MI= 0.7550151
##$NCOEF= 0
##$NC_proc= -12
##$NLEV= 6
##$NOISF1= 298.5841
##$NOISF2= 270.0111
##$NSP= 0
##$NTH_PI= 0
##$NZP= 0
##$OFFSET= 298.5841
##$PC= 1.4
##$PHC0= 68.65067
##$PHC1= 290.4213
##$PH_mod= 1
##$PKNL= yes
##$PPARMOD= 0
##$PPDIAG= 0
##$PPIPTYP= 0
##$PPMPNUM= 100
##$PPRESOL= 1
##$PSCAL= 0
##$PSIGN= 0
##$REVERSE= no
##$SF= 81.014009
##$SI= 32768
##$SIGF1= 270.0111
##$SIGF2= -158.5842
##$SINO= 77.54984
##$SIOLD= 32768
##$SREGLST= <31P.CDCl3>
##$SSB= 0
##$STSI= 32768
##$STSR= 0
##$SW_p= 37037.037037037
##$SYMM= 0
##$S_DEV= 0
##$TDeff= 32768
##$TDoff= 0
##$TI= <>
##$TILT= no
##$TM1= 0
##$TM2= 0
##$TOPLEV= 0
##$USERP1= <user>
##$USERP2= <user>
##$USERP3= <user>
##$USERP4= <user>
##$USERP5= <user>
##$WDW= 1
##$XDIM= 32768
##$YMAX_p= 346474351
##$YMIN_p= -13436626
$$ End of Bruker specific parameters
$$ ---------------------------------
##NTUPLES= NMR SPECTRUM
##VAR_NAME=  FREQUENCY,     SPECTRUM/REAL,   SPECTRUM/IMAG
##SYMBOL=    X,             R,               I
##VAR_TYPE=  INDEPENDENT,   DEPENDENT,       DEPENDENT
##VAR_FORM=  AFFN,          ASDF,            ASDF
##VAR_DIM=   32768,         32768,           32768
##UNITS=     HZ,            ARBITRARY UNITS, ARBITRARY UNITS
##FACTOR=    1.13031516577767, 1,            1
##FIRST=     37037.037037037, -5134238,      4297549
##LAST=      0,             -5140024,        5674499
##MIN=       0,             -13436626,       0
##MAX=       37037.037037037, 346474351,     0
$$ Real data points
##PAGE= N=1
##DATA TABLE= (X++(R..R)), XYDATA
$$ [...]
$$ plain form
18040 3420114 3834449 4018921 3992661 3811200 3546613 3263257 3003417 2789720 2634315 2539556
18030 2539556 2489754 2447400 2362548 2192146 1920960 1573584 1208576 897112 698819 644530
18020 644530 729081 916565 1157328 1407718 1642746 1858362 2063270 2263637 2452576 2614510
18010 2614510 2738277 2823517 2872756 2875452 2799276 2601862 2259956 1793456 1262003 735240
18000 735240 260560 -148124 -499116 -806012 -1077139 -1310210 -1491305 -1601216 -1627553 -1575275
17990 -1575275 -1468381 -1341152 -1223493 -1125886 -1030403 -897684 -693042 -415867 -109935 151776
17980 151776 296719 281888 110821 -169287 -490777 -796436 -1058374 -1275389 -1455998 -1600329
17970 -1600329 -1690248 -1692226 -1573309 -1323428 -970986 -581210 -236378 -6711 72470 4180
$$ packed form
18040C420114M14335J84472k6260j81461k64587k83356k59840k13697j55405r4759
18030B539556m9802m2354q4852j70402k71186l47376l65008l11464j98293n4289
18020F44530Q4551J87484K40763K50390K35028K15616K04908K00367J88939J61934
18010B614510J23767Q5240M9239K696p6176j97414l41906m66500n31453n26763
18000G35240m74680m08684l50992l06896k71127k33071j81095j09911k6337N2278
17990a575275J06894J27229J17659R7607R5483J32719K04642K77175L05932K61711
17980A51776J44943j4831j71067k80108l21490l05659k61938k17015j80609j44331
17970a600329q9919j978J18917K49881L52442L89776L44832K29667P9181o8290
$$ plain form
17960 4180 -183862 -452815 -757053 -1048775 -1291458 -1474802 -1618869 -1763221 -1945364 -2178213
17950 -2178213 -2437226 -2664870 -2794841 -2787994 -2657938 -2464330 -2276846 -2138938 -2057300 -2016705
17940 -2016705 -2000681 -2001714 -2019995 -2056443 -2102785 -2136023 -2127849 -2063641 -1950692 -1807192 -1644593
17929 -1644593 -1457934 -1228180 -935134 -576353 -179851 200554 502418 669880 661930 459611
17919 459611 75324 -441603 -1012552 -1552357 -1995132 -2306698 -2480515 -2529207 -2480491 -2372696
17909 -2372696 -2242799 -2111015 -1975269 -1824092 -1660399 -1516117 -1442398 -1479915 -1629854 -1845314
17899 -1845314 -2048214 -2161107 -2136862 -1971880 -1697277 -1357608 -997332 -663871 -413696 -303868
17889 -303868 -370045 -608810 -979547 -1424473 -1891548 -2345390 -2763671 -3127570 -3415856 -3606719
$$ packed form
17960D180j88042k68953l04238k91722k42683j83344j44067j44352j82143k32849
17950b178213k59013k27644j29971O847J30056J93608J87484J37908Q1638M0595
17940b016705J6024j033j8281l6448m6342l3238Q174O4208J12949J43500J62599
17929a644593J86659K29754K93046L58781L96502L80405L01864J67462p950k02319
17919D59611l84287n16927n70949n39805m42775l11566j73817m8692M8716J07795
17909b372696J29897J31784J35746J51177J63693J44282P3719l7517j49939k15460
17899a845314k02900j12893K4245J64982K74603L39669L60276L33461K50175J09828
17889c03868o6177k38765l70737m44926m67075m53842m18281l63899k88286j90863
$$ plain form
17879 -3606719 -3685892 -3654339 -3526912 -3319689 -3035623 -2661870 -2183516 -1607156 -979513 -384674
17869 -384674 84339 364652 449883 388190 253728 109872 -12730 -113880 -207667 -308181
17859 -308181 -423900 -558247 -710103 -872653 -1035632 -1191800 -1338931 -1472583 -1578858 -1637245
17849 -1637245 -1629581 -1547416 -1398776 -1214887 -1047813 -951768 -955282 -1042605 -1160266 -1247668 -1271230
17838 -1271230 -1238480 -1183700 -1137341 -1102270 -1052077 -946918 -752704 -456738 -79009 326715
17828 326715 689732 951875 1088957 1107265 1021407 835974 543749 136427 -380264 -974108
17818 -974108 -1585355 -2143427 -2595945 -2932076 -3183717 -3405306 -3646603 -3930772 -4243929 -4542173
17808 -4542173 -4777198 -4924689 -4992909 -5007261 -4988398 -4942639 -4868682 -4771277 -4668107 -4581778 -4522531
$$ packed form
17879c606719p9173L1553J27427K07223K84066L73753M78354N76360O27643N94839
17869c84674M69013K80313Q5231o1693j34462j43856j22602j01150r3787j00514
17859c08181j15719j34347j51856j62550j62979j56168j47131j33652j06275n8387
17849a637245P664Q2165J48640J83889J67074R6045l514q7323j17661q7402k3562
17838a271230L2750N4780M6359L5071N0193J05159J94214K95966L77729M05724
17828C26715L63017K62143J37082J8308q5858j85433k92225m07322n16691n93844
17818i74108o11247n58072m52518l36131k51641k21589k41297k84169l13157k98244
17808d542173k35025j47491o8220j4352J8863M5759P3957R7405J03170Q6329N9247
$$ plain form
17797 -4522531 -4477133 -4415270 -4309678 -4153444 -3962369 -3767939 -3613242 -3551252 -3633661 -3889654
17787 -3889654 -4311454 -4859391 -5479747 -6120542 -6739054 -7305240 -7806187 -8249497 -8658818
17778 -8658818 -9059847 -9465429 -9871243 -10262551 -10620486 -10919281 -11119787 -11171937 -11031955 -10687057
17768 -10687057 -10172102 -9564885 -8958767 -8426456 -7995335 -7648339 -7348082 -7065377 -6789794
17759 -6789794 -6516705 -6227586 -5886988 -5463484 -4955600 -4395158 -3825128 -3277566 -2772327
17750 -2772327 -2330209 -1980438 -1752830 -1662828 -1702675 -1843200 -2043753 -2266807 -2489591 -2704015
17740 -2704015 -2906704 -3089896 -3240344 -3344395 -3391939 -3376218 -3295656 -3161744 -3005228 -2871972
17730 -2871972 -2810049 -2854752 -3016912 -3277074 -3586765 -3878871 -4087269 -4167830 -4108904 -3926212
$$ packed form
17797d522531M5398O1863J05592J56234J91075J94430J54697O1990q2409k55993
17787c889654m21800n47937o20356o40795o18512n66186n00947m43310m09321
17778h658818m01029m05582m05814l91308l57935k98795k00506n2150J39982L44898
17768a0687057N14955O07217O06118N32311M31121L46996L00257K82705K75583
17759f789794K73089K89119L40598M23504N07884N60442N70030N47562N05239
17750b772327M42118L49771K27608R0002l9847j40525k00553k23054k22784k14424
17740b704015k02689j83192j50448j04051m7544J5721Q0562J33912J56516J33256
17730b871972O1923m4703j62160k60162l09691k92106k08398q0561N8926J82692
$$ plain form
17720 -3926212 -3648069 -3302282 -2911980 -2499612 -2092678 -1723846 -1423497 -1210067 -1086153
17711 -1086153 -1042462 -1063639 -1130014 -1216102 -1292722 -1337813 -1348688 -1342099 -1342046 -1368103 -1430437 -1528527
17699 -1528527 -1653610 -1797608 -1962125 -2155520 -2379657 -2622955 -2868101 -3103716 -3325989
17690 -3325989 -3530045 -3702962 -3827392 -3891967 -3898445 -3861193 -3802458 -3748736 -3729150 -3771506 -3893519
17679 -3893519 -4093988 -4350161 -4622760 -4867969 -5053592 -5169535 -5222271 -5216719 -5142029 -4973969
17669 -4973969 -4691297 -4292941 -3804106 -3269077 -2739084 -2263495 -1882045 -1612003 -1435569
17660 -1435569 -1302666 -1153900 -948058 -675787 -358368 -41239 215863 356551 350056 205976
17650 205976 -27603 -279651 -475585 -554101 -478357 -237984 157818 688990 1330444 2056925
$$ packed form
17720c926212K78143L45787L90302M12368M06934L68832L00349K13430J23914
17711a086153M3691k1177o6375q6088p6620m5091j0875O589N3k6057o2334r8090
17699a528527j25083j43998j64517j93395k24137k43298k45146k35615k22273
17690c325989k04056j72917j24430o4575o478L7252N8735N3722J9586m2356j22013
17679c893519k00469k56173k72599k45209j85623j15943n2736N552P4690J68060
17669d973969K82672L98356M88835N35029N29993M75589L81450K70042J76434
17660a435569J32903J48766K05842K72271L17419L17129K57102J40688o495j44080
17650B05976k33579k52048j95934p8516P5744K40373L95802N31172O41454P26481
$$ plain form
17640 2056925 2846626 3678644 4524224 5339066 6064102 6635880 7000113 7118753 6969487
17631 6969487 6546677 5867913 4978053 3942495 2832127 1708414 615203 -421514 -1388804
17622 -1388804 -2280036 -3087570 -3796402 -4382019 -4814997 -5069057 -5125644 -4974945 -4619903 -4083930
17612 -4083930 -3414006 -2671280 -1912111 -1174928 -486796 116862 583147 858296 918352 787939
17602 787939 535795 256601 48976 -9396 114912 402362 794698 1223504 1633353 1988170
17592 1988170 2265665 2450200 2530755 2504857 2381534 2175930 1899885 1559538 1161624 718728
17582 718728 246162 -244950 -749653 -1265967 -1792707 -2330045 -2878776 -3436362 -3993509 -4535313
17572 -4535313 -5044161 -5497813 -5863921 -6100690 -6168227 -6042572 -5721003 -5217995 -4560903 -3791035
$$ packed form
17640B056925P89701Q32018Q45580Q14842P25036N71778L64233J18640j49266
17631F969487m22810o78764q89860j035558j110368j123713j093211j036717r67290
17622a388804q91232q07534p08832n85617m32978k54060n6587J50699L55042N35973
17612d083930O69924P42726P59169P37183O88132O03658M66285K75149O0056j30413
17602G87939k52144k79194k07625n8372J24308K87450L92336M28806M09849L54817
17592A988170K77495J84535Q0555k5898j23323k05604k76045l40347l97914m42896
17582G18728m72566m91112n04703n16314n26740n37338n48731n57586n57147n41804
17572d535313n08848m53652l66108k36769o7537J25655L21569N03008O57092P69868
$$ plain form
17562 -3791035 -2966807 -2161935 -1454232 -907624 -555899 -396135 -395075 -505118 -678892 -872595
17552 -872595 -1043218 -1154143 -1190731 -1170186 -1134075 -1129002 -1186240 -1307704 -1464907 -1612415 -1707795
17541 -1707795 -1726563 -1665293 -1534688 -1351300 -1134133 -903603 -676218 -454851 -224900 34942
17531 34942 333964 659696 984965 1281644 1526551 1697079 1765577 1699713 1466774 1038445
17521 1038445 399989 -433929 -1409507 -2445061 -3457330 -4381618 -5175367 -5813627 -6286363
17512 -6286363 -6597329 -6762459 -6808497 -6768238 -6668652 -6518631 -6306118 -6006262 -5596738 -5074528
17502 -5074528 -4464468 -3810798 -3154920 -2515420 -1886598 -1257141 -632773 -43197 470061
17493 470061 869374 1125731 1216637 1129763 872090 473145 -20568 -552008 -1058150 -1478137
$$ packed form
17562c791035Q24228Q04872P07703N46608L51725J59764J060j10043j73774j93703
17552h72595j70623j10925l6588K0545L6111N073n7238j21464j57203j47508r5380
17541a707795j8768O1270J30605J83388K17167K30530K27385K21367K29951K59842
17531C4942K99022L25732L25269K96679K44907J70528O8498o5864k32939m28329
17521A038445o38456q33918r75578j035554j012269r24288p93749o38260m72736
17512f286363l10966j65130m6038M0259R9586J50021K12513K99856M09524N22210
17502e074528O10060O53670O55878O39500O28822O29457O24368N89576N13258
17493D70061L99313K56357R0906q6874k57673l98945m93713n31440n06142m19987
$$ plain form
17483 -1478137 -1765967 -1899717 -1881875 -1735251 -1501037 -1236808 -1005970 -856850 -802432 -816263
17473 -816263 -848654 -850438 -790753 -665575 -496656 -319463 -164346 -42892 51129 130489 206092
17462 206092 287087 381891 490912 594214 649646 611977 460098 204750 -132749 -548387
17452 -548387 -1060772 -1689408 -2426637 -3225131 -4006629 -4683368 -5180293 -5450606 -5483411 -5304586
17442 -5304586 -4970932 -4557094 -4138135 -3773642 -3497411 -3313569 -3199299 -3116179 -3030039 -2929473
17432 -2929473 -2827696 -2744895 -2687445 -2642588 -2589606 -2513222 -2408609 -2280417 -2142118 -2015402
17422 -2015402 -1925489 -1889846 -1903983 -1935513 -1935147 -1860188 -1695377 -1457844 -1186311 -927721 -732132
17411 -732132 -651881 -733909 -1003899 -1452353 -2033261 -2679174 -3327019 -3938831 -4501039 -5002555
$$ packed form
17483a478137k87830j33750J7842J46624K34214K64229K30838J49120N4418j3831
17473h16263l2391j784N9685J25178J68919J77193J55117J21454R4021P9360P5603
17462B06092Q0995R4804J09021J03302N5432l7669j51879k55348l37499m15638
17452e48387n12385o28636p37229p98494p81498o76739m96925k70313l2805J78825
17442e304586L33654M13838M18959L64493K76231J83842J14270Q3120Q6140J00566
17432b929473J01777Q2801N7450M4857N2982P6384J04613J28192J38299J26716
17422b015402Q9913L5643j4137l1530L66P4959J64811K37533K71533K58590J95589
17411g32132Q0251q2028k69990m48454n80908o45913o47845o11812n62208n01516
$$ plain form
17401 -5002555 -5411976 -5675258 -5736335 -5564955 -5173009 -4610326 -3944892 -3240791 -2545460 -1888897
17391 -1888897 -1289062 -757226 -301947 68075 342151 504635 531567 392597 61244 -469963
17381 -469963 -1176426 -1998770 -2854248 -3655749 -4328311 -4819572 -5105500 -5189457 -5093046 -4846264
17371 -4846264 -4485326 -4054934 -3606165 -3187280 -2830987 -2545225 -2313976 -2109003 -1906904
17362 -1906904 -1702387 -1513131 -1378798 -1353814 -1488533 -1803296 -2273000 -2833975 -3407776 -3927115
17352 -3927115 -4351302 -4667096 -4880820 -5010662 -5080456 -5110939 -5110947 -5075736 -4993188 -4850805 -4637709
17341 -4637709 -4343763 -3961731 -3493331 -2953359 -2366682 -1760633 -1161489 -598387 -106450
17332 -106450 280625 545631 696260 759025 767202 754180 751702 786410 873813 1014836 1199255
$$ packed form
17401e002555m09421k63282o1077J71380L91946N62683O65434P04101O95331O56563
17391a888897N99835N31836M55279L70022K74076J62484K6932j38970l31353n31207
17381d69963p06463q22344q55478q01501o72562m91261k85928q3957R6411K46782
17371d846264L60938M30392M48769M18885L56293K85762K31249K04973K02099
17362a906904K04517J89256J34333K4984j34719l14763m69704n60975n73801n19339
17352c927115m24187l15794k13724j29842o9794l0483qL5211Q2548J42383K13096
17341d637709K93946L82032M68400N39972N86677O06049N99144N63102M91937
17332a06450L87075K65006J50629O2765Q177j3022k478L4708Q7403J41023J84419
$$ plain form
17321 1199255 1413593 1645717 1884003 2117770 2342877 2566637 2803690 3062543 3331300
17312 3331300 3571867 3725593 3728544 3531410 3116684 2506079 1754197 930498 100066 -684988
17302 -684988 -1381740 -1949213 -2348521 -2553516 -2563247 -2403762 -2118011 -1754481 -1361736 -985489
17292 -985489 -664967 -432277 -316759 -348436 -552745 -936359 -1474224 -2110203 -2772157 -3390274
17282 -3390274 -3909350 -4294628 -4532753 -4628436 -4599930 -4476044 -4292007 -4080705 -3862855 -3646164
17272 -3646164 -3435671 -3242220 -3078163 -2947382 -2842740 -2751471 -2659366 -2549772 -2403355 -2204713
17262 -2204713 -1952256 -1661508 -1359387 -1075533 -834176 -647714 -516151 -433411 -395462 -404514
17252 -404514 -464433 -567514 -682824 -759116 -744272 -608921 -358740 -30182 324480 654848
$$ packed form
17321A199255K14338K32124K38286K33767K25107K23760K37053K58853K68757
17312C331300K40567J53726K951j97134m14726o10605p51882q23699q30432p85054
17302f84988o96752n67473l99308k04995r731J59485K85751L63530L92745L76247
17292i85489L20522K32690J15518l1677k04309l83614n37865o35979o61954o18117
17282c390274n19076l85278k38125r5683K8506J23886J84037K11302K17850K16691
17272c646164K10493J93451J64057J30781J04642R1269R2105J09594J46417J98642
17262b204713K52457K90748L02121K83854K41357J86462J31563Q2740L7949r052
17252d04514n9919j03081j15310p6292J4844J35351K50181L28558L54662L30368
$$ plain form
17242 654848 926280 1124863 1253795 1327356 1366510 1394596 1431675 1488458 1560514 1625285 1647354
17231 1647354 1592602 1443449 1206736 911954 603400 332045 148362 91994 178616 392458
17221 392458 691790 1025820 1353533 1654158 1926428 2181794 2435506 2694820 2947939 3160757
17211 3160757 3282033 3255073 3037862 2626895 2066093 1428533 786430 194179 -312580 -714854
17201 -714854 -1009737 -1207370 -1323585 -1369209 -1340389 -1219995 -995333 -678801 -309161 68918
17191 68918 423988 736845 986311 1141478 1170244 1058144 823508 517962 212609 -20361
17181 -20361 -122262 -58006 175383 543574 979994 1403514 1742041 1952879 2033308 2018056
17171 2018056 1964099 1928057 1946261 2026761 2153920 2297746 2420238 2477623 2423334 2218239
$$ packed form
17242F54848K71432J98583J28932P3561L9154K8086L7079N6783P2056O4771K2069
17231A647354n4752j49153k36713k94782l08554k71355j83683n6368Q6622K13842
17221C92458K99332L34030L27713L00625K72270K55366K53712K59314K53119K12818
17211C160757J21276k6960k17211m10967n60802o37560o42103n92251n06759m02274
17201g14854k94883j97633j16215m5624K8820J20394K24662L16532L69640L78079
17191F8918L55070L12857K49466J55167K8766j12100k34636l05546l05353k32970
17181b0361j01901O4256K33389L68191M36420M23520L38527K10838Q0429j5252
17171B018056n3957l6042J8204Q0500J27159J43826J22492N7385n4289k05095
$$ plain form
17161 2218239 1847276 1330198 714054 51361 -618365 -1270786 -1884773 -2429452 -2864646
17152 -2864646 -3158033 -3306282 -3342029 -3318258 -3280493 -3249033 -3222303 -3192234 -3157264 -3126821 -3118248
17141 -3118248 -3148120 -3220678 -3320436 -3416783 -3478146 -3483053 -3420783 -3287067 -3080860 -2800907 -2441550
17130 -2441550 -1992369 -1444772 -802016 -85156 669959 1422162 2134449 2781346 3354613
17121 3354613 3862421 4316585 4716021 5042658 5272514 5389868 5394880 5302674 5136233 4919932
17111 4919932 4679717 4446868 4256435 4138102 4105665 4151458 4248426 4360017 4454455 4516118
17101 4516118 4546216 4550525 4523987 4449131 4312701 4123287 3910409 3706712 3533751 3404430
17091 3404430 3331921 3328546 3394808 3512643 3651487 3782452 3891235 3982967 4074171 4171991 4253977
$$ packed form
17161B218239l70963n17078o16144o62693o69726o52421o13987n44679m35194
17152b864646k93387j48249l5747K3771L7765L1460K6730L0069L4970L0443Q573
17141c118248k9872p2558r9758r6347o1363m907O2270J33716K06207K79953L59357
17130b441550M49181N47597O42756P16860P55115P52203P12287O46897N73267
17121C354613N07808M54164L99436L26637K29856J17354N012r2206j66441k16301
17111D919932k40215k32849j90433j18333l2437M5793R6968J11591R4438O1663
17101D516118L0098M309k6538p4856j36430j89414k12878k03697j72961j29321
17091C404430p2509l375O6262J17835J38844J30965J08783R1732R1204R7820Q1986
$$ plain form
17080 4253977 4269329 4168734 3942446 3635527 3330208 3111730 3037779 3121802 3334522 3622296
17070 3622296 3931502 4225748 4490781 4728873 4947083 5144724 5305036 5395289 5376345 5216702
17060 5216702 4903943 4449824 3890126 3281469 2692985 2190589 1818940 1590735 1489582
17051 1489582 1484248 1544673 1651430 1795882 1971716 2163966 2347022 2497355 2610252 2702654
17041 2702654 2799533 2920050 3076772 3283418 3557267 3911275 4344567 4839949 5366704 5883755
17031 5883755 6344020 6703080 6930913 7021133 6992236 6879598 6723307 6558861 6413327 6304872
17021 6304872 6243942 6235686 6280627 6369567 6476374 6560147 6581662 6522673 6391875 6212521 6000309
17010 6000309 5747741 5427858 5014971 4504212 3913554 3271876 2608085 1946225 1302141
$$ packed form
17080D253977J5352j00595k26288l06919l05319k18478p3951Q4023K12720K87774
17070C622296L09206K94246K65033K38092K18210J97641J60312R0253j8944j59643
17060E216702l12759m54119n59698o08657n88484n02396l71649k28205j01153
17051A489582n334O0425J06757J44452J75834J92250J83056J50333J12897R2402
17041B702654R6879J20517J56722K06646K73849L54008M33292M95382N26755N17051
17031E883755M60265L59060K27833R0220k8897j12638j56291j64446j45534j08455
17021F304872o0930q256M4941Q8940J06807Q3773K1515n8989j30798j79354k12212
17010F000309k52568l19883m12887n10759n90658o41678o63791o61860o44084
$$ plain form
17001 1302141 683297 97179 -434762 -869628 -1150729 -1227115 -1073834 -703031 -162511 476015
16991 476015 1135847 1756698 2308124 2785577 3193638 3532605 3798446 3990720 4118553 4201499
16981 4201499 4266710 4343417 4457562 4631905 4891541 5264081 5765079 6376266 7037156 7662056
16971 7662056 8171132 8511740 8659631 8611542 8382572 8006962 7534734 7022479 6520666 6060957
16961 6060957 5650233 5278416 4936136 4628658 4378691 4219162 4176802 4251646 4405434 4569579
16951 4569579 4671901 4669146 4565420 4404471 4243533 4128946 4085927 4119891 4222311 4377404
16941 4377404 4566186 4765471 4945217 5070665 5111603 5055605 4918750 4746328 4600562 4539490
16931 4539490 4596311 4771056 5039974 5371805 5734028 6087420 6383185 6573429 6630485 6562916
$$ packed form
17001A302141o18844n86118n31941m34866k81101p6386J53281L70803N40520O38526
16991D76015O59832O20851N51426M77453M08061L38967K65841J92274J27833Q2946
16981D201499O5211P6707J14145J74343K59636L72540N00998O11187O60890O24900
16971G662056N09076L40608J47891m8089k28970l75610m72228n12255n01813m59709
16961F060957m10724l71817l42280l07478k49967j59529m2360P4844J53788J64145
16951D569579J02322k755j03726j60949j60938j14587m3019L3964J02420J55093
16941D377404J88782J99285J79746J25448M0938n5998j36855j72422j45766o1072
16931D539490N6821J74745K68918L31831L62223L53392K95765J90244N7056o7569
$$ plain form
16921 6562916 6418017 6267172 6179656 6196846 6317057 6495531 6660073 6737870 6680303 6471169
16911 6471169 6117808 5638848 5057914 4399568 3683281 2921295 2126598 1324955 558163
16902 558163 -127118 -697702 -1145276 -1482907 -1731407 -1907222 -2018956 -2069109 -2054537 -1968221
16892 -1968221 -1810093 -1601931 -1388608 -1217858 -1113077 -1061542 -1026910 -973230 -880684 -746557
16882 -746557 -577889 -383758 -174017 33056 203390 293848 273021 139723 -74636 -318933
16872 -318933 -541433 -707078 -806719 -853926 -872183 -882779 -898891 -922107 -940109 -930089 -867658
16861 -867658 -734387 -521084 -230323 120661 500792 871886 1197193 1446282 1596751 1636457
16851 1636457 1565052 1391735 1132214 810409 464683 151069 -65137 -128854 -12937 277512
$$ packed form
16921F562916j44899j50845q7516J7190J20211J78474J64542P7797n7567k09134
16911F471169l53361m78960n80934o58346p16287p61986p94697q01643p66792
16902E58163o85281n70584m47574l37631k48500j75815j11734n0153J4572Q6316
16892a968221J58128K08162K13323J70750J04781N1535L4632N3680R2546J34127
16882g46557J68668J94131K09741K07073J70334R0458k0827j33298k14359k44297
16872c18933k22500j65645r9641m7207j8257j0596j6112k3216j8002J0020O2431
16861h67658J33271K13303K90761L50984L80131L71094L25307K49089J50469L9706
16851A636457p1405j73317k59521l21805l45726l13614k16206o3717J15917K90449
$$ plain form
16841 277512 710965 1234125 1773961 2248126 2589847 2773378 2817969 2765832 2654552 2508247
16831 2508247 2351680 2230554 2215398 2377212 2746258 3285621 3903156 4492869 4974994 5312464
16821 5312464 5503335 5562267 5504423 5337579 5061784 4675529 4185940 3616631 3008593 2415256
16811 2415256 1894297 1496757 1255327 1178203 1251064 1438946 1683146 1903479 2016543 1965027
16801 1965027 1742411 1398507 1020196 695380 479550 384109 388959 461337 563115 649842
16791 649842 677361 619254 481616 301089 123863 -21473 -136017 -237627 -336016 -418268
16781 -418268 -453889 -410837 -271111 -39385 259705 593462 931374 1246863 1515989 1721396
16771 1721396 1859867 1944402 1995628 2027649 2039106 2014389 1929873 1760847 1491444 1126338
$$ packed form
16841B77512M33453N23160N39836M74165L41721J83531M4591n2137j11280j46305
16831B508247j56567j21126j5156J61814L69046N39363O17535N89713M82125L37470
16821E312464J90871N8932n7844j66844k75795l86255m89589n69309o08038n93337
16811B415256n20959l97540k41430p7124P2861J87882K44200K20333J13064n1516
16801A965027k22616l43904l78311l24816k15830r5441M850P2378J01778Q6727
16791F49842K7519n8107j37638j80527j77226j45336j14544j01610r8389q2252
16781d18268l5621M3052J39726K31726K99090L33757L37912L15489K69126K05407
16771A721396J38471Q4535N1226L2021J1457k4717q4516j69026k69403l65106
$$ plain form
16761 1126338 696263 252248 -148713 -459918 -657782 -747158 -756788 -727652 -699094 -696696 -726461
16750 -726461 -777127 -826275 -845617 -807029 -692596 -505036 -269353 -21533 208693 408078
16740 408078 577455 722634 845359 936131 969573 905504 699450 321614 -223976 -892094
16730 -892094 -1608159 -2293429 -2885655 -3341592 -3625827 -3703745 -3550579 -3169643 -2601121 -1910737
16720 -1910737 -1166585 -422906 279766 906403 1424574 1810416 2057967 2185121 2233067 2258616
16710 2258616 2320545 2464010 2708591 3043523 3431107 3817266 4146807 4381197 4513496 4570866
16700 4570866 4598851 4635341 4691831 4754404 4802921 4834209 4870188 4943324 5072212 5245325 5420303
16689 5420303 5538961 5553898 5452977 5265569 5048138 4860968 4746959 4714969 4731779 4731352
$$ packed form
16761A126338m30075m44015m00961l11205j97864q9376r630K9136K8558K398k9765
16750g26461n0666m9148j9342L8588J14433J87560K35683K47820K30226J99385
16740D08078J69377J45179J22725R0772L3442o4069k06054l77836n45590o68118
16730h92094p16065o85270n92226m55937k84235p7918J53166L80936N68522O90384
16720a910737P44152P43679P02672O26637N18171L85842K47551J27154M7946K5549
16710B258616O1929J43465K44581L34932L87584L86159L29541K34390J32299N7370
16700D570866K7985L6490N6490O2573M8517L1288L5979P3136J28888J73113J74978
16689E420303J18658J4937j00921j87408k17431j87170j14009l1990J6810m27
$$ plain form
16679 4731352 4640258 4404451 4006723 3475044 2880423 2318846 1882191 1633281 1594790 1750400
16669 1750400 2052977 2436337 2828462 3164249 3396229 3502159 3489662 3398344 3296337 3265437
16659 3265437 3375758 3661249 4108734 4665198 5258153 5817489 6287871 6629053 6813476
16650 6813476 6832832 6710444 6501781 6273260 6070114 5895276 5713370 5475336 5147502 4731142
16640 4731142 4263864 3799997 3381816 3026119 2737208 2527107 2417434 2423222 2539606 2743868
16630 2743868 3005895 3295212 3581045 3828360 3994253 4030764 3900245 3598294 3166446 2684218
16620 2684218 2247451 1943233 1826449 1904040 2135183 2448837 2768323 3028256 3177920 3178658
16610 3178658 3008072 2672641 2215493 1708338 1232673 862425 653713 641418 839570 1240282
$$ packed form
16679D731352r1094k35807l97728n31679n94621n61577m36655k48910l8491J55610
16669A750400L02577L83360L92125L35787K31980J05930j2497r1318j02007l0900
16659C265437J10321K85491M47485N56464N92955N59336M70382L41182J84423
16650F813476J9356j22388k08663k28521k03146j74838j81906k38034l27834m16360
16640D731142m67278m63867m18181l55697k88911k10101j09673N788J16384K04262
16630B743868K62027K89317K85833K47315J65893L6511j30519l01951m31848m82228
16620B684218m36767l04218j16784P7591K31143L13654L19486K59933J49664P38
16610C178658j70586l35431m57148n07155m75665l70248k08712j2295J98152M00712
$$ plain form
16600 1240282 1809958 2489121 3201504 3867708 4414432 4781305 4934574 4884258 4688006 4433143
16590 4433143 4207130 4075012 4074336 4222345 4522798 4966748 5531228 6181282 6876090 7575073
16580 7575073 8239044 8827413 9298126 9614129 9752902 9712976 9514265 9192052 8785098 8322984
16570 8322984 7823932 7306464 6800007 6338511 5941722 5601684 5284948 4949599 4569260
16561 4569260 4151252 3737629 3389552 3166782 3111336 3236173 3521462 3924297 4400044 4922189
16551 4922189 5486719 6099831 6762455 7463862 8183097 8891159 9552470 10129214 10588627
16542 10588627 10908334 11078312 11103177 11004682 10819120 10586046 10333165 10070453 9800268 9532507
16532 9532507 9288374 9087973 8931933 8793572 8629956 8404754 8107089 7754543 7380634
$$ packed form
16600A240282N69676O79163P12383O66204N46724L66873J53269n0316j96252k54863
16590D433143k26013j32118o76J48009L00453M43950N64480O50054O94808O98983
16580G575073O63971N88369M70713L16003J38773l9926j98711l22213m06954m62114
16570H322984m99052n17468n06457m61496l96789l40038l16736l35349l80339
16561D569260m18008m13623l48077k22770n5446J24837K85289M02835M75747N22145
16551D922189N64530O13112O62624P01407P19235P08062O61311N76744M59413
16542A0588627L19707J69978K4865r8495j85562k33074k52881k62712k70185k67761
16532I532507k44133k00401j56040j38361j63616k25202k97665l52546l73909
$$ plain form
16523 7380634 7016649 6678058 6360829 6047280 5718437 5368825 5014848 4686770 4407103
16514 4407103 4171825 3947949 3688828 3358897 2953332 2499535 2039067 1603235 1201637
16505 1201637 832149 502426 244654 111825 156374 402666 829058 1371291 1947713 2492049
16495 2492049 2970115 3368929 3674046 3861966 3914569 3838496 3672511 3482069 3346946 3342231
16485 3342231 3513014 3853364 4305148 4781708 5203999 5529196 5759971 5935896 6114927
16476 6114927 6352238 6681724 7106000 7598573 8114063 8598468 8997956 9272236 9414399
16467 9414399 9464609 9502190 9620708 9906195 10426852 11222912 12286520 13539553 14831810
16458 14831810 15979485 16834968 17341997 17536739 17503831 17325623 17054943 16718669 16336319
$$ packed form
16523G380634l63985l38591l17229l13549l28843l49612l53977l28078k79667
16514D407103k35278k23876k59121l29931m05565m53797m60468m35832m01598
16505A201637l69488l29723k57772j32829M4549K46292M26392N42233N76422N44336
16495B492049M78066L98814L05117J87920N2603p6073j65985j90442j35123m715
16485C342231J70783L40350M51784M76560M22291L25197K30775J75925J79031
16476F114927K37311L29486M24276M92573N15490M84405L99488K74280J42163
16467I414399N0210L7581J18518K85487N20657P96060J063608J253033J292257
16458A4831810J147675Q55483N07029J94742l2908j78208k70680l36274l82350
$$ plain form
16449 16336319 15931447 15528878 15147063 14793966 14466423 14152043 13834347 13498275 13131810
16440 13131810 12725735 12276530 11790638 11282831 10768117 10257477 9766286 9327925 8993826
16431 8993826 8812321 8801287 8937599 9171133 9449556 9736347 10017392 10299648 10602388 10940791
16421 10940791 11308168 11667839 11961257 12128945 12131343 11955718 11608008 11102356 10459236 9709692
16411 9709692 8897337 8075201 7299533 6623876 6094895 5747870 5600103 5642294 5829373 6078418
16401 6078418 6285617 6362409 6270918 6034979 5720759 5401359 5126361 4910417 4743691 4616065
16391 4616065 4538132 4541852 4658505 4891162 5202522 5525411 5788488 5940732 5959079 5842138
16381 5842138 5608416 5302463 4991361 4744606 4612601 4617908 4757383 5006992 5325721 5658640
$$ packed form
16449A6336319m04872m02569l81815l53097l27543l14380l17696l36072l66465
16440A3131810m06075m49205m85892n07807n14714n10640m91191m38361l34099
16431H993826j81505j1034J36312K33534K78423K86791K81045K82256L02740L38403
16421A0940791L67377L59671K93418J67688K398j75625l47710n05652o43120p49544
16411I709692q12355q22136p75668o75657n28981l47025j47767M2191J87079K49045
16401F078418K07199P6792r1491k35939l14220l19400k74998k15944j66726j27626
16391D616065p7933L720J16653K32657L11360L22889K63077J52244J8347j16941
16381E842138k33722l05953l11102k46755j32005N307J39475K49609L18729L32919
$$ plain form
16371 5658640 5940189 6101714 6088188 5880754 5508373 5033324 4520667 4021239 3579812 3245703
16361 3245703 3061489 3037905 3143486 3320378 3509394 3665128 3760876 3791717 3776833 3755170
16351 3755170 3770235 3849659 3992322 4170198 4340853 4460264 4489464 4399716 4184171 3871770
16341 3871770 3528890 3240711 3079398 3076211 3214796 3449347 3732678 4036173 4355909 4707749
16331 4707749 5113662 5583851 6105348 6645068 7163544 7628274 8018131 8319913 8528195
16322 8528195 8655787 8743120 8848455 9019579 9266470 9553331 9813387 9971611 9955684 9694106
16312 9694106 9121528 8206634 6992432 5614330 4261917 3097864 2198972 1561706 1147176
16303 1147176 918463 850465 921958 1106647 1372435 1690103 2043319 2426570 2829777 3226076
$$ packed form
16371E658640K81549J61525j3526k07434l72381m75049n12657m99428m41427l34109
16361C245703j84214k3584J05581J76892J89016J55734R5748L0841j4884k1663
16351C755170J5065P9424J42663J77876J70655J19411K9200q9748k15545l12401
16341C871770l42880k88179j61313l187J38585K34551K83331L03495L19736L51840
16331D707749M05913M70189N21497N39720N18476M64730L89857L01782K08282
16322H528195J27592Q7333J05335J71124K46891K86861K60056J58224j5927k61578
16312I694106n72578r14894j214202j378102j352413j164053q98892o37266m14530
16303A147176k28713o7998P1493J84689K65788L17668L53216L83251M03207L96299
$$ plain form
16293 3226076 3577209 3852464 4044060 4164001 4224228 4219342 4128904 3935797 3643264 3278540
16283 3278540 2883786 2503066 2172131 1911193 1719757 1577690 1455942 1331796 1199152
16274 1199152 1068601 959153 889889 878738 943861 1098007 1338715 1646178 1991928 2350144
16264 2350144 2702221 3033654 3331732 3590585 3817272 4028343 4238850 4456741 4689149
16255 4689149 4951369 5263192 5630229 6025773 6391733 6661558 6789028 6763447 6604988 6347331
16245 6347331 6020703 5647026 5248599 4858936 4522614 4282845 4168722 4193571 4362932 4681953
16235 4681953 5154538 5772973 6503717 7281034 8017177 8625530 9043497 9243643 9231494 9036951
16225 9036951 8707046 8299276 7868778 7451621 7057759 6681031 6318130 5982992 5707901
$$ packed form
16293C226076L51133K75255J91596J19941O0227m886r0438j93107k92533l64724
16283C278540l94754l80720l30935k60938j91436j42067j21748j24146j32644
16274A199152j30551j09448o9264j1151O5123J54146K40708L07463L45750L58216
16264B350144L52077L31433K98078K58853K26687K11071K10507K17891K32408
16255D689149K62220L11823L67037L95544L65960K69825J27470k5581j58459k57657
16245F347331l26628l73677l98427l89663l36322k39769j14123K4849J69361L19021
16235D681953M72585O18435P30744P77317P36143O08353M17967K00146j2149j94543
16225I036951l29905m07770m30498m17157l93862l76728l62901l35138k75091
$$ plain form
16216 5707901 5530938 5477766 5547893 5711727 5920363 6124148 6289411 6404270 6475062 6520083
16206 6520083 6561591 6614353 6675423 6724142 6736003 6701725 6635747 6568293 6529608 6535832 6579724
16195 6579724 6629013 6636065 6555218 6355507 6020935 5544212 4924153 4168689 3298434 2347531
16185 2347531 1363469 406670 -455563 -1165698 -1695487 -2052387 -2267839 -2380129 -2424927 -2430929
16175 -2430929 -2412312 -2359618 -2237306 -1992961 -1577336 -967676 -183578 710575 1616475 2425053
16165 2425053 3049060 3451526 3651408 3702129 3658135 3550249 3382040 3144287 2834082 2467218
16155 2467218 2080268 1721400 1432503 1234042 1124741 1094081 1132855 1233647 1388778 1593972
16145 1593972 1851672 2162846 2510037 2848073 3113373 3245448 3206366 2990541 2626423 2172494
$$ packed form
16216E707901j76963n3172P0127J63834K08636K03785J65263J14859P0792M5021
16206F520083M1508N2762O1070M8719J1861l4278o5978o7454l8685O224M3892
16195F579724M9289P052q0847j99711l34572m76723o20059p55464q70255r50903
16185B347531r84062r56799q62233p10135n29789l56900k15452j12290m4798o002
16175b430929J8617N2694J22312K44345M15625O09660P84098Q94153R05900Q08578
16165B425053O24007M02466J99882N0721m3994j07886j68209k37753l10205l66864
16155B467218l86950l58868k88897j98461j09301l0660L8774J00792J55131K05194
16145A593972K57700L11174L47191L38036K65300J32075l9082k15825l64118m53929
$$ plain form
16135 2172494 1705349 1298633 1000140 819243 731082 693473 666937 629171 578303 524906
16125 524906 481054 456173 461093 513041 634376 844601 1150609 1540283 1980958 2421218
16115 2421218 2797107 3047731 3140461 3092926 2971732 2861480 2823991 2876415 2997796 3151705
16105 3151705 3307732 3452544 3590017 3733933 3898007 4089306 4308295 4552900 4820913
16096 4820913 5107082 5395986 5657312 5852009 5949656 5944105 5854057 5710277 5542782 5377277
16086 5377277 5237838 5147751 5126740 5189137 5344758 5598622 5946013 6366637 6826435 7288383
16076 7288383 7722833 8108693 8426728 8652382 8752980 8689788 8426432 7944976 7262202 6433982
16066 6433982 5545174 4692311 3963611 3417162 3064697 2871437 2773931 2706529 2621304 2492221
$$ packed form
16135B172494m67145m06716k98493j80897q8161l7609k6536l7766n0868n3397
16125E24906m3852k4881M920N1948J21335K10225L06008L89674M40675M40260
16115B421218L75889K50624R2730m7535j21194j10252l7489N2424J21381J53909
16105C151705J56027J44812J37473J43916J64074J91299K18989K44605K68013
16096D820913K86169K88904K61326J94697R7647n551r0048j43780j67495j65505
16086E377277j39439r0087k1011O2397J55621K53864L47391M20624M59798M61948
16076G288383M34450L85860L18035K25654J00598o3192k63356m81456o82774q28220
16066F433982q88808q52863p28700n46449l52465j93260r7506o7402q5225j29083
$$ plain form
16056 2492221 2310639 2084693 1841334 1620174 1457504 1369781 1344535 1342580 1313434 1219997
16046 1219997 1059351 865969 695419 599056 603556 705691 883595 1114868 1390321 1719016
16036 1719016 2123307 2624419 3226866 3913319 4650737 5397816 6107633 6729049 7212649
16027 7212649 7520829 7635950 7563113 7330003 6985654 6596744 6239981 5989164 5897817 5985070
16017 5985070 6234020 6601532 7029191 7451121 7805392 8051674 8184523 8230721 8231463 8221089
16007 8221089 8214462 8205082 8167666 8063000 7849825 7505275 7046121 6536775 6074307 5755986
15997 5755986 5647120 5762752 6067185 6492270 6967884 7444781 7894083 8291614 8609055
15988 8609055 8820862 8916214 8903044 8802170 8637223 8426762 8181984 7910343 7623191 7342448
$$ packed form
16056B492221j81582k25946k43359k21160j62670q7723k5246j955k9146r3437
16046A219997j60646j93382j70550r6363M500J02135J77904K31273K75453L28695
16036A719016M04291N01112O02447O86453P37418P47079P09817O21416M83600
16027G212649L08180J15121p2837k33110l44349l88910l56763k50817r1347Q7253
16017E985070K48950L67512M27659M21930L54271K46282J32849M6198P42j0374
16007H221089o627r380l7416j04666k13175l44550m59154n09346m62468l18321
15997E755986j08866J15632L04433M25085M75614M76897M49302L97531L17441
15988H609055K11807R5352j3170j00874j64947k10461k44778k71641k87152k80743
$$ plain form
15978 7342448 7099335 6924104 6834656 6831472 6897930 7003410 7110984 7189632 7223614 7210456 7149172
15967 7149172 7032991 6857646 6636381 6401727 6189023 6016566 5876932 5741641 5575396
15958 5575396 5354339 5079351 4776854 4488315 4257736 4125286 4125301 4281531 4598649 5055146
15948 5055146 5602464 6172583 6691180 7090736 7322615 7369479 7253216 7029772 6769211 6531968
15938 6531968 6357235 6267998 6281719 6413604 6669340 7034757 7472454 7927763 8339043 8648880
15928 8648880 8817413 8836461 8735278 8569660 8400068 8272491 8207936 8198800 8212976 8208045 8149180
15917 8149180 8019326 7820069 7570103 7302759 7057381 6864150 6731540 6645902 6584155 6532238
15907 6532238 6498404 6512794 6612995 6824257 7145234 7545325 7973083 8371661 8696457 8927703
$$ packed form
15978G342448k43113j75231q9448l184O6458J05480J07574P8648L3982j3158o1284
15967G149172j16181j75345k21265k34654k12704j72457j39634j35291j66245
15958E575396k21057k74988l02497k88539k30579j32450J5J56230L17118M56497
15948E055146N47318N70119N18597L99556K31879M6864j16263k23444k60561k37243
15938F531968j74733q9237J3721J31885K55736L65417M37697M55309M11280L09837
15928H648880J68533J9048j01183j65618j69592j27577o4555r136J4176m931n8865
15917H149180j29854j99257k49966k67344k45378j93231j32610q5638o1747n1917
15907F532238l3834J4390J00201K11262L20977M00091M27758L98578L24796K31246
$$ plain form
15897 8927703 9071430 9149012 9181386 9176979 9133472 9055275 8971201 8932944 8995315 9198028 9560232
15886 9560232 10079921 10731824 11469394 12233888 12964814 13609421 14134812 14540261 14857936
15877 14857936 15134852 15407669 15691608 15988907 16300878 16629314 16968828 17297972 17574365
15868 17574365 17739933 17739095 17539937 17145267 16592061 15942044 15261232 14592639 13941447 13288080
15858 13288080 12619763 11954145 11337787 10824641 10454597 10248310 10215759 10362584 10684183
15849 10684183 11155668 11733024 12367712 13022155 13674187 14308506 14902232 15415506 15795281
15840 15795281 15992054 15979692 15766197 15391470 14916103 14407554 13929699 13537140 13270367
15831 13270367 13151024 13182580 13357152 13659173 14058574 14500462 14907315 15200432 15328798
$$ packed form
15897H927703J43727P7582L2374m407m3507p8197q4074l8257O2371K02713L62204
15886I560232N19689O51903P37570P64494P30926O44607N25391M05449L17675
15877A4857936K76916K72817K83939K97299L11971L28436L39514L29144K76393
15868A7574365J65568q38j99158l94670n53206o50017o80812o68593o51192o53367
15858A3288080o68317o65618o16358n13146l70044k06287l2551J46825L21599
15849A0684183M71485N77356O34688O54443O52032O34319N93726N13274L79775
15840A5795281J96773j2362k13495l74727m75367n08549m77855l92559k66773
15831A3270367j19343L1556J74572L02021L99401M41888M06853K93117J28366
$$ plain form
15822 15328798 15285127 15100466 14828219 14532402 14281051 14136452 14139148 14292805 14561813 14885429
15812 14885429 15198165 15443880 15581374 15586337 15454601 15209146 14905677 14624568 14444863 14412868
15802 14412868 14523475 14723434 14934266 15085340 15145028 15136251 15124936 15183919 15353208 15620097
15792 15620097 15927049 16199983 16384570 16475182 16519380 16591139 16746711 16990529 17270752 17501852
15782 17501852 17597708 17501911 17207437 16757177 16223623 15682283 15195215 14806210 14541138 14410781
15772 14410781 14414948 14544732 14782244 15101190 15469312 15849612 16200845 16483304 16670590 16757915
15762 16757915 16761219 16712071 16652394 16626223 16668256 16796671 17016725 17331401 17747701 18270866
15752 18270866 18891396 19578747 20289863 20985754 21642269 22249513 22804587 23303279 23734470
$$ packed form
15822A5328798m3671j84661k72247k95817k51351j44599K696J53657K69008L23616
15812A4885429L12736K45715J37494M963j31736k45455l03469k81109j79705l1995
15802A4412868J10607J99959K10832J51074N9688q777j1315N8983J69289K66889
15792A5620097L06952K72934J84587R0612M4198P1759J55572K43818K80223K31100
15782A7501852R5856r5797k94474m50260n33554n41340m87068l89005k65072j30357
15772A4410781M167J29784K37512L18946L68122L80300L51233K82459J87286Q7325
15762A6757915L304m9148n9677k6171M2033J28415K20054L14676M16300N23165
15752A8270866O20530O87351P11116O95891O56515O07244N55074M98692M31191
$$ plain form
15743 23734470 24081886 24334001 24494190 24583566 24637418 24699284 24813828 25017318 25326302 25729920
15733 25729920 26193093 26671167 27126666 27536825 27890107 28179864 28402410 28558803 28656644
15724 28656644 28710821 28741402 28765468 28785956 28787413 28744162 28635981 28462965 28253657 28062009
15714 28062009 27951316 27971075 28140272 28446045 28852786 29310959 29761669 30141283 30391499
15705 30391499 30473345 30377906 30128739 29774738 29374709 28979030 28616016 28287774 27975924 27653208
15695 27653208 27294097 26879418 26395932 25835185 25194264 24478512 23705140 22904217 22112341
15686 22112341 21360821 20666279 20028692 19437967 18887758 18388150 17965193 17646013 17442871
15677 17442871 17348757 17344092 17406006 17512150 17636568 17746556 17813204 17832555 17838114 17891100 18054295
$$ packed form
15743B3734470L47416K52115J60189Q9376N3852O1866J14544K03490L08984M03618
15733B5729920M63173M78074M55499M10159L53282K89757K22546J56393R7841
15724B8656644N4177L0581K4066K0488J457m3251j08181j73016k09308j91648
15714B8062009j10693J9759J69197L05773M06741M58173M50710L79614K50216
15705C0391499Q1846r5439k49167l54001m00029l95679l63014l28242l11850l22716
15695B7653208l59111m14679m83486n60747o40921p15752p73372q00923p91876
15686B2112341p51520o94542o37587n90725n50209m99608m22957l19180k03142
15677A7442871r4114m665O1914J06144J24418J09988O6648J9351N559N2986J63195
$$ plain form
15666 18054295 18367370 18837344 19444212 20151708 20913897 21677904 22390102 23008584 23513786
15657 23513786 23906841 24196176 24384377 24467409 24446833 24340922 24179430 23985885 23767465 23523647
15647 23523647 23263227 23010534 22794413 22631324 22517290 22432872 22354871 22265764 22156637 22027668
15637 22027668 21890962 21770389 21689908 21654381 21638905 21598845 21497407 21331887 21137041 20962533
15627 20962533 20844333 20791537 20792616 20830960 20900385 21016776 21219615 21556364 22056427 22713543
15617 22713543 23488722 24330073 25195910 26068656 26953270 27860703 28788064 29712388 30601219
15608 30601219 31426478 32170370 32824452 33387859 33866852 34274057 34627947 34954817 35290002
15599 35290002 35670839 36119829 36628057 37152543 37632042 38014195 38280409 38454011 38585704
$$ packed form
15666A8054295L13075M69974O06868P07496P62189P64007P12198O18482N05202
15657B3513786L93055K89335J88201Q3032k0576j05911j61492j93545k18420k43818
15647B3523647k60420k52693k16121j63089j14034q4418p8001q9107j09127j28969
15637B2027668j36706j20573q0481l5527j5476m0060j01438j65520j94846j74508
15627B0962533j18200n2796J079L8344O9425J16391K02839L36749N00063O57116
15617B2713543P75179Q41351Q65837Q72746Q84614R07433R27361R24324Q88831
15608C0601219Q25259P43892O54082N63407M78993M07205L53890L26870L35185
15599C5290002L80837M48990N08228N24486M79499L82153K66214J73602J31693
$$ plain form
15590 38585704 38725543 38900917 39115080 39362547 39644079 39970985 40363732 40850713 41462576
15581 41462576 42217220 43102270 44066238 45023375 45872319 46524180 46927388 47076454 47003780
15572 47003780 46761062 46397451 45945490 45424105 44853672 44268504 43717130 43251878 42915100
15563 42915100 42726625 42673939 42710866 42771331 42792366 42729886 42559575 42272244 41873430 41383921
15553 41383921 40835453 40264362 39707952 39204081 38793411 38521869 38435824 38567313 38919828
15544 38919828 39466910 40162452 40952752 41784742 42611112 43393153 44101920 44721896 45259982
15535 45259982 45752295 46255577 46820412 47460913 48140027 48777526 49274953 49548392 49558666
15526 49558666 49325327 48913341 48397741 47830178 47229523 46597034 45938304 45273427 44629294
$$ packed form
15590C8585704J39839J75374K14163K47467K81532L26906L92747M86981O11863
15581D1462576P54644Q85050R63968R57137Q48944O51861M03208J49066p2674
15572D7003780k42718l63611m51961n21385n70433n85168n51374m65252l36778
15563D2915100j88475n2686L6927O0465K1035o2480j70311k87331l98814m89509
15553D1383921n48468n71091n56410n03871m10670k71542q6045J31489L52515
15544C8919828N47082O95542P90300Q31990Q26370P82041P08767O19976N38086
15535D5259982M92313N03282N64835O40501O79114O37499M97427K73439J0274
15526D9558666k33339m11986n15600n67563o00655o32489o58730o64877o44133
$$ plain form
15517 44629294 44021911 43443734 42867287 42264033 41625892 40974352 40351354 39799901 39346908
15508 39346908 38995118 38725761 38511273 38333023 38194472 38122689 38159090 38342685 38687997 39166296
15498 39166296 39704557 40205792 40576299 40745616 40678849 40383582 39907999 39330357 38744603
15489 38744603 38242287 37890759 37718414 37720279 37879285 38183481 38627130 39200661 39882634 40642206
15479 40642206 41448908 42279167 43113869 43931831 44707394 45412846 46021086 46507890 46856231
15470 46856231 47062259 47140393 47125649 47072410 47047744 47115194 47309140 47612785 47958498 48254971
15460 48254971 48425703 48437758 48307916 48085217 47820251 47541672 47258171 46981545 46745527
15451 46745527 46601685 46598856 46765232 47102989 47592367 48198584 48878679 49590679 50305253 51010569
$$ packed form
15517D4629294o07383n78177n76447o03254o38141o51540o22998n51453m52993
15508C9346908l51790k69357k14488j78250j38551p1783L6401J83595L45312M78299
15498C9166296N38261N01235L70507J69317o6767k95267m75583n77642n85754
15489C8744603n02316l51528j72345J865J59006L04196M43649N73531O81973P59572
15479D0642206Q06702Q30259Q34702Q17962P75563P05452O08240M86804L48341
15470D6856231K06028P8134j4744n3239k4666O7450J93946L03645L45713K96473
15460D8254971J70732J2055j29842k22699k64966k78579k83501k76626k36018
15451D6745527j43842k829J66376L37757M89378O06217O80095P12000P14574P05316
$$ plain form
15441 51010569 51702532 52369146 52985965 53525286 53965927 54294949 54506081 54601243 54596582 54531396
15431 54531396 54472956 54508042 54720066 55159964 55824074 56653554 57561736 58477043 59373904 60269773
15421 60269773 61192808 62147707 63104479 64012608 64824602 65511248 66064767 66498587 66847118
15412 66847118 67157854 67475144 67830130 68247181 68756283 69394121 70193481 71174233 72343233
15403 72343233 73699037 75233468 76927250 78743492 80624444 82496168 84281114 85911148
15395 85911148 87334048 88514634 89437537 90116214 90603634 90991296 91387175 91880978 92519216
15386 92519216 93305382 94219433 95238962 96348317 97534376 98778714 100056492 101344006
15378 101344006 102630448 103929129 105283531 106761862 108436697 110357342 112529613 114911728
$$ packed form
15441E1010569O91963O66614O16819N39321M40641L29022K11132R5162m661o5186
15431E4531396n8440L5086K12024M39898O64110Q29480R08182R15307Q96861Q95869
15421F0269773R23035R54899R56772R08129Q11994O86646N53519M33820L48531
15412F6847118L10736L17290L54986M17051N09102O37838P99360R80752J169000
15403G2343233J355804J534431J693782J816242J880952J871724J784946J630034
15395H5911148J422900J180586R22903O78677M87420L87662L95879M93803O38238
15386I2519216P86166R14051J019529J109355J186059J244338J277778J287514
15378A01344006J286442J298681J354402J478331J674835J920645K172271K382115
$$ plain form
15370 114911728 117425690 119979459 122493273 124921169 127258987 129535155 131792176 134073533
15362 134073533 136421496 138877795 141478812 144246968 147184248 150269171 153457306 156688656
15354 156688656 159900587 163038172 166057206 168923147 171610569 174102920 176389877 178464712
15346 178464712 180329244 182007147 183553647 185049143 186579080 188215584 190011940 192005328
15338 192005328 194217072 196648143 199276637 202062582 204957081 207910347 210878508 213828626
15330 213828626 216735633 219569434 222281536 224804629 227071638 229044847 230732946 232181076
15322 232181076 233441624 234548109 235508160 236315320 236969683 237496488 237952544 238414245 238953337
15313 238953337 239617361 240427741 241393826 242530993 243872004 245468425 247383797 249680039
$$ packed form
15370A14911728K513962K553769K513814K427896K337818K276168K257021K281357
15362A34073533K347963K456299K601017K768156K937280L084923L188135L231350
15354A56688656L211931L137585L019034K865941K687422K492351K286957K074835
15346A78464712J864532J677903J546500J495496J529937J636504J796356J993388
15338A92005328K211744K431071K628494K785945K894499K953266K968161K950118
15330B13828626K907007K833801K712102K523093K267009J973209J688099J448130
15322B32181076J260548J106485R60051Q07160O54363N26805M56056M61701N39092
15313B38953337O64024Q10380R66085J137167J341011J596421J915372K296242
$$ plain form
15305 249680039 252397898 255538534 259059248 262887775 266945622 271168302 275514004 279955798
15297 279955798 284461174 288974511 293419788 297725388 301853175 305810944 309642922 313406337
15289 313406337 317144407 320866342 324542209 328110431 331490990 334602464 337381351 339794026
15281 339794026 341832140 343496914 344788093 345705858 346260055 346474351 346377891 345989937 345313067
15272 345313067 344343987 343091413 341582276 339853427 337943069 335893257 333760374 331620714
15264 331620714 329560636 327653584 325938638 324414485 323051982 321818117 320696990 319693855
15256 319693855 318821754 318084112 317465752 316936022 316462183 316026925 315638444 315321390 315089197
15247 315089197 314916245 314732796 314449675 313995930 313342535 312500191 311504299 310406116 309271159
$$ packed form
15305B49680039K717859L140636L520714L828527M057847M222680M345702M441794
15297B79955798M505376M513337M445277M305600M127787L957769L831978L763415
15289C13406337L738070L721935L675867L568222L380559L111474K778887K412675
15281C39794026K038114J664774J291179R17765N54197K14296r6460l87954o76870
15272C45313067r69080j252574j509137j728849j910358k049812k132883k139660
15264C31620714k060078j907052j714946j524153j362503j233865j121127j003135
15256C19693855q72101p37642o18360n29730m73839m35258l88481l17054k32193
15247C15089197j72952j83449k83121m53745o53395q42344r95892j098183j134957
$$ plain form
15238 309271159 308171038 307164479 306280643 305517898 304856666 304275510 303763010 303323860 302979449
15229 302979449 302763163 302711957 302858725 303229257 303840721 304696555 305780144 307052205 308449744
15220 308449744 309883150 311236404 312379251 313192282 313594445 313558250 313105766 312293320 311196501
15211 311196501 309897098 308468414 306960813 305394838 303767857 302073406 300323028 298556725
15203 298556725 296835484 295221619 293758688 292458591 291296918 290218491 289156086 288056420
15195 288056420 286898520 285695694 284484956 283309452 282199045 281159887 280178370 279230803
15187 279230803 278289506 277324713 276307534 275217731 274049902 272808464 271496013 270109753
15179 270109753 268650058 267130422 265580136 264042316 262570445 261221271 260044730 259075058
$$ packed form
15238C09271159j100121j006559q83836p62745o61232n81156n12500m39150l44411
15229C02979449k16286n1206J46768L70532O11464Q55834J083589J272061J397539
15220C08449744J433406J353254J142847Q13031M02163l6195m52484q12446j096819
15211C11196501j299403j428684j507601j565975j626981j694451j750378j766303
15203B98556725j721241j613865j462931j300097j161673j078427j062405j099666
15195B88056420j157900j202826j210738j175504j110407j039158r81517r47567
15187B79230803r41297r64793j017179j089803j167829j241438j312451j386260
15179B70109753j459695j519636j550286j537820j471871j349174j176541r69672
$$ plain form
15171 259075058 258323471 257773119 257381538 257092469 256850614 256612006 256349743 256058334 255753475
15162 255753475 255459793 255189989 254934087 254670759 254388007 254092604 253804592 253545611 253327181
15153 253327181 253142567 252967647 252772094 252533016 252240523 251892703 251489079 251032888 250540976
15144 250540976 250051265 249620671 249313268 249181057 249242028 249467239 249789177 250128200 250419486
15135 250419486 250627013 250743823 250784535 250774197 250736522 250687224 250636366 250596687 250590982 250650785 250802853
15124 250802853 251053711 251389424 251791989 252254766 252781600 253372756 254012200 254666672 255297183
15115 255297183 255875432 256392662 256853136 257258810 257599792 257857122 258011209 258044888 257938623
15106 257938623 257666989 257204053 256534621 255664048 254620234 253445147 252182553 250871374
$$ packed form
15171B59075058p51587n50352l91581k89069k41855k38608k62263k91409l04859
15162B55753475k93682k69804k55902k63328k82752k95403k88012k58981k18430
15153B53327181j84614j74920j95553k39078k92493l47820m03624m56191m91912
15144B50540976m89711m30594l07403j32211O0971K25211L21938L39023K91286
15135B50419486K07527J16810M0712j0338l7675m9298n0858l9679n705N9803J52068
15124B50802853K50858L35713M02565M62777N26834N91156O39444O54472O30511
15115B55297183N78249N17230M60474M05674L40982K57330J54087L3679j06265
15106B57938623k71634m62936o69432q70573j043814j175087j262594j311179
$$ plain form
15098 250871374 249544165 248223602 246915394 245603223 244253279 242832866 241333963 239779129
15090 239779129 238199528 236604618 234970614 233253108 231410254 229423222 227306329 225103228
15082 225103228 222870635 220656524 218484223 216353061 214255598 212197777 210205363 208312267
15074 208312267 206541783 204894718 203349469 201870862 200421436 198969711 197494790 195989662
15066 195989662 194462394 192929321 191398641 189856597 188272109 186619979 184905763 183174047
15058 183174047 181493901 179929891 178514558 177234783 176036853 174849376 173616686 172325771
15050 172325771 171009258 169723591 168519975 167425873 166440020 165534637 164663205 163774401
15042 163774401 162824272 161779005 160615457 159329669 157948072 156527043 155137006 153842023
$$ packed form
15098B50871374j327209j320563j308208j312171j349944j420413j498903j554834
15090B39779129j579601j594910j634004j717506j842854j987032k116893k203101
15082B25103228k232593k214111k172301k131162k097463k057821j992414j893096
15074B08312267j770484j647065j545249j478607j449426j451725j474921j505128
15066A95989662j527268j533073j530680j542044j584488j652130j714216j731716
15058A83174047j680146j564010j415333j279775j197930j187477j232690j290915
15050A72325771j316513j285667j203616j094102r85853r05383q71432q88804
15042A63774401r50129j045267j163548j285788j381597j421029j390037j294983
$$ plain form
15034 153842023 152685457 151681678 150812666 150033858 149288087 148517669 147670252 146705643 145607460
15025 145607460 144389193 143083604 141720436 140307210 138824414 137239206 135532239 133721219
15017 133721219 131863380 130033172 128288789 126648821 125094346 123591665 122111154 120624842
15009 120624842 119095207 117478489 115744153 113891198 111946520 109949057 107935674 105939958
15001 105939958 103999321 102156520 100449595 98898124 97495763 96211328 94996631 93800432
14993 93800432 92585190 91338230 90070190 88801082 87542580 86290084 85031724 83765750
14985 83765750 82510854 81300922 80168142 79129300 78188116 77347115 76610664 75977131 75436031
14976 75436031 74975519 74587644 74262748 73981523 73717973 73453252 73186353 72929954 72695981
$$ packed form
15034A53842023j156566j003779q69012p78808p45771p70418q47417r64609j098183
15025A45607460j218267j305589j363168j413226j482796j585208j706967j811020
15017A33721219j857839j830208j744383j639968j554475j502681j480511j486312
15009A20624842j529635j616718j734336j852955j944678j997463k013383j995716
15001A05939958j940637j842801j706925j551471j402361j284435j214697j196199
14993I3800432j215242j246960j268040j269108j258502j252496j258360j265974
14985H3765750j254896j209932j132780j038842r41184q41001p36451o33533n41100
14976G5436031m60512l87875l24896k81225k63550k64721k66899k56399k33973
$$ plain form
14967 72695981 72484951 72285598 72080051 71849530 71580235 71268358 70920760 70549330 70160866
14958 70160866 69748269 69289581 68756400 68125267 67383807 66531360 65579539 64552978 63486225
14949 63486225 62417892 61386233 60426502 59568519 58833288 58228086 57741774 57344265 56993083
14940 56993083 56645941 56274224 55870759 55448375 55032866 54657634 54361062 54180758 54141363
14931 54141363 54241370 54448136 54704453 54942574 55099849 55131187 55014656 54749547 54349839
14922 54349839 53837614 53238781 52577454 51866263 51099755 50259020 49325316 48294824 47187924
14913 47187924 46048128 44928915 43873113 42896308 41985230 41110784 40244102 39364229 38455446
14904 38455446 37501716 36487254 35403906 34258003 33070792 31872906 30696962 29573788
$$ packed form
14967G2695981k11030j99353k05547k30521k69295l11877l47598l71430l88464
14958G0160866m12597m58688n33181o31133p41460q52447r51821j026561j066753
14949F3486225j068333j031659r59731q57983p35231o05202m86312l97509l51182
14940E6993083l47142l71717m03465m22384m15509l75232k96572j80304l9395
14931E4141363J00007K06766K56317K38121J57275L1338j16531k65109l99708
14922E4349839n12225n98833o61327p11191p66508q40735r33704j030492j106900
14913D7187924j139796j119213j055802r76805r11078q74446q66682q79873r08783
14904C8455446r53730j014462j083348j145903j187211j197886j175944j123174
$$ plain form
14896 29573788 28536717 27630101 26907741 26413809 26161921 26132598 26285139 26565562 26908084
14887 26908084 27242973 27513397 27687259 27754363 27716924 27586166 27384215 27141568 26888916 26651627
14877 26651627 26450992 26306313 26230685 26222407 26261023 26314113 26350174 26345878 26283116 26144386 25915049
14866 25915049 25589516 25173821 24681858 24127271 23515477 22841547 22097859 21288762 20442860
14857 20442860 19614659 18873754 18284796 17886317 17679142 17629787 17683884 17779369 17854438 17854180
14847 17854180 17742946 17521541 17233754 16947949 16723936 16591313 16550203 16584026 16672560 16801309
14837 16801309 16964251 17160074 17388481 17649904 17941681 18246102 18520413 18704018 18744875
14828 18744875 18628223 18384460 18067871 17722133 17358715 16959684 16494378 15935206 15269012
$$ packed form
14896B9573788j037071r06616p22360m93932k51888k9323J52541K80423L42522
14887B6908084L34889K70424J73862O7104l7439j30758k01951k42647k52652k37289
14877B6651627k00635j44679p5628q278L8616N3090L6061m296o2762j38730k29337
14866B5915049l25533m15695m91963n54587o11794o73930p43688q09097q45902
14857B0442860q28201p40905n88958l98479k07175m9355N4097R5485P5069k58
14847A7854180j11234k21405k87787k85805k24013j32623m1110L3823Q8534J28749
14837A6801309J62942J95823K28407K61423K91777L04421K74311J83605M0857
14828A8744875j16652k43763l16589l45738l63418l99031m65306n59172o66194
$$ plain form
14819 15269012 14504926 13675415 12830251 12029158 11333767 10792638 10421337 10191874 10041452
14810 10041452 9896212 9698345 9425728 9096627 8756999 8456136 8224505 8065122 7957434
14801 7957434 7865157 7743908 7552255 7269827 6915733 6550881 6255704 6097642 6111156 6296234
14791 6296234 6622998 7033332 7447289 7782873 7980590 8019749 7924215 7757339 7601797 7528325
14781 7528325 7567970 7701361 7871513 8015873 8099542 8128056 8130568 8125516 8096573 8000016 7794776
14770 7794776 7464574 7015151 6459917 5813792 5096607 4336696 3572426 2854643 2247460
14761 2247460 1820075 1627754 1691805 1993826 2489965 3132894 3882000 4696594 5525047 6303667
14751 6303667 6968066 7472064 7804821 7993516 8085393 8119283 8106525 8033534 7880494 7640055
$$ packed form
14819A5269012p64086q29511q45164q01093o95391n41129l71301k29463j50422
14810A0041452j45240j97867k72617l29101l39628l00863k31631j59383j07688
14801G957434r2277j21249j91653k82428l54094l64852k95177j58062J3514J85078
14791F296234L26764M10334M13957L35584J97717L9159r5534j66876j55542p3472
14781G528325L9645J33391J70152J44360Q3669K8514K512n052k8943r6557k05240
14770G794776l30202m49423n55234o46125p17185p59911p64270p17783o07183
14761B247460m27385j92321O4051L02021M96139O42929P49106Q14594Q28453P78620
14751F303667O64399N03998L32757J88695R1877L3890j2758p2991j53040k40439
$$ plain form
14741 7640055 7325982 6974617 6642401 6393160 6273024 6287473 6397912 6538668 6641219 6653731
14731 6653731 6552205 6343050 6056355 5732272 5407956 5109096 4844418 4606726 4384669
14722 4384669 4176895 3994829 3850901 3742183 3645431 3531370 3386905 3225606 3080726 2991298
14712 2991298 2990666 3098516 3316839 3630594 4010531 4416930 4808569 5158253 5463405 5739183
14702 5739183 5999007 6239222 6438340 6567852 6604671 6539766 6384269 6172002 5953441 5782330
14692 5782330 5703445 5746461 5923837 6230300 6642694 7118997 7598978 8012391 8299067 8436022
14682 8436022 8453269 8418921 8397325 8410927 8433071 8409979 8291472 8053919 7709884 7304153
14672 7304153 6896302 6534745 6235872 5981259 5732711 5452984 5119991 4730185 4294283
$$ packed form
14741G640055l14073l51365l32216k49241j20136J4449J10439J40756J02551J2512
14731F653731j01526k09155k86695l24083l24316k98860k64678k37692k22057
14722D384669k07774j82066j43928j08718r6752j14061j44465j61299j44880q9428
14712B991298o32J07850K18323L13755L79937M06399L91639L49684L05152K75778
14702E739183K59824K40215J99118J29512L6819o4905j55497k12267k18561j71111
14692E782330p8885M3016J77376L06463M12394M76303M79981M13413K86676J36955
14682H436022J7247l4348k1596J3602K2144k3092j18507k37553l44035m05731
14672G304153m07851l61557k98873k54613k48548k79727l32993l89806m35902
$$ plain form
14663 4294283 3832143 3370968 2944232 2586035 2321869 2163323 2110102 2153944 2280725 2473827
14653 2473827 2720023 3011601 3339465 3682634 4004683 4261368 4415882 4453578 4387355 4250558
14643 4250558 4083049 3919296 3781497 3676277 3596984 3534426 3490399 3481981 3530626 3643832
14633 3643832 3804073 3971540 4095663 4129327 4043764 3841607 3562162 3272816 3046473 2934874
14623 2934874 2953738 3087655 3305309 3570676 3848793 4111919 4344668 4541514 4697904 4804799
14613 4804799 4851685 4832550 4748084 4603819 4407460 4167488 3894563 3605250 3323051 3071983
14603 3071983 2864584 2693562 2538295 2385428 2246504 2156880 2157663 2275211 2511360 2845502
14593 2845502 3239527 3639783 3982415 4210287 4295418 4249413 4111138 3919247 3688660 3406065
$$ packed form
14663D294283m62140m61175m26736l58197k64166j58546n3221M3842J26781J93102
14653B473827K46196K91578L27864L43169L22049K56685J54514L7696o6223j36797
14643D250558j67509j63753j37799j05220p9293o2558m4027q418M8645J13206
14633C643832J60241J67467J24123L3664q5563k02157k79445k89346k26343j11599
14623B934874J8864J33917K17654K65367K78117K63126K32749J96846J56390J06895
14613D804799M6886j9135q4466j44265j96359k39972k72925k89313k82199k51068
14603C071983k07399j71022j55267j52867j38924q9624P83J17548K36149L34142
14593B845502L94025M00256L42632K27872Q5131m6005j38275j91891k30587k82595
$$ plain form
14583 3406065 3047018 2603446 2101806 1599199 1163904 854806 706754 725809 898581 1208064
14573 1208064 1639321 2171561 2769878 3387059 3973867 4491537 4919577 5254763 5506700
14564 5506700 5697979 5865613 6052328 6285184 6556160 6824863 7044781 7188961 7251790 7233056
14554 7233056 7129151 6939802 6676716 6363300 6029227 5706824 5429823 5229794 5126598
14545 5126598 5118783 5185374 5299202 5439280 5593185 5750652 5895205 6000399 6033233 5962556
14535 5962556 5769167 5454917 5045293 4578899 4087506 3582854 3060915 2516700 1956253
14526 1956253 1399007 870753 393859 -17218 -353207 -604498 -759130 -808137 -754199 -614151
14516 -614151 -412577 -174092 79913 332043 569455 784193 974870 1150389 1330959 1539792
$$ packed form
14583C406065l59047m43572n01640n02607m35295l09098j48052J9055J72772L09483
14573A208064M31257N32240N98317O17181N86808N17670M28040L35186K51937
14564E506700J91279J67634J86715K32856K70976K68703K19918J44180O2829j8734
14554G233056j03905j89349k63086l13416l34073l22403k77001k00029j03196
14545E126598p815O6591J13828J40078J53905J57467J44553J05194L2834p0677
14535E962556j93389l14250m09624m66394m91393n04652n21939n44215n60447
14526A956253n57246n28254m76894m11077l35989k51291j54632m9007N3938J40048
14516f14151K01574K38485K54005K52130K37412K14738J90677J75519J80570K08833
$$ plain form
14506 1539792 1788070 2066605 2351893 2618955 2849341 3029903 3146503 3182960 3131546 3006823
14496 3006823 2846512 2693395 2571904 2481127 2410998 2365970 2373875 2472148 2682587 2992705
14486 2992705 3355516 3706609 3985941 4152845 4194004 4128791 4008321 3899013 3851298 3870279
14476 3870279 3908632 3887583 3734633 3419178 2969169 2460555 1983535 1602222 1330950 1141917
14466 1141917 995852 869445 760728 676868 619620 577233 524373 430202 272881 53616
14456 53616 -197765 -427669 -570857 -565977 -368692 42708 666752 1476952 2419150 3414731
14446 3414731 4372530 5202704 5824406 6170435 6199338 5914238 5372134 4671087 3922513 3226335
14436 3226335 2659908 2279444 2124579 2216226 2547437 3077942 3742728 4473359 5219104 5952679
$$ packed form
14506A539792K48278K78535K85288K67062K30386J80562J16600L6457n1414j24723
14496C006823j60311j53117j21491r0777p0129m5028P905R8273K10439L10118
14486B992705L62811L51093K79332J66904M1159o5213j20470j09308m7715J8981
14476C870279L8353k1049j52950l15455m50009n08614m77020l81313k71272j89033
14466A141917j46065j26407j08717q3860n7248m2387n2860r4171j57321k19265
14456E3616k51381k29904j43188M880J97285M11400O24044Q10200R42198R95581
14446C414731R57799Q30174O21702L46029K8903k85100n42104p01047p48574o96178
14436C226335n66427l80464j54865R1647L31211N30505O64786P30631P45745P33575
$$ plain form
14426 5952679 6657021 7305905 7855747 8254770 8460156 8450357 8229139 7823914 7279658 6651540
14416 6651540 6000129 5386574 4862338 4455816 4165310 3964603 3818024 3696900 3590433
14407 3590433 3506995 3466459 3489493 3589326 3765912 4000386 4253733 4476750 4629860 4699668
14397 4699668 4700821 4665342 4628846 4618569 4644889 4700504 4770092 4845418 4935951 5068925 5281483
14386 5281483 5611964 6092081 6736965 7535255 8447846 9418403 10387725 11303909 12126064
14377 12126064 12820480 13352648 13686845 13799573 13696644 13419232 13034567 12616469 12225593
14368 12225593 11900253 11660472 11515537 11465057 11497037 11592310 11733633 11909684 12111579 12326407
14358 12326407 12531287 12693622 12782766 12785514 12710675 12579702 12413878 12230318 12048345 11893752
$$ packed form
14426E952679P04342O48884N49842L99023K05386r799k21218m05225n44256o28118
14416F651540o51411o13555n24236m06522k90506k00707j46579j21124j06467
14407C590433q3438m0536K3034R9833J76586K34474K53347K23017J53110O9808
14397D699668J153l5479l6496j0277K6320N5615O9588P5326R0533J32974K12558
14386E281483L30481M80117O44884P98290R12591R70557R69322R16184Q22155
14377A2126064O94416N32168L34197J12728j02929k77412l84665m18098l90876
14368A2225593l25340k39781j44935n0480L1980R5273J41323J76051K01895K14828
14358A2326407K04880J62335Q9144K748p4839j30973j65824j83560j81973j54593
$$ plain form
14348 11893752 11789245 11736736 11707869 11650480 11506522 11234799 10830783 10332371 9806054 9321640
14338 9321640 8929981 8652471 8482297 8393993 8356026 8340822 8330951 8320357 8307830 8286077 8235502
14327 8235502 8127597 7935711 7646864 7266437 6812389 6306407 5770025 5223582 4684275
14318 4684275 4166701 3686974 3262494 2903169 2601551 2329703 2044284 1700539 1272915
14309 1272915 771228 240364 -257975 -671607 -977910 -1186683 -1325169 -1415889 -1461428 -1444021
14299 -1444021 -1338054 -1128079 -824031 -464324 -101316 222613 490259 707519 891326
14290 891326 1057704 1214690 1362347 1498626 1625069 1749199 1887016 2067293 2331241 2720308
14280 2720308 3256129 3927597 4695659 5510381 6326160 7108252 7833838 8490988 9074273
$$ packed form
14348A1893752j04507n2509k8867n7389j43958k71723m04016m98412n26317m84414
14338I321640l91659k77510j70174q8304l7967j5204r871j0594j2527k1753n0575
14327H235502j07905j91886k88847l80427m54048n05982n36382n46443n39307
14318D684275n17574m79727m24480l59325l01618k71848k85419l43745m27624
14309A272915n01687n30864m98339m13632l06303k08773j38486r0720m5539J7407
14299a444021J05967K09975L04048L59707L63008L23929K67646K17260J83807
14290H91326J66378J56986J47657J36279J26443J24130J37817J80277K63948L89067
14280B720308N35821O71468P68062Q14722Q15779P82092P25586O57150N83285
$$ plain form
14271 9074273 9578293 9995054 10317188 10542389 10676442 10736699 10755077 10775188 10839832 10972498
14261 10972498 11163752 11372112 11537166 11594319 11485637 11169256 10627793 9871293 8933962
14252 8933962 7870818 6756043 5675441 4709290 3915417 3325545 2955287 2811794 2884918
14243 2884918 3131729 3478962 3848773 4187197 4476120 4726864 4963643 5208204 5473494
14234 5473494 5764899 6083917 6432048 6812178 7222664 7646622 8047316 8374516 8575850
14225 8575850 8608292 8451879 8125328 7692708 7248835 6885928 6659815 6575152 6595455 6668661
14215 6668661 6755086 6847197 6971275 7166538 7455062 7825998 8241790 8654361 9017406 9290122
14205 9290122 9435716 9421676 9227670 8858101 8346485 7744314 7103822 6466791 5860196 5295824
$$ packed form
14271I074273N04020M16761L22134K25201J34053O0257J8378K0111O4644J32666
14261A0972498J91254K08360J65054N7153j08682l16381n41463p56500r37331
14252H933962j063144j114775j080602r66151p93873n89872l70258j43493P3124
14243B884918K46811L47233L69811L38424K88923K50744K36779K44561K65290
14234E473494K91405L19018L48131L80130M10486M23958M00694L27200K01334
14225H575850L2442j56413l26551m32620m43873l62907k26113q4663K0303P3206
14215F668661Q6425R2111J24078J95263K88524L70936M15792M12571L63045K72716
14205I290122J45594j4040j94006l69569n11616o02171o40492o37031o06595n64372
$$ plain form
14195 5295824 4774810 4296595 3866524 3496397 3198621 2979879 2837612 2757873 2714813 2674472
14185 2674472 2602618 2474374 2283874 2048920 1803985 1583852 1409551 1285319 1204375 1154386
14175 1154386 1117420 1068436 978798 824883 595955 295431 -63268 -457767 -852807 -1202134
14165 -1202134 -1463563 -1618535 -1679055 -1675911 -1640809 -1596773 -1556853 -1523396 -1485216 -1417274 -1288157
14154 -1288157 -1073329 -766490 -385795 24722 404139 698433 886842 990247 1055356 1126725
14144 1126725 1222736 1326214 1393120 1374460 1239610 989475 654946 285131 -67997 -366359
14134 -366359 -599660 -783449 -936451 -1056016 -1115508 -1085311 -957123 -752566 -514972 -293952
14124 -293952 -129761 -40664 -17627 -31059 -47264 -44369 -21065 691 -20678 -134272 -379710
$$ packed form
14195E295824n21014m78215m30071l70127k97776k18742j42267p9739m3060m0341
14185B674472p1854j28244j90500k34954k44935k20133j74301j24232q0944m9989
14175A154386l6966m8984q9638j53915k28928l00524l58699l94499l95040l49327
14165a202134k61429j54972o0520L144L5102M4036L9920L3457L8180O7942J29117
14154a288157K14828L06839L80695M10517L79417K94294J88409J03405O5109P1369
14144A126725R6011J03478O6906j8660j34850k50135l34529l69815l53128k98362
14134c66359k33301j83789j53002j19565n9492L0197J28188K04557K37594K21020
14124b93952J64191Q9097K3037j3432j6205K895K3304K1756k1369j13594k45438
$$ plain form
14113 -379710 -773689 -1305178 -1937862 -2617467 -3283667 -3885096 -4390089 -4784446 -5060939 -5216852
14103 -5216852 -5263920 -5236870 -5187957 -5167982 -5203074 -5281955 -5366054 -5416079 -5413027 -5360403 -5271784
14092 -5271784 -5154793 -5004054 -4810100 -4573876 -4307432 -4019679 -3708308 -3370140 -3016143
14083 -3016143 -2674402 -2382833 -2181667 -2109071 -2197524 -2466686 -2911703 -3495110 -4153873 -4822167
14073 -4822167 -5455327 -6037867 -6570698 -7048404 -7444411 -7715958 -7824809 -7756158 -7522645 -7156126
14063 -7156126 -6696873 -6186794 -5666869 -5173477 -4731412 -4349657 -4024540 -3746433 -3504840
14054 -3504840 -3290717 -3096481 -2914155 -2733498 -2542858 -2333499 -2104750 -1866014 -1634150
14045 -1634150 -1428117 -1263609 -1149214 -1084985 -1063861 -1075882 -1113577 -1175014 -1262671 -1379297
$$ packed form
14113c79710l93979n31489o32684o79605o66200o01429n04993l94357k76493j55913
14103e216852m7068K7050M8913J9975l5092p8881q4099n0025L052N2624Q8619
14092e271784J16991J50739J93954K36224K66444K87753L11371L38168L53997
14083c016143L41741K91569K01166P2596q8453k69162m45017n83407o58763o68294
14073d822167o33160n82540n32831m77706l96007k71547j08851O8651K33513L66519
14063g156126M59253N10079N19925M93392M42065L81755L25117K78107K41593
14054c504840K14123J94236J82326J80657J90640K09359K28749K38736K31864
14045a634150K06033J64508J14395O4229K1124j2021l7695o1437q7657j16626
$$ plain form
14035 -1379297 -1522883 -1682262 -1836444 -1961853 -2045405 -2092439 -2120752 -2144611 -2161451 -2152737 -2100033
14024 -2100033 -2002709 -1880550 -1760805 -1665493 -1609278 -1602287 -1650282 -1753559 -1906216 -2093296
14014 -2093296 -2287241 -2449740 -2541298 -2534162 -2421931 -2220742 -1960890 -1672369 -1370678 -1051174
14004 -1051174 -696911 -295402 146208 596514 1008865 1339278 1561942 1673196 1686192 1625511
13994 1625511 1523457 1411685 1307727 1205855 1079635 894114 621205 252804 -193221
13985 -193221 -677435 -1152971 -1583942 -1958439 -2287293 -2588217 -2865253 -3097603 -3247229 -3282529
13975 -3282529 -3201848 -3038618 -2844862 -2667009 -2532111 -2451221 -2430151 -2474484 -2586646 -2761012
13965 -2761012 -2981671 -3223596 -3456357 -3650227 -3782639 -3839475 -3811119 -3692378 -3489242 -3221893
$$ packed form
14035a379297j43586j59379j54182j25409q3552m7034k8313k3859j6840Q714N2704
14024b100033R7324J22159J19745R5312N6215O991m7995j03277j52657j87080
14014b093296j93945j62499r1558P136J12231K01189K59852K88521L01691L19504
14004a051174L54263M01509M41610M50306M12351L30413K22664J11254J2996o0681
13994A625511j02054j11772j03958j01872j26220j85521k72909l68401m46025
13985a93221m84214m75536m30971l74497l28854l00924k77036k32350j49626l5300
13975c282529Q0681J63230J93756J77853J34898Q0890K1070m4333j12162j74366
13965b761012k20659k41925k32761j93870j32412n6836K8356J18741K03136K67349
$$ plain form
13955 -3221893 -2917567 -2601728 -2295482 -2014590 -1764093 -1532948 -1297118 -1031070 -718208
13946 -718208 -353685 55647 489128 913070 1290426 1595845 1825932 1995910 2121935 2199869
13936 2199869 2198626 2078860 1824108 1456499 1026075 588945 192311 -130875 -363060 -500886
13926 -500886 -550264 -519772 -417822 -255822 -52182 169086 384298 574396 724277 818229
13916 818229 835098 749111 538094 191916 -284020 -864584 -1496839 -2100159 -2587138 -2896556
13906 -2896556 -3015109 -2977066 -2849940 -2715096 -2644711 -2678029 -2805971 -2972778 -3096957 -3104806
13896 -3104806 -2960775 -2678241 -2308951 -1923755 -1594407 -1377278 -1299459 -1351417 -1490534 -1655597
13886 -1655597 -1786556 -1840275 -1795122 -1646136 -1401032 -1082922 -733120 -404657 -146827 11173
$$ packed form
13955c221893L04326L15839L06246K80892K50497K31145K35830K66048L12862
13946g18208L64523M09332M33481M23942L77356L05419K30087J69978J26025P7934
13936B199869j243j19766k54752l67609m30424m37130l96634l23186k32185j37826
13926e00886m9378L0492J01950J62000K03640K21268K15212J90098J49881R3952
13916H18229J6869q5987k11017l46178m75936n80564o32255o03320m86979l09418
13906b896556j18553L8043J27126J34844P0385l3318j27942j66807j24179p849
13896c104806J44031K82534L69290L85196L29348K17129P7819n1958j39117j65063
13886a655597j30959n3719M5153J48986K45104L18110L49802L28463K57830J58000
$$ plain form
13876 11173 69224 52238 -6177 -82449 -170305 -271393 -379977 -478627 -547578 -573437 -546792
13865 -546792 -456814 -295274 -66998 206639 496614 780456 1052906 1327316 1625268 1959057
13855 1959057 2317480 2661296 2929499 3056668 2997066 2743704 2331747 1824269 1285284 749372
13845 749372 203194 -405798 -1134260 -2003320 -2979512 -3984904 -4926249 -5725738 -6342833
13836 -6342833 -6783650 -7093381 -7330736 -7536745 -7718273 -7855109 -7920781 -7899876 -7790698 -7595731
13826 -7595731 -7314767 -6951709 -6528367 -6088452 -5685641 -5366924 -5162795 -5082227 -5106683 -5188153
13816 -5188153 -5261521 -5269461 -5182524 -4999839 -4734767 -4402125 -4016835 -3598229 -3170095 -2754723
13806 -2754723 -2365392 -2003289 -1662910 -1341855 -1044655 -776973 -538353 -321765 -118431
$$ packed form
13876A1173N8051j6986n8415p6272q7856j01088j08584r8650o8951k5859K6645
13865e46792Q9978J61540K28276K73637K89975K83842K72450K74410K97952L33789
13855A959057L58423L43816K68203J27169n9602k53362m11957n07478n38985n35912
13845G49372n46178o08992p28462q69060r76192j005392r41345p99489o17095
13836f342833m40817l09731k37355k06009j81528j36836o5672K0905J09178J94967
13826g595731K80964L63058M23342M39915M02811L18717K04129Q0568k4456q1470
13816e188153p3368p940Q6937J82685K65072L32642L85290M18606M28134M15372
13806b754723L89331L62103L40379L21055K97200K67682K38620K16588K03334
$$ plain form
13797 -118431 78262 272352 465202 652256 820721 956157 1056940 1144723 1259835 1441587
13787 1441587 1704400 2024809 2347056 2601672 2726212 2682354 2466727 2110774 1666937 1188510
13777 1188510 716341 278151 -105380 -416060 -638440 -764268 -798341 -760649 -681191 -591019
13767 -591019 -517738 -486103 -516084 -615018 -768587 -939330 -1079048 -1148249 -1127261 -1014192 -817083
13756 -817083 -548022 -222898 134055 486449 789704 1005484 1119074 1145387 1116552 1059772
13746 1059772 982456 873675 715693 496079 216163 -106954 -445250 -768516 -1054195 -1294861
13736 -1294861 -1499176 -1685456 -1871469 -2065680 -2265276 -2463778 -2663468 -2880313 -3133238
13727 -3133238 -3424563 -3725805 -3977081 -4099283 -4013277 -3661488 -3028475 -2154363 -1134079
$$ packed form
13797a18431J96693J94090J92850J87054J68465J35436J00783Q7783J15112J81752
13787A441587K62813L20409L22247K54616J24540m3858k15627l55953m43837m78427
13777A188510m72169m38190l83531l10680k22380j25828l4073L7692P9458R0172
13767e91019P3281L1635k9981r8934j53569j70743j39718o9201K0988J13069J97109
13756h17083K69061L25124L56953L52394L03255K15780J13590K6313k8835n6780
13746A059772p7316j08781j57982k19614k79916l23117l38296l23266k85679k40666
13736a294861k04315j86280j86013j94211j99596j98502j99690k16845k52925
13727c133238k91325l01242k51276j22202Q6006L51789O33013Q74112J020284
$$ plain form
13718 -1134079 -99563 810961 1484942 1856450 1913516 1694832 1275346 745186 196518
13709 196518 -277051 -585609 -667123 -516073 -186744 235287 669587 1060496 1376510 1601567
13699 1601567 1730005 1769277 1747926 1720140 1756354 1918798 2235363 2687792 3218172 3747537
13689 3747537 4201082 4533214 4738825 4842575 4875833 4858699 4795695 4682787 4520261 4327099
13679 4327099 4150179 4058001 4114364 4343503 4710762 5134774 5521368 5792978 5899978 5822255
13669 5822255 5569395 5175724 4689209 4163960 3660568 3244699 2975170 2886183 2977295 3219010
13659 3219010 3565963 3963942 4350247 4658582 4833439 4845580 4697582 4418352 4052425 3646489
13649 3646489 3234212 2827317 2420266 2001919 1562654 1098702 620263 158573 -238498
$$ packed form
13718a134079J034516R10524O73981L71508N7066k18684m19486n30160n48668
13709A96518m73569l08558q1514J51050L29329M22031M34300L90909L16014K25057
13699A601567J28438L9272k1351k7786L6214J62444L16565M52429N30380N29365
13689C747537M53545L32132K05611J03750L3258j7134o3004j12908j62526j93162
13679D327099j76920r2178N6363K29139L67259M24012L86594K71610J07000p7723
13669E822255k52860l93671m86515n25249n03392m15869k69529q8987R1112K41715
13659C219010L46953L97979L86305L08335J74857J2141j47998k79230l65927m05936
13649C646489m12277m06895m07051m18347m39265m63952m78439m61690l97071
$$ plain form
13640 -238498 -524426 -676650 -710182 -673816 -630808 -633798 -707516 -848516 -1039084 -1263075 -1512591
13629 -1512591 -1782156 -2056467 -2303407 -2479620 -2546574 -2488861 -2325007 -2105223 -1896644 -1759998
13619 -1759998 -1723983 -1767900 -1824982 -1810336 -1658756 -1349111 -903716 -367301 220226 839116
13609 839116 1482616 2136198 2763430 3310251 3723859 3973882 4063787 4026809 3910525 3760512
13599 3760512 3609992 3476472 3365820 3283204 3244106 3274595 3397359 3614088 3899846 4213591
13589 4213591 4513014 4760893 4924442 4979458 4922971 4783116 4614821 4481843 4431464 4470821
13579 4470821 4559123 4625565 4604417 4465804 4224094 3920261 3591655 3251609 2892197 2503305
13569 2503305 2088787 1666736 1257869 875490 526658 222676 -14394 -161307 -213476 -195593
$$ packed form
13640b38498k85928j52224l3532L6366M3008k990p3718j41000j90568k23991k49516
13629a512591k69565k74311k46940j76213o6954N7713J63854K19784K08579J36646
13619a759998L6015m3917n7082J4646J51580L09645M45395N36415N87527O18890
13609H39116O43500O53582O27232N46821M13608K50023Q9905l6978j16284j50013
13599C760512j50520j33520j10652q2616l9098L0489J22764K16729K85758L13745
13589D213591K99423K47879J63549N5016n6487j39855j68295j32978n0379L9357
13579D470821Q8302O6442k1148j38613k41710l03833l28606l40046l59412l88892
13569B503305m14518m22051m08867l82379l48832l03982k37070j46913n2169J7883
$$ plain form
13559 -195593 -151626 -121279 -118969 -128491 -117131 -60543 39742 161048 283178 409937 568997
13548 568997 791242 1090234 1458787 1876801 2312976 2718736 3030727 3191360 3176963 3014290
13538 3014290 2772184 2532386 2359755 2288078 2320482 2436717 2602912 2780681 2932695 3025909
13528 3025909 3036987 2960461 2812958 2626807 2434501 2254313 2088142 1931053 1779272 1628330
13518 1628330 1469476 1296267 1119757 978856 934528 1047646 1352956 1846613 2493671 3244367
13508 3244367 4045434 4845143 5597870 6268630 6833682 7277434 7590882 7774056 7837637 7797541
13498 7797541 7665244 7444468 7138821 6762724 6344647 5918777 5511478 5134875 4794376
13489 4794376 4502374 4285020 4179223 4224949 4454427 4878220 5475915 6202227 7003560 7825161
$$ packed form
13559a95593M3967L0347K310r522J1360N6588J00285J21306J22130J26759J59060
13548E68997K22245K98992L68553M18014M36175M05760L11991J60633j4397j62673
13538C014290k42106k39798j72631p1677L2404J16235J66195J77769J52014R3214
13528C025909J1078p6526j47503j86151j92306j80188j66171j57089j51781j50942
13518A628330j58854j73209j76510j40901m4328J13118L05310M93657O47058P50696
13508C244367Q01067P99709P52727O70760N65052M43752L13448J83174O3581m0096
13498G797541j32297k20776l05647l76097m18077m25870m07299l76603l40499
13489D794376k92002k17354j05797M5726K29478M23793N97695P26312Q01333Q21601
$$ plain form
13479 7825161 8601116 9244348 9656583 9756843 9506934 8916168 8030213 6920472 5677783
13470 5677783 4402819 3191592 2122834 1252841 616262 225616 64705 80083 181185
13461 181185 258806 220613 26438 -298733 -680542 -1027004 -1258964 -1327513 -1214373 -920358
13451 -920358 -454694 163431 892942 1664280 2391511 3000197 3455412 3772865 4006024 4217661
13441 4217661 4452574 4724783 5021513 5314799 5570395 5753195 5833044 5789969 5615972 5313974
13431 5313974 4893720 4365217 3735672 3013783 2216372 1371298 515960 -307803 -1062353
13422 -1062353 -1722289 -2273959 -2705247 -2996916 -3126896 -3082786 -2869543 -2510157 -2045356 -1530374
13412 -1530374 -1021068 -553726 -135926 242617 591721 913385 1207499 1478514 1736088
$$ packed form
13479G825161P75955O43232M12235J00260k49909n90766q85955j109741j242689
13470E677783j274964j211227j068758q69993o36579l90646j60911J5378J01102
13461A81185P7621l8193j94175l25171l81809l46462k31960o8549J13140K94015
13451i20358M65664O18125P29511P71338P27231O08686M55215L17453K33159K11637
13441D217661K34913K72209K96730K93286K55596J82800P9849m3075j73997l01998
13431E313974m20254n28503o29545p21889p97411q45074q55338q23763p54550
13422a062353o59936n51670m31288k91669j29980M4110K13243L59386M64801N14982
13412a530374N09306M67342M17800L78543L49104L21664K94114K71015K57574
$$ plain form
13403 1736088 1992325 2257889 2536329 2818851 3086671 3323445 3528227 3716163 3904563
13394 3904563 4093485 4254807 4340885 4310668 4155744 3908057 3626518 3374643 3202269 3135384
13384 3135384 3171881 3282261 3419064 3536824 3612439 3651354 3677440 3715639 3776382 3848801 3906365
13373 3906365 3921723 3882525 3799265 3700273 3616462 3565471 3546610 3549266 3564951 3592589 3635069
13362 3635069 3691518 3752291 3802176 3830079 3837210 3839510 3867159 3959945 4152521 4453753 4834780
13351 4834780 5235248 5584368 5825008 5928944 5898058 5755040 5532466 5266900 4996722 4758113
13341 4758113 4578718 4473706 4446280 4490455 4594228 4742214 4915154 5085351 5214855 5264473
13331 5264473 5209058 5046755 4799121 4507335 4225485 4008602 3897672 3906794 4017101 4183474
$$ packed form
13403A736088K56237K65564K78440K82522K67820K36774K04782J87936J88400
13394C904563J88922J61322Q6078l0217j54924k47687k81539k51875j72374o6885
13384C135384L6497J10380J36803J17760P5615L8915K6086L8199O0743P2419N7564
13373C906365J5358l9198q3260r8992q3811n0991j8861K656J5685K7638M2480
13362C635069N6449O0773M9885K7903P131K300K7649R2786J92576L01232L81027
13351D834780M00468L49120K40640J03936l0886j43018k22574k65566k70178k38609
13341D758113j79395j05012k7426M4175J03773J47986J72940J70197J29504M9618
13331E264473n5415j62303k47634k91786k81850k16883j10930R122J10307J66373
$$ plain form
13321 4183474 4356800 4512397 4666783 4872159 5195116 5692983 6393061 7277400 8282350
13312 8282350 9317347 10291147 11128932 11776130 12197843 12381864 12342025 12113273 11737861
13303 11737861 11252935 10688734 10074627 9442954 8826460 8255079 7756799 7358419 7081546
13294 7081546 6937040 6923267 7026948 7222137 7468154 7711740 7895391 7967797 7891879 7650080
13284 7650080 7248201 6716784 6106700 5478081 4886787 4373338 3956469 3632733 3383657
13275 3383657 3188762 3036915 2927168 2859433 2826680 2818732 2833340 2880308 2972580 3112863 3285658
13264 3285658 3457714 3587267 3638583 3591328 3437153 3170764 2790062 2306640 1752877 1175045
13254 1175045 616747 106617 -340771 -716688 -1013314 -1223436 -1341187 -1363970 -1296274 -1152470
$$ packed form
13321D183474J73326J55597J54386K05376L22957M97867P00078Q84339J004950
13312H282350J034997R73800Q37785O47198M21713J84021l9839k28752l75412
13303A1737861m84926n64201o14107o31673o16494n71381m98280l98380k76873
13294G081546j44506j3773J03681J95189K46017K43586J83651P2406p5918k41799
13284G650080m01879n31417o10084o28619n91294n13449m16869l23736k49076
13275C383657j94895j51847j09747o7735l2753p948J4608M6968R2272J40283J72795
13264C285658J72056J29553N1316m7255j54175k66389l80702m83422n53763n77832
13254A175045n58298n10130m47388l75917k96626k10122j17751k2783O7696J43804
$$ plain form
13244 -1152470 -955343 -730658 -501058 -283207 -90391 59016 131627 79003 -145441 -562868
13234 -562868 -1155750 -1869551 -2623572 -3327394 -3901474 -4296496 -4503910 -4553731 -4500442 -4401423
13224 -4401423 -4294657 -4185629 -4052408 -3867808 -3623767 -3340937 -3059649 -2822714 -2661643
13215 -2661643 -2589984 -2602301 -2677938 -2788376 -2904855 -3003485 -3069012 -3099961 -3112654 -3136236 -3196737
13204 -3196737 -3299171 -3419654 -3513113 -3531797 -3443267 -3240105 -2940445 -2580545 -2202788 -1845997
13194 -1845997 -1540661 -1305276 -1143152 -1043555 -986497 -947195 -900238 -826463 -721160 -596358
13184 -596358 -471903 -361377 -266080 -180815 -99901 -12970 101958 273208 519354 837691
13174 837691 1203872 1576604 1902879 2127396 2211343 2155388 2009350 1855503 1774221 1813979
$$ packed form
13244a152470J97127K24685K29600K17851J92816J49407P2611n2624k24444m17427
13234e62868n92882p13801p54021p03822n74080l95022k07414m9821N3289R9019
13224d401423J06766J09028J33221J84600K44041K82830K81288K36935J61071
13215b661643P1659j2317p5637j10438j16479r8630o5527l0949j2693k3582o0501
13204c196737j02434j20483r3459j8684Q8530K03162K99660L59900L77757L56791
13194a845997L05336K35385J62124R9597N7058L9302M6957P3775J05303J24802
13184e96358J24455J10526R5297Q5265Q0914Q6931J14928J71250K46146L18337
13174H37691L66181L72732L26275K24517Q3947n5955j46038j53847q1282L9758
$$ plain form
13164 1813979 1978810 2231388 2505963 2726594 2824507 2752142 2496390 2085463 1578278 1039695
13154 1039695 520050 51362 -346417 -662702 -899102 -1069506 -1192885 -1283890 -1350016 -1398565
13144 -1398565 -1448290 -1536676 -1714519 -2026375 -2488456 -3080410 -3754545 -4450845 -5106981 -5663343
13134 -5663343 -6069422 -6294964 -6339081 -6225502 -5983604 -5630574 -5168994 -4598029 -3925006 -3169267
13124 -3169267 -2363409 -1558971 -829677 -257624 96033 214194 123652 -122525 -463496 -842768
13114 -842768 -1217142 -1561357 -1860683 -2093463 -2222134 -2207356 -2035995 -1740285 -1393547 -1082567
13104 -1082567 -870547 -774404 -771899 -828530 -918718 -1026071 -1128983 -1189818 -1159185 -990277 -652106
13093 -652106 -136617 539024 1331565 2172705 2977794 3663813 4169249 4466868 4564837 4497012
$$ packed form
13164A813979J64831K52578K74575K20631R7913p2365k55752m10927n07185n38583
13154A039695n19645m68688l97779l16285k36400j70404j23379r1005o6126m8549
13144a398565m9725q8386j77843l11856m62081n91954o74135o96300o56136n56362
13134e663343m06079k25542m4117J13579K41898L53030M61580N70965O73023P55739
13124c169267Q05858Q04438P29294N72053L53657J18161r0542k46177l40971l79272
13114h42768l74374l44215k99326k32780j28671J4778J71361K95710L46738L10980
13104a082567K12020R6143K505n6631r0188j07353j02912o0835L0633J68908L38171
13093f52106N15489O75641P92541Q41140Q05089O86019N05436K97619R7969o7825
$$ plain form
13083 4497012 4308339 4042594 3735177 3411145 3089266 2790873 2547092 2395157 2361867 2446234
13073 2446234 2616883 2826070 3026257 3175145 3232274 3162211 2948156 2600499 2147232 1616115
13063 1616115 1027296 399176 -243047 -863673 -1419029 -1866156 -2175754 -2342688 -2385830 -2335412
13053 -2335412 -2216105 -2038127 -1802286 -1511960 -1179221 -821263 -455051 -96867 236207
13044 236207 529616 780919 1006625 1234665 1485007 1754536 2016478 2230619 2356117 2361883
13034 2361883 2233468 1977071 1619754 1205587 789866 429475 165670 5152 -87088 -175700
13024 -175700 -328889 -591822 -973154 -1450329 -1986241 -2542788 -3084364 -3575194 -3974772 -4234663
13014 -4234663 -4304843 -4152484 -3779553 -3223446 -2541235 -1791182 -1022508 -273812 423333 1036891
$$ packed form
13083D497012j88673k65745l07417l24032l21879k98393k43781j51935l3290Q4367
13073B446234J70649K09187K00187J48888N7129p0063k14055l47657m53267n31117
13063A616115n88819o28120o42223o20626n55356m47127l09598j66934m3142N0418
13053b335412J19307J77978K35841K90326L32739L57958L66212L58184L33074
13044B36207K93409K51303K25706K28040K50342K69529K61942K14141J25498N766
13034B361883j28415k56397l57317m14167m15721l60391k63805j60518r2240q8612
13024a75700j53189k62933l81332m77175n35912n56547n41576m90830l99578k59891
13014d234663p0180J52359L72931N56107O82211P50053P68674P48696O97145O13558
$$ plain form
13004 1036891 1526506 1843383 1943884 1813430 1485295 1036670 559539 125341 -231222
12995 -231222 -501393 -680427 -756470 -717575 -566938 -331317 -56366 206458 413320 537068
12985 537068 572046 535546 463797 401514 389309 453759 601690 820105 1081649 1349779 1579185
12974 1579185 1717317 1716091 1552674 1245594 850382 432955 38401 -322024 -657700 -973155
12964 -973155 -1254136 -1477138 -1633707 -1749789 -1883483 -2098230 -2426107 -2845593 -3290274 -3682311
12954 -3682311 -3966158 -4122098 -4159108 -4099953 -3968816 -3783199 -3549437 -3264348 -2923797 -2531978
12944 -2531978 -2102832 -1653621 -1200208 -759084 -350067 6642 296474 512731 653039
12935 653039 714713 692039 574826 351323 18943 -404518 -879052 -1349530 -1758734 -2066927
$$ packed form
13004A036891M89615L16877J00501j30454l28135m48625m77131m34198l56563
12995b31222k70171j79034p6043L8895J50637K35621K74951K62824K06862J23748
12985E37068L4978l6500p1749o2283j2205O4450J47931K18415K61544K68130K29406
12974A579185J38132j226j63417l07080l95212m17427l94554l60425l35676l15455
12964i73155k80981k23002j56569j16082j33694k14747l27877m19486m44681l92037
12954c682311k83847j55940l7010N9155J31137J85617K33762K85089L40551L91819
12944b531978M29146M49211M53413M41124M09017L56709K89832K16257J40308
12935F53039O1674k2674j17213k23503l32380m23461m74534m70478m09204l08193
$$ plain form
12925 -2066927 -2269117 -2393009 -2475226 -2535920 -2572932 -2575720 -2541954 -2482389 -2412885 -2342431 -2266458
12914 -2266458 -2167662 -2022055 -1808098 -1515423 -1147674 -717357 -237607 281740 831941 1401167
12904 1401167 1971477 2517387 3007318 3408312 3691669 3838231 3843473 3719506 3490634 3185547
12894 3185547 2833002 2462253 2102825 1781779 1522186 1343213 1257624 1264682 1343914 1460470
12884 1460470 1582317 1691997 1781929 1846812 1887129 1914762 1947391 1997174 2068133 2163731 2292712
12873 2292712 2465027 2682786 2936282 3207939 3478486 3729856 3945073 4107931 4202790 4213502
12863 4213502 4123020 3917022 3591015 3154284 2625826 2025399 1367188 662841 -65843 -775115
12853 -775115 -1401949 -1881979 -2168833 -2243507 -2116089 -1826257 -1440762 -1042253 -710758 -504618
$$ packed form
12925b066927k02190j23892q2217o0694l7012k788L3766N9565O9504P0454P5973
12914b266458R8796J45607K13957K92675L67749M30317M79750N19347N50201N69226
12904A401167N70310N45910M89931M00994K83357J46562N242j23967k28872l05087
12894C185547l52545l70749l59428l21046k59593j78973q5589P058P9232J16556
12884A460470J21847J09680Q9932O4883M0317K7633L2629M9783P0959R5598J28981
12873B292712J72315K17759K53496K71657K70547K51370K15217J62858R4859J0712
12863D213502r0482k05998l26007m36731n28458o00427o58211p04347p28684p09272
12853g75115o26834m80030k86854p4674J27418K89832L85495L98509L31495K06140
$$ plain form
12843 -504618 -446854 -522758 -692316 -911471 -1147990 -1380752 -1584430 -1715667 -1717598 -1543918
12833 -1543918 -1186153 -685601 -125694 385944 736839 831155 616498 105633 -626986 -1478004
12823 -1478004 -2355174 -3197697 -3969649 -4641565 -5180499 -5555282 -5747817 -5759375 -5608891 -5327329
12813 -5327329 -4952980 -4526611 -4082522 -3639189 -3199071 -2759011 -2321531 -1897216 -1497193
12804 -1497193 -1122564 -759003 -381146 34535 496587 994554 1506396 2010498 2491184
12795 2491184 2932044 3307186 3586562 3753595 3816292 3801170 3737088 3642457 3523869 3384810
12785 3384810 3235317 3092730 2972507 2877641 2794632 2696325 2548220 2316643 1977733 1526070
12775 1526070 982012 391829 -187531 -714145 -1178267 -1598199 -1999883 -2393999 -2762732
$$ packed form
12843e04618N7764p5904j69558k19155k36519k32762k03678j31237j931J73680
12833a543918L57765N00552N59907N11638L50895R4316k14657n10865p32619q51018
12823a478004q77170q42523p71952o71916n38934l74783j92535j1558J50484K81562
12813e327329L74349M26369M44089M43333M40118M40060M37480M24315M00023
12804a497193L74629L63561L77857M15681M62052M97967N11842N04102M80686
12795B491184M40860L75142K79376J67033O2697j5122o4082r4631j18588j39059
12785C384810j49493j42587j20223r4866q3009r8307j48105k31577l38910m51663
12775A526070n44058n90183n79360n26614m64122m19932m01684l94116l68733
$$ plain form
12766 -2762732 -3064328 -3255235 -3315290 -3254631 -3097489 -2862700 -2561133 -2206111 -1819147 -1425102
12756 -1425102 -1046060 -699847 -398714 -147860 47591 167277 168777 3030 -356084 -889195
12746 -889195 -1529931 -2183252 -2752320 -3161606 -3370516 -3377487 -3213931 -2927886 -2565762 -2164983
12736 -2164983 -1758452 -1378357 -1050726 -785967 -576528 -406001 -262464 -143572 -50155 20429
12726 20429 72361 107221 127012 140877 165961 223257 335125 523436 804076 1180089 1638646
12715 1638646 2153101 2687947 3204684 3669470 4064524 4399327 4710232 5042185 5422024
12706 5422024 5840906 6254658 6598566 6809293 6845895 6701959 6405281 6007266 5565406 5123415
12696 5123415 4698557 4284304 3865459 3435526 3008181 2618209 2310580 2123849 2079046 2176894
$$ packed form
12766b762732l01596j90907o0055O0659J57142K34789L01567L55022L86964L94045
12756a425102L79042L46213L01133K50854J95451J19686J500j65747l59114n33111
12746h89195o40736o53321n69068m09286k08910o971J63556K86045L62124M00779
12736b164983M06531L80095L27631K64759K09439J70527J43537J18892R3417P0584
12726B0429N1932L4860J9791J3865K5084N7296J11868J88311K80640L76013M58557
12715A638646N14455N34846N16737M64786L95054L34803L10905L31953L79839
12706E422024M18882M13752L43908K10727L6602j43936k96678l98015m41860m41991
12696E123415m24858m14253m18845m29933m27345l89972l07629j86731m4803R7848
$$ plain form
12686 2176894 2396301 2693091 3008903 3293948 3529779 3732312 3930249 4137031 4340906
12677 4340906 4519719 4663452 4781584 4887957 4978416 5023711 4985487 4842633 4607520 4319403
12667 4319403 4019993 3729611 3440649 3131769 2790243 2423404 2052176 1696995 1368428
12658 1368428 1066641 788614 537654 326891 173306 87088 62883 76744 92538 79595
12648 79595 33258 -17403 -21576 71479 295739 662132 1159674 1761510 2432223 3130137 3804365
12637 3804365 4395897 4850606 5138651 5264875 5261896 5173012 5036991 4877938 4698757 4480611
12627 4480611 4190934 3796400 3274913 2623492 1860822 1024578 165373 -659998 -1393433
12618 -1393433 -1977658 -2360728 -2508933 -2424009 -2149805 -1756807 -1310881 -848099 -373307 120003
$$ packed form
12686B176894K19407K96790L15812K85045K35831K02533J97937K06782K03875
12677D340906J78813J43733J18132J06373R0459M5295l8224j42854k35113k88117
12667D319403k99410k90382k88962l08880l41526l66839l71228l55181l28567
12658A368428l01787k78027k50960k10763j53585q6218k4205J3861J5794j2943
12648G9595m6337n0661m173R3055K24260L66393M97542O01836O70713O97914O74228
12637C804365N91532M54709K88045J26224k979q8884j36021j59053j79181k18146
12627D480611k89677l94534n21487o51421p62670q36244q59205q25371p33435
12618a393433n84225l83070j48205Q4924K74204L92998M45926M62782M74792M93310
$$ plain form
12608 120003 627146 1125072 1584871 1991441 2352614 2691480 3029397 3370441 3695847 3973716
12598 3973716 4180845 4321906 4430327 4551890 4727828 4989147 5356257 5833843 6403321
12589 6403321 7021926 7630719 8167693 8582422 8848233 8968054 8972778 8911852 8835775 8776984
12579 8776984 8743652 8732503 8747530 8805750 8925933 9111931 9341199 9561181 9695763 9664831
12569 9664831 9412330 8929070 8258449 7483065 6697987 5983292 5390691 4947867 4670112
12560 4670112 4565937 4631057 4837595 5132055 5446867 5715004 5877071 5884615 5709558 5359269
12550 5359269 4883319 4358337 3854469 3405730 3005532 2627134 2249366 1868696 1495243
12541 1495243 1143393 826571 557349 349199 215381 162834 185002 261516 366863 480478
$$ packed form
12608A20003N07143M97926M59799M06570L61173L38866L37917L41044L25406K77869
12598C973716K07129J41061J08421J21563J75938K61319L67110M77586N69478
12589F403321O18605O08793N36974M14729K65811J19821M724o0926p6077n8791
12579H776984l3332j1149J5027N8220J20183J85998K29268K19982J34582l0932
12569I664831k52501m83260o70621p75384p85078p14695n92601m42824k77755
12560D670112j04175O5120K06538K94460L14812K68137J62067P544j75057l50289
12550E359269m75950n24982n03868m48739m00198l78398l77768l80670l73453
12541A495243l51850l16822k69222k08150j33818n2547K2168P6514J05347J13615
$$ plain form
12531 480478 589071 681043 742225 758960 723885 638394 512897 366244 220833 92515
$$ packed form
12531D80478J08593R1972O1182J6735l5075q5491j25497j46653j45411j28318
$$ [...]
##END NTUPLES=NMR SPECTRUM
##END=
