##TITLE=31P ikalashn
DE-75k_NaOH
20.11.2024
##JCAMPDX= 6.0         $$ Bruker NMR JCAMP-DX V2.0
##DATA TYPE= NMR SPECTRUM
##DATA CLASS= NTUPLES
##ORIGIN= UXNMR, Bruker Analytische Messtechnik GmbH
##OWNER= root
$$ TOPSPIN		Version 1.3
$$ 2024-11-20 16:01:18.109 +0400  Irina@DPX200
$$ Compression mode = diff/dup
##.OBSERVE FREQUENCY= 81.01967998063
##.OBSERVE NUCLEUS= ^31P
##.ACQUISITION MODE= SIMULTANEOUS
##.ACQUISITION SCHEME= undefined
##.AVERAGES= 32
##.DIGITISER RES= 17
##SPECTROMETER/DATA SYSTEM= spect
##.PULSE SEQUENCE= zgpg
##.SOLVENT NAME= CDCl3
##.SHIFT REFERENCE= INTERNAL, CDCl3, 1, 298.5841
##AUDIT TRAIL= $$ (NUMBER, WHEN, WHO, WHERE, WHAT)
$$ ##TITLE= Audit trail, TOPSPIN		Version 1.3
$$ ##JCAMPDX= 5.01
$$ ##ORIGIN= Bruker BioSpin GmbH
$$ ##OWNER= Irina
$$ $$ F:/spectra/data/iren/nmr/P31dec/1/pdata/1/auditp.txt
$$ ##AUDIT TRAIL=  $$ (NUMBER, WHEN, WHO, WHERE, VERSION, WHAT)
(   1,<2024-11-20 16:00:44.781 +0400>,<Irina>,<DPX200>,<TOPSPIN 1.3>,
      <created by zg
	started at 2024-11-20 15:59:49.375 +0400,
	POWCHK disabled, PULCHK disabled
       terminated by command 'halt'
       configuration hash MD5:
       BE 6D 3F 07 2A EA 11 49 91 17 2B D3 AF B3 58 0D
       data hash MD5: 32K
       DC F8 4B 8D B1 A0 2A 29 4A BE 0C 4D 1F 45 BD 10>)
(   2,<2024-11-20 16:00:46.375 +0400>,<Irina>,<DPX200>,<TOPSPIN 1.3>,
      <Start of raw data processing
       efp BC_mod = 2 LB = 8 FT_mod = 6 PKNL = 1 PHC0 = 178.3767 PHC1 = 129.5168 SI = 32K 
       data hash MD5: 32K
       61 56 D0 32 D0 BB F0 B3 48 5F 00 1A 78 36 4F 15>)
(   3,<2024-11-20 16:00:49.000 +0400>,<Irina>,<DPX200>,<TOPSPIN 1.3>,
      <apk 
       data hash MD5: 32K
       4A 7E 43 F1 87 E7 94 5F FA F5 68 E1 60 F9 8D 25>)
(   4,<2024-11-20 16:00:51.859 +0400>,<Irina>,<DPX200>,<TOPSPIN 1.3>,
      <abs n ABSG = 5 
       data hash MD5: 32K
       C9 9D C9 CE 40 0F D1 A7 BA E4 AD 97 0B DA 6C B3>)
$$ ##END=
$$ 
$$ $$ hash MD5
$$ $$ 32 FD 0D 14 23 5F 5F 7F EB 07 59 B4 CB BA 9F B4
##$RELAX= 
##$RELAX= 
##$RELAX= 
##$RELAX= 
##$RELAX= 
##$RELAX= 
##$RELAX= 
##$RELAX= 
##$RELAX= 
##$RELAX= 
##$RELAX= 
$$ Bruker specific parameters
$$ --------------------------
##$DU= <F:/spectra>
##$EXPNO= 1
##$NAME= <P31dec>
##$PROCNO= 1
##$TYPE= <nmr>
##$USER= <iren>
##$AMP= (0..31)
100 100 100 100 100 100 100 100 100 100 100 100 100 100 100 100 100 100 
100 100 100 100 100 100 100 100 100 100 100 100 100 100 
##$ANAVPT= -1
##$AQSEQ= 0
##$AQ_mod= 1
##$AUNM= <au_zg>
##$AUTOPOS= <>
##$BF1= 81.014009
##$BF2= 200.13
##$BF3= 200.13
##$BF4= 200.13
##$BF5= 200.13
##$BF6= 200.13
##$BF7= 200.13
##$BF8= 200.13
##$BYTORDA= 1
##$CFDGTYP= 0
##$CFRGTYP= 5
##$CHEMSTR= <none>
##$CNST= (0..63)
1 1 145 1 1 1 1 1 1 1 1 1 1 1 1 1 1 1 1 1 1 1 1 1 1 1 1 1 1 1 1 1 1 1 
1 1 1 1 1 1 1 1 1 1 1 1 1 1 1 1 1 1 1 1 1 1 1 1 1 1 1 1 1 1 
##$CPDPRG= <waltz16>
##$CPDPRG1= <>
##$CPDPRG2= <waltz16>
##$CPDPRG3= <>
##$CPDPRG4= <mlev>
##$CPDPRG5= <mlev>
##$CPDPRG6= <mlev>
##$CPDPRG7= <mlev>
##$CPDPRG8= <mlev>
##$CPDPRGB= <>
##$CPDPRGT= <>
$$ [...]
##$SW_h= 37037.037037037
##$TD= 32768
##$TD0= 1
##$TE= 300
##$TE2= 300
##$TE3= 300
##$TEG= 300
##$TL= (0..7)
0 120 53 12 22 120 120 120 
##$TP= (0..7)
150 150 150 150 150 150 150 150 
##$TP07= 0
##$TPNAME0= <>
##$TPNAME1= <>
##$TPNAME2= <>
##$TPNAME3= <>
##$TPNAME4= <>
##$TPNAME5= <>
##$TPNAME6= <>
##$TPNAME7= <>
##$TPOAL= (0..7)
0.5 0.5 0.5 0.5 0.5 0.5 0.5 0.5 
##$TPOFFS= (0..7)
0 0 0 0 0 0 0 0 
##$TUNHIN= 0
##$TUNHOUT= 0
##$TUNXOUT= 0
##$USERA1= <user>
##$USERA2= <user>
##$USERA3= <user>
##$USERA4= <user>
##$USERA5= <user>
##$V9= 5
##$VALIST= <valist>
##$VCLIST= <CCCCCCCCCCCCCCC>
##$VD= 0
##$VDLIST= <DDDDDDDDDDDDDDD>
##$VPLIST= <PPPPPPPPPPPPPPP>
##$VTLIST= <TTTTTTTTTTTTTTT>
##$WBST= 1024
##$WBSW= 4
##$XGAIN= (0..3)
0 0 0 0 
##$XL= 0
##$YL= 0
##$YMAX_a= 973
##$YMIN_a= -4673
##$ZGOPTNS= <>
##$ZL1= 120
##$ZL2= 120
##$ZL3= 120
##$ZL4= 120
##$ABSF1= 298.5841
##$ABSF2= -158.5842
##$ABSG= 5
##$ABSL= 5
##$ALPHA= 0
##$AQORDER= 0
##$ASSFAC= 0
##$ASSFACI= 0
##$ASSFACX= 0
##$ASSWID= 0
##$AUNMP= <proc_1d>
##$AXLEFT= 0
##$AXRIGHT= 0
##$AXTYPE= 0
##$AXUNIT= <>
##$AZFE= 0.1
##$AZFW= 0.5
##$BCFW= 0
##$BC_mod= 2
##$BYTORDP= 0
##$COROFFS= 0
##$CY= 12.5935478210449
##$DATMOD= 1
##$DC= 0
##$DFILT= <>
##$DTYPP= 0
##$F1P= 47.1127640792319
##$F2P= -24.0371245302204
##$FCOR= 0.5
##$FTSIZE= 32768
##$FT_mod= 6
##$GAMMA= 0
##$GB= 0
##$INTBC= 1
##$INTSCL= 7.269226e-011
##$ISEN= 30
##$LB= 8
##$LEV0= 0
##$LPBIN= 0
##$MAXI= 12.09355
##$MC2= 0
##$MEAN= 0
##$ME_mod= 0
##$MI= 0.7550151
##$NCOEF= 0
##$NC_proc= -12
##$NLEV= 6
##$NOISF1= 298.5841
##$NOISF2= 270.0111
##$NSP= 0
##$NTH_PI= 0
##$NZP= 0
##$OFFSET= 298.5841
##$PC= 1.4
##$PHC0= 146.9548
##$PHC1= 148.1423
##$PH_mod= 1
##$PKNL= yes
##$PPARMOD= 0
##$PPDIAG= 0
##$PPIPTYP= 0
##$PPMPNUM= 100
##$PPRESOL= 1
##$PSCAL= 0
##$PSIGN= 0
##$REVERSE= no
##$SF= 81.014009
##$SI= 32768
##$SIGF1= 270.0111
##$SIGF2= -158.5842
##$SINO= 77.54984
##$SIOLD= 32768
##$SREGLST= <31P.CDCl3>
##$SSB= 0
##$STSI= 32768
##$STSR= 0
##$SW_p= 37037.037037037
##$SYMM= 0
##$S_DEV= 0
##$TDeff= 32768
##$TDoff= 0
##$TI= <>
##$TILT= no
##$TM1= 0
##$TM2= 0
##$TOPLEV= 0
##$USERP1= <user>
##$USERP2= <user>
##$USERP3= <user>
##$USERP4= <user>
##$USERP5= <user>
##$WDW= 1
##$XDIM= 32768
##$YMAX_p= 307980232
##$YMIN_p= -15390782
$$ End of Bruker specific parameters
$$ ---------------------------------
##NTUPLES= NMR SPECTRUM
##VAR_NAME=  FREQUENCY,     SPECTRUM/REAL,   SPECTRUM/IMAG
##SYMBOL=    X,             R,               I
##VAR_TYPE=  INDEPENDENT,   DEPENDENT,       DEPENDENT
##VAR_FORM=  AFFN,          ASDF,            ASDF
##VAR_DIM=   32768,         32768,           32768
##UNITS=     HZ,            ARBITRARY UNITS, ARBITRARY UNITS
##FACTOR=    1.13031516577767, 1,            1
##FIRST=     37037.037037037, -5026836,      3805787
##LAST=      0,             -2191565,        988994
##MIN=       0,             -15390782,       0
##MAX=       37037.037037037, 307980232,     0
$$ Real data points
##PAGE= N=1
##DATA TABLE= (X++(R..R)), XYDATA
$$ [...]
16812C81372r41691r32773r64709q81489o55242l80830j89642j19467k1302J35090
16802d570683J81785M2411j09192K8888L79852N37461L37745m2011l82287n47283
16792d143314m40845j61724Q4698K77249M46910M43580J98288j61838l94464l73001
16782d224461k45280j59621j49966k40642l56241k64424J48056O44473Q55051
16773c993055O81399L00642m3637k92403m80019n14313l45397k2076M55648R35869
16763c317342J125889J016519Q47211P55725O71177L75604j69651o72234q21801
16754a88903o09524k64284j3091J07437J75064J63417n9193m11504n79176l93967
16744b073724m6497K15744L49242L73439K71587Q7664j3261p043K231J62257M97717
$$ y = [381372, -560319, -1493092, -2457801, -3339290, -3994532, -4375362, -4565004, -4684471, -4705773, -4570683, -4388898, -4346487, -4455679, -4426791, -4046939, -3509478, -3171733, -3213744, -3596031, -4143314, -4584159, -4745883, -4661185, -4383936, -3937026, -3493446, -3295158, -3456996, -3851460, -4224461, -4469741, -4629362, -4779328, -5019970, -5376211, -5640635, -5492579, -4848106, -3993055, -3311656, -3011014, -3054651, -3347054, -3827073, -4341386, -4686783, -4708859, -4253211, -3317342, -2191453, -1174934, -327723, 428002, 1099179, 1474783, 1305132, 632898, -188903, -798427, -1062711, -1075802, -968365, -793301, -629884, -689077, -1100581, -1679757, -2073724, -2120221, -1904477, -1555235, -1181796, -910209, -822545, -835806, -842849, -840618, -678361, -180644]
16733a80644N39284K3340o43378r38778q43105n40443l7696N63569J002505J016996
16723c8350N87003J19495j62850l70430m54036k85588L8657K36518J09576k01804
16713d21809l83747l76692l38659k40812J16023N96479Q62236Q63169N97588O4305
16703A338081m91063q01426q18350p12963o27398m22868l5582K96726L08631L1589
16693a934623k12996k75996k72652k37410j44414o0573N5457L17232O70375R46402
16683a149198J124606J325956J338797Q11110L3241m01927l77337k10180j12982
16674B382086j09086j73214j79807j21960j40949k54765l71215l55803j77035
16665D98252j09873k45700l45603l39057k64862j02281Q6741J48108N4423o7104
$$ y = [-180644, 358640, 381980, -261398, -1200176, -2043281, -2583724, -2621420, -2057851, -1055346, -38350, 548653, 668148, 505298, 134868, -319168, -604756, -566099, -329581, -220005, -421809, -805556, -1182248, -1520907, -1761719, -1645696, -1049217, -186981, 676188, 1273776, 1338081, 847018, 45592, -772758, -1485721, -2113119, -2535987, -2571569, -2274843, -1966212, -1934623, -2147619, -2423615, -2696267, -2933677, -3078091, -3138664, -3083207, -2765975, -2095600, -1149198, -24592, 1301364, 2640161, 3451271, 3484512, 3082585, 2705248, 2495068, 2382086, 2273000, 2099786, 1919979, 1798019, 1657070, 1402305, 1031090, 675287, 498252, 388379, 142679, -202924, -541981, -806843, -909124, -822383, -674275, -619852, -686956]
16655f86956o0298K7058J08338J83451J30348o5244k12443k26367j97613j46362
16645a146088L625L13310P45701J012298P36049q9313r57397j317261j059565
16636a758641m92898n5132Q1040J2778j67278l07412k38514q1628l9071j35015
16626c181771k97681l98954l12565p0843K11709M61988N78080M46297J65119r429
16616b408050p407J23168M13610Q01067J053503J051978R12547P35315N35942
16607C211673K43428l31151j128103j598865j394277q53010l82783j1971L86278
16598a858781P74584Q69900O11319K63479J9320k48379o47932q96269q24446p00020
16588b637225o35110m05692P463L77500N71905N27737K81318O8329L1537J92908
$$ y = [-686956, -747254, -720196, -611858, -428407, -298059, -363303, -575746, -802113, -999726, -1146088, -1142463, -829153, -83452, 928846, 1664895, 1575582, 618185, -699076, -1758641, -2251539, -2306671, -2225631, -2212853, -2380131, -2687543, -2926057, -3007685, -3046756, -3181771, -3479452, -3878406, -4190971, -4261814, -4050105, -3588117, -3010037, -2563740, -2398621, -2408050, -2415457, -2292289, -1878679, -1077612, -24109, 1027869, 1940416, 2675731, 3211673, 3455101, 3123950, 1995847, 396982, -997295, -1850305, -2233088, -2245059, -1858781, -1084197, -214297, 397022, 660501, 679821, 431442, -216490, -1112759, -1937205, -2637225, -3272335, -3678027, -3670564, -3293064, -2721159, -2193422, -1912104, -1843775, -1812238, -1619330]
16578a619330M78699O06867M51113L10862L51979M15635L31839R1906k46639o23999
16568E48932p43937m61949p4597J42341J35418p5482l26825l58322k06815j35774
16558a557010k93585o09477q34986p87884n72409m63793m73257k99985J5142J54523
16548e722721j6956m22959p23447m42196M26823J331635J816167J816917J477660
16539d59077R38618L19883k10678m51714l47321j69089k5876K69240O06866P12634
16529A183486O04045L75455n3451o48059j119921j245876j105079r24987q70845
16520c805232j033512j415583j785433j781480j192284k26701N89439R01439P55844
16511h993503M38652K69092L76187O83710J088393J379865J319376R53053M47899
$$ y = [-1619330, -1140631, -533764, -82651, 228211, 580190, 995825, 1327664, 1419570, 1172931, 548932, -195005, -656954, -731551, -589210, -453792, -529274, -856099, -1214421, -1421236, -1557010, -1850595, -2460072, -3295058, -4082942, -4655351, -5119144, -5592401, -5892386, -5877244, -5722721, -5739677, -6162636, -6886083, -7328279, -6901456, -5569821, -3753654, -1936737, -459077, 479541, 799424, 588746, 137032, -210289, -379378, -405254, -136014, 470852, 1183486, 1787531, 2162986, 2109535, 1461476, 341555, -904321, -2009400, -2934387, -3805232, -4838744, -6254327, -8039760, -9821240, -11013524, -11240225, -10650786, -9749347, -8993503, -8554851, -8285759, -7909572, -7225862, -6137469, -4757604, -3438228, -2485175, -2037276]
16502b037276l0667l98022o23728o96218o37927m62289k31208l8023P0981J89912
16492d894465N01641R74201J356520J545816J594098J441968J035649N19328J48007
16483D222763O1869J04549R4545O0993Q007j91413n28150p71870o86628l47358
16473B027307n4548N2353l1360j43574j24649j08219k77958p31930j281534j597291
16463b271403j739931j909612j955133j472547n68702J76619O51021J027764J208623
16454f853301J064177Q54332R39047J323295J669752J626409J226084Q02349N04297
16445C156441J76252k42267o23105q57751q55643o20003l20069j08219P9738K84115
16435F9489L11884K9602m48491q28969r13282q48587p45767n18074j99117P5878
$$ y = [-2037276, -2067943, -2465965, -3089693, -3785911, -4423838, -4886127, -5117335, -5155358, -5084377, -4894465, -4392824, -3418623, -2062103, -516287, 1077811, 2519779, 3555428, 4074756, 4222763, 4284632, 4389181, 4483726, 4544719, 4552726, 4361313, 3833163, 3061293, 2374665, 2027307, 1972759, 2025112, 1993752, 1850178, 1725529, 1617310, 1339352, 607422, -674112, -2271403, -4011334, -5920946, -7876079, -9348626, -9917328, -9740709, -9089688, -8061924, -6853301, -5789124, -4934792, -3995745, -2672450, -1002698, 623711, 1849795, 2652144, 3156441, 3332693, 3090426, 2467321, 1609570, 753927, 133924, -186145, -294364, -214626, 69489, 381373, 410975, -37516, -866485, -1779767, -2628354, -3374121, -3892195, -4091312, -4015434]
16425d015434J00632j43023k76006k0162M27566O26806L97202J03272K31320Q52944
16415a714883J565922J757648J274286M44886l12122o09980l66508J06462L56025
16406B501736J87184j98952l94067k54238J3626J42041M2054j48311l47332o27711
16396I16030j046446j383145j250323p32460k87656j04632j56778l46689o33283
16387e025382j206321j987529k471551k162211q94695P35106J696820J720832
16379i594931J372736J163146J166491J327934J629600J961257K186602K028463
16371C241298J390274N68253k14940q19439j027008q34252m63034j13027P716
16362A735841k50172o08777n91826k73751j75134l88259n52920n59212n42157
$$ y = [-4015434, -3914802, -4057825, -4333831, -4353993, -3926427, -3299621, -2902419, -2799147, -2567827, -1714883, -148961, 1608687, 2882973, 3327859, 3015737, 2405757, 2039249, 2145711, 2501736, 2688920, 2489968, 2095901, 1841663, 1855289, 1997330, 2039384, 1891073, 1543741, 916030, -130416, -1513561, -2763884, -3496344, -3784000, -3888632, -4045410, -4392099, -5025382, -6231703, -8219232, -10690783, -12852994, -13747689, -13012583, -11315763, -9594931, -8222195, -7059049, -5892558, -4564624, -2935024, -973767, 1212835, 3241298, 4631572, 5199825, 4984885, 4165446, 3138438, 2304186, 1841152, 1728125, 1735841, 1485669, 876892, 285066, 11315, -163819, -552078, -1104998, -1664210, -2206367]
16353b206367l78460J81420J085056J738156J719655J415369J246408J136273
16345E937510R15853N19745N0067k81849m97163p21892r66674j093332q75999
16336B986266l57739J74256M84588N21683M00554L62659N32745O55628L74604
16327F135244k83402q68731j084348j126144j316012j539567j370651p40110q9768
16318b283489K61366M48259O60005Q87303R32919O56149J49237n90093j743108
16309f21452l239951m492742m328974k408853k98810P61206R98396R63163Q22926
16300a1845091O17781M84018M55547L97892K65213J82295K64162N12800P52320
16291g913063Q26691P78408O80763N08985K72658j6383l62239o73012p55618o01177
$$ y = [-2206367, -2584827, -2403407, -1318351, 419805, 2139460, 3554829, 4801237, 5937510, 6853363, 7373108, 7423175, 7141326, 6644163, 5922271, 4955597, 3862265, 2986266, 2628527, 2802783, 3287371, 3809054, 4209608, 4572267, 5105012, 5760640, 6135244, 5851842, 4983111, 3898763, 2772619, 1456607, -82960, -1453611, -2193721, -2283489, -2022123, -1573864, -913859, -26556, 906363, 1562512, 1711749, 1121656, -621452, -3861403, -8354145, -12683119, -15091972, -15390782, -14629576, -13631180, -12668017, -11845091, -11227310, -10743292, -10287745, -9889853, -9624640, -9442345, -9178183, -8665383, -7913063, -7086372, -6307964, -5627201, -5118216, -4845558, -4861941, -5224180, -5897192, -6652810, -7253987]
16281g253987m34407l81150k89022N862L65061N07663L32633M9419q042K17080
16271f888890M94338O57233O83651N80230L77091K26132K17196L13757M35396
16262b903866M50565K84663l0830l38040n48504p00108p67735p46742o56577l00547
16252f257721L98193J150529J537647J448097J235891J085179P09028L0793n03226
16243H34410o02079n29100o57028r52210j167514j205719j121463r75187q70456
16234g246346r19985r31278n77042J32901R45185J557735J729490J569645J295696
16225b443999Q73948L15432k06960n12845m71970j66433J22264K01337K08153
16216b081073L48744N01110M09636M5384m21305p81265q11823m92906k2064M57305
$$ y = [-7253987, -7688394, -8069544, -8358566, -8352704, -7987643, -7479980, -7147347, -7097928, -7105970, -6888890, -6394552, -5737319, -5053668, -4473438, -4096347, -3870215, -3653019, -3339262, -2903866, -2453301, -2168638, -2199468, -2537508, -3086012, -3786120, -4553855, -5300597, -5957174, -6257721, -5859528, -4708999, -3171352, -1723255, -487364, 597815, 1306843, 1337636, 834410, 232331, -296769, -953797, -1906007, -3073521, -4279240, -5400703, -6375890, -7246346, -8166331, -9097609, -9674651, -9541750, -8596565, -7038830, -5309340, -3739695, -2443999, -1570051, -1254619, -1461579, -1974424, -2446394, -2612827, -2490563, -2289226, -2081073, -1732329, -1231219, -821583, -776199, -1197504, -1978769, -2790592, -3283498, -3305562, -2848257]
16206b848257Q99043J124720R20885M54581J95315L00474M84946M81555L28078
16197B341340J95689J16535o9733m10799n68501k53479L31554Q07069R09883N58307
16187C957865o1531o81415j144231j276460j021603o51312m22010j91846J75529
16178a317014M42054L74611J8795m38319p66114p58009n29943l57145k48838j42173
16168c722095p4920l4885J24237M81498Q49363R75700P67773L50944n4469j95769
16158e32623j22416j56833l16191l30726p0947K42621L80391M04556M80539N71997
16148E50368N44302N00588N38864L80066j85293q28632j047275p00240j26741
16139c73993K61364M26289N10525M12826O0492l52417o77950r55539j200157j278272
$$ y = [-2848257, -1949214, -824494, 96391, 550972, 746287, 1046761, 1531707, 2013262, 2341340, 2537029, 2653564, 2583831, 2173032, 1604531, 1351052, 1682606, 2489675, 3399558, 3957865, 3896334, 3214919, 2070688, 794228, -227375, -878687, -1300697, -1492543, -1317014, -874960, -500349, -481554, -919873, -1685987, -2443996, -2973939, -3331084, -3579922, -3722095, -3797015, -3831900, -3707663, -3226165, -2376802, -1401102, -633329, -282385, -336854, -532623, -655039, -811872, -1128063, -1458789, -1529736, -1287115, -906724, -502168, -21629, 550368, 1094670, 1595258, 2134122, 2514188, 2328895, 1500263, 452988, -247252, -373993, -112629, 313660, 824185, 1237011, 1297503, 945086, 267136, -688403, -1888560, -3166832]
16129c166832j086653o59515k35765p7511j47138j87218L5618L86246N83177N88663
16119c966928N62280O32791P26403O81368M75909L64529L96803K52563j85078
16110e9360o17844p69584o88945n01567k76090k3707K55305M87794O56436P92278
16100g45284Q34593O68548L05548k0175o3197J51258M27626N17432L06682j03653
16090B279378n55652p81064n77845j48865J03078O1577j06360l08772m84949n56724
16080a076198n34113l58402o1822J40428K06222K22331K59272L64143M87548O02659
16070B52068P46187P66548M93387L7075m56237r40756j239312j205654r28943
16061b475637n31697j07647K83111N62931O63115N76182M26192M86562Q45027
$$ y = [-3166832, -4253485, -4913000, -5148765, -5226276, -5373414, -5560632, -5525014, -5138768, -4555591, -3966928, -3404648, -2771857, -2045454, -1364086, -888177, -523648, -126845, 125718, -59360, -677204, -1446788, -2135733, -2637300, -2913390, -2937097, -2681792, -2193998, -1537562, -745284, 89309, 757857, 1063405, 1043230, 980033, 1131291, 1558917, 2076349, 2383031, 2279378, 1723726, 942662, 364817, 215952, 319030, 380607, 274247, -34525, -519474, -1076198, -1610311, -1968713, -2030535, -1890107, -1683885, -1461554, -1202282, -838139, -350591, 252068, 998255, 1764803, 2258190, 2295265, 1839028, 898272, -341040, -1546694, -2475637, -3007334, -3114981, -2831870, -2268939, -1605824, -1029642, -603450, -116888, 728139]
16052G28139J296433J563038J466729J047607M24530j51245l82868k83291j05169
16043E603903q0447k10158l17979l35974l45798m71166o65712o27140k50280O0080
16033B359329j01398n86260q46446o46405k63930j994J44685K28960J22783k14192
16023A95132n37274n34889j70031K45464L37535J0260n87896j172307j445439
16014c659445j240616n32800N07856J417945J758143J495695R10666K29638m10766
16005D76316p10835l49476N32880J339068J459136Q29807L4721l81728m01357
15996B828532l04530k42670k05848j24816n452N3324k2550j13265n3747L474j43984
15985A668468l31816k72301J7161L51576N28197M62166L60396K76553O9062k11141
$$ y = [728139, 2024572, 3587610, 5054339, 6101946, 6526476, 6375231, 5992363, 5709072, 5603903, 5523456, 5313298, 4995319, 4659345, 4313547, 3842381, 3176669, 2549529, 2299249, 2359329, 2257931, 1671671, 825225, 178820, -85110, -87104, 57581, 286541, 409324, 195132, -342142, -877031, -1047062, -801598, -464063, -453803, -1041699, -2214006, -3659445, -4900061, -5432861, -4925005, -3507060, -1748917, -253222, 657444, 887082, 476316, -234519, -583995, -51115, 1287953, 2747089, 3576896, 3611617, 3229889, 2828532, 2524002, 2281332, 2075484, 1950668, 1945216, 1998540, 1975990, 1862725, 1808978, 1812452, 1668468, 1336652, 1064351, 1081512, 1433088, 1961285, 2423451, 2783847, 3060400, 3129462, 2918321]
15975B918321m62444o73626q19696p92486n61557l71856m54275o48533p25460
15966b591612n98674k16295K51002N04047L96172M6711k43269k77066p3991L39935
15956b463040Q43168J049865P56145J14615n04178p51128o50126n24957m82423
15947b612059l02865J6719L47869N73646N50001K65575r6772l59140n22390n99041
15937b738457n30879k74001Q2585L28147L85009L48368K35217P0728J8750J46019
15927a928514L03149L64850L16375J78447K9704Q68J04730J78352Q1608p8069
15917d48500O953L21271M25887P0060m43693o91763n46513k73291k23711l94846
15907b198146n55261n01976k12534M0547P6439J27558L33884N11535M91584M15550
$$ y = [2918321, 2455877, 1782251, 962555, 170069, -391488, -763344, -1217619, -1866152, -2591612, -3190286, -3406581, -3155579, -2651532, -2255360, -2208649, -2451918, -2728984, -2802975, -2463040, -1619872, -570007, 186138, 300753, -203425, -954553, -1604679, -2129636, -2612059, -2914924, -2898205, -2550336, -1976690, -1426689, -1161114, -1257886, -1617026, -2139416, -2738457, -3269336, -3543337, -3460752, -3132605, -2747596, -2399228, -2164011, -2093283, -2074533, -1928514, -1625365, -1260515, -944140, -765693, -735989, -735121, -630391, -452039, -370431, -448500, -441547, -120276, 305611, 375671, -68022, -759785, -1306298, -1579589, -1803300, -2198146, -2753407, -3255383, -3467917, -3427370, -3350931, -3223373, -2889489, -2377954, -1886370, -1470820]
15897a470820N40553P08541N37582J56059K073J80176N37520Q71325R61176P91618
15887C815803O70697P03459O55514L67508r7985o14544j066194j323546j346587
15878A764125j272288j165584r86078q60864q37266p31491m14057j8993L14870
15869d207626N50309O51443O84751Q50978J179572J378584J173370O25176K5032
15860B911589l47935m94572n11137l65303k7564M41537Q33523Q67636M94804L3592
15850C836170j81351j59453k3928J88156M02139M89844M24081K83363R2079k09838
15840E141262o05099q54652p40888l20027J27600L68562L51309J61930P4575L08903
15830D013475O53766O85274L93458R8102j35527l94430o31964p91368q94032q97393
$$ y = [-1470820, -930267, -221726, 315856, 471915, 473988, 654164, 1191684, 2063009, 3024185, 3815803, 4486500, 5189959, 5845473, 6212981, 6114996, 5500452, 4434258, 3110712, 1764125, 491837, -673747, -1659825, -2520689, -3357955, -4089446, -4503503, -4522496, -4207626, -3657317, -3005874, -2321123, -1470145, -290573, 1088011, 2261381, 2886557, 2911589, 2563654, 2069082, 1557945, 1192642, 1165078, 1606615, 2440138, 3307774, 3802578, 3836170, 3654819, 3495366, 3471438, 3659594, 4061733, 4551577, 4975658, 5259021, 5351100, 5141262, 4536163, 3681511, 2940623, 2620596, 2748196, 3116758, 3468067, 3629997, 3704572, 4013475, 4667241, 5352515, 5745973, 5844075, 5708548, 5314118, 4682154, 3890786, 2996754, 2099361]
15820B099361o78162k30132K20710L77520J99726r3995k18114o8212J43212K06781
15810A958695O6950j72912l03049k76668j71255m7982O9262K18729L67197L62437
15800B071404K17818J92407L85258N63306M94715J89942k82776r23674j562815
15791A345585j843570j566797r26372l46919r353J63774L06427M67479M29102
15782a980644J11845k10488l41897m07888m74435m21737k01712K10749P63039
15773b953168J201632J212631P92666K62740j30209l65752n26022o49040o25614
15764a780136m16897j86753j06244l02260q21232j322808j278498o70064L6827
15755f848065M15555L98044K32478J57101J24204L9584o3650k97879p17708j016476
$$ y = [2099361, 1421199, 1191067, 1411777, 1789297, 1989023, 1895028, 1676914, 1608702, 1751914, 1958695, 2025645, 1852733, 1549684, 1273016, 1101761, 1053779, 1123041, 1341770, 1708967, 2071404, 2289222, 2481629, 2866887, 3430193, 3924908, 4114850, 3832074, 2908400, 1345585, -497985, -2064782, -2991154, -3338073, -3347426, -3183652, -2877225, -2409746, -1980644, -1868799, -2079287, -2421184, -2829072, -3303507, -3725244, -3926956, -3716207, -2953168, -1751536, -538905, 253761, 516501, 386292, 20540, -505482, -1154522, -1780136, -2197033, -2383786, -2490030, -2792290, -3613522, -4936330, -6214828, -6884892, -6848065, -6432510, -6034466, -5801988, -5644887, -5520683, -5481099, -5544749, -5842628, -6560336, -7576812]
15745g576812q71211l26115L29280Q30745R29993N79874K28897K97502O31317
15736d946530Q65258Q12471M96916K09876K09281L39157L07719J37286K577j99190
15726a765179o02080r75891j044366q92105o90720l40063K15784Q49731J437487
15717c807402J722984J402393O37071l9693l43871l89677l55949l32522l77887
15708a884553m54802l92783j71521J55203N63234Q85016R93824R13009P18149
15699A324776M97732K64357R869k39996m87624p00736p39655n18716j62024K39193
15689e12824O22765P49597N57968L40355L03134M14002N71961N80186L53342K27428
15679D207914M64904P60810Q15755O23318J33619n83381j229788j541008j404396
$$ y = [-7576812, -8448023, -8774138, -8444858, -7614113, -6684120, -6104246, -5875349, -5577847, -4946530, -4081272, -3268801, -2771885, -2562009, -2352728, -2013571, -1705852, -1568566, -1565989, -1765179, -2367259, -3343150, -4387516, -5279621, -5970341, -6310404, -6094620, -5244889, -3807402, -2084418, -682025, -44954, -84647, -428518, -818195, -1174144, -1506666, -1884553, -2339355, -2732138, -2903659, -2748456, -2185222, -1300206, -306382, 606627, 1324776, 1822508, 2086865, 2096734, 1856738, 1369114, 668378, -71277, -589993, -752017, -512824, 109941, 859538, 1417506, 1757861, 2060995, 2474997, 3046958, 3627144, 3980486, 4207914, 4672818, 5433628, 6249383, 6872701, 7006320, 6422939, 5193151, 3652143, 2247747]
15670B247747r16804m35616k63128l48703n08296o24586p09212p95835p34283
15661c088716l21618L50827Q51235R81303J057745J456047K017331K244083J987562
15652G535799J417558O53615j55439p84442j123368j243532j241823j061938p92982
15643C203448o31692n52452m85666l91917k19015n3507k1061j28293k03296j6218
15633E00331L31289M85130M06162K96621J43443j29809l96717n03991m05636k00500
15623E26323j29935k66906l98322l95901m19753n30091o76787q66292r47466o60635
15613d765765l1066O79750J207599J379766J152629O72317K27190O6936J65192
15604G54548K35322J67725J12496J75318K84969L31656K36402R0008J20358K82268
$$ y = [2247747, 1330943, 895327, 632199, 283496, -224800, -849386, -1558598, -2354433, -3088716, -3410334, -3059507, -2208272, -1226969, -169224, 1286823, 3304154, 5548237, 7535799, 8953357, 9606972, 9451533, 8667091, 7543723, 6300191, 5058368, 3996430, 3203448, 2571756, 2019304, 1533638, 1141721, 922706, 869199, 848138, 719845, 516549, 500331, 831620, 1316750, 1722912, 2019533, 2162976, 2033167, 1636450, 1132459, 726823, 526323, 396388, 129482, -268840, -664741, -1084494, -1614585, -2291372, -3157664, -4105130, -4765765, -4796831, -4117081, -2909482, -1529716, -377087, 295230, 522420, 589356, 754548, 989870, 1157595, 1270091, 1445409, 1730378, 2062034, 2298436, 2388444, 2508802, 2791070]
15594B791070M22490N22130L92769j22660p40052j117417j252745j291334j345351
15585a741100j364930j236816r85825o55025k92772j4910J92495M36250P06878
15576d955755R28808J153911J324617J185965P37575K03943k61262n34974n93095
15567h10267n25709l95815k42879o5537R6049J77399J80159J40822J75030K64583
15557a006165K82210L31158N24054P50561R14587R77113Q73730O48213L70304
15548D665765N2953j80499k06088k70167o24668j001359j040611p25093k84596
15539C85637o611k7870k11310l31877k86295o4849J88676L06725L07235K56005
15529E15466R4906k12533n31170p00400p03358o80378o52659n29953l10488K1458
$$ y = [2791070, 3213560, 3735690, 4128459, 4005799, 3265747, 2148330, 895585, -395749, -1741100, -3106030, -4342846, -5328671, -5983696, -6276468, -6291378, -6098883, -5662633, -4955755, -4026947, -2873036, -1548419, -362454, 375121, 579064, 317802, -217172, -810267, -1335976, -1731791, -1974670, -2040207, -1944158, -1766759, -1586600, -1445778, -1270748, -1006165, -723955, -392797, 131257, 881818, 1796405, 2773518, 3647248, 4295461, 4665765, 4718718, 4538219, 4332131, 4061964, 3437296, 2435937, 1395326, 670233, 385637, 379026, 351156, 139846, -192031, -478326, -543175, -354499, -47774, 259461, 515466, 610372, 397839, -133331, -833731, -1537089, -2217467, -2870126, -3400079, -3710567, -3689109]
15519c689109N33344J119006J414066J278674J025213R74137J122327J140799
15511D918457O73623j71724r18593j235878j200391j066507q50561m94435o4783
15502d10792L87687P67511R51119R32832Q90986R58450J083872J008866N58818
15493G129349j01335o57358q79359q06301o63811n60247n06410n03328m45224
15484B005976j60228M05639J046619J419806J410911J136490O61397P1844n50910
15475G447544j133094j430401j268489q13556l72165r6303R20n2872o7216J09234
15465B323602L24079M11895M37710N05883O28742Q11799J035089J109222R09989
15456H498010O58047N00119K35022k22836o59393p99861o89606o51347o78388
$$ y = [-3689109, -3155765, -2036759, -622693, 655981, 1681194, 2655331, 3777658, 4918457, 5592080, 5420356, 4501763, 3265885, 2065494, 998987, 148426, -346009, -410792, -23105, 744406, 1695525, 2628357, 3519343, 4477793, 5561665, 6570531, 7129349, 7028014, 6370656, 5491297, 4684996, 4021185, 3460938, 2954528, 2451200, 2005976, 1845748, 2251387, 3298006, 4717812, 6128723, 7265213, 7926610, 7998454, 7447544, 6314450, 4884049, 3615560, 2802004, 2429839, 2333536, 2334456, 2281584, 2214368, 2323602, 2647681, 3059576, 3497286, 4003169, 4631911, 5443710, 6478799, 7588021, 8498010, 9156057, 9656176, 9891198, 9668362, 9008969, 8209108, 7519502, 6868155, 6189767]
15447F189767m73587M262L67922J22708n54791q85920o34888k94057j99283k07791
15437C434342p0353J87140L58193L80170K62211P0615j11008k97902m64571o34274
15427C114563q72379j085837j058145o92191j71097K88876O52928R08631R35823
15418B021172P17925M48689K62897J04511j23822m00029o32825p31493o93713
15409I73312n72967n01898n62043o26106o19682m62705L8106P35827J069352P94013
15399B65209K30947r1202O3241L41812K53908p6903j04226O7961o5224l78947
15389E06576l91008m8304K90674L84318L23373L02603L73682M24962K70795q8516
15379B349155m45612o02145m45705j66068o0938j28048k07800k60459k49963j79316
$$ y = [6189767, 5716180, 5720442, 6088364, 6211072, 5656281, 4770361, 4135473, 3841416, 3642133, 3434342, 3363989, 3551129, 3909322, 4289492, 4551703, 4622318, 4511310, 4213408, 3748837, 3114563, 2242184, 1156347, 98202, -593989, -765086, -476210, 176718, 1085349, 2021172, 2739097, 3187786, 3450683, 3555194, 3431372, 3031343, 2398518, 1667025, 973312, 400345, -101553, -663596, -1289702, -1909384, -2372089, -2333983, -1598156, -528804, 265209, 496156, 404954, 468195, 810007, 1063915, 987012, 882786, 950747, 885523, 506576, 115568, 67264, 357938, 742256, 1065629, 1368232, 1741914, 2166876, 2437671, 2349155, 1903543, 1301398, 855693, 689625, 628687, 500639, 292839, 32380, -217583, -396899]
15369c96899j49983k10905l68219m47579k39197J28736L46679K30649j40587n30219
15359a777524p64076p35766m60220j94244j61656k08001k7922L68141P48037J006644
15349b206587J182574J256728J087941P27227M45442L10287J72615M5450L4623
15340C056300Q0300J1906k28645n51300r01640j234662j307652q70378r3996M82491
15330a557276O55933P30676R56686J174841J089055O32356Q573n64178j027827
15321B098839j265481j155981r03818q48250r80359r80877o72954k45215N4301
15312d899795K37513M31395P23603R89568R53090O05662K26165l2707k25642l38578
15302a329726l43022l31459l31057k12182R4604N14700Q19152P79424M01782n5518
$$ y = [-396899, -546882, -757787, -1126006, -1573585, -1812782, -1684046, -1337367, -1106718, -1247305, -1777524, -2541600, -3277366, -3737586, -3931830, -4093486, -4301487, -4329409, -3961268, -3213231, -2206587, -1024013, 232715, 1320656, 2047883, 2493325, 2803612, 2976227, 3021677, 3056300, 3136600, 3148506, 2919861, 2368561, 1466921, 232259, -1075393, -1945771, -2039767, -1557276, -901343, -170667, 786019, 1960860, 3049915, 3682271, 3690844, 3126666, 2098839, 833358, -322623, -1226441, -2074691, -3055050, -4035927, -4708881, -4954096, -4899795, -4662282, -4230887, -3507284, -2517716, -1564626, -958964, -732799, -765506, -991148, -1329726, -1672748, -2004207, -2335264, -2547446, -2452842, -1938142, -1118990, -339566, 62216, 6698]
15292F698k88321k98164l06430l79361m26300l16468n4419J69249O0535m34125
15282b267106r55002j143053j000787q08630p18467o10327m03110q7942L71026
15273g623398Q83662J305260J590484J700972J566580J257551J001410Q17013
15265B499534N28634J67059m8353o6312n1035l4296O3752K34030L06386J43170
15255C742569m1729R339J63486P5343l60627q49973j015755p91609l98757o7999
15245D64288P6475J20785J76384J26824p6280j92764j2817K72665L24163J19713
15235A399436j17054k76716m43037o15427o84065o39971n11102k71849p9669j57786
15225b397240m33974o66569o39306k68775K57812O15936P26359P88544R26325
$$ y = [6698, -281623, -579787, -886217, -1265578, -1691878, -2008346, -2062765, -1893516, -1832981, -2267106, -3222108, -4365161, -5365948, -6174578, -6893045, -7503372, -7906482, -7994424, -7623398, -6739736, -5434476, -3843992, -2143020, -576440, 681111, 1682521, 2499534, 3028168, 3195227, 3146874, 3080562, 3029527, 2995231, 3058983, 3293013, 3599399, 3742569, 3700840, 3710179, 3873665, 3949008, 3588381, 2738408, 1722653, 931044, 532287, 464288, 540763, 661548, 837932, 964756, 888476, 695712, 682895, 955560, 1279723, 1399436, 1282382, 1005666, 562629, -52798, -736863, -1376834, -1887936, -2159785, -2239454, -2397240, -2831214, -3497783, -4137089, -4405864, -4148052, -3532116, -2805757, -2017213, -1090888]
15216a090888J055768J101627J027877P05074J83720j73413j45308L8708L7169
15207B740334j64649l82877m62011l78569j45185J26201J39589j56606n16823
15198G99404p31507p84378o61457l09314R6464K24932J0689k60558k66807j6003
15188a898535K13232L59564N51868P81651R52443R91430P85966L06166j66712
15179B877073l15481j42335J85493M98221O52596N94096M10442K30694J49657
15170E140456J97406K24429J02015q3964j83012k24221k69747l23916m55705n77474
15160C546267n44455m22041l29471l09986m03506n95151p22048p10863o79120
15151a170374p10450q14147r17749r24351q17612o38174m17802j86635M513J42651
$$ y = [-1090888, -35120, 1066507, 2094384, 2799458, 2983178, 2809765, 2664457, 2703165, 2740334, 2575685, 2192808, 1730797, 1352228, 1207043, 1333244, 1472833, 1316227, 799404, 67897, -716481, -1377938, -1687252, -1590788, -1365856, -1355167, -1615725, -1882532, -1898535, -1685303, -1325739, -773871, 7780, 960223, 1951653, 2737619, 3043785, 2877073, 2561592, 2419257, 2604750, 3102971, 3755567, 4349663, 4760105, 4990799, 5140456, 5337862, 5562291, 5664306, 5580342, 5397330, 5173109, 4903362, 4579446, 4123741, 3546267, 3001812, 2579771, 2250300, 1940314, 1536808, 941657, 219609, -491254, -1170374, -1880824, -2694971, -3612720, -4537071, -5354683, -5992857, -6410659, -6597294, -6592781, -6450130]
15141f450130L25057O92378J116474J346054J428921J412244J198522Q90239O35590
15132B595349M04435J45376r3707k02094j09959J37064K80705J1014o79164j374911
15122A114108j647622j554414j339412j094735r23562q51573p23148m30962k0812
15113g472132M17022P47070Q99770J016376J242696J550797J720083J645987J444453
15104C212122J113271N61368r2095o64791j093262j354646j410556j253195r52666
15095a934450o95313o30567o15643m68576k07315J01623M58534P84445R12634
15086b294628Q18583N04619N1801k14234j78054o0406N0335K75228O45528R35162
15076E33934R77386Q68728P70004P31009O32086K96581k18261o11560o89142n49701
$$ y = [-6450130, -6125073, -5432695, -4316221, -2970167, -1541246, -129002, 1069520, 1959759, 2595349, 2999784, 3145160, 3051453, 2849359, 2739400, 2876464, 3157169, 3168183, 2489019, 1114108, -533514, -2087928, -3427340, -4522075, -5445637, -6297210, -7020358, -7451320, -7472132, -7055110, -6308040, -5408270, -4391894, -3149198, -1598401, 121682, 1767669, 3212122, 4325393, 4886761, 4794666, 4129875, 3036613, 1681967, 271411, -981784, -1934450, -2629763, -3260330, -3875973, -4344549, -4551864, -4450241, -3991707, -3207262, -2294628, -1476045, -971426, -919625, -1133859, -1311913, -1372319, -1321984, -1046756, -401228, 533934, 1511320, 2380048, 3150052, 3881061, 4513147, 4809728, 4591467, 3979907, 3290765, 2741064]
15066B741064l77495k68550k15413j58985q2103M4711J24768p6442o79861j477557
15056d25863j996015j902489j170967l8364J095262J890696K057877J566822Q11705
15047A888664J51578k94953o03887r13345j103688r83012n35546P8667M97665
15038a817857N28096K40187k75812p01014o27603m6238O11944Q77335N62552j48730
15028g97140p20217q67271q94352j007972j017073q65356o76594m38356j45087
15019g429418J14199K54258K50444K64582N12791R08691J028492O86988K14981
15010c193992J2395J43726M41945P93294R15216O49734J90381l16418p22860q76228
15000a962807p76300n24594k15618N3370J72526J65200K25929L37531K66458m5501
$$ y = [2741064, 2363569, 2095019, 1879606, 1720621, 1638518, 1683229, 1807997, 1731555, 1051694, -425863, -2421878, -4324367, -5495334, -5533698, -4438436, -2547740, -489863, 1076959, 1888664, 2040242, 1745289, 1141402, 228057, -875631, -1858643, -2394189, -2315522, -1817857, -1289761, -1049574, -1325386, -2026400, -2654003, -2700241, -2088297, -1210962, -648410, -797140, -1517357, -2384628, -3278980, -4286952, -5304025, -6169381, -6845975, -7284331, -7429418, -7315219, -7060961, -6810517, -6545935, -6033144, -5124453, -4095961, -3408973, -3193992, -3181597, -3037871, -2595926, -1802632, -887416, -237682, -47301, -363719, -1086579, -1962807, -2739107, -3263701, -3479319, -3425949, -3253423, -3088223, -2862294, -2524763, -2258305, -2303806]
14990b303806m98517q97729r74927p05828l04675j1897J00113J46960J47887J55550
14980e146869K48973L30663L64626M39748M44924K58999k7693k61648l45698l17855
14970d011830j75015J01872L62439M81665N09797M56916K20735j86781n77287
14961b817489o89296m27564j8843K47800K57265R4218P4890M03677R02718J242791
14951g29833J337832J268650J010260O18526K08340k47079o78706j003360j281188
14942E03442j395280j267172r78893n70948j76175R9527L94913P52213J021951
14933a616422J188115J252023J076682O63675K38280R2498L62827Q55403J202161
14924E315242J300184J213233R83122O64480J51326m54336p30906o63502n68583
$$ y = [-2303806, -2802323, -3700052, -4674979, -5380807, -5685482, -5697379, -5597266, -5450306, -5302419, -5146869, -4897896, -4567233, -4202607, -3762859, -3317935, -3058936, -3086629, -3348277, -3693975, -4011830, -4186845, -4084973, -3722534, -3240869, -2731072, -2274156, -2053421, -2240202, -2817489, -3506785, -3934349, -3953192, -3705392, -3448127, -3353909, -3279019, -2875342, -1972624, -729833, 607999, 1876649, 2886909, 3505435, 3713775, 3466696, 2787990, 1784630, 503442, -891838, -2159010, -3137903, -3708851, -3885026, -3785499, -3390586, -2638373, -1616422, -428307, 823716, 1900398, 2564073, 2802353, 2894851, 3257678, 4113081, 5315242, 6615426, 7828659, 8811781, 9476261, 9627587, 9173251, 8442345, 7778843, 7210260]
14915G210260m75256l15403j58412r0804j14131j52010j81019k63310l66721m39732
14905D653462n53698q65712j347198j658216j552394j084077m81886k1241J98172
14896b712788K85603K59113n3727n70421q31969p81484p71621p45710m96494p3146
14886f492644L90638O72990N91559K51746r0265k43821k43636k39456k02601q426
14876e613916K76566M10610K36483r8338m08151p50384r71258p45908j54229L52434
14866g466091M40307K01735P46J47219N32774P85614Q42777Q16761P12365N27043
14856b458750K88610l6880m57778p67897q13350p82300q81668r15887o49292j87293
14846g662485L85993J065835J597754J699138J367849Q96413O14154M81142K44153
$$ y = [7210260, 6735004, 6419601, 6261189, 6170385, 6056254, 5904244, 5723225, 5459915, 5093194, 4653462, 4099764, 3234052, 1886854, 228638, -1323756, -2407833, -2889719, -2910960, -2712788, -2427185, -2168072, -2221799, -2792220, -3624189, -4405673, -5177294, -5923004, -6419498, -6492644, -6102006, -5429016, -4837457, -4585711, -4675976, -4919797, -5163433, -5402889, -5605490, -5613916, -5337350, -4926740, -4690257, -4788595, -5196746, -5947130, -6918388, -7664296, -7818525, -7466091, -7025784, -6824049, -6823303, -6676084, -6143310, -5357696, -4514919, -3698158, -2985793, -2458750, -2170140, -2207020, -2664798, -3432695, -4246045, -5028345, -5910013, -6825900, -7475192, -7662485, -7276492, -6210657, -4612903, -2913765, -1545916, -649503, -35349, 445793, 689946]
14837F89946j35616n05107p69765q80937q11973n13388j2327M32332M70418j47546
14827b183963j056974j447102j198882q20674n23886j45318L55362P96842J087483
14818e137112J337929J505724J405857J100437P84362N45805L84290J62505j60404
14809A929393m11906m82496l35718m2327J21291N7713m4939J5437K64467N55918
14799A626833P16426N12496q4522o60711q25097o44833m51839m23130m33944m01597
14789a069918l95662l85298l49367l56822l09326q5122Q6570M7373j7235m7084
14779b881891j84575l80481m53152l41893q1641J34848P1934j91683l73223l61650
14769e043407j56988J49948L54379M15406L90835K73197J72168K57134M76646
$$ y = [689946, 554330, 49223, -720542, -1601479, -2413452, -2926840, -2939167, -2506835, -2036417, -2183963, -3240937, -4688039, -5886921, -6707595, -7231481, -7376799, -7021437, -6224595, -5137112, -3799183, -2293459, -887602, 212835, 997197, 1543002, 1927292, 2089797, 1929393, 1517487, 1034991, 699273, 656946, 778237, 835950, 791011, 806448, 1070915, 1626833, 2343259, 2855755, 2771233, 2110522, 1285425, 640592, 188753, -234377, -668321, -1069918, -1465580, -1850878, -2200245, -2557067, -2866393, -2951515, -2864945, -2817572, -2834807, -2881891, -3066466, -3446947, -3900099, -4241992, -4323633, -4188785, -4116851, -4308534, -4681757, -5043407, -5200395, -5050447, -4696068, -4280662, -3889827, -3616630, -3444462, -3187328, -2710682]
14760b710682N69082L80901n884l97644p28061r48836r62541p71154m95558l50009
14750f420386m52664o31758o48318m89568j85818K85952Q45373J296934J447017
14741d953236J299319R91003O08232K42830K8359n3483p1035K9559K40150N07877
14731a130425P64117Q28471N84830P6346n35751j006073j125719q42096l97473
14722b783773M2412M28681N94389N68664N88550O43704N89643M79926L75400K53966
14712A781562O1661k24870n28711q08943r83617q47507m15240k0398R4037m4166
14702a936192k98398n38148n68931j63432N88474J269567J494753J246237Q86900
14693A980830O86407N66951M78741M83401N38532O11388P07312Q76569J091191
$$ y = [-2710682, -2141600, -1760699, -1766583, -2164227, -2892288, -3841124, -4803665, -5574819, -6070377, -6420386, -6873050, -7504808, -8153126, -8642694, -8828512, -8542560, -7697187, -6400253, -4953236, -3653917, -2662914, -2054682, -1811852, -1783493, -1836976, -1908011, -1878452, -1638302, -1130425, -366308, 462163, 1046993, 1123339, 587588, -418485, -1544204, -2386300, -2783773, -2741361, -2312680, -1718291, -1149627, -561077, 82627, 672270, 1152196, 1527596, 1781562, 1843223, 1618353, 1089642, 280699, -702918, -1550425, -1965665, -1986063, -1892026, -1936192, -2234590, -2772738, -3341669, -3505101, -2916627, -1647060, -152307, 1093930, 1980830, 2667237, 3234188, 3712929, 4196330, 4734862, 5346250, 6053562, 6930131, 8021322]
14684H021322J083266O77570N3314l77412m34234l46727l03884l03801l68150
14675G701264l90062k27814n7997M7532K09069L24502L53194L03851M5818l51299
14665G958058o14677p32543q64744j064452j279133j325992j215077j111726j025570
14656a275856q93125o97259m55377k07073o7291m5132J836R8565K61779N14524
14646b764409O73305O62060O87290P73705O83882K73564k93467p24442r16712
14637i45224q25336n12067k02236L5569K14189K30145O755m05035q01087r06245
14627d110572n57925R8443N77798N46874K10038o0055j61251r5015J35440L79479
14617c036746N17907N98922O00482M15112J10113j73447m73487q05880q75442
$$ y = [8021322, 9104588, 9782158, 9835472, 9458060, 9023826, 8677099, 8373215, 8069414, 7701264, 7311202, 7083388, 7025391, 7072923, 7281992, 7606494, 7959688, 8263539, 8309357, 7958058, 7343381, 6610838, 5746094, 4681642, 3402509, 2076517, 861440, -250286, -1275856, -2168981, -2866240, -3321617, -3528690, -3595981, -3641113, -3639277, -3540712, -3278933, -2764409, -2091104, -1429044, -741754, 31951, 715833, 989397, 695930, -28512, -945224, -1770560, -2282627, -2484863, -2449294, -2235105, -2004960, -1998205, -2403240, -3204327, -4110572, -4668497, -4570054, -3992256, -3445382, -3235344, -3295399, -3456650, -3551665, -3416225, -3036746, -2518839, -1919917, -1319435, -904323, -794210, -967657, -1441144, -2247024, -3122466]
14608c122466n73802j62776J99547L82248L52517K69460K12507J57583J24850
14599b160332J84846K91770L03262K54479K75661L64578M13000L78722K78421
14590E84407Q2374k07202n59216q14887q38305p20607o54804o58016n75588l51051
14580d712895m8521K83008N38996O00309N11762M12506L21766K29948L62616P04293
14570g96212P85796L57087l39578r31092j220554j179406q90399n06784j44183
14561d865325J15792K87478N07472Q33867J099219J113373R27038P49339N91192
14552A359445L70470J47326J47922M13177N57309L94098K09758J54009Q1011q4349
14542C750176k45389k47875J0822L87855N21454L09345L5322j27005l01134o64087
$$ y = [-3122466, -3696268, -3859044, -3659497, -3277249, -2924732, -2655272, -2442765, -2285182, -2160332, -1975486, -1683716, -1380454, -1125975, -850314, -485736, -72736, 305986, 584407, 666781, 459579, -99637, -914524, -1752829, -2473436, -3128240, -3786256, -4361844, -4712895, -4761416, -4478408, -3939412, -3339103, -2827341, -2414835, -2093069, -1863121, -1500505, -796212, -10416, 346671, 7093, -923999, -2144553, -3323959, -4214358, -4721142, -4865325, -4749533, -4462055, -3954583, -3120716, -2021497, -908124, 18914, 768253, 1359445, 1729915, 1877241, 2025163, 2438340, 2995649, 3389747, 3599505, 3753514, 3834525, 3750176, 3504787, 3256912, 3267734, 3655589, 4177043, 4486388, 4521710, 4394705, 4093571, 3429484]
14532C429484j081212j108481n18518L19752P67461P37171N34280L41797K14299
14523C636033k6044l72389n08493m01785l52134n42890q24055j015941j014528
14514a422226q02566m85491k45288k32999l13174k63095j19222k4724n3040k01284
14504d163109k94945j78819J06010L57182L95634L18266K67366K34322K66296
14495b691797N15975R63063J317419J345258J101505Q06923O51483O17521N60705
14486E188055L39363r2322n86122q80104q41182n74729j88136K50010M78536K41596
14476C334965l35247q36619r37602o02421q9735K58632M14394N16642M91163K15774
14466B429946j60855m36085n88291o04499n97967p74607j041316j059523o63371
$$ y = [3429484, 2348272, 1239791, 721273, 1041025, 1808486, 2545657, 3079937, 3421734, 3636033, 3609989, 3237600, 2729107, 2327322, 1975188, 1432298, 608243, -407698, -1422226, -2224792, -2710283, -2955571, -3188570, -3501744, -3764839, -3884061, -3908785, -3961825, -4163109, -4458054, -4636873, -4530863, -4173681, -3778047, -3459781, -3192415, -2958093, -2691797, -2175822, -1212759, 104660, 1449918, 2551423, 3358346, 4009829, 4627350, 5188055, 5527418, 5435096, 4848974, 3968870, 3127688, 2552959, 2364823, 2614833, 3093369, 3334965, 2999718, 2163099, 1225497, 623076, 533341, 791973, 1206367, 1723009, 2214172, 2429946, 2269091, 1833006, 1244715, 640216, 42249, -732358, -1773674, -2833197, -3496568]
14457c496568L7044O75655J013197J184811J197475Q46375K53562j73617l18572
14448A219362l83656m25956l72037k88549l54803n37812n31594k43730R2691K45352
14438a580732J95223J23793P0102j05032l49349m25585k47757q9749j62506l26343
14428b897935m56830n29238l81495Q1298P03839J259557J500431J381003J208303
14419A868933J182196J134939P94169J34749n93805j078048j146431q94557n35695
14410H66450k38072j20966k22341l79197m01444l39146m16280o08212o41806m98307
14400b999321k99642Q2259O84389J195697J413611J352001J029742N37654J12716
14391C109106J4016J71773J74238j21098l92718m51122m84995o08094o48187m86142
$$ y = [-3496568, -3459524, -2783869, -1770672, -585861, 611614, 1457989, 1711551, 1537934, 1219362, 835706, 409750, 37713, -250836, -605639, -1143451, -1675045, -1918775, -1826084, -1580732, -1385509, -1261716, -1191614, -1296646, -1645995, -2071580, -2319337, -2409086, -2571592, -2897935, -3354765, -3884003, -4265498, -4184200, -3480361, -2220804, -720373, 660630, 1868933, 3051129, 4186068, 4980237, 5114986, 4521181, 3443133, 2296702, 1402145, 866450, 628378, 507412, 285071, -94126, -495570, -834716, -1250996, -1859208, -2501014, -2999321, -3298963, -3216704, -2532315, -1336618, 76993, 1428994, 2458736, 2996390, 3109106, 3123122, 3294895, 3469133, 3348035, 2955317, 2504195, 2019200, 1411106, 762919, 276777]
14381B76777k08531J24793M26155O00926O47607O18108N27728L21928K8408l11065
14371C052834o36858p79764o18638k81285j8581P7036J35648K56818L25177K43202
14361A755589N3324j03250q7290k8193j35621k72627j35494J79609L27281J58529
14351A711857k52371m93309k35390K81255N43837K96732k02588n80713o85295
14342C84015m75680q5409K10240K70282M5545l43502n27596l38414j6530J83391
14332f93658K44094K02426L4309j71205k26632q3877J16001J46702j4126j89797
14322f35763k62622k26480k99145o42964j047431j256794j251515j006752m61319
14313g090785J52590N15517N87174M12696N1413k25729j44604K04949M57679M40678
$$ y = [276777, 68246, 193039, 619194, 1220120, 1867727, 2485835, 3013563, 3335491, 3363899, 3052834, 2415976, 1636212, 1017574, 736289, 717708, 794744, 930392, 1187210, 1512387, 1755589, 1808913, 1705663, 1618373, 1590180, 1454559, 1181932, 1046438, 1226047, 1553328, 1711857, 1459486, 966177, 730787, 1012042, 1555879, 1852611, 1650023, 1069310, 384015, -91665, -177074, 33166, 303448, 348993, 5491, -522105, -860519, -877049, -693658, -449564, -247138, -212829, -384034, -610666, -694543, -578542, -431840, -445966, -635763, -898385, -1124865, -1424010, -2066974, -3114405, -4371199, -5622714, -6629466, -7090785, -6938195, -6422678, -5835504, -5422808, -5371395, -5597124, -5741728, -5536779, -5079100, -4638422]
14303d638422L71137M70213O00722N16327J88103j30809j67598l6035O4664J16470
14293b645228J68860K15268J93390P4123l8234K590J06421O3844r3049r5820J54624
14282a893211M54345N78293M99201L25820K16073K51673M51269O56570N97421
14273B137454K94499R6696K70272P34995J214011J438823J344502J048597N79895
14264I159744K9347l61929n92991p82378q93856q34216n62089j17487L99613P91753
14254F235511Q74905N62126o7415o29579p74826m97168O401N31766J034085J603014
14244H878820K395497L330531M136095M734853N126926M949360L686080J207390
14236C8445552j648063l479688l731139l064944k323613j654028r69091l81566
$$ y = [-4638422, -4267285, -3797072, -3196350, -2680023, -2491920, -2622729, -2790327, -2826362, -2761698, -2645228, -2476368, -2261100, -2067710, -1993587, -2031821, -2029231, -1922810, -1858966, -1952015, -2047835, -1893211, -1438866, -860573, -361372, -35552, 180521, 432194, 883463, 1540033, 2137454, 2431953, 2528649, 2798921, 3533916, 4747927, 6186750, 7531252, 8579849, 9159744, 9189091, 8827162, 8234171, 7451793, 6557937, 5723721, 5161632, 5044145, 5443758, 6235511, 7110416, 7672542, 7605127, 6975548, 6200722, 5703554, 5709955, 6241721, 7275806, 8878820, 11274317, 14604848, 18740943, 23475796, 28602722, 33552082, 37238162, 38445552, 36797489, 33317801, 29586662, 26521718, 24198105, 22544077, 21574986, 21193420]
14228B1193420L49Q9250o7310j93435Q2760P59757J438367J872161K121583K176731
14218B9473633J588120N5437j837320l024067l059301k363900j575439j040751
14210A8216412p77736o37848n51191m99527k86319K28381P90891J147945J311585
14201A8942593J386433J454198J407151R83944J02286r57971j875540k449672
14193A8993422k616975k492593k241074j974977j670124j212119o64833m19524
14185E701203o84239j176070j424945j192349o62852j12428L25436O08608P81437
14176B163801R02406J114910J472746J690522J571527J174954N83822R73k50684
14167A0424977j60811k0613J6227n3479j84791l02172l43484j90632Q9877K17685
$$ y = [21193420, 21193769, 21283019, 21215709, 21022274, 21105034, 21864791, 23303158, 25175319, 27296902, 29473633, 31061753, 31117190, 29279870, 26255803, 23196502, 20832602, 19257163, 18216412, 17438676, 16800828, 16249637, 15750110, 15463791, 15692172, 16483063, 17631008, 18942593, 20329026, 21783224, 23190375, 24174319, 24276605, 23318634, 21443094, 18993422, 16376447, 13883854, 11642780, 9667803, 7997679, 6785560, 6120727, 5701203, 5016964, 3840894, 2415949, 1223600, 560748, 448320, 773756, 1382364, 2163801, 3066207, 4181117, 5653863, 7344385, 8915912, 10090866, 10674688, 10675661, 10424977, 10264166, 10243553, 10259780, 10206301, 10021510, 9719338, 9375854, 9185222, 9275099, 9492784]
14157I492784P4429k03275m35281o34781q64505j049376j030043p45220l71340
14148D233392j56829j87150l85581n44596n61507m16478K2162O30698J034495
14139C668606J190570J278851J356513J363733J202589R40831P51652P90059J064121
14130A3607525J398593J458663J034077L35498l41852p74696q17250n53434j34538
14121A5212586L52666P15911O98269J64149o83739j332211j467416j124255m53866
14112A2082094L02825Q67452J109762J102832J100922J341048J768579K291223
14104B1966737K997666L988889N191930O461369P816350R373166J1051075J2892499
14096H1739681J5523976J9606915K5172112L1743510L8024508M0850306L5497390
$$ y = [9492784, 9567213, 9363938, 8928657, 8293876, 7429371, 6379995, 5349952, 4604732, 4233392, 4076563, 3889413, 3503832, 2959236, 2397729, 1981251, 2003413, 2634111, 3668606, 4859176, 6138027, 7494540, 8858273, 10060862, 11001693, 11753345, 12543404, 13607525, 15006118, 16464781, 17498858, 17834356, 17492504, 16717808, 15900558, 15347124, 15212586, 15565252, 16281163, 16979432, 17143581, 16459842, 15127631, 13660215, 12535960, 12082094, 12384919, 13252371, 14362133, 15464965, 16565887, 17906935, 19675514, 21966737, 24964403, 28953292, 34145222, 40606591, 48422941, 57796107, 68847182, 81739681, 97263657, 116870572, 142042684, 173786194, 211810702, 252661008, 288158398]
14089B88158398J9821834j127288j8325169k6841074k7951259k5234762k1355793
14082A87144887j7539902j4413901j2593774j2220691j2556061j2474924j1457629
14075I3888005r872374q383918p330956o552308n780395m977952m207769l497364
14067D3284969k893660k503010k325946k070509j583717j213911j240171j351455
14059B8102590j220783j044968j011775q59838m22998Q6640M75457Q83047J579159
14050B6566531K473486L079888K994760K127520P24841p38241j981777k905481
14042C2341527l396548l382176k905642k103937j213610m77264q2228j02306l60974
14033A8316842n60373n95334n59354m81593k71204k718O2731l8644l8971J30545
$$ y = [288158398, 307980232, 306852944, 288527775, 261686701, 233735442, 208500680, 187144887, 169604985, 155191084, 142597310, 130376619, 117820558, 105345634, 93888005, 84015631, 75631713, 68300757, 61748449, 55968054, 50990102, 46782333, 43284969, 40391309, 37888299, 35562353, 33491844, 31908127, 30694216, 29454045, 28102590, 26881807, 25836839, 24825064, 23965226, 23542228, 23628868, 24104325, 24987372, 26566531, 29040017, 32119905, 35114665, 37242185, 37967026, 37228785, 35247008, 32341527, 28944979, 25562803, 22657161, 20553224, 19339614, 18862350, 18780122, 18677816, 18316842, 17756469, 17161135, 16601781, 16120188, 15848984, 15846266, 15908997, 15870353, 15831382, 15961927]
14023A5961927L97581N87715N00217J61513j51953j26357K91399Q03331J038242
14014A9463615Q36307K93214k15718k96617k4649J91104J08090k06346n18062
14005A9630938o09087n98704q88697j515833k045810k090562j570622p14123J16628
13996I714128P58982J222838J442396J390598J181373Q77684M54143o2820n40321
13987A6439001q63230r93141r19037p27731m70470j67195k540j87310o29875r20974
13977A0557498p75441k87523L00088Q35598J226343J564233J944235K231797K269276
13968A9866104K138013J865404J225195K97141l92834n16101l08579j64585k49569
13959B3760189m18459l47130L6672L34421J28543m55951q83106q19441l14318
$$ y = [15961927, 16359508, 16947223, 17447440, 17608953, 17457000, 17330643, 17622042, 18425373, 19463615, 20299922, 20593136, 20377418, 20080801, 20056152, 20247256, 20355346, 20149000, 19630938, 19021851, 18423147, 17534450, 16018617, 13972807, 11882245, 10311623, 9597500, 9714128, 10473110, 11695948, 13138344, 14528942, 15710315, 16587999, 17042142, 16979322, 16439001, 15575771, 14582630, 13663593, 12935862, 12465392, 12298197, 12295657, 12108347, 11478472, 10557498, 9782057, 9494534, 9794622, 10630220, 11856563, 13420796, 15365031, 17596828, 19866104, 22004117, 23869521, 25094716, 25391857, 24999023, 24482922, 24174343, 24009758, 23760189, 23341730, 22994600, 23031272, 23365693, 23494236, 23038285, 22155179, 21335738, 21021420]
13950B1021420L94252J050609J457627J525808J185195M17599m56662q75197n92557
13941B5128094Q4046O84008R60528R17735O43825K48767j15518k83905k98941
13932B7968639l61628n86026r41663j251927j268562r13050m96058l91629n66573
13923B1191523o36605l25422K70162Q16011R44411M89771l57357j204187j657521
13914A9530786j596484j234484p80297m59882m35564m78294l72001l06188l71291
13905A3496301k81503r697J32235J29193J39128J29305J36473J95379J01654k97110
13895A3871358q11728r93554o13195l5624L46740N14399M35274n4027q46033j468662
13885A0344948j641051j492612j260225j069817r01653o94896n69946p19376r80518
$$ y = [21021420, 21415672, 22466281, 23923908, 25449716, 26634911, 27052510, 26595848, 25720651, 25128094, 25212140, 25896148, 26856676, 27774411, 28418236, 28667003, 28551485, 28267580, 27968639, 27607011, 27020985, 26079322, 24827395, 23558833, 22645783, 22149725, 21758096, 21191523, 20554918, 20229496, 20499658, 21315669, 22260080, 22749851, 22392494, 21188307, 19530786, 17934302, 16699818, 15919521, 15459639, 15024075, 14545781, 14173780, 13867592, 13496301, 13214798, 13205101, 13337336, 13466529, 13605657, 13734962, 13871435, 14066814, 14168468, 13871358, 13059630, 12066076, 11452881, 11417257, 11763997, 12278396, 12713670, 12659643, 11813610, 10344948, 8703897, 7211285, 5951060, 4881243, 3979590, 3284694, 2714748, 1995372, 1014854]
13876A014854r51819n70764p1547M36604Q88156J031008P81891N31444O49596
13867C739423R98321J184630R97527N95320K99223J50390O3q8366K3525K81214
13857H181270N12550O47193O82327O19364L88681k0750l45878l39702k6811L63728
13847A0661972O98072J091405J513211J770916J829696J546180P63397j67636
13839A9707213o49166p19013r22354j293818j406787j136533p34855m75627n81187
13830A1787873j014596j479849j636126j312072p45777k87068M1398L57432O51829
13821F363044R12192J023836R07264O91411L87986k3571l48206n44316p76999
13812H592641r90344r50933n78968n4173L57555M00362Q9197j44139m4485R1160
$$ y = [1014854, 63035, -507729, -579276, -142672, 745484, 1776492, 2558383, 3089827, 3739423, 4737744, 5922374, 6919901, 7515221, 7814444, 7964834, 7964897, 7876531, 7900056, 8181270, 8693820, 9341013, 10023340, 10642704, 11031385, 11010635, 10664757, 10325055, 10298244, 10661972, 11360044, 12451449, 13964660, 15735576, 17565272, 19111452, 19874849, 19707213, 19058047, 18339034, 17416680, 16122862, 14716075, 13579542, 12844687, 12369060, 11787873, 10773277, 9293428, 7657302, 6345230, 5599453, 5312385, 5353783, 5711215, 6363044, 7275236, 8299072, 9206336, 9897747, 10285733, 10262162, 9913956, 9369640, 8592641, 7602297, 6651364, 6072396, 6018223, 6375778, 6776140, 6865337, 6721198, 6676713, 6767873]
13802F767873P0477O5419J87473L70156N38426P86406J118903J252924J000218
13793A2158275N34116J62902k6109q4323K7378L22896O01097O15724M25050K48204
13783A4985210J72796K34715L16224K28914M005k14817k84297j82626N825J84147
13773A5450096J49439j50697m01637l17065K2283L30461L78273J71503r6130l49357
13763A5187169o70857j055081j227754j028121p17709n18059l58390k45560l25618
13754I040020n37336o88915p49650p89890p69720o40065o52119r32705j116623
13745B162997r58904o16801l20380j40506K0607K64809N87242J000027J371986
13736C371077J383562J033040N70525J83244K8866J16228K27785Q264p12620j567881
$$ y = [6767873, 6838350, 6903769, 7091242, 7461398, 7999824, 8786230, 9905133, 11158057, 12158275, 12692391, 12855293, 12829184, 12744861, 12772239, 13095135, 13696232, 14311956, 14737006, 14985210, 15158006, 15392721, 15708945, 15937859, 15941864, 15727047, 15442750, 15260124, 15265949, 15450096, 15599535, 15448838, 15047201, 14730136, 14752419, 15082880, 15461153, 15632656, 15536526, 15187169, 14516312, 13461231, 12233477, 11205356, 10487647, 9969588, 9611198, 9365638, 9040020, 8502684, 7813769, 7064119, 6274229, 5504509, 4864444, 4212325, 3279620, 2162997, 1204093, 587292, 266912, 126406, 147013, 411822, 999064, 1999091, 3371077, 4754639, 5787679, 6358204, 6541448, 6570314, 6686542, 6914327, 6922591, 6209971, 4642090]
13726D642090j977081j765159j200470n93809j75120p4914k31693l62055k33832
13717a972043O3379K45980K96852M24995O53972P92404O87029M42819J61843j52214
13707A645016l26750k20273K9861K77765M62071M29696J27458r8629M8996L78637
13697B753848N33125L69235O1442k60751o57776j003646j039818o74897j18953
13688c8191K20127K12849J30441J31260R7049L2310J43482N44304J062901J330521
13678C867053J159806O87736J42080k93693n30538o68589q48499r07507o46920
13669A960929k12832R8946K28518L40938N32987P32028Q30126Q43400P26755M43339
13659F525134J66432k8084j54060j72253j14332j16735k76268m64520m68132k61048
$$ y = [4642090, 2665009, 899850, -300620, -894429, -1069549, -1144463, -1376156, -1738211, -1972043, -1908664, -1662684, -1365832, -940837, -286865, 505539, 1192568, 1635387, 1797230, 1645016, 1318266, 1097993, 1127854, 1405619, 1867690, 2297386, 2424844, 2326215, 2375211, 2753848, 3286973, 3656208, 3717650, 3456899, 2799123, 1795477, 755659, 80762, -38191, 181936, 394785, 525226, 656486, 753535, 785845, 929327, 1473631, 2536532, 3867053, 5026859, 5714595, 5856675, 5562982, 5032444, 4363855, 3515356, 2607849, 1960929, 1748097, 1847043, 2075561, 2416499, 2949486, 3681514, 4511640, 5355040, 6081795, 6525134, 6691566, 6663482, 6509422, 6337169, 6222837, 6106102, 5829834, 5365314, 4897182, 4636134]
13649D636134M6288K78041L30556L45206L30161K0366n29710q84938q29314m95221
13639C247569q5284J62634L6337l19286m57217j58908L08111O00828O57905N23990
13629D516679K68226O5583N6873K40697M33907M09292K59518K62408L92430L16205
13619G221818j20508o91350j064803j180662j142656q12151j49394N05313R37331
13610C502938J143718J023443N77256Q0468k07239l58229n65936o85815n58409
13601C952195l09072k07114l79468o68482q50189r05720r48326r05751o40321
13592a862248k92277j99561k93404k50787n1865O9873r996j14336l8314K29984
13582b812931M79491N16450M34560L58771K76581J38723m5721m2959K63848O30184
$$ y = [4636134, 4682422, 4960463, 5291019, 5636225, 5966386, 5986752, 5457042, 4572104, 3742790, 3247569, 3162285, 3324919, 3361256, 3041970, 2584753, 2425845, 2733956, 3334784, 3992689, 4516679, 4784905, 4850488, 4907361, 5148058, 5581965, 5991257, 6250775, 6513183, 6905613, 7221818, 7101310, 6409960, 5345157, 4164495, 3021839, 2209688, 2060294, 2565607, 3502938, 4646656, 5670099, 6247355, 6327823, 6120584, 5762355, 5196419, 4510604, 3952195, 3643123, 3436009, 3056541, 2388059, 1537870, 632150, -316176, -1221927, -1862248, -2154525, -2354086, -2647490, -2898277, -2950142, -2880269, -2890265, -3004601, -3042915, -2812931, -2333440, -1816990, -1382430, -1023659, -747078, -608355, -654076, -697035, -433187, 196997]
13572A96997Q34825R33655R54670Q45424O89129O03816O33963O38291M06153j3989
13562F722934l42858m85756n38450o04478o23316l89216O30K04909R6521k69354
13552C771566p08223q38130n25688q2549K63725M69203M41420J77395k18872p34641
13542B015206j247453j484476j347050r98014n93883k19340l8366l9650P8350
13533c874676M61488Q47060R06923O79590L87425J47811m6594k28173l29935l51322
13523a400403l46870l37156l14874k08064Q2399N09058Q67804R59342P20569K95194
13513H26999r7112k31182p4402J75073L47328M97538N58843K31612l44170o25298
13503A265229m33186j51839p4540j20067k41666m29987n17271m44478m22494n71758
$$ y = [196997, 1031822, 1965477, 2920147, 3765571, 4454700, 5058516, 5692479, 6330770, 6736923, 6722934, 6380076, 5894320, 5355870, 4751392, 4128076, 3738860, 3739490, 3944399, 4040920, 3771566, 3063343, 2225213, 1699525, 1616976, 1880701, 2349904, 2791324, 2968719, 2749847, 2015206, 767753, -716723, -2063773, -3061787, -3655670, -3875010, -3913376, -3953026, -3874676, -3413188, -2566128, -1659205, -979615, -592190, -444379, -490973, -719146, -1049081, -1400403, -1747273, -2084429, -2399303, -2607367, -2524968, -2015910, -1148106, -188764, 531805, 826999, 729887, 498705, 424303, 599376, 946704, 1444242, 2003085, 2234697, 1890527, 1265229, 832043, 680204, 605664, 485597, 243931, -186056, -703327, -1147805, -1570299, -2142057]
13493b142057o42730l53500J60686O45164J020425J204954J124821Q62508O01869
13484B482140M83834M83569M58944L37353J48587L1129Q1540J27312n3239m55257
13474D125912r23367j151003r62542m91134r5725q4772k98983l85707k91533j01778
13464f60632N1470O7914J28160L47456O07501P55974O53125K88460n4475n0399
13454B134554K10517L26197J43546o3523l4503K58506O47267Q86752Q88330Q01706
13444F199349P77730P55780N84640J76623m02852r35328j132761q78352m04840
13435D739989r9119j05324l11322n72412p60235p36158m66470p1671K47258M38885
13425B303421N93420N72471J82348l80092o81778n73873l22399j40348M2868K58107
$$ y = [-2142057, -2784787, -3138287, -2977601, -2332437, -1312012, -107058, 1017763, 1880271, 2482140, 2965974, 3449543, 3908487, 4245840, 4394427, 4425556, 4507096, 4634408, 4581169, 4125912, 3202545, 2051542, 1089000, 597866, 502141, 417369, 118386, -267321, -558854, -660632, -609162, -541248, -413088, -65632, 541869, 1297843, 1950968, 2239428, 2184953, 2134554, 2345071, 2671268, 2814814, 2751291, 2716788, 2975294, 3622561, 4509313, 5397643, 6199349, 6977079, 7732859, 8317499, 8494122, 8091270, 7155942, 6023181, 5144829, 4739989, 4640870, 4535546, 4224224, 3651812, 2891577, 2155419, 1688949, 1617278, 1864536, 2303421, 2896841, 3469312, 3651660, 3271568, 2589790, 2015917, 1693518, 1553170, 1596038, 1854145]
13415A854145L31028P5347m27161q77820j083369j020512p59485k95433L70681
13406a832579R90027J351327J486785J480136J335838R41747K87116l93379r14211
13397D732807j260544j330522r78251m83900l20592l73750k31295L6050J91292
13388a8705K05001N5831k41305n12642n22601k09741K29199N15746N94518O27379
13378G22680P48614R48316J119061J103969P69357J82491l29949n53744o03107
13369D107688o35718o60143n77322m12557l49295m15049m29167k46833O6473M47707
13359H95784Q30311Q97220M36847k34177n76262m90843l68396n34936q61627j050112
13349a056191r82276o06789M7975O58757R65774J183110J425331J387784R58307
$$ y = [1854145, 2185173, 2260520, 1833359, 955539, -127830, -1148342, -1907827, -2203260, -1832579, -842552, 508775, 1995560, 3475696, 4811534, 5753281, 6040397, 5647018, 4732807, 3472263, 2141741, 1163490, 679590, 358998, -14752, -246047, -209997, -18705, 186296, 242127, 822, -511820, -1034421, -1244162, -1014963, -499217, 95301, 722680, 1471294, 2419610, 3538671, 4642640, 5411997, 5594488, 5264539, 4710795, 4107688, 3471970, 2811827, 2234505, 1821948, 1472653, 1057604, 628437, 381604, 448077, 895784, 1726095, 2623315, 3060162, 2825985, 2249723, 1758880, 1390484, 855548, -6079, -1056191, -2038467, -2645256, -2597281, -1938524, -972750, 210360, 1635691, 3023475, 3981782]
13340C981782M40866J04241k0387m7117r0326j66854j97408j45688j37979k21300
13330C499830k88949k37950r7734j9663K517R3822J64496N0180l03611p78000
13320B084938j055072q80692k63826N70451J216152J313546Q62897J80995m28195
13311C601194q18196r16966p51643m24908o3314J82719L23709M56048M62131K48496
13301B299270M5668k1590r3952k39194l57834l64445k75414j31976J06131M64083
13291A430747Q49296J048550R67142P94838O80684N74354M64952M36686M71752
13282G719001M70710L62888N9207m56950r90651j271882j325666j391382j493543
13273A681732j458733j235484r17376n92599k81739j3308J90186K76489Q6355
$$ y = [3981782, 4422648, 4526889, 4506502, 4459385, 4369059, 4202205, 4004797, 3859109, 3721130, 3499830, 3210881, 2972931, 2875197, 2855534, 2858051, 2951873, 3116369, 3166549, 2862938, 2084938, 1029866, 149174, -114652, 455799, 1671951, 2985497, 3848394, 4029389, 3601194, 2782998, 1866032, 1114389, 689481, 626167, 808886, 1132595, 1588643, 2050774, 2299270, 2344938, 2323348, 2229396, 1990202, 1632368, 1267923, 992509, 860533, 966664, 1430747, 2280043, 3328593, 4295735, 5090573, 5771257, 6345611, 6810563, 7247249, 7719001, 8189711, 8552599, 8611806, 8154856, 7164205, 5892323, 4566657, 3175275, 1681732, 222999, -1012485, -1929861, -2522460, -2804199, -2817507, -2627321, -2350832, -2264477]
13264b264477k75040m22910k00299J31762K93658L71466N47075P44627Q15184
13255b58954P47674M93446N8830l49051o33930q03521p91125n94347l58204k05227
13245b694409j09545K1778K36561M70971N61789M23033J49094r3072k11090k57924
13235a502814l68027n01781l61894J13394N97914Q64558P91075L29662j73556
13226b11469k41185P9780K37815j01778o68727j109074j306228j306331j143875
13217e771072o96459J2584O99392J109355J109523Q34845N62206L60429K84997
13208a494200M44151O37284O00024M51549L57926L33799L68384L47648L32756
13199B379321N15164Q01485R79590R60892P60900M22136j3368m58858o93675n86295
$$ y = [-2264477, -2539517, -2962427, -3162726, -3030964, -2737306, -2365840, -1818765, -1074138, -258954, 488720, 982166, 1040996, 691945, 58015, -745506, -1536631, -2130978, -2489182, -2694409, -2803954, -2782176, -2545615, -2074644, -1512855, -1089822, -940728, -1033800, -1244890, -1502814, -1870841, -2372622, -2734516, -2621122, -2023208, -1158650, -367575, -37913, -211469, -452654, -372874, -135059, -236837, -905564, -2014638, -3320866, -4627197, -5771072, -6467531, -6454947, -5755555, -4646200, -3536677, -2701832, -2139626, -1779197, -1494200, -1050049, -412765, 187259, 638808, 996734, 1330533, 1698917, 2046565, 2379321, 2894485, 3695970, 4675560, 5636452, 6397352, 6819488, 6806120, 6347262, 5653587, 5067292]
13189E067292l80050l30668l55853k82354r2273R9131K46844N05521R81482J432610
13179F891682J506107J182455P37841L65901m648m09083p20265q83008q90542
13170G776440p55334n07940k05265L1563k8073n03911j107745j414969j353796
13161A930970j158783j020784r27080p62949m63326l4867K58015J08275k58275
13152b328804l69362k33534j99735m70407r62259j376032j348509q39959k62799
13143h391400m1833k15015m12602m15963k76368J8663M68505R17399J072295Q18032
13133f458287M59901K14836p0556m18657o26502n40895j56052K46977L92063L52628
13123f604544K39652O4378j60628l11724j60896K45511N21360M63302K11107n3877
$$ y = [5067292, 4687242, 4356574, 4000721, 3718367, 3626094, 3725225, 3972069, 4477590, 5459072, 6891682, 8397789, 9580244, 10318085, 10683986, 10679338, 10270255, 9549990, 8666982, 7776440, 7021106, 6513166, 6307901, 6339464, 6311391, 5807480, 4699735, 3284766, 1930970, 772187, -248597, -1175677, -1938626, -2401952, -2436819, -2178804, -2070529, -2328804, -2698166, -2931700, -3131435, -3601842, -4564101, -5940133, -7288642, -8128601, -8391400, -8433233, -8648248, -9060850, -9476813, -9753181, -9734518, -9266013, -8348614, -7276319, -6458287, -5998386, -5783550, -5854106, -6272763, -6899265, -7440160, -7596212, -7349235, -6957172, -6604544, -6364892, -6300514, -6461142, -6772866, -6933762, -6688251, -6166891, -5703589, -5492482, -5546359]
13113e546359k82317l81503k97359j89664r5427J79420P01126J180776J201634
13104c529673O11745k93595r62402j069221p70423m27173k50616j91544l70M12197
13094f471075Q67388J147309J196118J040414O14149r9774q63190j385880j562154
13085e516695j425243j152827q99296n23787O3899N77722P41584O77640O52149
13076f804854Q12770J106294J336275J356050J093456O45966K96694L08264O90756
13067H41671J081694J032830M89047o4184j54210O6630J26178k36308q31823j088863
13057A262662o47143K04054Q18191R16890P16784M26862P5481l05582o21354q35396
13047B011449q44779o29066l90961l04430k79473j49860R5708M55063Q26539J068811
$$ y = [-5546359, -5828676, -6210179, -6507538, -6697202, -6792629, -6613209, -5912083, -4731307, -3529673, -2917928, -3211523, -4173925, -5243146, -6013569, -6440742, -6691358, -6882902, -6883272, -6471075, -5603687, -4456378, -3260260, -2219846, -1605697, -1705471, -2568661, -3954541, -5516695, -6941938, -8094765, -8994061, -9517848, -9453949, -8876227, -8134643, -7457003, -6804854, -5992084, -4885790, -3549515, -2193465, -1100009, -454043, -157349, 150915, 841671, 1923365, 2956195, 3445242, 3381058, 3226848, 3293478, 3419656, 3183348, 2351525, 1262662, 615519, 819573, 1637764, 2554654, 3271438, 3698300, 3773781, 3468199, 2846845, 2011449, 1166670, 537604, 146643, -157787, -437260, -587120, -491412, -36349, 790190, 1859001]
13037A859001J141405J004669O53497K33801j38914m22775n14466l40176j07122
13028C368920j54540l93433m91276m11203k99334k11934k19893l53910m75455
13019C57942m36984k31032k2206j06982n43990j035555j257661j138540o60732
13010e075740J23806R43430J410952J318744R07491N50569L49820K00578M6339
13001G75989M9752L43541O75574O81617L67485j1034l06173m97071n63658m93445
12991A022577m40358n44844o75501n36754p132N24183N52887K07822r282j2780
12981H0818Q5498L03718N60038O72659N91323M74607M69490N17642N04734L42519
12971D603046L441k79099l05506k38022k12177k03705k54239l83040o03917q68368
$$ y = [1859001, 3000406, 4005075, 4658572, 4892373, 4753459, 4330684, 3816218, 3476042, 3368920, 3214380, 2820947, 2329671, 1918468, 1619134, 1407200, 1187307, 833397, 357942, -79042, -310074, -332280, -439262, -983252, -2018807, -3276468, -4415008, -5075740, -4951934, -4008504, -2597552, -1278808, -371317, 179252, 529072, 729650, 775989, 825741, 1169282, 1844856, 2526473, 2893958, 2882924, 2576751, 2079680, 1516022, 1022577, 582219, 37375, -638126, -1174880, -1182012, -657829, -104942, 102880, 93598, 80818, 166316, 470034, 1030072, 1702731, 2294054, 2768661, 3238151, 3755793, 4260527, 4603046, 4606487, 4327388, 4021882, 3783860, 3571683, 3367978, 3113739, 2730699, 2126782, 1258414]
12961A258414r67985q11448n16962k83523j82848j37526n8606J49032M18737N02125
12951f30590L65669J86476J04006K39449N02481N29439J98546j65654k20770p9342
12941A029710p7953k72572m84869n90547o20274n87793n14109m78878n49495p32292
12931c879072q62684p16333l14700R3792K73186K25160J60641J88528L29782O26308
12921c875392J001163J260836J199083P13330l5908o83432q94465n95194p7505
12912a987484J82179o246l19137l23361K2625M19414N98224M06537l2461m23446
12902a463156o19353o08440l35140K06113P97931J157263J141341P82511K61752
12893A320822p5837m3781J17142J53103J24051J75354K33069J34116r7798l07431
$$ y = [1258414, 290429, -521019, -1037981, -1321504, -1504352, -1641878, -1700484, -1551452, -1132715, -630590, -264921, -78445, 25561, 265010, 767491, 1296930, 1495476, 1329822, 1109052, 1029710, 951757, 679185, 194316, -396231, -1016505, -1604298, -2118407, -2597285, -3146780, -3879072, -4741756, -5458089, -5772789, -5678997, -5405811, -5180651, -5020010, -4831482, -4501700, -3875392, -2874229, -1613393, -414310, 299020, 263112, -420320, -1314785, -1909979, -1987484, -1805305, -1811551, -2130688, -2454049, -2431424, -2012010, -1413786, -1007249, -1039710, -1463156, -2082509, -2690949, -3026089, -2819976, -2022045, -864782, 276559, 1059070, 1320822, 1244985, 1201204, 1318346, 1471449, 1595500, 1770854, 2003923, 2138039, 2040241, 1732810]
12883A732810l78383l25331j55704J03649J85188q6000m38748m91619j88323J40216
12873I7755R3526j97820l02267k49198k64179l22964m02512m65095l78698j58056
12863b549508K4404J30565K84473M29608M99647N82607O22706N12044L01681J23507
12853I61734P9061L6113k10039o26522j025902j238048j210347r37187m65112
12844d636249l1701K29751N25776R65340J242461J085808O08101L6907l92582
12835c66388m61667k83772k30255m58179q19097j029272q46136l26118R7364J48479
12825d575041J60634M55761P32955P17951N87738N45037O00198O31120M77117
12816C33470R8138l05310n07573m44975j59945K09252N00560N96145M38203K86804
$$ y = [1732810, 1354427, 1029096, 873392, 977041, 1162229, 1076229, 637481, 145862, -42461, 97755, 191281, -6539, -308806, -558004, -822183, -1145147, -1547659, -2012754, -2391452, -2549508, -2525104, -2394539, -2110066, -1680458, -1180811, -598204, 24502, 536546, 838227, 961734, 1040795, 1076908, 866869, 240347, -785555, -2023603, -3233950, -4171137, -4636249, -4667950, -4438199, -3912423, -2947083, -1704622, -618814, -10713, 26194, -366388, -828055, -1111827, -1342082, -1800261, -2619358, -3648630, -4494766, -4820884, -4723520, -4575041, -4414407, -3958646, -3225691, -2507740, -1920002, -1374965, -774767, -143647, 333470, 431608, 126298, -381275, -826250, -986195, -776943, -276383, 319762, 757965, 1044769]
12806A044769M61249P68262Q29009N52720O7694m56317q38638j041287j268650
12797A18811j593882j779926j727093j529966j165306n41398L22957J213497J813039
12788d869267J796412J018592j48518r18919p06233K47142J155390J556639J387352
12779E18590Q29662L03054l7742k21273j79283m8151o3689k63863n75859q86925
12769f25479j086827j217510j413079j569560j436442r46438k27914M64780Q18127
12760g240342P45635N81713O15642P54809P88137O87116O03644O28102O71185
12751a164359N46852J41051l19529m61240l85187m11867m20471j30483L25791
12742b279442N85120N68509N15080N49722N31024L61760J58419O0651j1748j23065
$$ y = [1044769, 1506018, 2274280, 3103289, 3656009, 3723703, 3267386, 2428748, 1387461, 118811, -1475071, -3254997, -4982090, -6512056, -7677362, -8218760, -7895803, -6682306, -4869267, -3072855, -2054263, -2202781, -3121700, -3827933, -3580791, -2425401, -868762, 518590, 1348252, 1651306, 1613564, 1392291, 1213008, 1164857, 1101168, 837305, 261446, -625479, -1712306, -2929816, -4342895, -5912455, -7348897, -8295335, -8523249, -8058469, -7240342, -6494707, -5912994, -5297352, -4542543, -3754406, -3067290, -2463646, -1835544, -1164359, -617507, -476456, -795985, -1257225, -1642412, -2054279, -2474750, -2605233, -2279442, -1694322, -1125813, -610733, -61011, 470013, 831773, 990192, 1050843, 1039095, 916030]
12732I16030j26277K3653J49739J56561J71438K12611K10361K19595K02574l4138
12722B102147m27453o58042o00080l77582j86050j64223k59562l59079m39188
12713a369112n01470n43282n74321o27262o53940n15450k08366R3631L05790M41157
12703d152625O08702Q58147R25612O44385K86926J21733M737k02845k31084J51496
12693i84816O42930Q27080O98870L71668j36334o84902r51301q63617o65219n19966
12683b265607l47861r2944J52037K64355K29817J56592J08886J50874L22446M59870
12673h61535L26017n3394m41353o11322n36654m68350o24914q79062r00114n09197
12663e559878L7889L76691O10126R76901J313738J416403J321631J071486O70419
$$ y = [916030, 789753, 813406, 963145, 1119706, 1291144, 1503755, 1714116, 1933711, 2136285, 2102147, 1674694, 1016652, 416572, 38990, -147060, -311283, -570845, -929924, -1369112, -1870582, -2413864, -2988185, -3615447, -4269387, -4784837, -4993203, -4899572, -4593782, -4152625, -3543923, -2685776, -1760164, -1115779, -828853, -707120, -702383, -905228, -1136312, -984816, -341886, 485194, 1184064, 1555732, 1419398, 734496, -216805, -1080422, -1745641, -2265607, -2613468, -2706412, -2554375, -2290020, -2060203, -1903611, -1794725, -1643851, -1321405, -861535, -535518, -588912, -1030265, -1641587, -2178241, -2646591, -3271505, -4150567, -5050681, -5559878, -5521989, -5145298, -4535172, -3558271, -2244533, -828130, 493501, 1564987, 2235406]
12654B235406K44387J1641q429n1868k67552l98935k45770p437O0048n1401j65306
12643A354784k04707k67289m98908q16731q23802l77652J08507K26186J74504
12634a125108L76111R10851J496509J790870J582744R21795K43847r0374j53925
12625E953320k66567n64584q70585q18721k89820K55282M13643L24390J89234
12616D325592J7639k28359m36629m23529j42586K58902N42889N90500L94861J41095
12606E040375O9031J25799R1861n6768j09175J8486K01660L58196M06080J91691
12596F337236k58731p69269j133222j125274q11706n66703o89599j144179j623347
12587a784794j754842j360920o55155J0434M68294P61157R93308J042104Q23857
$$ y = [2235406, 2479793, 2491434, 2483005, 2431137, 2163585, 1764650, 1518880, 1511443, 1571491, 1520090, 1354784, 1150077, 882788, 383880, -432851, -1256653, -1634305, -1525798, -1299612, -1125108, -748997, 161854, 1658363, 3449233, 5031977, 5953772, 6197619, 6107245, 5953320, 5686753, 5122169, 4251584, 3432863, 3143043, 3398325, 3811968, 4136358, 4325592, 4343231, 4114872, 3678243, 3254714, 3112128, 3371030, 3913919, 4504419, 4899280, 5040375, 5109406, 5235205, 5327066, 5270298, 5161123, 5179609, 5381269, 5739465, 6145545, 6337236, 6078505, 5309236, 4176014, 3050740, 2239034, 1672331, 982732, -161447, -1784794, -3539636, -4900556, -5555711, -5545277, -5076983, -4315826, -3322518, -2280414, -1456557]
12578a456557N43421L15381J59815J53648J52884l2914l57616p68087j198458
12569b488483j342398j017354m29849J35590N09882O13704N76043N24173M07916
12560b510776J81633j13037m48100o88840o15492l60054l44940n76979o22560
12551f099145l78735k03094k07545j26100P0662J29678p0339k34693L4485P71973
12541f312853J504746J729323J422809R36160N57145K34603j75096n22285n26047
12532a151495k84875j65512l16346n93346p75268p78545n80930j97429K45456
12523d598290O51844R98708J203803J234384J125375P87908J93988m27009p99422
12514C71289q56659o45536j87581L79442P67154P87112N73336L71458J91071k2085
$$ y = [-1456557, -913136, -597755, -437940, -284292, -131408, -164322, -521938, -1290025, -2488483, -3830881, -4848235, -5278084, -5142494, -4632612, -4018908, -3442865, -2918692, -2510776, -2329143, -2442180, -2890280, -3579120, -4194612, -4554666, -4899606, -5476585, -6099145, -6477880, -6680974, -6888519, -7014619, -6943957, -6814279, -6884618, -7119311, -7084826, -6312853, -4808107, -3078784, -1655975, -719815, -162670, 71933, -103163, -625448, -1151495, -1436370, -1601882, -1918228, -2511574, -3286842, -4065387, -4646317, -4843746, -4598290, -3946446, -2947738, -1743935, -509551, 615824, 1403732, 1597720, 1170711, 371289, -485370, -1130906, -1318487, -939045, -171891, 615221, 1188557, 1560015, 1751086, 1729001]
12504A729001k21591k66158j7262L77031N41286M30087K82968J80327O207l69894
12494B672002q82100j371903j771641j956742j787538j365085r39662n98591k38571
12485h239831J23842N33997R87662J232939J226939J171745J133675R13965L49737
12476e65330l27934o90719m94601Q1366N88914P56945O20798M62274N11903O03966
12466A547582N06795K71087J00855J27484K82360L45150K29013N0703j68474m81785
12456B810770q05435r67431r45823p95053m37537O9262M74071N85401M08976J17177
12446E14378j09369j27152Q7852L21619L70423L05794K60591K07600J31409K70284
12436B233429P19489J169386J319139J050731M58245j37430l86024k07165Q8579
$$ y = [1729001, 1507410, 1241252, 1223990, 1601021, 2142307, 2572394, 2855362, 3035689, 3041896, 2672002, 1789902, 417999, -1353642, -3310384, -5097922, -6463007, -7402669, -8001260, -8239831, -8115989, -7581992, -6594330, -5361391, -4134452, -2962707, -1829032, -915067, -565330, -893264, -1583983, -2078584, -1997218, -1408304, -651359, -30561, 431713, 943616, 1547582, 2054377, 2325464, 2426319, 2553803, 2836163, 3181313, 3410326, 3461029, 3292555, 2810770, 2005335, 1037904, 92081, -702972, -1140509, -1071247, -597176, -11775, 397201, 514378, 405009, 277857, 365709, 687328, 1057751, 1363545, 1624136, 1831736, 1963145, 2233429, 2952918, 4122304, 5441443, 6492174, 6950419, 6812989, 6426965, 6219800, 6308379]
12427F308379R8157k90018q42855j173792j065807o90320m11357m21584o64256
12418H46547q76428p78851l50234J70533M79620N16189N87766P27934O17576J76218
12408B116870l33014o10374n80699l22298j8396R7740L5892k469j4269o7189r4503
12397B07291K2038K56120M20203M37572M14642L91326L04597Q6899j68154k09654
12387B162880j8569J02658l7135l19364n02243m93435m77001o45115p72753m87193
12377a487270P7496M84305M86374K34340J08187J61825J30564n4983k28099k22116
12367c09377L3388M24592P11323P20858N11069K46212p9535m74665p76005p83630
12357B24230n42542l65579m02951m56649k57293J35701L65715J75464k83044n67374
$$ y = [6308379, 6406536, 6116518, 5273663, 4099871, 3034064, 2343744, 1932387, 1510803, 846547, -29881, -808732, -1158966, -988433, -508813, 7376, 595142, 1323076, 1940652, 2116870, 1783856, 1173482, 592783, 270485, 252089, 349829, 385721, 383252, 368983, 301794, 207291, 229329, 485449, 905652, 1343224, 1757866, 2149192, 2453789, 2540688, 2372534, 2162880, 2144311, 2246969, 2209834, 1890470, 1388227, 894792, 417791, -227324, -1000077, -1487270, -1409774, -925469, -439095, -204755, -96568, 65257, 195821, 140838, -87261, -309377, -275989, 148603, 859926, 1580784, 2091853, 2338065, 2258530, 1783865, 1007860, 224230, -318312, -683891, -1086842, -1543491, -1800784, -1665083, -1299368, -1123904, -1406948, -1974322]
12347a974322m63481k27658j51310j14181j5888n5388k21515l16933k99423j53888
12337c993987N9579J80580P8914k73442p38344j051308j028033p22854l10840
12328g799735j2010O1599J93227N42138Q03700P95295P10052O95061O30688M72842
12318b907143L01813P5771k07424l70899k53023M8897J87501N1015o3654N3593
12308c083553J25079m0710k28285l07340k67600r4602J08195J57246O4492J70167
12298c396911N83058Q61429P24919L89622R7973q9451k15848k65102j52903P8079
12288a385135L18175M73133M38978K48742N3729o6962r1686j4424J50254L86120
12278E10924O53037P91954N53736N471l98426m15346j38954J72425K73696K33934
$$ y = [-1974322, -2437803, -2665461, -2816771, -2930952, -2946840, -3002228, -3223743, -3540676, -3840099, -3993987, -3934408, -3753828, -3674914, -3948356, -4686700, -5738008, -6766041, -7488895, -7799735, -7811745, -7750146, -7556919, -7014781, -6211081, -5415786, -4705734, -4010673, -3379985, -2907143, -2605330, -2529559, -2736983, -3107882, -3360905, -3312008, -3124507, -3073492, -3137146, -3083553, -2958474, -2999184, -3227469, -3534809, -3802409, -3897011, -3788816, -3631570, -3567078, -3396911, -2813853, -1952424, -1227505, -837883, -739910, -829361, -1045209, -1310311, -1463214, -1385135, -1066960, -593827, -154849, 93893, 147622, 80660, -11026, -25450, 124804, 510924, 1163961, 1955915, 2509651, 2515122, 2116696, 1701350, 1562396, 1734821, 2008517, 2242451]
12268B242451J22675j97547p78655j310562j319353o62103M15343J394876J752803
12259A659928J328891M89140q5979j08964J68763M51649N61765M05469j7046n70037
12249D283579r28863q52237n13155k21022m9967N0493R1348L8392r5869k47720
12239A554979m37254o30489o33975m30385j23464J44387K81771M78715Q35943
12230A040228J081257Q78897K93337l23212p01910p80481o47165m76456k95133
12221F9362o4739J32974L67463P37321J037658J112960J028426Q50185O30384
12212E901994L46727j2522l43462m89857m85034m85301m66902l44700k25217k43361
12202C152365l76335m91646n37705n78269o75187p85691q30126o85947k34603
$$ y = [2242451, 2365126, 2167579, 1388924, 78362, -1240991, -1903094, -1487751, -92875, 1659928, 2988819, 3477959, 3391980, 3283016, 3451779, 3903428, 4465193, 4870662, 4853616, 4283579, 3354716, 2502479, 1989324, 1768302, 1718335, 1768828, 1860176, 1898568, 1802699, 1554979, 1117725, 487236, -146739, -577124, -700588, -556201, -274430, 204285, 1040228, 2121485, 3000382, 3293719, 2970507, 2268597, 1488116, 840951, 364495, 69362, 4623, 137597, 505060, 1242381, 2280039, 3392999, 4421425, 5271610, 5901994, 6248721, 6236199, 5892737, 5402880, 4917846, 4432545, 3965643, 3620943, 3395726, 3152365, 2776030, 2284384, 1746679, 1168410, 493223, -292468, -1122594, -1808541, -2043144]
12193b043144K92982M68399K42174n5770k22235k75053j43098K88953Q90602J240536
12183F84346R44187J52593m68775n47225l75442l72684m55972k54726K38969O87031
12173B32302Q58866N58205j53494o87001o59083l57009j34630j03625l28287o72615
12163a446371p95770n43285j26471K09729M16735M30979K29058L5900J26158M25117
12153a038221N61275L98546J69693P433j56466k94663m09701o29128r44528j081619
12143c417379q21449j38406Q48666J723575K052425J695647R06930J98482k65586
12134B782905n50015o14102m34599k76809m73145q26481q21987m70998k52174
12125a937405l26147l47721j66728p7096k47295m65244m97923l15210k2864K40957
$$ y = [-2043144, -1750162, -1281763, -1039589, -1095359, -1317594, -1592647, -1735745, -1446792, -556190, 684346, 1628533, 1781126, 1312351, 765126, 389684, 17000, -438972, -693698, -454729, 232302, 1091168, 1649373, 1495879, 808878, 149795, -207214, -341844, -445469, -773756, -1446371, -2242141, -2785426, -2911897, -2702168, -2285433, -1854454, -1625396, -1589496, -1463338, -1038221, -476946, -78400, 91293, 98726, -57740, -352403, -762104, -1391232, -2335760, -3417379, -4238828, -4377234, -3528568, -1804993, 247432, 1943079, 2850009, 3048491, 2782905, 2232890, 1618788, 1184189, 907380, 434235, -392246, -1214233, -1685231, -1937405, -2263552, -2611273, -2778001, -2855097, -3102392, -3567636, -4065559, -4380769, -4403633, -4162676]
12115d162676M45348N59051M83235K19047j1331J1136K58376N94578Q02392P30511
12105g0333M55731K40537K30383K25800Q1977k3793l4317r2059j61115k55283
12095E97528m66202p27911r67398j081653j003752q65418p70019p24158o62984
12086f671967n08947k41172J69665O22211R48208J042986R18330P42543N96027
12077b382116K64623k30671m70696k53708J85150N54200P03059N14124J14853
12068a001182j44636j21534J37551N60095R33292J102393J159036J105962Q74780
12059D605757N30546J69252j09113k90575m29811m67821l37972k26794k71026
12050C172443l81291n04173o92459r87834j249363j300324j056879n71705o7720
$$ y = [-4162676, -3717328, -3158277, -2675042, -2455995, -2467326, -2456190, -2197814, -1603236, -800844, -70333, 385398, 625935, 856318, 1082118, 1164095, 1140302, 1105985, 1013926, 852811, 597528, 131326, -596585, -1563983, -2645636, -3649388, -4514806, -5284825, -6008983, -6671967, -7180914, -7422086, -7252421, -6630210, -5682002, -4639016, -3720686, -2978143, -2382116, -2117493, -2348164, -2818860, -3072568, -2887418, -2333218, -1630159, -1116035, -1001182, -1145818, -1267352, -1129801, -569706, 363586, 1465979, 2625015, 3730977, 4605757, 5136303, 5305555, 5196442, 4905867, 4476056, 4008235, 3670263, 3443469, 3172443, 2791152, 2286979, 1594520, 606686, -642677, -1943001, -2999880, -3571585, -3639305]
12041c639305K70252L59435K68401J38770k8951k99709n63046o74575n62134l49810
12031e080672j58314J60136M51540L68277J45571K11867M69682N09739J71995
12022b750179l52055p69149q08461l65886L33936R23789J097299Q00192L68747
12013a521767J44273J67488K33334J17210j80578m67413n10020l05632l3367K05981
12003b150491M16515N50963M94005J89880k32223m21882l64805m10360o12730
11994b541128p72059p59611n82724k43808K35719N66284M89749J27508l08832
11985c788902o35944o93220n47537l07500M3842L83322M82599L37077R9172j04791
11975d731882j76660n8524J82011M07592N38380N79060O22912P04595P63391P49212
$$ y = [-3639305, -3369053, -3009618, -2741217, -2602447, -2631398, -2931107, -3494153, -4168728, -4730862, -5080672, -5238986, -5078850, -4627310, -4259033, -4113462, -3901595, -3431913, -2922174, -2750179, -3102234, -3871383, -4679844, -5045730, -4711794, -3788005, -2690706, -1890514, -1521767, -1377494, -1210006, -976672, -859462, -1040040, -1507453, -2017473, -2323105, -2356472, -2150491, -1733976, -1183013, -689008, -499128, -731351, -1153233, -1518038, -1928398, -2541128, -3313187, -4072798, -4655522, -4899330, -4663611, -4097327, -3607578, -3480070, -3788902, -4424846, -5118066, -5665603, -5973103, -5929261, -5545939, -5063340, -4726263, -4627091, -4731882, -4908542, -4967066, -4785055, -4377463, -3839083, -3260023, -2637111, -1932516, -1169125, -419913]
11965d19913N66423K22817q8842j48623J86339P66425J228948J350553J138597
11956D802724P32694K88021j54285n40128p95641r88594j269441j626490j755704
11947a306844j394741o11901L02311R25018J000967P54325N62011M74917L55660
11938A061723J41314j68095n03776p84747q99293p45253l41224K96300J082070
11929h60981J686761J761878J368973Q83806N69637M43758L42303J05782k40008
11920F061909m93630o31866p25004p64411p98238q62985r40580q86139n71485
11911f12429j20330J65843J5466m26019p13345o89152m51026r6515L22345O94748
11901a910414Q80618Q94056P38003K96382l30247q09379r57177q09956n04111
$$ y = [-419913, 146510, 369327, 280485, 131862, 318201, 1084626, 2313574, 3664127, 4802724, 5535418, 5823439, 5669154, 5129026, 4333385, 3344791, 2075350, 448860, -1306844, -2701585, -3313486, -3011175, -2086157, -1085190, -330865, 231146, 706063, 1061723, 1203037, 1034942, 531166, -253581, -1152874, -1898127, -2239351, -1943051, -860981, 825780, 2587658, 3956631, 4840437, 5410074, 5853832, 6196135, 6301917, 6061909, 5568279, 4936413, 4211409, 3446998, 2648760, 1785775, 845195, -40944, -612429, -732759, -566916, -551450, -977469, -1690814, -2379966, -2830992, -2927507, -2605162, -1910414, -1029796, -135740, 602263, 898645, 568398, -240981, -1198158, -2008114, -2512225]
11892b512225j97268j9998L4254L2149K1205Q3512J54830N7598k15899n46274
11882c108116p26064o74108n23076k52225J84721N12686N63304M85984M60144
11873c076750L92826J09462k51765l82119r6962L41832M98358K57774j52569l44730
11863b704643j16273K96070M81008L98702L12137L71743N50646O29845M76930
11854F96165K32330J50200L28990M67488L93805K46376J27519P8179M7820j100
11844B767772P6607L44195N08005K72219k36289p43166j085099j150934j017036
11835b63726q38956o53091m47056j84003K05457O74438R29459P40561L07825K2244
11825D93152m181O8532J58413K67638M34219O84243Q90201R09488O71336J28954
$$ y = [-2512225, -2709493, -2729491, -2695237, -2663088, -2641883, -2558371, -2403541, -2345943, -2561842, -3108116, -3834180, -4508288, -5031364, -5283589, -5098868, -4586182, -4022878, -3536894, -3076750, -2683924, -2574462, -2826227, -3208346, -3305308, -2963476, -2465118, -2207344, -2359913, -2704643, -2820916, -2524846, -2043838, -1645136, -1332999, -961256, -410610, 219235, 696165, 928495, 1078695, 1407685, 1875173, 2268978, 2515354, 2642873, 2721052, 2768872, 2767772, 2844379, 3188574, 3696579, 3968798, 3732509, 2989343, 1904244, 753310, -263726, -1102682, -1755773, -2202829, -2386832, -2181375, -1506937, -577478, 163083, 470908, 493152, 488971, 557503, 715916, 983554, 1417773, 2102016, 2992217, 3901705, 4573041, 4701995]
11815D701995n02761p90908o18598l29421k82196m86374p02595p86381q16788
11806f14027q95088r46092p98679m97637k38338n8249J54964L74442L70896R3260
11796c054548j93216j94698Q0130L38653L42382J49219l7934j13275j25176j92976
11786c001439l47186m83421m23391r1790K19914J74445j6248l4147l3417j59562
11776d196242k68670l16603l05585j44653J08517K07388O7350j43573k06737M6575
11766e152233N28192R72554J122085R37399O13415L58206L50564N71527O53562
11757I55271L97423K4402k79731n38912n63684j18197N96319J172249J330178
11748B975318J026466N11030Q5768j89650m08181n63319n45403l07961o680Q8983
$$ y = [4701995, 4199234, 3408326, 2789728, 2460307, 2178111, 1691737, 989142, 202761, -614027, -1509115, -2455207, -3253886, -3751523, -3989861, -4048110, -3893146, -3518704, -3147808, -3054548, -3247764, -3442462, -3362332, -3023679, -2681297, -2532078, -2570012, -2683287, -2808463, -3001439, -3348625, -3832046, -4255437, -4347227, -4127313, -3952868, -3969116, -4003263, -4036680, -4196242, -4464912, -4781515, -5087100, -5231753, -5123236, -4915848, -4848498, -4992071, -5198808, -5152233, -4624041, -3651487, -2529402, -1592003, -978588, -620382, -269818, 301709, 955271, 1352694, 1377096, 1097365, 558453, -5231, -123428, 472891, 1645140, 2975318, 4001784, 4512814, 4598582, 4408932, 4000751, 3437432, 2892029, 2584068, 2577388, 2666371]
11738B666371q8864l32375l59826j30025J87348M87443N38311P6910o14046r47934
11728A483313q65129o56602m42841j88030J36720M17683M97688L65848J91356
11719I40006J28054K18026L75143M56049L86436K15224K3179j91599m83039o95368
11709A372111o12662l93433m00417o75034r21128j035800j182603j233752q34483
11700e917201j09968M51053O59516N80676L47268K15986K88080L38402J31162
11691c015026k71343o62544q03736m37890L69284J206499J658158J574767J105094
11682G23263N29236Q6430k60854o19229q29570p75376n90087m08772k60036j99444
11672b604439k45603l52453n51446q52635j025226r27100o95262m68048k39267
$$ y = [2666371, 2577507, 2245132, 1885306, 1755281, 1942629, 2430072, 2968383, 3045293, 2431247, 1483313, 618184, -38418, -481259, -669289, -532569, -114886, 382802, 748650, 940006, 1068060, 1286086, 1661229, 2117278, 2503714, 2718938, 2742117, 2550518, 2067479, 1372111, 759449, 366016, -34401, -709435, -1630563, -2666363, -3848966, -5082718, -5917201, -6027169, -5576116, -4916600, -4335924, -3988656, -3772670, -3484590, -3146188, -3015026, -3286369, -3948913, -4752649, -5190539, -4821255, -3614756, -1956598, -381831, 723263, 1252499, 1338929, 1078075, 458846, -370724, -1146100, -1736187, -2144959, -2404995, -2604439, -2850042, -3202495, -3753941, -4606576, -5631802, -6558902, -7254164, -7722212, -7961479]
11663g961479O7100M99106J015381J388013J347167R87935N93263K68384P8244
11654a716886J09650K39133J47813j67750l11262j27019J15499J69993J9795j89851
11644a710885l05680k70371j33749K7316K57366P28041J412970J978218K106655
11635D089881J779049J108778J78028q11201j502751j594777j137297m58581J31252
11626A782381M47208M35961L56262M06728M17871K82635J81473J75893J52419
11617D638831J31131J49314J75703J96283J64356M992k89780n35451n75830o03318
11607C456231q74115j357749j847442k103007j844165j002064J19814J060685
11599d391812J486034J445516J223699R44790N46754J12915l9155J31607L35708
$$ y = [-7961479, -7894379, -7395273, -6379892, -4991879, -3644712, -2656777, -2063514, -1795130, -1716886, -1607236, -1368103, -1220290, -1388040, -1699302, -1826321, -1710822, -1540829, -1521034, -1710885, -2016565, -2286936, -2420685, -2393369, -2136003, -1407962, 5008, 1983226, 4089881, 5868930, 6977708, 7155736, 6344535, 4841784, 3247007, 2109710, 1651129, 1782381, 2229589, 2665550, 3021812, 3428540, 3846411, 4129046, 4310519, 4486412, 4638831, 4769962, 4919276, 5094979, 5291262, 5455618, 5460610, 5170830, 4635379, 4059549, 3456231, 2582116, 1224367, -623075, -2726082, -4570247, -5572311, -5452497, -4391812, -2905778, -1460262, -236563, 708227, 1254981, 1367896, 1328741, 1460348, 1796056]
11590A796056N22132P28644P04480M09436Q2418k56906n47036n18752j99853Q7927
11580B808546K42913L78147N47307O06467L33782j03705k96267l05223l94818
11571C817149n47073o88119p21285m83155Q1051P31252J095115J093755R52692
11562E331382P83286N14785K8710n96141j083279j247032j051900n77519J3303
11553B115595M50985N81849M75297K14897j78240n86481p57635o59098o70939
11544I86230j004945j225130r26005l16517K23422N11156N33389M71357N44578
11535b02465O21646M46953J32957K5274J96314L62943L10561N4108j92172j80233
11525A575886R6558M42745P26341R21683J037283J053354Q36232K80381l81395
$$ y = [1796056, 2318188, 3046832, 3751312, 4160748, 4243166, 3986260, 3439224, 2920472, 2720619, 2808546, 3051459, 3429606, 3976913, 4583380, 4917162, 4813457, 4517190, 4211967, 3817149, 3270076, 2581957, 1860672, 1377517, 1458568, 2189820, 3284935, 4378690, 5331382, 6114668, 6629453, 6658163, 6062022, 4978743, 3731711, 2679811, 2102292, 2115595, 2566580, 3148429, 3623726, 3838623, 3660383, 3073902, 2316267, 1657169, 986230, -18715, -1243845, -2169850, -2486367, -2262945, -1751789, -1218400, -747043, -202465, 419181, 866134, 999091, 1024365, 1220679, 1583622, 1894183, 1948291, 1756119, 1575886, 1672444, 2115189, 2841530, 3763213, 4800496, 5853850, 6690082, 6970463, 6589068]
11516F589068q30479r63109q97592q11668p32644o03978m04778p0999K91019K98765
11506A863605j76757p69428j072169r91177o47724j95324J19678R4854k02493
11497a976935n20288o63202n78922l33376q1046J10581L72678O92138Q18732O34457
11487a525183K36012j43804k61437j78987p4346N3197R8607o8021l37195n52690
11477b753847o11822l94137Q6413N56979P82836P98145O71391M24310K12239J30881
11467i6612J35753K64382M90356N94847M74510K71201P6116j06274k52552l50665
11457A501062l73721l33813k82210j56406O7282K60624L90457M57223M12080L33784
11447B276362L20124L27590J55808j77206m48471p25508j103373j364812j292228
$$ y = [6589068, 5758589, 4795480, 3897888, 3086220, 2353576, 1749598, 1344820, 1273821, 1564840, 1863605, 1686848, 917420, -154749, -1145926, -1793650, -1988974, -1869296, -1774442, -1976935, -2497223, -3160425, -3739347, -4072723, -4153769, -4043188, -3670510, -2978372, -2159640, -1525183, -1289171, -1432975, -1694412, -1873399, -1947745, -1894548, -1795941, -1863962, -2201157, -2753847, -3365669, -3759806, -3673393, -3116414, -2333578, -1535433, -864042, -439732, -227493, -96612, 39141, 303523, 793879, 1388726, 1863236, 2134437, 2210553, 2104279, 1851727, 1501062, 1127341, 793528, 511318, 354912, 422194, 682818, 1073275, 1530498, 1942578, 2276362, 2596486, 2924076, 3079884, 2902678, 2454207, 1728699, 625326, -739486, -2031714]
11438b031714j005525p14718m60572j45563K66856O23035P63018P12649N89034
11429a403500L78549J96851K10678L51948L71949J35736k56740m70847l42548
11420h27924j28363K8593J83901K62344J96342J09319Q4119m173j67164k64461
11410e27467l33548m50529n46473m88949l65725k81634p5930K81281O59273R45274
11400a184427J021263Q43310M51622j58583q82174j418874j537020j224764n88840
11391d678487R8802N58517Q07329J083604J631808K317248K650159K329610J467391
11382H265981N08392k01396o78674q87161p01028l34847j58786l44431q46614
11373D621436j364099j509660j319201j202514j224721j100799q08754n68748
$$ y = [-2031714, -3037239, -3751957, -4212529, -4358092, -4091236, -3468201, -2705183, -1992534, -1403500, -1024951, -828100, -617422, -265474, 106475, 242211, -14529, -485376, -827924, -956287, -927694, -743793, -481449, -285107, -175788, -91669, -95842, -263006, -527467, -861015, -1311544, -1858017, -2346966, -2712691, -2994325, -3070255, -2788974, -2129701, -1184427, -163164, 680146, 1131768, 973185, 91011, -1327863, -2864883, -4089647, -4678487, -4579685, -4021168, -3213839, -2130235, -498427, 1818821, 4468980, 6798590, 8265981, 8774373, 8572977, 7894303, 7007142, 6306114, 5971267, 5812481, 5468050, 4621436, 3257337, 1747677, 428476, -774038, -1998759, -3099558, -3908312, -4477060]
11365d477060m77666l93579j09309L58273P73930J033972J133765R43756O23186
$$ y = [-4477060, -4954726, -5348305, -5457614, -5099341, -4325411, -3291439, -2157674, -1213918, -590732]
$$ [...]
##END NTUPLES=NMR SPECTRUM
##END=
