##TITLE=31P ikalashn
DE-75k3 TFA
20.12.2024
##JCAMPDX= 6.0         $$ Bruker NMR JCAMP-DX V2.0
##DATA TYPE= NMR SPECTRUM
##DATA CLASS= NTUPLES
##ORIGIN= UXNMR, Bruker Analytische Messtechnik GmbH
##OWNER= root
$$ TOPSPIN		Version 1.3
$$ 2024-12-20 14:01:20.453 +0400  Irina@DPX200
$$ Compression mode = diff/dup
##.OBSERVE FREQUENCY= 81.01967998063
##.OBSERVE NUCLEUS= ^31P
##.ACQUISITION MODE= SIMULTANEOUS
##.ACQUISITION SCHEME= undefined
##.AVERAGES= 64
##.DIGITISER RES= 17
##SPECTROMETER/DATA SYSTEM= spect
##.PULSE SEQUENCE= zgpg
##.SOLVENT NAME= D2O
##.SHIFT REFERENCE= INTERNAL, D2O, 1, 298.5841
##AUDIT TRAIL= $$ (NUMBER, WHEN, WHO, WHERE, WHAT)
$$ ##TITLE= Audit trail, TOPSPIN		Version 1.3
$$ ##JCAMPDX= 5.01
$$ ##ORIGIN= Bruker BioSpin GmbH
$$ ##OWNER= Irina
$$ $$ F:/spectra/data/iren/nmr/P31dec/1/pdata/1/auditp.txt
$$ ##AUDIT TRAIL=  $$ (NUMBER, WHEN, WHO, WHERE, VERSION, WHAT)
(   1,<2024-12-20 14:00:29.531 +0400>,<Irina>,<DPX200>,<TOPSPIN 1.3>,
      <created by zg
	started at 2024-12-20 13:58:46.359 +0400,
	POWCHK disabled, PULCHK disabled
       configuration hash MD5:
       BE 6D 3F 07 2A EA 11 49 91 17 2B D3 AF B3 58 0D
       data hash MD5: 32K
       7C B4 5D 44 9B C2 3E 05 38 A6 9D 3A E1 E9 2E 43>)
(   2,<2024-12-20 14:00:29.859 +0400>,<Irina>,<DPX200>,<TOPSPIN 1.3>,
      <Start of raw data processing
       efp BC_mod = 2 LB = 15 FT_mod = 6 PKNL = 1 PHC0 = 83.64471 PHC1 = -35.63737 SI = 32K 
       data hash MD5: 32K
       39 45 E9 0D 6A 42 8F 13 5A 6E F5 22 BA F9 95 9B>)
(   3,<2024-12-20 14:00:42.843 +0400>,<Irina>,<DPX200>,<TOPSPIN 1.3>,
      <apk 
       data hash MD5: 32K
       DF 62 DF E3 5F 9F 3F 8A DB 5E BC B8 08 B4 A4 5D>)
(   4,<2024-12-20 14:00:45.234 +0400>,<Irina>,<DPX200>,<TOPSPIN 1.3>,
      <abs n ABSG = 5 
       data hash MD5: 32K
       8F B9 95 94 55 68 3B 86 EB F4 20 21 4F B0 66 0F>)
(   5,<2024-12-20 14:01:07.734 +0400>,<Irina>,<DPX200>,<TOPSPIN 1.3>,
      <pk fgphup PHC0 = 117.14 PHC1 = -211.2 
       data hash MD5: 32K
       B3 34 8C 02 A3 09 3D 05 C0 74 B9 37 7C 80 A9 57>)
(   6,<2024-12-20 14:01:09.562 +0400>,<Irina>,<DPX200>,<TOPSPIN 1.3>,
      <abs n ABSG = 5 
       data hash MD5: 32K
       A2 4B D7 30 9F 8C F7 3B 62 A0 B2 1E A3 8F 8B 86>)
$$ ##END=
$$ 
$$ $$ hash MD5
$$ $$ 5E 9D B6 58 06 DC 37 C3 D2 0E 3F 56 5D 83 4D 1E
##$RELAX= 
##$RELAX= 
##$RELAX= 
##$RELAX= 
##$RELAX= 
##$RELAX= 
##$RELAX= 
##$RELAX= 
##$RELAX= 
##$RELAX= 
##$RELAX= 
$$ Bruker specific parameters
$$ --------------------------
##$DU= <F:/spectra>
##$EXPNO= 1
##$NAME= <P31dec>
##$PROCNO= 1
##$TYPE= <nmr>
##$USER= <iren>
##$AMP= (0..31)
100 100 100 100 100 100 100 100 100 100 100 100 100 100 100 100 100 100 
100 100 100 100 100 100 100 100 100 100 100 100 100 100 
##$ANAVPT= -1
##$AQSEQ= 0
##$AQ_mod= 1
##$AUNM= <au_zg>
##$AUTOPOS= <>
##$BF1= 81.014009
##$BF2= 200.13
##$BF3= 200.13
##$BF4= 200.13
##$BF5= 200.13
##$BF6= 200.13
##$BF7= 200.13
##$BF8= 200.13
##$BYTORDA= 1
##$CFDGTYP= 0
##$CFRGTYP= 5
##$CHEMSTR= <none>
$$ [...]
##$SW_h= 37037.037037037
##$TD= 32768
##$TD0= 1
##$TE= 300
##$TE2= 300
##$TE3= 300
##$TEG= 300
##$TL= (0..7)
0 120 53 12 22 120 120 120 
##$TP= (0..7)
150 150 150 150 150 150 150 150 
##$TP07= 0
##$TPNAME0= <>
##$TPNAME1= <>
##$TPNAME2= <>
##$TPNAME3= <>
##$TPNAME4= <>
##$TPNAME5= <>
##$TPNAME6= <>
##$TPNAME7= <>
##$TPOAL= (0..7)
0.5 0.5 0.5 0.5 0.5 0.5 0.5 0.5 
##$TPOFFS= (0..7)
0 0 0 0 0 0 0 0 
##$TUNHIN= 0
##$TUNHOUT= 0
##$TUNXOUT= 0
##$USERA1= <user>
##$USERA2= <user>
##$USERA3= <user>
##$USERA4= <user>
##$USERA5= <user>
##$V9= 5
##$VALIST= <valist>
##$VCLIST= <CCCCCCCCCCCCCCC>
##$VD= 0
##$VDLIST= <DDDDDDDDDDDDDDD>
##$VPLIST= <PPPPPPPPPPPPPPP>
##$VTLIST= <TTTTTTTTTTTTTTT>
##$WBST= 1024
##$WBSW= 4
##$XGAIN= (0..3)
0 0 0 0 
##$XL= 0
##$YL= 0
##$YMAX_a= 1073
##$YMIN_a= -6802
##$ZGOPTNS= <>
##$ZL1= 120
##$ZL2= 120
##$ZL3= 120
##$ZL4= 120
##$ABSF1= 298.5841
##$ABSF2= -158.5842
##$ABSG= 5
##$ABSL= 5
##$ALPHA= 0
##$AQORDER= 0
##$ASSFAC= 0
##$ASSFACI= 0
##$ASSFACX= 0
##$ASSWID= 0
##$AUNMP= <proc_1d>
##$AXLEFT= 0
##$AXRIGHT= 0
##$AXTYPE= 0
##$AXUNIT= <>
##$AZFE= 0.1
##$AZFW= 0.5
##$BCFW= 0
##$BC_mod= 2
##$BYTORDP= 0
##$COROFFS= 0
##$CY= 12.5935478210449
##$DATMOD= 1
##$DC= 0
##$DFILT= <>
##$DTYPP= 0
##$F1P= 47.1127640792319
##$F2P= -24.0371245302204
##$FCOR= 0.5
##$FTSIZE= 32768
##$FT_mod= 6
##$GAMMA= 0
##$GB= 0
##$INTBC= 1
##$INTSCL= 7.269226e-011
##$ISEN= 30
##$LB= 15
##$LEV0= 0
##$LPBIN= 0
##$MAXI= 12.09355
##$MC2= 0
##$MEAN= 0
##$ME_mod= 0
##$MI= 0.7550151
##$NCOEF= 0
##$NC_proc= -14
##$NLEV= 6
##$NOISF1= 298.5841
##$NOISF2= 270.0111
##$NSP= 0
##$NTH_PI= 0
##$NZP= 0
##$OFFSET= 298.5841
##$PC= 1.4
##$PHC0= 152.9391
##$PHC1= -134.1429
##$PH_mod= 1
##$PKNL= yes
##$PPARMOD= 0
##$PPDIAG= 0
##$PPIPTYP= 0
##$PPMPNUM= 100
##$PPRESOL= 1
##$PSCAL= 0
##$PSIGN= 0
##$REVERSE= no
##$SF= 81.014009
##$SI= 32768
##$SIGF1= 270.0111
##$SIGF2= -158.5842
##$SINO= 77.54984
##$SIOLD= 32768
##$SREGLST= <31P.CDCl3>
##$SSB= 0
##$STSI= 32768
##$STSR= 0
##$SW_p= 37037.037037037
##$SYMM= 0
##$S_DEV= 0
##$TDeff= 32768
##$TDoff= 0
##$TI= <>
##$TILT= no
##$TM1= 0
##$TM2= 0
##$TOPLEV= 0
##$USERP1= <user>
##$USERP2= <user>
##$USERP3= <user>
##$USERP4= <user>
##$USERP5= <user>
##$WDW= 1
##$XDIM= 32768
##$YMAX_p= 441055711
##$YMIN_p= -45340778
$$ End of Bruker specific parameters
$$ ---------------------------------
##NTUPLES= NMR SPECTRUM
##VAR_NAME=  FREQUENCY,     SPECTRUM/REAL,   SPECTRUM/IMAG
##SYMBOL=    X,             R,               I
##VAR_TYPE=  INDEPENDENT,   DEPENDENT,       DEPENDENT
##VAR_FORM=  AFFN,          ASDF,            ASDF
##VAR_DIM=   32768,         32768,           32768
##UNITS=     HZ,            ARBITRARY UNITS, ARBITRARY UNITS
##FACTOR=    1.13031516577767, 1,            1
##FIRST=     37037.037037037, 14712387,      -13910145
##LAST=      0,             -12059181,       -23744961
##MIN=       0,             -45340778,       0
##MAX=       37037.037037037, 441055711,     0
$$ Real data points
##PAGE= N=1
##DATA TABLE= (X++(R..R)), XYDATA
$$ [...]
17567b107089j950708j454071r40155m51039n0582J81293K12358J03406k3605
$$ -2107089 -4057797 -5511868 -6452023 -6903062 -6953644 -6772351 -6559993 -6456587 -6480192
17558f480192o2020K4464J94590L63597M53379M24793K82924O5798j76561m00691
$$ -6480192 -6542212 -6517748 -6323158 -5959561 -5506182 -5081389 -4798465 -4732667 -4909228 -5309919
17548e309919n73420o66578o58386n47030l66146j76356k2287J01068K25948L62699
$$ -5309919 -5883339 -6549917 -7208303 -7755333 -8121479 -8297835 -8320122 -8219054 -7993106 -7630407
17538g630407M85837N60364N69658N21686M39136L47660K65070J90335J06374
$$ -7630407 -7144570 -6584206 -6014548 -5492862 -5053726 -4706066 -4440996 -4250661 -4144287
17529d144287Q263o9840o9272M7183K68541N45939Q13362R98928J035884Q85206
$$ -4144287 -4136024 -4205864 -4275136 -4227953 -3959412 -3413473 -2600111 -1601183 -565299 319907
17519C19907N60822J34977k85182n97149p43282p36192o46877n53430m87478m20001
$$ 319907 880729 1015706 730524 133375 -609907 -1346099 -1992976 -2546406 -3033884 -3453885
17509c453885k92920p0390K22805M97092O33558N46531K40793j80846n75566q42909
$$ -3453885 -3746805 -3817195 -3594390 -3097298 -2463740 -1917209 -1676416 -1857262 -2432828 -3275737
17499c275737r67797r95619r67804q75608o69158l08887J92467P68906J323090
$$ -3275737 -4243534 -5239153 -6206957 -7082565 -7751723 -8060610 -7868143 -7099237 -5776147
17490e776147J755837K006805K085606K058219J990833J896309J725096J406328
$$ -5776147 -4020310 -2013505 72101 2130320 4121153 6017462 7742558 9148886
17482I148886R08357K75665l79870r25397j271569j422654j466652j502122j568978
$$ 9148886 10057243 10332908 9953038 9027641 7756072 6333418 4866766 3364644 1795666
17473A795666j642211j673885j631784j505211j292372r99799o55153l11931l7915
$$ 1795666 153455 -1520430 -3152214 -4657425 -5949797 -6949596 -7604749 -7916680 -7954595
17464g954595J10352J21133L9712o3764j41893j84114j85838j13876Q3655M29417
$$ -7954595 -7844243 -7723110 -7683398 -7747162 -7889055 -8073169 -8259007 -8372883 -8289228 -7859811
17454g859811Q78267J322692J644972J784272J767700J685677J641785J712585
$$ -7859811 -6981544 -5658852 -4013880 -2229608 -461908 1223769 2865554 4578139
17446D578139J925380K247048K587103K823250K839815K559726J966696J121155
$$ 4578139 6503519 8750567 11337670 14160920 17000735 19560461 21527157 22648312
17438B2648312J54874p70708j520621k019890k260628k295660k212603k088807
$$ 22648312 22803186 22032478 20511857 18491967 16231339 13935679 11723076 9634269
17430I634269j955145j793673j567224j261487r12886n99001l97375l43983m12399
$$ 9634269 7679124 5885451 4318227 3056740 2143854 1544853 1147478 803495 391096
17421C91096n26058o09546o42552o63198p28261q78325j121924j427623j729081
$$ 391096 -134962 -744508 -1387060 -2050258 -2778519 -3656844 -4778768 -6206391 -7935472
17412g935472j944539j996419j832438j458047r62232m95941j93454r1890j15547
$$ -7935472 -9880011 -11876430 -13708868 -15166915 -16129147 -16625088 -16818542 -16910432 -17025979
17403a7025979j33211m6288J47421L56294M59190L83331J43636j77888m85980
$$ -17025979 -17159190 -17205478 -17058057 -16701763 -16242573 -15859242 -15715606 -15893494 -16379474
17394a6379474p07576p90901p01465m44096q2600K86272N87378P96679R27652
$$ -16379474 -17087050 -17877951 -18579416 -19023512 -19106112 -18819840 -18232462 -17435783 -16508131
17385a6508131J004604J055275J112842J197973J291593J337504J280310J108442
$$ -16508131 -15503527 -14448252 -13335410 -12137437 -10845844 -9508340 -8228030 -7119588
17377g119588Q77102O93371O53283P68172R52693J093900J137613J117627J118611
$$ -7119588 -6242486 -5549115 -4895832 -4127660 -3174967 -2081067 -943454 174173 1292784
17368A292784J212151J403378J618986J744225J677422J375215Q80784L17723
$$ 1292784 2504935 3908313 5527299 7271524 8948946 10324161 11204945 11522668
17360A1522668j59449m35357m88636l97121k81140k25634k47483l25375m40262
$$ 11522668 11363219 10927862 10439226 10042105 9760965 9535331 9287848 8962473 8522211
17351H522211n79713p18696q08814p91100o32505l55278k1381L06967N83231P75812
$$ 8522211 7942498 7223802 6414988 5623888 4991383 4636105 4614724 4921691 5504922 6280734
17341F280734Q77248R06927Q87140Q11846O41023L32131j14536o38386j141825
$$ 6280734 7157982 8064909 8952049 9763895 10404918 10737049 10622513 9984127 8842302
17332H842302j524499j703474j626575j288804p42639r4923N11107R34440J086333
$$ 8842302 7317803 5614329 3987754 2698950 1956311 1861388 2372495 3306935 4393268
17323D393268R68573O82732L91133K26308K09334K55899K58038J51772p3065l93251
$$ 4393268 5361841 6044573 6435706 6662014 6871348 7127247 7385285 7537057 7463992 7070741
17313G070741p73205j177291j572447j926684k206759k376999k409741k309190
$$ 7070741 6297536 5120245 3547798 1621114 -585645 -2962644 -5372385 -7681575
17305g681575k122583j912581j706555j470676j134058o44275k1194O21713J117632
$$ -7681575 -9804158 -11716739 -13423294 -14893970 -16028028 -16672303 -16693497 -16071784 -14954152
17296a4954152J341337J288435J060958P70188M62258J40050j76186m45263o50083
$$ -14954152 -13612815 -12324380 -11263422 -10493234 -10030976 -9890926 -10067112 -10512375 -11162458
17287a1162458q12172r55429j072170j130170j102493r87449q13408o34785n14669
$$ -11162458 -11974630 -12930059 -14002229 -15132399 -16234892 -17222341 -18035749 -18670534 -19185203
17278a9185203m94749n73172p12777q72683j027878j154860j204529j101991p88408
$$ -19185203 -19679952 -20253124 -20965901 -21838584 -22866462 -24021322 -25225851 -26327842 -27116250
17269b7116250k74317L45641R32185J364651J582599J583974J403253J103220
$$ -27116250 -27390567 -27044926 -26112741 -24748090 -23165491 -21581517 -20178264 -19075044
17261a9075044P71878N00203L48765L27600M02478N23396O56200P96951R62621
$$ -19075044 -18303166 -17802963 -17454198 -17126598 -16724120 -16200724 -15544524 -14747573 -13784952
17252a3784952J166075J393052J601695J745803J793786J725938J533425J239862
$$ -13784952 -12618877 -11225825 -9624130 -7878327 -6084541 -4358603 -2825178 -1585316
17244a585316R18921O68849N53750N65107O38774P08017P39631P21659O30928
$$ -1585316 -666395 2454 556204 1121311 1760085 2468102 3207733 3929392 4560320
17235D560320M31316J11054k81077o40480q51926q43593o18045k41635J99922
$$ 4560320 4991636 5102690 4821613 4181133 3329207 2485614 1867569 1625934 1825856
17226A825856O40699J035773J344175J531719J584895J506017J297256R59421
$$ 1825856 2466555 3502328 4846503 6378222 7963117 9469134 10766390 11725811
17218A1725811N09943r30m98177r09445j183346j287717j212256r87901o94959
$$ 11725811 12235754 12234824 11736647 10827202 9643856 8356139 7143883 6155982 5461023
17209E461023m37011k97353l15255n00727q61737j397120k048617k667001l046959
$$ 5461023 5024012 4726659 4411404 3910677 3048940 1651820 -396797 -3063798 -6110757
17200f110757l020844k548541j745780q34415m6051M63746O48092N48908K62529
$$ -6110757 -9131601 -11680142 -13425922 -14260337 -14306388 -13842642 -13194550 -12645642 -12383113
17191a2383113q0366l36918l96762k27477J15246N20458Q76418J115392J223711
$$ -12383113 -12463479 -12800397 -13197159 -13424636 -13309390 -12788932 -11912514 -10797122 -9573411
17182i573411J218778J124134R64070P68247N71209M03652K81277K04736J78710
$$ -9573411 -8354633 -7230499 -6266429 -5498182 -4926973 -4523321 -4242044 -4037308 -3858598
17173c858598K26705L72026O01454Q51577J031544J067522R36273O64272L03576
$$ -3858598 -3631893 -3259867 -2658413 -1806836 -775292 292230 1228503 1892775 2196351
17164B196351r0299m68635p93333j043329j219313j333197j391322j396555j364249
$$ 2196351 2106052 1637417 844084 -199245 -1418558 -2751755 -4143077 -5539632 -6903881
17155f903881j322510j294412j285484j282368j256600j179473j041078q48811
$$ -6903881 -8226391 -9520803 -10806287 -12088655 -13345255 -14524728 -15565806 -16414617
17147a6414617o05636l00883P1705M92267R11141J261317J483279J554705J498851
$$ -16414617 -17020253 -17321136 -17249431 -16757164 -15846023 -14584706 -13101427 -11546722 -10047871
17138a0047871J358586J168069R58435P77056O65984O04230M90428K04515l06325
$$ -10047871 -8689285 -7521216 -6562781 -5785725 -5119741 -4515511 -4025083 -3820568 -4126893
17129d126893r92902j738589k423357k967727l339174l535395l566948l449635
$$ -4126893 -5119795 -6858384 -9281741 -12249468 -15588642 -19124037 -22690985 -26140620
17121b6140620l201630k839979k377176j818438j166712m45214K77292Q91663
$$ -26140620 -29342250 -32182229 -34559405 -36377843 -37544555 -37989769 -37712477 -36820814
17113c6820814J290318J418154J303193J051842Q06665O85010P32166R08301J106363
$$ -36820814 -35530496 -34112342 -32809149 -31757307 -30950642 -30265632 -29533466 -28625165 -27518802
17104b7518802J198944J104092Q27177M41740L1139l53585o93808r80167j194563
$$ -27518802 -26319858 -25215766 -24388589 -23946849 -23915710 -24269295 -24963103 -25943270 -27137833
17095b7137833j305835j270529j038943n79338Q2604Q42716J547357K056385K290771
$$ -27137833 -28443668 -29714197 -30753140 -31332478 -31249874 -30407158 -28859801 -26803416 -24512645
17086b4512645K241316J951922J496666R60739M26983l4082l72780n66068o21300
$$ -24512645 -22271329 -20319407 -18822741 -17862002 -17435019 -17469101 -17841881 -18407949 -19029249
17077a9029249n78581m98105m25693l67124l02293k22650j52757j37537k09060
$$ -19029249 -19607830 -20105935 -20531628 -20898752 -21201045 -21423695 -21576452 -21713989 -21923049
17068b1923049l65653n79219q15698j047264j249113j388843j422043j306890
$$ -21923049 -22288702 -22867921 -23683619 -24730883 -25979996 -27368839 -28790882 -30097772
17060c0097772j035387o49147k10326K50116P48333J306687J901679K456383K881102
$$ -30097772 -31133159 -31782306 -31992632 -31742516 -30994183 -29687496 -27785817 -25329434 -22448332
17051b2448332L118716L157035L010839K697430K225071J607756R00652K20168
$$ -22448332 -19329616 -16172581 -13161742 -10464312 -8239241 -6631485 -5730833 -5510665
17043e510665k82198m80174l28224J14848P04881J275054J715812K012638K211336
$$ -5510665 -5792863 -6273037 -6601261 -6486413 -5781532 -4506478 -2790666 -778028 1433308
17034A433308K358453K472426K543797K546635K454315K248040J916342J457510
$$ 1433308 3791761 6264187 8807984 11354619 13808934 16056974 17973316 19430826
17026A9430826Q84755K25909m76073j156355j733124k137756k347952k392666
$$ 19430826 20315581 20541490 20065417 18909062 17175938 15038182 12690230 10297564
17018A0297564k327683k206452k067355j937139j838617j795462j829250j944604
$$ 10297564 7969881 5763429 3696074 1758935 -79682 -1875144 -3704394 -5648998
17010e648998k113376k278831k382911k398455k342982k255983k153298k004187
$$ -5648998 -7762374 -10041205 -12424116 -14822571 -17165553 -19421536 -21574834 -23579021
17002b3579021j750376j338266p43420K641P92835J468276J886341J987777J820858
$$ -23579021 -25329397 -26667663 -27411083 -27408442 -26615607 -25147331 -23260990 -21273213 -19452355
16993a9452355J515457J225469J065816J071987J198613J348034J417072J354722
$$ -19452355 -17936898 -16711429 -15645613 -14573626 -13375013 -12026979 -10609907 -9255185
16985i255185J190504R91461P85421N37944K06500j95369n93509r02881j072876
$$ -9255185 -8064681 -7073220 -6287799 -5749855 -5543355 -5738724 -6332233 -7235114 -8307990
16976h307990j093394r79442p63874n01287k63144j12305p4060j29294k33934
$$ -8307990 -9401384 -10380826 -11144700 -11645987 -11909131 -12021436 -12095496 -12224790 -12458724
16967a2458724l47353m47890n26593n69797n50949m42608k38766L1012L09747
$$ -12458724 -12806077 -13253967 -13780560 -14350357 -14901306 -15343914 -15582680 -15551668 -15241921
16958a5241921N42498P00192P75560P67169O78233N30759L76430K83094K92459
$$ -15241921 -14699423 -13999231 -13223671 -12456502 -11778269 -11247510 -10871080 -10587986 -10295527
16949a0295527L82475M78621N10712M61797L67249K77173K27483K35764L00106
$$ -10295527 -9913052 -9434431 -8923719 -8461922 -8094673 -7817500 -7590017 -7354253 -7054147
16940g054147L95530M84289N40277N69961O11378P06729Q70640J078778J275845
$$ -7054147 -6658617 -6174328 -5634051 -5064090 -4452712 -3745983 -2875343 -1796565 -520720
16931e20720J395363J391105J263112J050317P94647N16102K20863p7534l49412
$$ -520720 874643 2265748 3528860 4579177 5373824 5889926 6110789 6033255 5683843
16922E683843n51682o40547o05957n02484m23439m29846n10508o08065o70478
$$ 5683843 5132161 4491614 3885657 3383173 2959734 2529888 2019380 1411315 740837
16913G40837o79391o44318n82678n12356m60820m68414n75328q05432j151954
$$ 740837 61446 -582872 -1165550 -1677906 -2138726 -2607140 -3182468 -3987900 -5139854
16904e139854j563106j944539k191251k228417k031552j620078j042365l65689
$$ -5139854 -6702960 -8647499 -10838750 -13067167 -15098719 -16718797 -17761162 -18126851
16896a8126851L38464J012595J605002K038875K218488K096071J729575J260750
$$ -18126851 -17788387 -16775792 -15170790 -13131915 -10913427 -8817356 -7087781 -5827031
16888e827031Q40253N71600M95794N96106Q09503J048504J232997J311075J254139
$$ -5827031 -4986778 -4415178 -3919384 -3323278 -2513775 -1465271 -232274 1078801 2332940
16879B332940J048595P07873K88111j20706m28501n87319o18755n96936n87341
$$ 2332940 3381535 4089408 4377519 4256813 3828312 3240993 2622238 2025302 1437961
16870A437961n93156n59796m29353j99861N0766J97728J43241j20949n06005q68891
$$ 1437961 844805 285009 -144344 -344205 -293439 -95711 47530 -73419 -579424 -1448315
16860a448315j068725j016271p15872k74695J52459M49350N78551N57011M16478
$$ -1448315 -2517040 -3533311 -4249183 -4523878 -4371419 -3922069 -3343518 -2786507 -2370029
16851b370029J89383q2592l41941n27031n94191n35739l91326k44357j86415k61387
$$ -2370029 -2180646 -2263238 -2605179 -3132210 -3726401 -4262140 -4653466 -4897823 -5084238 -5345625
16841e345625m34046o08359o79936n96069l94844j88717r2554j54263l41692n76182
$$ -5345625 -5779671 -6388030 -7067966 -7664035 -8058879 -8247596 -8340150 -8494413 -8836105 -9412287
16831i412287p73120q71431q47628p08032m70740j60990J80624M98632P40711
$$ -9412287 -10185407 -11056838 -11904466 -12612498 -13083238 -13244228 -13063604 -12564972 -11824261
16822a1824261Q74567Q84373P64478N37678K74645O5952l9146o0005n3788o5581
$$ -11824261 -10949694 -10065321 -9300843 -8763165 -8488520 -8422568 -8461714 -8521719 -8575507 -8641088
16812h641088r8174j13027n9066R3475L42591O69291J054798J476991J889486
$$ -8641088 -8739262 -8852289 -8911355 -8817880 -8475289 -7805998 -6751200 -5274209 -3384723
16803c384723K221930K422581K496139K482346K399631K219188J891252J398441
$$ -3384723 -1162793 1259788 3755927 6238273 8637904 10857092 12748344 14146785
16795A4146785P95020J95498k88741o18219q40254j037823j263688j511841j728794
$$ 14146785 14941805 15137303 14848562 14230343 13390089 12352266 11088578 9576737 7847943
16786G847943j845262j813383j631013j341740j016275p21888m88288k96178j06657
$$ 7847943 6002681 4189298 2558285 1216545 200270 -521618 -1009906 -1306084 -1412741
16777a412741R7276L04868N07974P20726R57918J192671J343288J314877J062265
$$ -1412741 -1315465 -1010597 -502623 218103 1176021 2368692 3711980 5026857 6089122
16768F089122O16742O7065m70354q83956j114428j184282j167617j123319j052104
$$ 6089122 6705864 6772929 6302575 5418619 4304191 3119909 1952292 828973 -223131
16759b23131r06318o35216k30844K49770O94736R78768J019878Q18224M50751
$$ -223131 -1129449 -1764665 -1995509 -1745739 -1051003 -72235 947643 1765867 2216618
16750B216618L0426l31375n43673n62826m24948k31887q0622l368K5509M4839
$$ 2216618 2247044 1915669 1371996 809170 384222 152335 71713 68345 93854 138693
16740A38693Q4247J66727L02014M73365O44285P83225Q83265R62535J043466J122520
$$ 138693 222940 389667 691681 1165046 1809331 2592556 3475821 4438356 5481822 6604342
16730F604342J159834J109039R63324P68431N84307M30090K65198K6000l17164
$$ 6604342 7764176 8873215 9836539 10604970 11189277 11619367 11884565 11910565 11593401
16721A1593401p37344j176543j579406j898548k083789k088120j896559j553619
$$ 11593401 10856057 9679514 8100108 6201560 4117771 2029651 133092 -1420527
16713a420527j159475q25745o16147n16836m62047l90487k85723j80376j31840
$$ -1420527 -2580002 -3405747 -4021894 -4538730 -5000777 -5391264 -5676987 -5857363 -5989203
16704e989203j87987l65133o45790r86086j321742j570122j642284j478283j087495
$$ -5989203 -6177190 -6542323 -7188113 -8174199 -9495941 -11066063 -12708347 -14186630 -15274125
16695a5274125n58826k8415L78391N98060O38125N38908L29924K4870l50002p28515
$$ -15274125 -15832951 -15861366 -15482975 -14884915 -14246790 -13707882 -13377958 -13353088 -13703090 -14431605
16685a4431605j005612j076276q95528n16290o2317L54739P02035J015241J325718
$$ -14431605 -15437217 -16513493 -17409021 -17925311 -17987628 -17632889 -16930854 -15915613 -14589895
16676a4589895J593859J710773J572438J166302O02442O9385k54987k83213m3320
$$ -14589895 -12996036 -11285263 -9712825 -8546523 -7944081 -7874696 -8129683 -8412896 -8456216
16667h456216L55357P85384J154343J411730J510752J383003R73709L05083n03116
$$ -8456216 -8100859 -7315475 -6161132 -4749402 -3238650 -1855647 -881938 -576855 -1079971
16658a079971j277255j860580k165527k188384j991976j667535j291847r03539
$$ -1079971 -2357226 -4217806 -6383333 -8571717 -10563693 -12231228 -13523075 -14426614
16650a4426614n10826j18261K52599N64704P83885Q96192R12850Q64425P87978
$$ -14426614 -14937440 -15055701 -14803102 -14238398 -13454513 -12558321 -11645471 -10781046 -9993068
16641i993068P11470O51231O29919O81277Q15842R87240J109086J108019R62506
$$ -9993068 -9281598 -8630367 -8000448 -7319171 -6503329 -5516089 -4407003 -3298984 -2336478
16632b336478P06893M11223J51963j3416o1970j1006R1457J94978K77880L53481
$$ -2336478 -1629585 -1218362 -1066399 -1079815 -1141785 -1152791 -1061334 -866356 -588476 -234995
16622b34995M44397N51522O44221O73524O02153M37819K32241L2769j56204l53307
$$ -234995 209402 760924 1405145 2078669 2680822 3118641 3350882 3383651 3227447 2874140
16612B874140n58071p42750q71190r07053q07200n27488n8908N31279J109942
$$ 2874140 2316069 1573319 702129 -204924 -1012124 -1539612 -1598520 -1067241 42701
16603D2701J548908J788857J845724J781592J674157J588395J555186J569102
$$ 42701 1591609 3380466 5226190 7007782 8681939 10270334 11825520 13394622
16595A3394622J599276J600214J524321J340453J052822P10011L96364K04755
$$ 13394622 14993898 16594112 18118433 19458886 20511708 21221719 21618083 21822838
16587B1822838K01362M00356P56267J171881J522209J691744J609244J262895
$$ 21822838 22024200 22424556 23180823 24352704 25874913 27566657 29175901 30438796
16579C0438796O93672k3054p94226j518933k100330k465123k582518k474084k212690
$$ 30438796 31132468 31109414 30315188 28796255 26695925 24230802 21648284 19174200 16961510
16570A6961510j905993j659056j530342j509414j527584j493627j340388j057471
$$ 16961510 15055517 13396461 11866119 10356705 8829121 7335494 5995106 4937635
16562D937635o85746k79046J31660N40246R36122J277420J496494J530225J344375
$$ 4937635 4251889 3972843 4104503 4644749 5580871 6858291 8354785 9885010 11229385
16553A1229385R37216L39337l75257j087113j664072k016249k132548k069156
$$ 11229385 12166601 12505938 12130681 11043568 9379496 7363247 5230699 3161543
16545C161543j901246j685017j457912j249720j070431q91150o62064l66541n6744
$$ 3161543 1260297 -424720 -1882632 -3132352 -4202783 -5093933 -5755997 -6122538 -6179282
16536f179282J66663K13604N9481k36515n58003p83097q26803o60130l15881J15341
$$ -6179282 -6012619 -5799015 -5739534 -5976049 -6534052 -7317149 -8143952 -8804082 -9119963 -9004622
16526i004622N09215P56670Q15456P25135N73386M42008L70167L53964L72437
$$ -9004622 -8495407 -7738737 -6923281 -6198146 -5624760 -5182752 -4812585 -4458621 -4086184
16517d086184M10368M63625N41925O71315Q69802J105486J298253J380667J347104
$$ -4086184 -3675816 -3212191 -2670266 -1998951 -1129149 -23663 1274590 2655257 4002361
16508D002361J233945J070280Q66106O36656M17248K46939J40774Q4362M8014
$$ 4002361 5236306 6306586 7172692 7809348 8226596 8473535 8614309 8698671 8746685
16499H746685j1480j56243m46433q98646j461063k023069k454601k667872k673755
$$ 8746685 8735205 8578962 8132529 7233883 5772820 3749751 1295150 -1372722 -4046477
16490d046477k579194k508852k512153k535433k474110k253846j882997j444007
$$ -4046477 -6625671 -9134523 -11646676 -14182109 -16656219 -18910065 -20793062 -22237069
16482b2237069j031583o93588m27900k23263q8683m0829o8523j17679j21199m5116
$$ -22237069 -23268652 -23962240 -24390140 -24613403 -24702086 -24742915 -24811438 -24929117 -25050316 -25095432
16472b5095432J00033K87766N05250P56575J044219J352087J649009J904540K101162
$$ -25095432 -24995399 -24707633 -24202383 -23445808 -22401589 -21049502 -19400493 -17495953 -15394791
16463a5394791K242908K355620K463931K556676K578405K461824K172093J729307
$$ -15394791 -13151883 -10796263 -8332332 -5775656 -3197251 -735427 1436666 3165973
16455C165973J206138P05993L18993Q0401k5631k8078M6888J58951K53900L09018
$$ 3165973 4372111 5078104 5397097 5477498 5451867 5423789 5470677 5629628 5883528 6192546
16445F192546L73938N42624Q74411J339368J826837K196346K331237K174924J750033
$$ 6192546 6566484 7109108 7983519 9322887 11149724 13346070 15677307 17852231 19602264
16436A9602264J158932N57271J00451j17101j03336K9844J15797J9464k85239
$$ 19602264 20761196 21318467 21418918 21301817 21198481 21228325 21344122 21363586 21078347
16427B1078347p06934j117609j455446j748586k041577k309031k444585k331365
$$ 21078347 20371413 19253804 17798358 16049772 14008195 11699164 9254579 6923214
16419F923214j928250j300777n80358J02513O55253J022427J179367J130726R01286
$$ 6923214 4994964 3694187 3113829 3216342 3871595 4894022 6073389 7204115 8105401
16410H105401N37194J34818j51326j75735R3068N28516R07687J029145Q08719
$$ 8105401 8642595 8777413 8626087 8450352 8543420 9071936 9979623 11008768 11817487
16401A1817487L07298l11612q59975j197097j268535j101823p73639l72908L0171
$$ 11817487 12124785 11813173 10953198 9756101 8487566 7385743 6612104 6239196 6269367
16392F269367L96462O96547Q82338R00149P39380M69174K32025J78890L65888
$$ 6269367 6665829 7362376 8244714 9144863 9884243 10353417 10585442 10764332 11130220
16383A1130220O99520J001650J144499J125119J011883Q37002N58612J14840n03554
$$ 11130220 11829740 12831390 13975889 15101008 16112891 16949893 17508505 17623345 17119791
16374A7119791j217140j867314k271816k306331j959534j325862n57391J87863
$$ 17119791 15902651 14035337 11763521 9457190 7497656 6171794 5614403 5802266
16366E802266P90228J192818J384599J362558J129295P32255K74044j47901n02996
$$ 5802266 6592494 7785312 9169911 10532469 11661764 12394019 12668063 12520162 12017166
16357A2017166q09078j066940j239840j298857j274897j257136j333766j532332
$$ 12017166 11208088 10141148 8901308 7602451 6327554 5070418 3736652 2204320
16349B204320j815833k121702k393661k591151k685979k650584k453523k078358
$$ 2204320 388487 -1733215 -4126876 -6718027 -9404006 -12054590 -14508113 -16586471
16341a6586471j553760r63406m20508k3341J80866K05674J12141p955n1409N9114
$$ -16586471 -18140231 -19103637 -19524145 -19547486 -19366620 -19160946 -19048805 -19056760 -19108169 -19049055
16331a9049055L31390O91441J021897J226817J275973J201995J065055R22565
$$ -19049055 -18717665 -18026224 -17004327 -15777510 -14501537 -13299542 -12234487 -11311922
16323a1311922Q25618Q22786R44328J180249J482454J791955K064276K268645
$$ -11311922 -10486304 -9663518 -8719190 -7538941 -6056487 -4264532 -2200256 68389
16315F8389K366469K299457K007898J467324P19639j12403q39377j264991j279051
$$ 68389 2434858 4734315 6742213 8209537 8929176 8816773 7977396 6712405 5433354
16306E433354r24097l71214J84549O20703R13103J103910J249579J382286J503442
$$ 5433354 4509257 4138043 4322592 4943295 5856398 6960308 8209887 9592173 11095615
16297A1095615J589270J590305J444702J112567O02994k0880o49613j153175j430178
$$ 11095615 12684885 14275190 15719892 16832459 17435453 17414573 16764960 15611785 14181607
16288A4181607j449289j244506q75274m02454R9630N31160P88259Q09733O14590
$$ 14181607 12732318 11487812 10612538 10210084 10309714 10840874 11629133 12438866 13053456
16279A3053456K99259o234j94421k19325j02987R1455K98873M71853N76358N87512
$$ 13053456 13352715 13346481 13152060 12932735 12829748 12921203 13220076 13691929 14268287 14855799
16269A4855799N00158L39303J50892j9885j40911j96409j93842j66839j62433
$$ 14855799 15355957 15695260 15846152 15826267 15685356 15488947 15295105 15128266 14965833
16260A4965833k18985l44279m98702n94282n23468k12730L26600R77960J553622
$$ 14965833 14746848 14402569 13903867 13309585 12786117 12573387 12899987 13877947 15431569
16251A5431569J887648J923799J712013J331171Q38396K80459k86559q06602j238239
$$ 15431569 17319217 19243016 20955029 22286200 23124596 23405055 23118496 22311894 21073655
16242B1073655j546870j691648j637703j383604r70960m71943K9320M59349P81068
$$ 21073655 19526785 17835137 16197434 14813830 13842870 13370927 13400247 13859596 14640664
16233A4640664J006869J180047J327317J424810J421772J297586J082511Q26757
$$ 14640664 15647533 16827580 18154897 19579707 21001479 22299065 23381576 24208333
16225B4208333N68806L39261J77680J21394J65145K36290K26407N9479k67742
$$ 24208333 24777139 25116400 25294080 25415474 25580619 25816909 26043316 26102795 25835053
16216B5835053o99890j157954j562288j845481j967541j927870j750569j443300
$$ 25835053 25135163 23977209 22414921 20569440 18601899 16674029 14923460 13480160
16208A3480160r81236l53983L74947J069612J582816J827034J812912J629873
$$ 13480160 12498924 12144941 12519888 13589500 15172316 16999350 18812262 20442135
16200B0442135J381772J132157Q94020O52315L91890J12097j71680m29153o19847
$$ 20442135 21823907 22956064 23850084 24502399 24894289 25006386 24834706 24405553 23785706
16191B3785706p03714o51130m51072j20303K88742O86570R63538J032824Q73776
$$ 23785706 23081992 22430862 21979790 21859487 22148229 22834799 23798337 24831161 25704937
16182B5704937N32496Q2039m03921q43341j147796j264074j219213j114834j068934
$$ 25704937 26237433 26319472 25915551 25072210 23924414 22660340 21441127 20326293 19257359
16173A9257359j155515j381838j701672k043232k332167k504560k523546k405697
$$ 19257359 18101844 16720006 15018334 12975102 10642935 8138375 5614829 3209132
16165C209132k226762k074557j976917j879375j706195j443031j149386q95172
$$ 3209132 982370 -1092187 -3069104 -4948479 -6654674 -8097705 -9247091 -10142263
16157a0142263p05090n64218m47948l31836j96032m2366R7698J78732J64676M7333
$$ -10142263 -10847353 -11411571 -11859519 -12191355 -12387387 -12429753 -12332055 -12153323 -11988647 -11941314
16147a1941314j45516l61463n45283o51780o52198n39404l22416j4844L64088
$$ -11941314 -12086830 -12448293 -12993576 -13645356 -14297554 -14836958 -15159374 -15174218 -14810130
16138a4810130P77187J168259J480326J673516J723021J608187J320769Q90756
$$ -14810130 -14032943 -12864684 -11384358 -9710842 -7987821 -6379634 -5058865 -4168109
16130d168109L89483j13761n99025j082345j551040j926397k098746k000967j652401
$$ -4168109 -3778626 -3892387 -4491412 -5573757 -7124797 -9051194 -11149940 -13150907 -14803308
16121a4803308j139099n66379l6809L53131N33153M94065L12272J43050J67458
$$ -14803308 -15942407 -16508786 -16545595 -16192464 -15659311 -15165246 -14852974 -14709924 -14542466
16112a4542466N07216J159323J990184K786035L333542L496610L256515K705288
$$ -14542466 -14035250 -12875927 -10885743 -8099708 -4766166 -1269556 1986959 4692247
16104D692247K003133J312153P33129K90194l1522k52559m05098n38590o90004
$$ 4692247 6695380 8007533 8740662 9030856 8999334 8746775 8341677 7803087 7113083
16095G113083q53369r92565j083806j137964j178970j209090j202129j119626
$$ 7113083 6259714 5267149 4183343 3045379 1866409 657319 -544810 -1664436
16087a664436r23113n85577j13081M44247J012991J528871J946822K229448K343969
$$ -1664436 -2587549 -3173126 -3286207 -2841960 -1828969 -300098 1646724 3876172 6220141
16078F220141K279082K057369J721761J313048Q71034M51667J16970j05239k42616
$$ 6220141 8499223 10556592 12278353 13591401 14462435 14914102 15031072 14925833 14683217
16069A4683217l51911m77971o44425q63866j130415j410441j661208j859779k010892
$$ 14683217 14331306 13853335 13208910 12345044 11214629 9804188 8142980 6283201 4272309
16060D272309k134690k247696k338495k351689k206489j846027j279704n81479
$$ 4272309 2137619 -110077 -2448572 -4800261 -7006750 -8852777 -10132481 -10713960
16052a0713960J57295Q79053J572239K243651K879756L426133L806131L968212
$$ -10713960 -10556665 -9677612 -8105373 -5861722 -2981966 444167 4250298 8218510
16044H218510L915388L688719L333798K893198K421477J981015J605778J274758
$$ 8218510 12133898 15822617 19156415 22049613 24471090 26452105 28057883 29332641
16036B9332641R34603N56893J74951j39323l39275m47179n40070o96453r50870
$$ 29332641 30267244 30824137 30999088 30859765 30520490 30073311 29533241 28836788 27885918
16027B7885918j279521j604317j808483j778648j466378r26437l00732K40637
$$ 27885918 26606397 25002080 23193597 21414949 19948571 19022134 18721402 18962039
16019A8962039N62380N99544L65751m8630m96296q30568r80903r87472r52210
$$ 18962039 19524419 20123963 20489714 20441084 19944788 19114220 18133317 17145845 16193635
16010A6193635r37815r08618p75830n00984j50902J38435K35972P0000l46416
$$ 16193635 15255820 14347202 13571372 13070388 12919486 13057921 13293893 13363893 13017477
16001A3017477r18197j508162j995542k308113k420258k346003k130887j830515
$$ 13017477 12099280 10591118 8595576 6287463 3867205 1521202 -609685 -2440200
15993b440200j487008j116765p11613k61619K05449O08755Q56322R09766P98723
$$ -2440200 -3927208 -5043973 -5755586 -6017205 -5811756 -5203001 -4346679 -3436913 -2638190
15984b638190N69452K37899j89782o60852j062620j275685j244714j003769o37771
$$ -2638190 -2068738 -1830839 -2020621 -2681473 -3744093 -5019778 -6264492 -7268261 -7906032
15975g906032k19983K16289O57290J078787J440409J696124J805918J756836J588592
$$ -7906032 -8126015 -7909726 -7252436 -6173649 -4733240 -3037116 -1231198 525638 2114230
15966B114230J383356J211006J085601R70834Q15444N98977L70509K36322K84573
$$ 2114230 3497586 4708592 5794193 6765027 7580471 8179448 8549957 8786279 9070852
15957I070852N12609Q18936J053461J087914Q68053M23436j51463p23645j159942
$$ 9070852 9583461 10402397 11455858 12543772 13411825 13835261 13683798 12960153 11800211
15948A1800211j375132j362624j185620r38395p06026n38349m40526l86758l53097
$$ 11800211 10425079 9062455 7876835 6938440 6232414 5694065 5253539 4866781 4513684
15939D513684l40082l61052m10055m50017m41766l81353k98337k20015j50905
$$ 4513684 4173602 3812550 3402495 2952478 2510712 2129359 1831022 1611007 1460102
15930A460102q7007k9683L1013J36675L35713O25623R30449J138766J160483R62614
$$ 1460102 1373095 1343412 1374425 1511100 1846813 2472436 3402885 4541651 5702134 6664748
15920F664748N76595Q5620l93956p39823q75192q18990o77616n71500n54821n86341
$$ 6664748 7241343 7326963 6933007 6193184 5317992 4499002 3821386 3249886 2695065 2108724
15910B108724n67178m18394j44144J63114L75892M11722K94217J44178R3013J86944
$$ 2108724 1541546 1123152 979008 1142122 1518014 1929736 2223953 2368131 2461144 2648088
15900B648088L62280M99122M94287L06897k3833l91351o79314q34267q88938r13124
$$ 2648088 3010368 3509490 4003777 4310674 4286841 3895490 3216176 2381909 1492971 579847
15890E79847r41848r51237r00730p88068o52727n32743m34654l46707k65660j99261
$$ 579847 -362001 -1313238 -2213968 -3002036 -3654763 -4187506 -4622160 -4968867 -5234527 -5433788
15880e433788j48377j01541n2926j4867m32M680M7298J82031M32806P65035J092305
$$ -5433788 -5582165 -5683706 -5736632 -5751499 -5751931 -5747251 -5699953 -5517922 -5085116 -4320081 -3227776
15869c227776J318680J386663J298360J100106Q51333O10419M37770L90051M96756
$$ -3227776 -1909096 -522433 775927 1876033 2727366 3337785 3775555 4165606 4662362
15860D662362P38211J051840J372959J674143J955839K197208K331462K281167
$$ 4662362 5400573 6452413 7825372 9499515 11455354 13652562 15984024 18265191
15852A8265191K012354J543884R17646J90419n49298j195333j671501j954259
$$ 18265191 20277545 21821429 22739075 22929494 22380196 21184863 19513362 17559103
15844A7559103k045503j938777j627493j145448n84832o0779L40510N74056O17510
$$ 17559103 15513600 13574823 11947330 10801882 10217050 10156271 10496781 11070837 11688347
15835A1688347M73568J87463j72196n53709r21723j228936j423386j490102j468746
$$ 11688347 12161915 12349378 12177182 11623473 10701750 9472814 8049428 6559326 5090580
15826E090580j425128j409918j439422j503217j579635j642060j662787j628895
$$ 5090580 3665452 2255534 816112 -687105 -2266740 -3908800 -5571587 -7200482
15818g200482j555877j467920j358806j184933r02248n07867m9979L90728P21915
$$ -7200482 -8756359 -10224279 -11583085 -12768018 -13670266 -14178133 -14228112 -13837384 -13115469
15809a3115469Q58416P54011M38935K7029l29417n08076m56488j86952K44897
$$ -13115469 -12257053 -11503042 -11064107 -11037078 -11366495 -11874571 -12331059 -12518011 -12273114
15800a2273114P51492J228384J591744J823693J990905K205706K537618K945270
$$ -12273114 -11521622 -10293238 -8701494 -6877801 -4886896 -2681190 -143572 2801698
15792B801698L296437L456043L360064L026547K520909J917773J284243O77325
$$ 2801698 6098135 9554178 12914242 15940789 18461698 20379471 21663714 22341039
15784B2341039J37645l22256p18567j070640j364777j546788j557413j380512
$$ 22341039 22478684 22156428 21437861 20367221 19002444 17455656 15898243 14517731
15776A4517731j061854o80487k95478Q2437M65470Q39102J149101J343905J421978
$$ 14517731 13455877 12775390 12479912 12562349 13027819 13866921 15016022 16359927 17781905
15767A7781905J429348J411342J366964J249334J011657O52271K14443k47860
$$ 17781905 19211253 20622595 21989559 23238893 24250550 24902821 25117264 24869404
15759B4869404o95414j106260j469255j773431j996048k103846k073198j913840
$$ 24869404 24173990 23067730 21598475 19825044 17828996 15725150 13651952 11738112
15751A1738112j675929j429738j223190j048232q53201n92921k67783P4520L63990
$$ 11738112 10062183 8632445 7409255 6361023 5507822 4914901 4647118 4721638 5085628
15742E085628N49609O43222P22306Q65179J075300J276173J373040J310942J093496
$$ 5085628 5635237 6278459 7000765 7865944 8941244 10217417 11590457 12901399 13994895
15733A3994895P78258M59373K34077J66349K66580M91697P61918R86880J092288
$$ 13994895 14773153 15232526 15466603 15632952 15899532 16391229 17153147 18140027 19232315
15724A9232315J039733Q35746N31173K10399l3855j34299p5950R9561L22344N35177
$$ 19232315 20272048 21107794 21638967 21849366 21815511 21681212 21605262 21704823 22027167 22562344
15714B2562344P01693P79007P09710M63791Q8449k97296n72931o90201o84322
$$ 22562344 23264037 24043044 24752754 25216545 25304994 25007698 24434767 23744566 23060244
15705B3060244o33420o20926p15153r44640j271553j597222j810350j838768j664856
$$ 23060244 22426824 21805898 21090745 20146105 18874552 17277330 15466980 13628212 11963356
15696A1963356j313279q47362l74922j9436J57666K18492L14684N68170R68321
$$ 11963356 10650077 9802715 9427793 9408357 9566023 9784515 10099199 10667369 11635690
15687A1635690J371588J599950J562024J307355R79628P16191N71630N09688M54991
$$ 11635690 13007278 14607228 16169252 17476607 18456235 19172426 19744056 20253744 20708735
15678B0708735L56527K16181P5773j8802n6632p5457j38468l06622o25300j102005
$$ 20708735 21065262 21281443 21357216 21338414 21281782 21206325 21067857 20761235 20135935 19033930
15668A9033930j675890k218285k578815k651044k421826j975161j444398r47256
$$ 19033930 17358040 15139755 12560940 9909896 7488070 5512909 4068511 3121255
15660C121255n48351k59225n4915J14111L11417N92309R77874J442564J920654
$$ 3121255 2572904 2313679 2258764 2372875 2684292 3276601 4254475 5697039 7617693
15651G617693K331719K614608K745350K734773K629211K509346K453704K481324
$$ 7617693 9949412 12564020 15309370 18044143 20673354 23182700 25636404 28117728
15643B8117728K533811K515053K349174K017797J567534J093862P03282M60926
$$ 28117728 30651539 33166592 35515766 37533563 39101097 40194959 40898241 41359167
15635D1359167L59472L43301L57206L57538K88463P5019l46247r73764j702098
$$ 41359167 41718639 42061940 42419146 42776684 43065147 43140166 42793919 41820155 40118057
15626D0118057k348461k744763k819971k612157k229386j803169j443144j191846
$$ 40118057 37769596 35024833 32204862 29592705 27363319 25560150 24117006 22925160
15618B2925160j007369q01077n06729j23513K95153O86578J019847J307957J588304
$$ 22925160 21917791 21116714 20609985 20486472 20781625 21468203 22488050 23796007 25384311
15609B5384311J889315K206022K496540K698393K751001K609676K252799J686266
$$ 25384311 27273626 29479648 31976188 34674581 37425582 40035258 42288057 43974323
15601D3974323R44740R5639p62341j530392k152592k616163k906823k982094k800950
$$ 43974323 44919063 45014702 44252361 42721969 40569377 37953214 35046391 32064297 29263347
15592B9263347k376509j797006j195728o85665k97699K5597L67169P58297J152145
$$ 29263347 26886838 25089832 23894104 23208439 22910740 22936337 23303506 24061803 25213948
15583B5213948J456778J591274J532468J334152J103643R43731R01202R55862
$$ 25213948 26670726 28262000 29794468 31128620 32232263 33175994 34077196 35033058
15575C5033058J044784J102305J102777J076819J082919J175558J401433J781871
$$ 35033058 36077842 37180147 38282924 39359743 40442662 41618220 43019653 44801524
15567D4801524K261521K692059K896889K764721K299176J608276Q61303K37542
$$ 44801524 47063045 49755104 52651993 55416714 57715890 59324166 60185469 60423011
15559F0423011j26032j79199K6119L67732P16713R83301J118121J097676R32387
$$ 60423011 60296979 60117780 60143899 60511631 61228344 62211645 63329766 64427442 65359829
15550F5359829O84761M58283L53017M19712O38656R30823J198135J374953J456898
$$ 65359829 66044590 66502873 66855890 67275602 67914258 68845081 70043216 71418169 72875067
15541G2875067J484488J502112J534902J593587J679599J772668J819170J745873
$$ 72875067 74359555 75861667 77396569 78990156 80669755 82442423 84261593 86007466
15533H6007466J496828J065081M95276j38415p59062j304585j735930k047173
$$ 86007466 87504294 88569375 89064651 88926236 88167174 86862589 85126659 83079486
15525H3079486k272551k460232k613053k655953k481157k043095j421479q01116
$$ 83079486 80806935 78346703 75733650 73077697 70596540 68553445 67131966 66330850
15517F6330850l90890l35252o47521j189024j724229k032124j993379j597158
$$ 66330850 65939960 65604708 64957187 63768163 62043934 60011810 58018431 56421273
15509E6421273q98707N662R75342J842886K475742K830773K943036K866255K629089
$$ 56421273 55522566 55528228 56503570 58346456 60822198 63652971 66596007 69462262 72091351
15500G2091351K235698J688179J002428K14973o08437j368387j954712k295027
$$ 72091351 74327049 76015228 77017656 77232629 76624192 75255805 73301093 71006066
15492G1006066k383144k257873j967782j563884j109023o72673l10748n2880R3404
$$ 71006066 68622922 66365049 64397267 62833383 61724360 61051687 60740939 60688059 60781463
15483F0781463J25937K8072k29719o52791j179886j678589j993351k024739j790963
$$ 60781463 60907400 60935472 60705753 60052962 58873076 57194487 55201136 53176397 51385434
15474E1385434j428576j129720j046990j213499j526323j807576j909390j804881
$$ 51385434 49956858 48827138 47780148 46566649 45040326 43232750 41323360 39518479
15466C9518479j608854j506458j632665j984484k421611k745254k796205k515456
$$ 39518479 37909625 36403167 34770502 32786018 30364407 27619153 24822948 22307492
15458B2307492j948899j213199m51968K01594O57558Q91394R38442Q67078P54675
$$ 22307492 20358593 19145394 18693426 18895020 19552578 20443972 21382414 22249492 23004167
15449B3004167O73569O76115P77757R53459J149940J302299J353631J277581J093567
$$ 23004167 23677736 24353851 25131608 26085067 27235007 28537306 29890937 31168518 32262085
15440C2262085Q65835O82171O13610O76260Q25244R84046J083115J085968R96242
$$ 32262085 33127920 33810091 34423701 35099961 35925205 36909251 37992366 39078334 40074576
15431D0074576Q43651O60584M72681L06656J97026J76349K50468L77159M69459
$$ 40074576 40918227 41578811 42051492 42358148 42555174 42731523 42981991 43359150 43828609
15422D3828609M31636K14706j47319n51268q69359r89179q48702m71936K4524
$$ 43828609 44260245 44474951 44327632 43776364 42907005 41917826 41069124 40597188 40621712
15413D0621712M80402P67050Q38781P41411N83181M77426M79062N57068O29746
$$ 40621712 41102114 41869164 42707945 43449356 44032537 44509963 44989025 45546093 46175839
15404D6175839O31305N50609M20524K84448J71445R1159M6605N1135J25790K75777
$$ 46175839 46807144 47357753 47778277 48062725 48234170 48325329 48371934 48423069 48548859 48824636
15394D8824636M75629O78891Q40761R35241R55081R03394P95254O64970N58980
$$ 48824636 49300265 49979156 50819917 51755158 52710239 53613633 54408887 55073857 55632837
15385E5632837N11569N27755N96134P14826Q91065J120229J389091J702821K089302
$$ 55632837 56144406 56672161 57268295 57983121 58874186 59994415 61383506 63086327 65175629
15376F5175629K568448L123562L703979M245854M686031M971823N075660N004026
$$ 65175629 67744077 70867639 74571618 78817472 83503503 88475326 93550986 98555012
15368I8555012M796095M521175M273488M155046M250290M604256N206664N982084
$$ 98555012 103351107 107872282 112145770 116300816 120551106 125155362 130362026 136344110
15360A36344110O803430P539778Q110290Q503030Q748755Q878566Q893358Q737936
$$ 136344110 143147540 150687318 158797608 167300638 176049393 184927959 193821317 202559253
15352B02559253Q277375P318739N709067L456845P77839j981058m484925o515862
$$ 202559253 210836628 218155367 223864434 227321279 228099118 226118060 221633135 215117273
15344B15117273p989178q913346r343760r350256q999421q351949p467677o404129
$$ 215117273 207128095 198214749 188870989 179520733 170521312 162169363 154701686 148297557
15336A48297557n207147l905550k518506j072072L92062J826392L192453M464771
$$ 148297557 143090410 139184860 136666354 135594282 135986344 137812736 141005189 145469960
15328A45469960N629670O690859P671889Q591902R426991J0107803J0563344J0754410
$$ 145469960 151099630 157790489 165462378 174054280 183481271 193589074 204152418 214906828
15320B14906828J0657499J0231480R415696Q168613O525287M643650K800780J307992
$$ 214906828 225564327 235795807 245211503 253380116 259905403 264549053 267349833 268657825
15312B68657825L74678J5576O7755K86584M41694L69935j6677p55434j854772
$$ 268657825 269032503 269048079 269115834 269402418 269844112 270214047 270197370 269441936 267587164
15303B67587164l281189m929819o618320q116724r209779r769133r785041r329820
$$ 267587164 264305975 259376156 252757836 244641112 235431333 225662200 215877159 206547339
15295B06547339q490811p338564n949529m437735k941755j569237l56304P19524
$$ 206547339 198056528 190717964 184768435 180330700 177388945 175819708 175463404 176182928
15287A76182928J702156K636392L561153M500694N457606O411283P316590Q106762
$$ 176182928 177885084 180521476 184082629 188583323 194040929 200452212 207768802 215875564
15279B15875564Q708221R058346R107261Q804726Q095287O933531N310171L280289
$$ 215875564 224583785 233642131 242749392 251554118 259649405 266582936 271893107 275173396
15271B75173396R86594j338596l407171m942232n758007n817824n231339m185515
$$ 275173396 276159990 274821394 271414223 266471991 260713984 254896160 249664821 245479306
15263B45479306k863478j415850J1371J245235K101637K446855K253256J610085
$$ 245479306 242615828 241199978 241211349 242456584 244558221 247005076 249258332 250868417
15255B50868417P01613k22932q95687j101227p43035J23096J293029K460161L296328
$$ 250868417 251570030 251347098 250451411 249350184 248607149 248730245 250023274 252483435 255779763
15246B55779763L539088L061275J908540K87834j494171l110159m277550m813290
$$ 255779763 259318851 262380126 264288666 264576500 263082329 259972170 255694620 250881330
15238B50881330m680993m000442k992316j886720q55156J1320O85676J149056
$$ 250881330 246200337 242199895 239207579 237320859 236465703 236477023 237162699 238311755
15230B38311755J321786J058857K47703j067556k647666m138613n215705n709991
$$ 238311755 239633541 240692398 240940101 239872545 237224879 233086266 227870561 222160570
15222B22160570n655960n243619m713204m262408m003666l951392m022882m075091
$$ 222160570 216504610 211260991 206547787 202285379 198281713 194330321 190307439 186232348
15214A86232348l983343l713594l331524k948997k661141k514557k505585k593781
$$ 186232348 182249005 178535411 175203887 172254890 169593749 167079192 164573607 161979826
15206A61979826k719985k823610k864297k846179k817926k837398k935200l103769
$$ 161979826 159259841 156436231 153571934 150725755 147907829 145070431 142135231 139031462
15198A39031462l297562l436920l430742l213150k764529k104059j271520l20398
$$ 139031462 135733900 132296980 128866238 125653088 122888559 120784500 119512980 119192582
15190A19192582O76613J630173K456519L096671L505885L633642L442041K959857
$$ 119192582 119869195 121499368 123955887 127052558 130558443 134192085 137634126 140593983
15182A40593983K308734J661827J171471R23462R27425J122295J391346J596620
$$ 140593983 142902717 144564544 145736015 146659477 147586902 148709197 150100543 151697163
15174A51697163J634542J483873J199583Q48897M45872n5995p04552j471393k227092
$$ 151697163 153331705 154815578 156015161 156864058 157309930 157253935 156549383 155077990 152850898
15165A52850898k797465l054051k974932k651395k241535j891045j666789j538717
$$ 152850898 150053433 146999382 144024450 141373055 139131520 137240475 135573686 134034969
15157A34034969j415093j211832r04783n18858q5817L62862P76439J093179J277951
$$ 134034969 132619876 131408044 130503261 129984403 129898586 130261448 131037887 132131066 133409017
15148A33409017J348382J367591J413356J543296J770323K062639K376224K693302
$$ 133409017 134757399 136124990 137538346 139081642 140851965 142914604 145290828 147984130
15140A47984130L023886L375062L730994M055611M300752M418813M386497M221496
$$ 147984130 151008016 154383078 158114072 162169683 166470435 170889248 175275745 179497241
15132A79497241L969653L672171L342536K972527K563247K152807J806643J572407
$$ 179497241 183466894 187139065 190481601 193454128 196017375 198170182 199976825 201549232
15124B01549232J449902J414439J465545J643099J997613K548360L258015M034290
$$ 201549232 202999134 204413573 205879118 207522217 209519830 212068190 215326205 219360495
15116B19360495M763972N367077N837305O242123O677394P197048P771556Q319892
$$ 219360495 224124467 229491544 235328849 241570972 248248366 255445414 263216970 271536862
15108B71536862Q784503R171741R524936R861479J0126726J0202618R967881R359435
$$ 271536862 280321365 289493106 299018042 308879521 319006247 329208865 339176746 348536181
15100C48536181Q382548P076310N490286L694104J783686j35796j958676l567620
$$ 348536181 356918729 363995039 369485325 373179429 374963115 374827319 372868643 369301023
15092C69301023m844452n717094o191039o330623o215336n905234n424026m758978
$$ 369301023 364456571 358739477 352548438 346217815 340002479 334097245 328673219 323914241
15084C23914241l879949k768036j431925R0754J732419L397593M983553O413651
$$ 323914241 320034292 317266256 315834331 315925085 317657504 321055097 326038650 332452301
15076C32452301P648084Q655087R387414R810511R945817R858912R602380R184249
$$ 332452301 340100385 348755472 358142886 367953397 377899214 387758126 397360506 406544755
15068D06544755Q584783P780858O748473N459387L892138K045317o3136k398162
$$ 406544755 415129538 422910396 429658869 435118256 439010394 441055711 440992575 438594413
15060D38594413m897389p460689r952298j2211187j4071338j5400895j6147133
$$ 438594413 433697024 426236335 416284037 404072850 390001512 374600617 358453484
15053C58453484j6357778j6165218j5734547j5194340j4596984j3936175j3191915
$$ 358453484 342095706 325930488 310195941 295001601 280404617 266468442 253276527
15046B53276527j2358598j1444318j0461429r432719q405363p441516o585102
$$ 253276527 240917929 229473611 219012182 209579463 201174100 193732584 187147482
15039A87147482n836882n157194m493505l819211l156431k556109k044697j592696
$$ 187147482 181310600 176153406 171659901 167840690 164684259 162128150 160083453 158490757
15031A58490757j145966o79423k06626K47478O56606R82489J185371J254776J218375
$$ 158490757 157344791 156665368 156458742 156706220 157362826 158345315 159530686 160785462 162003837
15022A62003837J124790J029706R84541J006777J045617R84496O96340J18779
$$ 162003837 163128627 164158333 165142874 166149651 167195268 168179764 168876104 168994883
15014A68994883p04391j641056k523625l194568l531037l468523l033067k350438
$$ 168994883 168290492 166649436 164125811 160931243 157400206 153931683 150898616 148548178
15006A48548178j592485q81228k31877M19258J138683J935657K754027L509642
$$ 148548178 146955693 146074465 145842588 146261846 147400529 149336186 152090213 155599855
14998A55599855M140072M633952N028683N383240N742418O112119O465281O785303
$$ 155599855 159739927 164373879 169402562 174785802 180528220 186640339 193105620 199890923
14990A99890923P106716P487969P928626Q326426Q523647Q387930P856373O937203
$$ 199890923 206997639 214485608 222414234 230740660 239264307 247652237 255508610 262445813
14982B62445813N704636M295305K879562J602456N39000k94215q91566j231406
$$ 262445813 268150449 272445754 275325316 276927772 277466772 277172557 276280991 275049585
14974B75049585j292269j088052o85627j80888L47642Q54482J296913J604258
$$ 275049585 273757316 272669264 271983637 271802749 272150391 273004873 274301786 275906044
14966B75906044J690602J498959J029196L24349n66923j616418k805617m081117
$$ 275906044 277596646 279095605 280124801 280449150 279882227 278265809 275460192 271379075
14958B71379075n323307o380992p148508p603607p786672p773367p653626p491844
$$ 271379075 266055768 259674776 252526268 244922661 237135989 229362622 221708996 214217152
14950B14217152p293391p019493o630009o107934n463902m740974m012086l354737
$$ 214217152 206923761 199904268 193274259 187166325 181702423 176961449 172949363 169594626
14942A69594626k813983k386627k042528j751896j481982j179214p79995k62365
$$ 169594626 166780643 164394016 162351488 160599592 159117610 157938396 157158401 156896036
14934A56896036L01825P57420R49682Q09886L72361k70740j021559j796161k516858
$$ 156896036 157197861 157955281 158904963 159714849 160087210 159816470 158794911 156998750 154481892
14925A54481892l111375l539534l823865m040820m266253m516264m729205m796959
$$ 154481892 151370517 147830983 144007118 139966298 135700045 131183781 126454576 121657617
14917A21657617m622356m183571l578400k998164k621025k505690k578823k708835
$$ 121657617 117035261 112851690 109273290 106275126 103654101 101148411 98569588 95860753
14909I5860753k786558k766245k668788k559153k509533k555276k657887k708870
$$ 95860753 93074195 90307950 87639162 85080009 82570476 80015200 77357313 74648443
14901G4648443k592627k266612j783622j234497o79307j39091L67735Q05032J127286
$$ 74648443 72055816 69789204 68005582 66771085 66091778 65952687 66320422 67125454 68252740
14892F8252740J291718J270498J065812P08601K41968k83588q09864j288958j700099
$$ 68252740 69544458 70814956 71880768 72589369 72831337 72547749 71737885 70448927 68748828
14883F8748828k036275k281223k418067k463460k478747k533418k650306k782945
$$ 68748828 66712553 64431330 62013263 59549803 57071056 54537638 51887332 49104387
14875D9104387k852041k812951k683246k499814k267330j965969j594815j187540
$$ 49104387 46252346 43439395 40756149 38256335 35989005 34023036 32428221 31240681
14867C1240681p90596m43801j80192j9167N0391O0759L0802m5082j66124k90709
$$ 31240681 30450085 30006284 29826092 29806925 29857316 29918075 29948877 29903795 29737671 29446962
14857B9446962l42764k59092l4199K75581N87611Q35953R87287J026754R48202
$$ 29446962 29104198 28845106 28810907 29086488 29674099 30510052 31497339 32524093 33472295
14848C3472295P63635M99542J71013k26566o89371j172613j591648j854750j896747
$$ 33472295 34235930 34735472 34906485 34679919 33990548 32817935 31226287 29371537 27474790
14839B7474790j697044j281904p06429k8550O92024J374193J922051K272469K435782
$$ 27474790 25777746 24495842 23789413 23760863 24452887 25827080 27749131 30021600 32457382
14830C2457382K478239K454953K357190K126861J722668J173817N72653J5293
$$ 32457382 34935621 37390574 39747764 41874625 43597293 44771110 45343763 45359056
14822D5359056m54612q55285j231300j603374j935873k140786k113850j780573
$$ 45359056 44904444 44049159 42817859 41214485 39278612 37137826 35023976 33243403
14814C3243403j131666k38190P64004J721659K517845L100864L478700L688265
$$ 33243403 32111737 31873547 32637551 34359210 36877055 39977919 43456619 47144884
14806D7144884L757786L687614L464641L094917K624685K133864J703249J374608
$$ 47144884 50902670 54590284 58054925 61149842 63774527 65908391 67611640 68986248
14798F8986248J134322R33256P22474M72355J66231k06446o37976j088262j496261
$$ 68986248 70120570 71053826 71776300 72248655 72414886 72208440 71570464 70482202 68985941
14789F8985941j817032k049510k222055k352918k434267k453341k417803k360372
$$ 68985941 67168909 65119399 62897344 60544426 58110159 55656818 53239015 50878643
14781E0878643k327821k359828k462836k599135k703287k713346k600006k381040
$$ 50878643 48550822 46190994 43728158 41129023 38425736 35712390 33112384 30731344
14773C0731344k105852j812191j494890j131488p40280l86366j12599J26172M48046
$$ 30731344 28625492 26813301 25318411 24186923 23446643 23060277 22947678 23073850 23521896
14764B3521896R48547J597136K216797K577805K542552K156254J624392J199936
$$ 23521896 24470443 26067579 28284376 30862181 33404733 35560987 37185379 38385315
14756C8385315J054121J203635J523485J820929J924531J751437J328022P56981
$$ 38385315 39439436 40643071 42166556 43987485 45912016 47663453 48991475 49748456
14748D9748456J59149l65538p45814r41016r50017q08511n67089k73705K6260
$$ 49748456 49907605 49542067 48796253 47855237 46905220 46096709 45529620 45255915 45282175
14739D5282175K92884N11587P03791R02546J113009J295284J382221J321263J114292
$$ 45282175 45575059 46086646 46790437 47692983 48805992 50101276 51483497 52804760 53919052
14730E3919052Q26445N55493L80480L21314L34614L42491K66617N4120k98500
$$ 53919052 54745497 55300990 55681470 56002784 56337398 56679889 56946506 57000626 56702126
14721E6702126p32321j141761j413974j472754j313525j008080o61901l52621
$$ 56702126 55969805 54828044 53414070 51941316 50627791 49619711 48957810 48605189
14713D8605189j02704R9553K65466L92391M72324N09354N33535N92948P21857
$$ 48605189 48502485 48602038 48867504 49259895 49732219 50241573 50775108 51368056 52089913
14704E2089913R17001J146320J373329J572133J729589J834836J860558J762554
$$ 52089913 53006914 54153234 55526563 57098696 58828285 60663121 62523679 64286233
14696F4286233J512329J136548P24920L94357K35698K82013N10163Q59969J262688
$$ 64286233 65798562 66935110 67660030 68054387 68290085 68572098 69082261 69942230 71204918
14687G1204918J677206K110867K598619L158559L768274M374302M913783N330286
$$ 71204918 72882124 74992991 77591610 80750169 84518443 88892745 93806528 99136814
14679I9136814N579628N630467N473742N145521M736371M358066M085581L920645
$$ 99136814 104716442 110346909 115820651 120966172 125702543 130060609 134146190 138066835
14671A38066835L799146L631313L348246K930267K406468J832963J267311P51730
$$ 138066835 141865981 145497294 148845540 151775807 154182275 156015238 157282549 158034279
14663A58034279L03448r5030m94031r43886j448412j953788k389244k716812k946638
$$ 158034279 158337727 158242697 157748666 156804780 155356368 153402580 151013336 148296524 145349886
14654A45349886l117245l263074l392889l494001l556861l589020l591453l523539
$$ 145349886 142232641 138969567 135576678 132082677 128525816 124936796 121345343 117821804
14646A17821804l316682k938239k428122j859738j276863o79482o0320N57418
$$ 117821804 114505122 111566883 109138761 107279023 106002160 105322678 105262358 105819776
14638A05819776J115118J545048J804557J889758J819163J609596J267596P95162
$$ 105819776 106934894 108479942 110284499 112174257 113993420 115603016 116870612 117665774
14630A17665774K02356m79539j193749j866383k424482k819182l041023l111233
$$ 117665774 117868130 117388591 116194842 114328459 111903977 109084795 106043772 102932539
14622A02932539l055478k890998k643232k368831k151711k067221k142127k345543
$$ 102932539 99877061 96986063 94342831 91974000 89822289 87755068 85612941 83267398
14614H3267398k614350k879999l077200l149262l062074k813530k425842j933080
$$ 83267398 80653048 77773049 74695849 71546587 68484513 65670983 63245141 61312061
14606F1312061j373943p84721k00291L27126P16737Q87912Q11126N27227J17685
$$ 61312061 59938118 59153397 58953106 59280232 59996969 60884881 61696007 62223234 62340919
14597F2340919l35213p59722j083314j232579j161972q82815m54857M5705N42217
$$ 62340919 62005706 61245984 60162670 58930091 57768119 56885304 56430447 56476152 57018369
14588E7018369R54263J204354J248915J106967Q52776N73761L20980Q2068k03531
$$ 57018369 57972632 59176986 60425901 61532868 62385644 62959405 63280385 63362453 63158922
14579F3158922n92129j077551j563047j885974j893613j531778q86383j47441
$$ 63158922 62566793 61489242 59926195 58040221 56146608 54614830 53728447 53581006
14571E3581006M77054Q46705R42123Q65060P78078Q15845J022820J353631J728265
$$ 53581006 54058060 54904765 55846888 56711948 57490026 58305871 59328691 60682322 62410587
14562F2410587K090381K422063K720852K975538L162353L255386L234508L089812
$$ 62410587 64500968 66923031 69643883 72619421 75781774 79037160 82271668 85361480
14554H5361480K829664K488600K129890J842725J727391J857715K230259K737450
$$ 85361480 88191144 90679744 92809634 94652359 96379750 98237465 100467724 103205174
14546A03205174L195328L419686L309663K886504K266862J597048R89985M93782
$$ 103205174 106400502 109820188 113129851 116016355 118283217 119880265 120870250 121364032
14538A21364032R7512k36547n29836p63311q99991r34007r07055q67605q22942
$$ 121364032 121461544 121224997 120695161 119931850 119031859 118097852 117190797 116323192 115500250
14529A15500250p43712o10168m44727l01224k25926k31239l10403m70330p35245
$$ 115500250 114756538 114146370 113701643 113400419 113174493 112943254 112632851 112162521 111427276
14520A11427276j113581j570096k041679k482642k888124l271514l627499l924720
$$ 111427276 110313695 108743599 106701920 104219278 101331154 98059640 94432141 90507421
14512I0507421m130625m230592m220214m093086l848688l514256l155839k863599
$$ 90507421 86376796 82146204 77925990 73832904 69984216 66469960 63314121 60450522
14504F0450522k719807k765910k978043l264777l502369l592218l496094l225363
$$ 60450522 57730715 54964805 51986762 48721985 45219616 41627398 38131304 34905941
14496C4905941k808483k275736j669601j054691n04139p2778K19875L91571M92605
$$ 34905941 32097458 29821722 28152121 27097430 26593291 26520513 26740388 27131959 27624564
14487B7624564N96818P76611J053424J353693J524919J419095R82171K89785m78954
$$ 27624564 28221382 28997993 30051417 31405110 32930029 34349124 35331295 35621080 35142126
14478C5142126j110081j437715j402961j065337n71328r4161K31788L53140L02494
$$ 35142126 34032045 32594330 31191369 30126032 29554704 29460543 29692331 30045471 30347965
14469C0347965J70506N5903J2070K0918J5624o5588k38630m67313o80305q00363
$$ 30347965 30518471 30574374 30586444 30607362 30622986 30557398 30318768 29851455 29171150 28370787
14459B8370787p82637o44624m61472l22963k83571l39587m36651m94029m37405
$$ 28370787 27588150 26943526 26482054 26159091 25875520 25535933 25099282 24605253 24167848
14450B4167848k32723R4867M76379Q41165J142949J348086J418066J319911J053960
$$ 24167848 23935125 24029992 24506371 25347536 26490485 27838571 29256637 30576548 31630508
14441C1630508O63212K09149k59792p14497j127309j460590j685638j809050j860237
$$ 31630508 32293720 32502869 32243077 31528580 30401271 28940681 27255043 25445993 23585756
14432B3585756j847952j742608j506138j137298o97700l04289q5008j11984l52116
$$ 23585756 21737804 19995196 18489058 17351760 16654060 16349771 16264763 16152779 15800663
14423A5800663o76820r33082j027459r64238q17293o67386n55651m75471l91349
$$ 15800663 15123843 14190761 13163302 12199064 11381771 10714385 10158734 9683263 9291914
14414I291914k61991m9543K82418P60978J377953K064629K692784L118716L249487
$$ 9291914 9029923 8980380 9262798 10023776 11401729 13466358 16159142 19277858 22527345
14405B2527345L075000K649848K065356J428660Q36596L56288K4653j50968j98433
$$ 22527345 25602345 28252193 30317549 31746209 32582805 32939093 32963746 32812778 32614345
14396C2614345j74888j48314j77606k85784m35269n43497n43880m38418k94572
$$ 32614345 32439457 32291143 32113537 31827753 31392484 30848987 30305107 29866689 29572117
14387B9572117j94798j90700l03664n48166r22690j370297j768757j984843j950159
$$ 29572117 29377319 29186619 28882955 28334789 27412099 26041802 24273045 22288202 20338043
14378B0338043j688511j282771q26612l94832l2379K39552M02954M34781L36450
$$ 20338043 18649532 17366761 16540149 16145317 16112938 16352490 16755444 17190225 17526675
14369A7526675J72862N8967Q2130K29592L93686M48334L32125Q2403j93598l82651
$$ 17526675 17699537 17758504 17840634 18070226 18463912 18912246 19244371 19326774 19133176 18750525
14359A8750525m18875k96113m6126K90829O83452J102317J495558J780978J873102
$$ 18750525 18331650 18035537 17989411 18280240 18963692 20066009 21561567 23342545 25215647
14350B5215647J725108J352607Q22573K18835l89175r55612j449143j847880k149283
$$ 25215647 26940755 28293362 29115935 29334770 28945595 27989983 26540840 24692960 22543677
14341B2543677k377844k573838k773672k996111l229953l422387l489134l358674
$$ 22543677 20165833 17591995 14818323 11822212 8592259 5169872 1680738 -1677936
14333a677936l021244k536341j992643j463502r94323o13433l41108j83980j20370
$$ -1677936 -4699180 -7235521 -9228164 -10691666 -11685989 -12299422 -12640530 -12824510 -12944880
14324a2944880r7300n2694N0684K03909L59865M69253N17538N30925N51102O06290
$$ -12944880 -13042180 -13094874 -13044190 -12840281 -12480416 -12011163 -11493625 -10962700 -10411598 -9805308
14314i805308O97061P98051Q74358R03349Q85911Q43428Q04458P84341P73343
$$ -9805308 -9108247 -8310196 -7435838 -6532489 -5646578 -4803150 -3998692 -3214351 -2441008
14305b441008P51722P17618O95436P17761P93586Q85154R26393Q80306P74527
$$ -2441008 -1689286 -971668 -276232 441529 1235115 2120269 3046662 3926968 4701495
14296D701495O74432O30575O52451P07507P23465O05711K91399j87067o94225
$$ 4701495 5375927 6006502 6658953 7366460 8089925 8695636 8987035 8799968 8105743
14287H105743j060075j168745j006151o57083k67764J1536Q7412l4439k52806
$$ 8105743 7045668 5876923 4870772 4213689 3945925 3957461 4044873 4010434 3757628
14278C757628m26232m39455k38042J68619P23902J349708J954313K421168K621521
$$ 3757628 3331396 2891941 2653899 2822518 3546420 4896128 6850441 9271609 11893130
14269A1893130K469026J976378J264276N12655j14703n30188p39406q12379q28761
$$ 11893130 14362156 16338534 17602810 18115465 18000762 17470574 16731168 15918789 15090028
14260A5090028q24856p71664o03208k77129J82271O93456J166001J537599J765092
$$ 15090028 14265172 13493508 12890300 12613171 12795442 13488898 14654899 16192498 17957590
14251A7957590J793669J558455J029020K51594o47428j492038k107750k382640
$$ 17957590 19751259 21309714 22338734 22590328 21942900 20450862 18343112 15960472
14243A5960472k308710j966299j458063q56445k12328M06435R09714J226675J354415
$$ 15960472 13651762 11685463 10227400 9370955 9158627 9565062 10474776 11701451 13055866
14234A3055866J362986J338368J309180J227179J012360O13269M3364o12031j217541
$$ 13055866 14418852 15757220 17066400 18293579 19305939 19919208 19962572 19350541 18133000
14225A8133000j635404j778784j645577j315576r04317n00156j36138J86175M58619
$$ 18133000 16497596 14718812 13073235 11757659 10853342 10353186 10217048 10403223 10861842
14216A0861842O55286P51891P52469O94388O16881N18650L56832R9206k22318
$$ 10861842 11517128 12269019 13021488 13715876 14332757 14851407 15208239 15307445 15085127
14207A5085127n14922o85979p05140o12073m78332l71890l34992l59163l80256
$$ 15085127 14570205 13884226 13179086 12567013 12088681 11716791 11381799 11022636 10642380
14198A0642380l23438j58519R7825M21089P92765J172955J486677J658794J659645
$$ 10642380 10318942 10160423 10258248 10679337 11472102 12645057 14131734 15790528 17450173
14189A7450173J511058J260657R66680P00403N37433N27151O64197Q86746J101591
$$ 17450173 18961231 20221888 21188568 21888971 22426404 22953555 23617752 24504498 25606089
14180B5606089J223089J209518J073837Q58411N92896K69376j41963o45637j183208
$$ 25606089 26829178 28038696 29112533 29970944 30563840 30833216 30691253 30045616 28862408
14171B8862408j643922j926531k008351j956227j863960j779678j688321j546099
$$ 28862408 27218486 25291955 23283604 21327377 19463417 17683739 15995418 14449319
14163A4449319j326669j051626p87761o09435n57222o23032p59235r00690r97017
$$ 14449319 13122650 12071024 11283263 10673828 10116606 9493574 8734339 7833649 6836632
14154F836632j039635j060736j107660j218212j409111j669515j956974k207240
$$ 6836632 5796997 4736261 3628601 2410389 1001278 -668237 -2625211 -4832451
14146d832451k358025k370619k241139k005907j737167j515571j384681j320167
$$ -4832451 -7190476 -9561095 -11802234 -13808141 -15545308 -17060879 -18445560 -19765727
14138a9765727j241585j058089p11299j93151M52148J135197J743483K175508
$$ -19765727 -21007312 -22065401 -22776700 -22969851 -22517703 -21382506 -19639023 -17463515
14130a7463515K373672K338429K113888J761714J345463R23575N42427K31794
$$ -17463515 -15089843 -12751414 -10637526 -8875812 -7530349 -6606774 -6064347 -5832553
14122e832553O369j29729j84479j83344j57839j17709m3388Q6007K61818M45619
$$ -5832553 -5826184 -5955913 -6140392 -6323736 -6481575 -6599284 -6642672 -6556665 -6294847 -5849228
14112e849228N94993O84494P08854O81427O29550N76302N20334M35662K88345
$$ -5849228 -5254235 -4569741 -3860887 -3179460 -2549910 -1973608 -1453274 -1017612 -729267
14103g29267N3598k69482o48744j028430j353278j586203j712054j730109j637108
$$ -729267 -675669 -945151 -1593895 -2622325 -3975603 -5561806 -7273860 -9003969 -10641077
14094a0641077j416247j053081n63967J446N84719J136224J617963K010320K317949
$$ -10641077 -12057324 -13110405 -13674372 -13672926 -13088207 -11951983 -10334020 -8323700 -6005751
14085f005751K554371K714618K772836K719894K599212K481776K390498K257767
$$ -6005751 -3451380 -736762 2036074 4755968 7355180 9836956 12227454 14485221
14077A4485221J968590J448876P25576p6985p93634j291717j525277j543517j443686
$$ 14485221 16453811 17902687 18628263 18551278 17757644 16465927 14940650 13397133 11953447
14068A1953447j306731j182134j120843j180979j377674j642487j857556j939116
$$ 11953447 10646716 9464582 8343739 7162760 5785086 4142599 2285043 345927
14060C45927j885549j753343j598920j434545j223728r20419n24175j00304K57722
$$ 345927 -1539622 -3292965 -4891885 -6326430 -7550158 -8470577 -8994752 -9095056 -8837334
14051h837334M86804N80762N75185N21316M74796M91332O04146P88987R62563
$$ -8837334 -8350530 -7769768 -7194583 -6673267 -6198471 -5707139 -5102993 -4314006 -3351443
14042c351443J039636J004321R19130Q57035Q29690P84246O57312M22176R7347
$$ -3351443 -2311807 -1307486 -388356 468679 1298369 2082615 2739927 3162103 3259450
14033C259450k63488n78698p56813p39600n41048k42605M6542K26628K37518R4294
$$ 3259450 2995962 2417264 1660451 920851 379803 137198 183740 410368 647886 742180
14023G42180j06029k46470k68632j77752J3721L13394P15715J167845J586589
$$ 742180 636151 389681 121049 -56703 -42982 270412 986127 2153972 3740561
14014C740561J901472K074362K091069J949354J651505J200930O12770o5362p47779
$$ 3740561 5642033 7716395 9807464 11756818 13408323 14609253 15222023 15156661 14408882
14005A4408882j332162j732424j906178j870892j700433j497279j353472j318586
$$ 14408882 13076720 11344296 9438118 7567226 5866793 4369514 3016042 1697456
13997A697456j385322j498181j580171j564581j421710j168663q55101n38701
$$ 1697456 312134 -1186047 -2766218 -4330799 -5752509 -6921172 -7776273 -8314974
13989h314974k62241k6581K27570N94967J138578J827194K524741L041446L220099
$$ -8314974 -8577215 -8603796 -8376226 -7781259 -6642681 -4815487 -2290746 750700 3970799
13980C970799L009052K481716J795446J115444N43069Q2491l39569q11140j366889
$$ 3970799 6979851 9461567 11257013 12372457 12915526 12998017 12658448 11847308 10480419
13971A0480419j968200k544894l042934l429520l672556l733964l587031l239710
$$ 10480419 8512219 5967325 2924391 -505129 -4177685 -7911649 -11498680 -14738390
13963a4738390k743207k173153j589726j007997m02485K57008R55715J612329
$$ -14738390 -17481597 -19654750 -21244476 -22252473 -22654958 -22397950 -21442235 -19829906
13955a9829906K125698K452224K629776K734634K826189K914504K954716K869376
$$ -19829906 -17704208 -15251984 -12622208 -9887574 -7061385 -4146881 -1192165 1677211
13947A677211K591505K104019J451595P23996K9411n28947q76011r86394q85439
$$ 1677211 4268716 6372735 7824330 8548326 8577737 8048790 7172779 6186385 5300946
13938E300946o22920k43147K25512P61266J329607J865191K270766K444129K325277
$$ 5300946 4678026 4434879 4660391 5421657 6751264 8616455 10887221 13331350 15656627
13929A5656627J936781J381109P83498K19758l06006q11728j279413j663011j939305
$$ 15656627 17593408 18974517 19758015 19977773 19671767 18860039 17580626 15917615 13978310
13920A3978310k126313k255922k344380k383713k345370k189731j879542j392762
$$ 13978310 11851997 9596075 7251695 4867982 2522612 332881 -1546661 -2939423
13912b939423p32124O8739R36074J748155K359168K660566K626999K305088J774841
$$ -2939423 -3671547 -3602808 -2666734 -918579 1440589 4101155 6728154 9033242 10808083
13903A0808083J129114M64662j37729o31004r98005j233905j330042j268721j035727
$$ 10808083 11937197 12401859 12264130 11633126 10635121 9401216 8071174 6802453 5766726
13894E766726o38632j07634N15920J175604J787735K258665K527512K585899K457893
$$ 5766726 5128094 5020460 5536380 6711984 8499719 10758384 13285896 15871795 18329688
13885A8329688K167964J720265J103461L29081n28060j337259j969960k360040
$$ 18329688 20497652 22217917 23321378 23650459 23122399 21785140 19815180 17455140
13877A7455140k520993k516099k413707k265149k116367k020852k016040k082158
$$ 17455140 14934147 12418048 10004341 7739192 5622825 3601973 1585933 -496225
13869d96225k142000k111210j938982j600727j080684l86287M27255J262486K012467
$$ -496225 -2638225 -4749435 -6688417 -8289144 -9369828 -9756115 -9328860 -8066374 -6053907
13860f053907K594052K968693L149499L190334L152330L066712K930125K737537
$$ -6053907 -3459855 -491162 2658337 5848671 9001001 12067713 14997838 17735375
13852A7735375K509719K278776K050512J788655J441202R86385M51452j13743
$$ 17735375 20245094 22523870 24574382 26363037 27804239 28790624 29242076 29128333
13844B9128333o72882j210110j704394k100674k325114k350660k238672k088457
$$ 29128333 28455451 27245341 25540947 23440273 21115159 18764499 16525827 14437370
13836A4437370j942263j759285j488731j153255q50836o81823o75905p74369q71638
$$ 14437370 12495107 10735822 9247091 8093836 7243000 6561177 5885272 5110903 4239265
13827D239265q79238p63724n45540k80154l3395J49557K71412L83084N47117P94655
$$ 4239265 3360027 2596303 2050763 1770609 1737214 1886771 2158183 2541267 3088384 3883039
13817C883039J113183J460187J776799J994729K046159J886745J528541J052223
$$ 3883039 4996222 6456409 8233208 10227937 12274096 14160841 15689382 16741605
13809A6741605N70726J68391j30375l42440m85652n57433n45890m50515k90201
$$ 16741605 17312331 17480722 17350347 17007907 16522255 15964822 15418932 14968417 14678216
13800A4678216j08323K2779K3340j48859m66542q34433j124159j232605j128901
$$ 14678216 14569893 14592672 14616012 14467153 14000611 13166178 12042019 10809414 9680513
13791I680513q56595n03041j66531O8451J50403P5172j11926l37893n35849o62739
$$ 9680513 8823918 8320877 8154346 8222797 8373200 8448372 8336446 7998553 7462704 6799965
13781F799965p01871o65072n83738m79302l41427j42922J26055M41783P59618
$$ 6799965 6098094 5433022 4849284 4369982 4028555 3885633 4011688 4453471 5213089
13772E213089J042694J286427J517280J763282K022152K249273K362574K262603
$$ 5213089 6255783 7542210 9059490 10822772 12844924 15094197 17456771 19719374
13764A9719374J880534J240036M71962k49283p94575j128121j301990j414896
$$ 19719374 21599908 22839944 23311906 23062623 22268048 21139927 19837937 18423041
13756A8423041j557281j768828k026160k264583k422247k470917k406104k220599
$$ 18423041 16865760 15096932 13070772 10806189 8383942 5913025 3506921 1286322
13748A286322j898603j430555q33846j69319M64121R66819J287850J446397J501936
$$ 1286322 -612281 -2042836 -2876682 -3046001 -2581880 -1615061 -327211 1119186 2621122
13739B621122J497249J424272J243882R40942N56630J66193j65675m04406n31823
$$ 2621122 4118371 5542643 6786525 7727467 8284097 8450290 8284615 7880209 7348386
13730G348386n24131l51763q411M64523R85919J453430J754357J792892J541365
$$ 7348386 6824255 6472492 6464081 6928604 7914523 9367953 11122310 12915202 14456567
13721A4456567J070270N17349J8965l40702n37334n88749n34462m16619k65734
$$ 14456567 15526837 16044186 16063151 15722449 15185115 14596366 14061904 13645285 13379551
13712A3379551r9828O7044K19209L41947M27199M69706M53905L56093J72133o3272
$$ 13379551 13279723 13346767 13565976 13907923 14335122 14804828 15258733 15614826 15786959 15723687
13702A5723687k93370m68974n64835n94922o24266p35611r55181j214962j396317
$$ 15723687 15430317 14961343 14396508 13801586 13177320 12441709 11486528 10271566 8875249
13693H875249j410140j242169r39532n70513j96223J38758M10167O15499P63900
$$ 8875249 7465109 6222940 5283408 4712895 4516672 4655430 5065597 5681096 6444996
13684F444996Q59700R01017Q96686Q73250Q56697Q52643Q42827P88523O39383
$$ 6444996 7304696 8205713 9102399 9975649 10832346 11684989 12527816 13316339 13955722
13675A3955722L55283p1171o07696j185273j702064k038981k100316j860521j374305
$$ 13955722 14311005 14239834 13632138 12446865 10744801 8705820 6605504 4744983 3370678
13666C370678p42001p1233N36080R90892J241130J294795J210005J053851Q67331
$$ 3370678 2628677 2557444 3093524 4084416 5325546 6620341 7830346 8884197 9751528
13657I751528O65497M56538K44775K3684k11150m37066o01766o50949n63826l71370
$$ 9751528 10417025 10873563 11118338 11142022 10930872 10493806 9892040 9241091 8677265 8305895
13647H305895j44495M1173J37132J31473M6828o0181j13480n8526R8226K89758
$$ 8305895 8161400 8202573 8339705 8471178 8518006 8457825 8344345 8285819 8384045 8673803
13637H673803M30802M66531L94566K55398J05050j2734q4394j30270j85891k63462
$$ 8673803 9104605 9571136 9965702 10221100 10326150 10313416 10229022 10098752 9912861 9649399
13627I649399l28937l26582k28606n8167J31746K95539M12252M74123M70765L92701
$$ 9649399 9320462 8993880 8765274 8707107 8838853 9134392 9546644 10020767 10491532 10884233
13617A0884233K49959P8972q1892k28067l88161n76230p50117q29478p55538n33582
$$ 10884233 11134192 11213164 11131272 10903205 10515044 9938814 9188697 8359219 7603681 7070099
13607G070099k32784M4708K07253K09471N9852j95768m97043p99523j102351j434037
$$ 7070099 6837315 6882023 7089276 7298747 7358599 7162831 6665788 5866265 4763914 3329877
13597C329877j794771k118987k308735k303359k106144j749146j254436o40736
$$ 3329877 1535106 -583881 -2892616 -5195975 -7302119 -9051265 -10305701 -10946437
13589a0946437L7552O71090J130822J335175J289931J068365P57898M26436J26244
$$ -10946437 -10908885 -10237795 -9106973 -7771798 -6481867 -5413502 -4655604 -4229168 -4102924
13580d102924r9666k35271l05124l49395l84494l99404l84222l46043k98876k51889
$$ -4102924 -4202590 -4437861 -4742985 -5092380 -5476874 -5876278 -6260500 -6606543 -6905419 -7157308
13570g157308k11589j85808j68490j09951Q3662M95538J131916J903981K660429
$$ -7157308 -7368897 -7554705 -7723195 -7833146 -7749484 -7253946 -6122030 -4218049 -1557620
13561a557620L236099L495550L372850K904274K220838J479059P82348J66498
$$ -1557620 1678479 5174029 8546879 11451153 13671991 15151050 15933398 16099896
13553A6099896l60549p87991j099442j275224j297844j174733r59322p37981n95543
$$ 16099896 15739347 14951356 13851914 12576690 11278846 10104113 9144791 8406810 7811267
13544G811267n92131p49205j034862j366774j647090j806912j828902j738908
$$ 7811267 7219136 6469931 5435069 4068295 2421205 614293 -1214609 -2953517
13536b953517j575733j357820j071405o99675k71007J36721M50467O52737P80175
$$ -2953517 -4529250 -5887070 -6958475 -7658150 -7929157 -7792436 -7341969 -6689232 -5909057
13527e909057Q82401R72867J003003Q92318O01661J79677k61373o10130q11434
$$ -5909057 -5026656 -4053789 -3050786 -2158468 -1556807 -1377130 -1638503 -2248633 -3060067
13518c060067q87730r17220r75042j067702j110006r80451o20868q8107M83748
$$ -3060067 -3947797 -4865017 -5840059 -6907761 -8017767 -8998218 -9619086 -9707193 -9223445
13509i223445R55608J225427J238796R99848N86550J35266k22701m25032m88991
$$ -9223445 -8267837 -7042410 -5803614 -4803766 -4217216 -4081950 -4304651 -4729683 -5218674
13500e218674m78133m57464m47521m01386k38873P7353M89990Q65616J066652
$$ -5218674 -5696807 -6154271 -6601792 -7003178 -7242051 -7164698 -6674708 -5809092 -4742440
13491d742440J028642Q00258N21315L46401L53889N01386O66397P33393O52365
$$ -4742440 -3713798 -2913540 -2392225 -2045824 -1691935 -1190549 -524152 209241 861606
13482H61606M42963J66413j04563k96929l40331j93797J13521M80742P86659R45308
$$ 861606 1304569 1470982 1366419 1069490 729159 535362 648883 1129625 1916284 2861592
13472B861592R24337P32552M07847K0258l26716n20102m86816k36473J36308M87057
$$ 2861592 3785929 4518481 4926328 4946586 4619870 4099768 3612952 3376479 3512787 3999844
13462C999844O76504O37167M16535J50007j7623K542K17077N51923Q83626J099634
$$ 3999844 4676348 5313515 5730050 5880057 5862434 5864976 6082053 6633976 7517602 8617236
13452H617236J155609J091010R95460R49890R80968J062893J162218J276746J427270
$$ 8617236 9772845 10863855 11859315 12809205 13790173 14853066 16015284 17292030 18719300
13443A8719300J613434J779990J830142J683305J331235Q41175L06381k06239
$$ 18719300 20332734 22112724 23942866 25626171 26957406 27798581 28104962 27898723
13435B7898723o71694j090877j469671j799756k039061k120384k007682j753505
$$ 27898723 27227029 26136152 24666481 22866725 20827664 18707280 16699598 14946093
13427A4946093j492492j366629j438812j655325j875929j942556j744878j262389
$$ 14946093 13453601 12086972 10648160 8992835 7116906 5174350 3429472 2167083
13419B167083n72645J85677Q77386J415789J764713J921796J910121J768588J523492
$$ 2167083 1594438 1780115 2657501 4073290 5838003 7759799 9669920 11438508 12962000
13410A2962000J162341O48503k7529q10029j585131k219468k599014k652988k370016
$$ 12962000 14124341 14772844 14745315 13935286 12350155 10130687 7531673 4878685 2508669
13401B508669j814314j131726n19880j49236p9036k41889m99484p06765p57664
$$ 2508669 694355 -437371 -957251 -1106487 -1185523 -1427412 -1926896 -2633661 -3391325
13392c391325o13524k97010J40344O36053J111473J474454J646793J597164J348714
$$ -3391325 -4004849 -4301859 -4161515 -3525462 -2413989 -939535 707258 2304422 3653136
13383C653136R58475M98818N4951k86842m71147m94038l92860k23986l8081J46724
$$ 3653136 4611611 5110429 5165380 4878538 4407391 3913353 3520493 3296507 3258426 3405150
13373C405150L44786N66132P89020R69645J061332J021567Q15598M27749j16324
$$ 3405150 3749936 4316068 5105088 6074733 7136065 8157632 8973230 9400979 9284655
13364I284655p27546j260561j565887j552112j205487n67785K81959J224981K107083
$$ 9284655 8557109 7296548 5730661 4178549 2973062 2405277 2687236 3912217 6019300
13355F019300K770998L104500L074734K724473K134311J387988N69759k25980
$$ 6019300 8790298 11894798 14969532 17694005 19828316 21216304 21786063 21560083
13347B1560083r09979j432843j800400k050352k213668k299206k306967k245067
$$ 21560083 20650104 19217261 17416861 15366509 13152841 10853635 8546668 6301601
13339F301601k133846j999658j869518j766649j696235j629101j512059j313060
$$ 6301601 4167755 2168097 298579 -1468070 -3164305 -4793406 -6305465 -7618525
13331g618525j063273q44826p22470o84582o59386n90558m88930m08236l80940
$$ -7618525 -8681798 -9526624 -10249094 -10933676 -11593062 -12183620 -12672550 -13080786 -13461726
13322a3461726l82930l52084k38589m8203J59018L17636M06211M50699M91572
$$ -13461726 -13844656 -14196740 -14435329 -14483532 -14324514 -14006878 -13600667 -13149968 -12658396
13313a2658396N54169O39259P28616P95820Q18112P90122P27281O50560N72277
$$ -12658396 -12104227 -11464968 -10736352 -9940532 -9122420 -8332298 -7605017 -6954457 -6382180
13304f382180M98782M38390M05545M22549N12240O77543Q83261J065412J164502
$$ -6382180 -5883398 -5445008 -5039463 -4616914 -4104674 -3427131 -2543870 -1478458 -313956
13295c13956J145834R98571P41385M30129J30880j29189l71533o23696q81235
$$ -313956 831878 1830449 2571834 3001963 3132843 3003654 2632121 2008425 1127190
13286A127190j109928j266603j313494j228147j011800o87485k89358J40152N46136
$$ 1127190 17262 -1249341 -2562835 -3790982 -4802782 -5490267 -5779625 -5639473 -5093337
13277e093337Q69472J064535J106561R92293P45982M21502Q5337k17709m90433
$$ -5093337 -4223865 -3159330 -2052769 -1060476 -314494 107008 192345 -25364 -515797
13268e15797p67807j065972j348138j543088j590397j466901j185500p82802l02953
$$ -515797 -1283604 -2349576 -3697714 -5240802 -6831199 -8298100 -9483600 -10266402 -10569355
13259a0569355K16451P36927J192784J489781J553430J386384J073281P24813
$$ -10569355 -10352904 -9615977 -8423193 -6933412 -5379982 -3993598 -2920317 -2195504
13251b195504M20426J98996P4038L2064K3488j8408j29039k81279m08613m58277
$$ -2195504 -1775078 -1576082 -1502044 -1469980 -1446492 -1464900 -1593939 -1875218 -2283831 -2742108
13241b742108m26302l58384l25677l87789n58894p94371j007098j106961j042350
$$ -2742108 -3168410 -3526794 -3852471 -4240260 -4799154 -5593525 -6600623 -7707584 -8749934
13232h749934q22546n14560k14558P102J59904L25329N76089R02593J219542J434249
$$ -8749934 -9572480 -10087040 -10301598 -10294496 -10134592 -9809263 -9233174 -8330581 -7111039 -5676790
13222e676790J507922J465552J362437J247271J147260J067119R91345Q96109
$$ -5676790 -4168868 -2703316 -1340879 -93608 1053652 2120771 3112116 4008225
13214D008225P66190N94354L66377O4501l08700p18270j105610j405951j569493
$$ 4008225 4774415 5368769 5735146 5799647 5490947 4772677 3667067 2261116 691623
13205F91623j575416j422138j105171o24197k6885N68535J016808J219251J161615
$$ 691623 -883793 -2305931 -3411102 -4035299 -4062184 -3493649 -2476841 -1257590 -95975
13196i5975Q99670N22629J25320k04245l94529m07508k53324J3106L12142N65778
$$ -95975 803695 1326324 1451644 1247399 852870 445362 192038 205144 517286 1083064
13186A083064P23668P76733P44440O51369N26503M18161L86693M70227O55405
$$ 1083064 1806732 2583465 3327905 3979274 4505777 4923938 5310631 5780858 6436263
13177F436263Q78568J052485J101257R93487P61559M88988K65180J38557R8891
$$ 6436263 7314831 8367316 9468573 10462060 11223619 11712607 11977787 12116344 12215235
13168A2215235Q9771M4093p0784k32795l83928m61117m20454k59457l1315J70457
$$ 12215235 12305006 12349099 12278315 12045520 11661592 11200475 10780021 10520564 10489249 10659706
13158A0659706K62218K21825R2306o8916k41541m43570o93952r86179j286377
$$ 10659706 10921924 11143749 11236055 11167139 10925598 10482028 9788076 8801897 7515520
13149G515520j529406j617642j460283j044265m70531Q9634M88097O65738O47544
$$ 7515520 5986114 4368472 2908189 1863924 1393393 1483027 1971124 2636862 3284406
13140C284406M96464K69019j4291l68425q01120j265793j667544j920830j998466
$$ 3284406 3780870 4049889 4035598 3667173 2866053 1600260 -67284 -1988114 -3986580
13131c986580j926426j742605j468100j109058o72990j84596L06280P35642J056355
$$ -3986580 -5913006 -7655611 -9123711 -10232769 -10905759 -11090355 -10784075 -10048433 -8992078
13122h992078J261700J377090J433684J451936J442687J410699J347463J223760
$$ -8992078 -7730378 -6353288 -4919604 -3467668 -2024981 -614282 733181 1956941
13114A956941R99676O51215J95265l06217p63455j083722j196037j076319p65283
$$ 1956941 2956617 3607832 3803097 3496880 2733425 1649703 453666 -622653 -1387936
13105a387936l57968M4609L92929O99369R78601J178951J193642R50642M85371
$$ -1387936 -1745904 -1701295 -1308366 -608997 369604 1548555 2742197 3692839 4178210
13096D178210p3055n78208r37417j130566j175435j082210q44167m66182J0042
$$ 4178210 4105155 3526947 2589530 1458964 283529 -798681 -1642848 -2109030 -2098988
13087b098988N14339R74031J326291J517511J512549J319660J004968O67489L85909
$$ -2098988 -1584649 -610618 715673 2233184 3745733 5065393 6070361 6737850 7123759
13078G123759J82006L0090j03891k36965l82871n79027q75011j282017j743674
$$ 7123759 7305765 7335855 7231964 6994999 6612128 6033101 5158090 3876073 2132399
13069B132399k160800k437058k511872k379211k088571j724520j381347j141180
$$ 2132399 -28401 -2465459 -4977331 -7356542 -9445113 -11169633 -12550980 -13692160
13061a3692160j046582j078409j166512j230855j220696j128483r80177q17044
$$ -13692160 -14738742 -15817151 -16983663 -18214518 -19435214 -20563697 -21543874 -22360918
13053b2360918o76750n72785m85915l85597k60530j18544M0834K41143N10088
$$ -22360918 -23037668 -23610453 -24096368 -24481965 -24742495 -24861039 -24820205 -24579062 -24068974
13044b4068974Q45175J198250J497977J694874J784693J785532J701508J521603
$$ -24068974 -23223799 -22025549 -20527572 -18832698 -17048005 -15262473 -13560965 -12039362
13036a2039362J256707R69322P53649O77343P38041Q72171R98325J051622J000926
$$ -12039362 -10782655 -9813333 -9059684 -8382341 -7644300 -6772129 -5773804 -4722182 -3721256
13027c721256Q66194P20501O52178P13764Q98221J142986J349151J418510J299672
$$ -3721256 -2855062 -2134561 -1482383 -768619 129602 1272588 2621739 4040249 5339921
13018E339921J008354O03535J46400l24428p94799j261654j711514k105443k383938
$$ 5339921 6348275 6951810 7098210 6773782 5978983 4717329 3005815 900372 -1483566
13009a483566k483306k355545j996072j464390q72310l42790L3043K17886K23779
$$ -1483566 -3966872 -6322417 -8318489 -9782879 -10655189 -10997979 -10964936 -10747050 -10523271
13000a0523271R5115j04798l10212m79701o14656p46190q96389j051376j174599
$$ -10523271 -10428156 -10532954 -10843166 -11322867 -11937523 -12683713 -13580102 -14631478 -15806077
12991a5806077j237742j230442j152567j012858q29472o19377l90360j44796J22025
$$ -15806077 -17043819 -18274261 -19426828 -20439686 -21269158 -21888535 -22278895 -22423691 -22301666
12982b2301666M25220P71108J132754J457670J695664J809585J770378J565304
$$ -22301666 -21876446 -21105338 -19972584 -18514914 -16819250 -15009665 -13239287 -11673983
12974a1673983J222133Q16365M37450J35357j03361l22564n36603p04463p62299
$$ -11673983 -10451850 -9635485 -9198035 -9062678 -9166039 -9488603 -10025206 -10729669 -11491968
12965a1491968o76008m63517j86200O4822J94763J52714l9424l05646n49332o76388
$$ -11491968 -12167976 -12631493 -12817693 -12752871 -12558108 -12405394 -12444818 -12750464 -13299796 -13976184
12955a3976184o24169l92481m5434L21165O24430Q30323R63621J083195J237315
$$ -13976184 -14600353 -14992834 -15038268 -14717103 -14092673 -13262350 -12298729 -11215534 -9978219
12946i978219J423598J573534J582468J378868R77113M67154l6190m29850o33333
$$ -9978219 -8554621 -6981087 -5398619 -4019751 -3042638 -2575484 -2611674 -3041524 -3674857
12937c674857o06528l81019n8958K45280M69411O07219O60783O11114M39426J59773
$$ -3674857 -4281385 -4662404 -4721362 -4476082 -4006671 -3399452 -2738669 -2127555 -1688129 -1528356
12927a528356j77504n02962p39835q18081p09007m55009j56964P1239J42319J3600
$$ -1528356 -1705860 -2208822 -2948657 -3766738 -4475745 -4930754 -5087718 -5016479 -4874160 -4860560
12917d860560l02305p29060j140801j408426j451370j262990r04187m74862p2813
$$ -4860560 -5162865 -5891925 -7032726 -8441152 -9892522 -11155512 -12059699 -12534561 -12607374
12908a2607374K42470M62558O16561P41430Q57218R70841J097086J255308J435825
$$ -12607374 -12364904 -11902346 -11285785 -10544355 -9687137 -8716296 -7619210 -6363902 -4928077
12899d928077J582596J626512J540636J359753J144392R25735O87001L96211N1602
$$ -4928077 -3345481 -1718969 -178333 1181420 2325812 3251547 3938548 4334759 4386361
12890D386361k98656n70737o90865o50857n26653m32576m39279n19364n68523
$$ 4386361 4087705 3516968 2826103 2175246 1648593 1216017 776738 257374 -311149
12881c11149m86943k53043O6759L67802N61431N96156M62366K01886q9808k88416
$$ -311149 -798092 -1051135 -984376 -616574 -55143 541013 1003379 1205265 1115457 827041
12871H27041k90827o7923L09936O96960R39296R48544P37892M00893N1011k33453
$$ 827041 536214 468291 778227 1475187 2414483 3363027 4100919 4501812 4552823 4319370
12861D319370m22843n13315n07001m16474k75582j31598j9579N8464J35220K58652
$$ 4319370 3896527 3383212 2876211 2459737 2184155 2052557 2032978 2091442 2226662 2485314
12851B485314M51811O71884Q07817P37592M12296j08903p08247j285026j779376
$$ 2485314 2937125 3609009 4416826 5154418 5566714 5457811 4749564 3464538 1685162
12842A685162k147525k352392k388957k300020k153480k002751j860012j695675
$$ 1685162 -462363 -2814755 -5203712 -7503732 -9657212 -11659963 -13519975 -15215650
12834a5215650j469096j172756q42414n17489k00508J36871N13437R13093J301080
$$ -15215650 -16684746 -17857502 -18699916 -19217405 -19417913 -19281042 -18767605 -17854512 -16553432
12825a6553432J661018K007861K350902K641441K774234K653041K251093J614507
$$ -16553432 -14892414 -12884553 -10533651 -7892210 -5117976 -2464935 -213842 1400665
12817A400665Q39213O2157n59886r15859j003042r19117p92980p18306p26818
$$ 1400665 2239878 2302035 1742149 826290 -176752 -1095869 -1888849 -2607155 -3333973
12808c333973p97228q87480r72072j054105j143459j235560j319514j394639j464994
$$ -3333973 -4131201 -5018681 -5990753 -7044858 -8188317 -9423877 -10743391 -12138030 -13603024
12799a3603024j518411j517937j418352j199524q99321o14407m47789m35620n16098
$$ -13603024 -15121435 -16639372 -18057724 -19257248 -20156569 -20770976 -21218765 -21654385 -22170483
12790b2170483n66137m74947k05676J91125O17661R85334J238535J344224J287661
$$ -22170483 -22736620 -23211567 -23417243 -23226118 -22608457 -21623123 -20384588 -19040364 -17752703
12781a7752703J087873Q02456N00498K23571k6776k60477m61098n83723n91116
$$ -17752703 -16664830 -15862374 -15361876 -15138305 -15165081 -15425558 -15886656 -16470379 -17061495
12772a7061495m92293l49414k45452k35860l20630m56035n88701o75333o77393
$$ -17061495 -17553788 -17903202 -18148654 -18384514 -18705144 -19161179 -19749880 -20425213 -21102606
12763b1102606n59323l15160J471K89536M54479M59107L33130J45759j9838p5272
$$ -21102606 -21661929 -21977089 -21975618 -21686082 -21231603 -20772496 -20439366 -20293607 -20313445 -20388717
12753b0388717M9763L60714P74870J153853J366594J342923J099655P33187L77424
$$ -20388717 -20338954 -19978240 -19203370 -18049517 -16682923 -15340000 -14240345 -13507158 -13129734
12744a3129734J41655O0196Q5844J34390J44817J08271N5716L0401P1014K02933
$$ -13129734 -12988079 -12927883 -12842039 -12707649 -12562832 -12454561 -12398845 -12368444 -12297430 -12094497
12734a2094497M23583O88459R19317J043770J039623R40091P99884O70774O07666
$$ -12094497 -11670914 -10982455 -10063138 -9019368 -7979745 -7039654 -6239770 -5568996 -4961330
12725d961330O68795Q82671J214184J579052J898491K134578K280392K332907
$$ -4961330 -4292535 -3409864 -2195680 -616628 1281863 3416441 5696833 8029740
12717H029740K273503K062199J653773J037784K79735m79655j089843j474459
$$ 8029740 10303243 12365442 14019215 15056999 15336734 14857079 13767236 12292777
12709A2292777j655023j702634j681210j628895j563650j489005j399372j285182
$$ 12292777 10637754 8935120 7253910 5625015 4061365 2572360 1172988 -112194
12701a12194j136809r53610p59567o07878n51782n96521o79822p00393n72178
$$ -112194 -1249003 -2202613 -2962180 -3570058 -4121840 -4718361 -5398183 -6098576 -6670754
12692f670754k72583J41920N61655Q65038R47119P43104K55631m38050j216102
$$ -6670754 -6943337 -6801417 -6239762 -5374724 -4427605 -3684501 -3428870 -3866920 -5083022
12683e083022j959150k580025l020341l235052l200812k944155k538556k045514
$$ -5083022 -7042172 -9622197 -12642538 -15877590 -19078402 -22022557 -24561113 -26606627
12675b6606627j454166o94448K71309J357337K353356L019195L200803K897327
$$ -26606627 -28060793 -28755241 -28483932 -27126595 -24773239 -21754044 -18553241 -15655914
12667a5655914K253415J489378Q10775L42006J08912O2638J15684J77441J93315
$$ -15655914 -13402499 -11913121 -11102346 -10760340 -10651428 -10588790 -10473106 -10295665 -10102350
12658a0102350J68744J45677J44827J35309O2704j02287l41295o00617q25962
$$ -10102350 -9933606 -9787929 -9643102 -9507793 -9445089 -9547376 -9888671 -10489288 -11315250
12649a1315250r95774j126301j250340j394048j556885j689943j697791j490793
$$ -11315250 -12311024 -13437325 -14687665 -16081713 -17638598 -19328541 -21026332 -22517125
12641b2517125j053584m55816K06853Q64211J462474J937377K224867K302522
$$ -22517125 -23570709 -24026525 -23819672 -22955461 -21492987 -19555610 -17330743 -15028221
12633a5028221K211486K023539J783586J492601J139422P32203L02613j04417
$$ -15028221 -12816735 -10793196 -9009610 -7517009 -6377587 -5645384 -5342771 -5447188
12625e447188m45346o95685q53014r15489q66318o91717m13155r8231J62552L01539
$$ -5447188 -5892534 -6588219 -7441233 -8356722 -9223040 -9914757 -10327912 -10426143 -10263591 -9962052
12615i962052L12805K51064J92960J94759K64998L55774L84586K88394P4149j83473
$$ -9962052 -9649247 -9398183 -9205223 -9010464 -8745466 -8389692 -8005106 -7716712 -7642563 -7826036
12605g826036l96461n14807n38155m97458m26119l36482k16246m6051J73162L98572
$$ -7826036 -8222497 -8737304 -9275459 -9772917 -10199036 -10535518 -10751764 -10797815 -10624653 -10226081
12595a0226081N48713N37604L19049q2967n74040j024612j319872j393209j232078
$$ -10226081 -9677368 -9139764 -8820715 -8903682 -9477722 -10502334 -11822206 -13215415 -14447493
12586a4447493q66654l56477K16756P55029J163819J386452J429802J359618J261115
$$ -14447493 -15314147 -15670624 -15453868 -14698839 -13535020 -12148568 -10718766 -9359148 -8098033
12577h098033J180596J086427Q85753M93247r5880p82045j403782j818179j963981
$$ -8098033 -6917437 -5831010 -4945257 -4452010 -4547890 -5329935 -6733717 -8551896 -10515877
12568a0515877j864738j584634j188194p29111k51129K10990O19520R19248J050888
$$ -10515877 -12380615 -13965249 -15153443 -15882554 -16133683 -15922693 -15303173 -14383925 -13333037
12559a3333037R88199P57815M25450P0318k33321m25716m64860l31587m6541L14017
$$ -13333037 -12344838 -11587023 -11161573 -11091255 -11324576 -11750292 -12215152 -12546739 -12593280 -12279263
12549a2279263O31668P86916P01231L68592j27865o34720r90543j094155r29482
$$ -12279263 -11647595 -10860679 -10159448 -9790856 -9918721 -10553441 -11543984 -12638139 -13567621
12540a3567621n43966j9465N38447J007809J276967J279893J013553N40546j0897
$$ -13567621 -14111587 -14131052 -13592605 -12584796 -11307829 -10027936 -9014383 -8473837 -8484734
$$ [...]
##END NTUPLES=NMR SPECTRUM
##END=
