##TITLE=31P ikalashn
DE-75k2_TFA2
15.11.2024
##JCAMPDX= 6.0         $$ Bruker NMR JCAMP-DX V2.0
##DATA TYPE= NMR SPECTRUM
##DATA CLASS= NTUPLES
##ORIGIN= UXNMR, Bruker Analytische Messtechnik GmbH
##OWNER= root
$$ TOPSPIN		Version 1.3
$$ 2024-11-15 15:12:27.859 +0400  Irina@DPX200
$$ Compression mode = diff/dup
##.OBSERVE FREQUENCY= 81.01967998063
##.OBSERVE NUCLEUS= ^31P
##.ACQUISITION MODE= SIMULTANEOUS
##.ACQUISITION SCHEME= undefined
##.AVERAGES= 128
##.DIGITISER RES= 17
##SPECTROMETER/DATA SYSTEM= spect
##.PULSE SEQUENCE= zgpg
##.SOLVENT NAME= D2O
##.SHIFT REFERENCE= INTERNAL, D2O, 1, 298.5841
##AUDIT TRAIL= $$ (NUMBER, WHEN, WHO, WHERE, WHAT)
$$ ##TITLE= Audit trail, TOPSPIN		Version 1.3
$$ ##JCAMPDX= 5.01
$$ ##ORIGIN= Bruker BioSpin GmbH
$$ ##OWNER= Irina
$$ $$ F:/spectra/data/iren/nmr/P31dec/1/pdata/1/auditp.txt
$$ ##AUDIT TRAIL=  $$ (NUMBER, WHEN, WHO, WHERE, VERSION, WHAT)
(   1,<2024-11-15 15:11:55.843 +0400>,<Irina>,<DPX200>,<TOPSPIN 1.3>,
      <created by zg
	started at 2024-11-15 15:08:37.703 +0400,
	POWCHK disabled, PULCHK disabled
       configuration hash MD5:
       BE 6D 3F 07 2A EA 11 49 91 17 2B D3 AF B3 58 0D
       data hash MD5: 32K
       BB 0C 6F 0D 1C A3 4B 21 C0 AA C2 85 CC FC 99 A4>)
(   2,<2024-11-15 15:11:58.890 +0400>,<Irina>,<DPX200>,<TOPSPIN 1.3>,
      <Start of raw data processing
       efp BC_mod = 2 LB = 10 FT_mod = 6 PKNL = 1 PHC0 = 137.4958 PHC1 = 133.5118 SI = 32K 
       data hash MD5: 32K
       9D A1 EE 8A D6 41 FA 7F B4 33 34 22 27 CB 7B 0F>)
(   3,<2024-11-15 15:12:01.921 +0400>,<Irina>,<DPX200>,<TOPSPIN 1.3>,
      <apk 
       data hash MD5: 32K
       75 6D B4 20 4A FA 3A 04 2C A8 2B 5C CE 6F D1 1A>)
(   4,<2024-11-15 15:12:16.031 +0400>,<Irina>,<DPX200>,<TOPSPIN 1.3>,
      <abs n ABSG = 5 
       data hash MD5: 32K
       F4 E1 88 BE 3B 77 9B 78 E4 38 CF 5C 10 BF E2 56>)
$$ ##END=
$$ 
$$ $$ hash MD5
$$ $$ AE 69 9E 26 65 60 A7 BE 16 64 12 92 42 15 2E 44
##$RELAX= 
##$RELAX= 
##$RELAX= 
##$RELAX= 
##$RELAX= 
##$RELAX= 
##$RELAX= 
##$RELAX= 
##$RELAX= 
##$RELAX= 
##$RELAX= 
$$ Bruker specific parameters
$$ --------------------------
##$DU= <F:/spectra>
##$EXPNO= 1
##$NAME= <P31dec>
##$PROCNO= 1
##$TYPE= <nmr>
##$USER= <iren>
##$AMP= (0..31)
100 100 100 100 100 100 100 100 100 100 100 100 100 100 100 100 100 100 
100 100 100 100 100 100 100 100 100 100 100 100 100 100 
##$ANAVPT= -1
##$AQSEQ= 0
##$AQ_mod= 1
##$AUNM= <au_zg>
##$AUTOPOS= <>
##$BF1= 81.014009
##$BF2= 200.13
##$BF3= 200.13
##$BF4= 200.13
##$BF5= 200.13
##$BF6= 200.13
##$BF7= 200.13
##$BF8= 200.13
##$BYTORDA= 1
##$CFDGTYP= 0
##$CFRGTYP= 5
##$CHEMSTR= <none>
##$CNST= (0..63)
1 1 145 1 1 1 1 1 1 1 1 1 1 1 1 1 1 1 1 1 1 1 1 1 1 1 1 1 1 1 1 1 1 1 
1 1 1 1 1 1 1 1 1 1 1 1 1 1 1 1 1 1 1 1 1 1 1 1 1 1 1 1 1 1 
##$CPDPRG= <waltz16>
##$CPDPRG1= <>
##$CPDPRG2= <waltz16>
##$CPDPRG3= <>
##$CPDPRG4= <mlev>
##$CPDPRG5= <mlev>
##$CPDPRG6= <mlev>
##$CPDPRG7= <mlev>
##$CPDPRG8= <mlev>
##$CPDPRGB= <>
##$CPDPRGT= <>
##$D= (0..63)
$$ [...]
##$SW_h= 37037.037037037
##$TD= 32768
##$TD0= 1
##$TE= 300
##$TE2= 300
##$TE3= 300
##$TEG= 300
##$TL= (0..7)
0 120 53 12 22 120 120 120 
##$TP= (0..7)
150 150 150 150 150 150 150 150 
##$TP07= 0
##$TPNAME0= <>
##$TPNAME1= <>
##$TPNAME2= <>
##$TPNAME3= <>
##$TPNAME4= <>
##$TPNAME5= <>
##$TPNAME6= <>
##$TPNAME7= <>
##$TPOAL= (0..7)
0.5 0.5 0.5 0.5 0.5 0.5 0.5 0.5 
##$TPOFFS= (0..7)
0 0 0 0 0 0 0 0 
##$TUNHIN= 0
##$TUNHOUT= 0
##$TUNXOUT= 0
##$USERA1= <user>
##$USERA2= <user>
##$USERA3= <user>
##$USERA4= <user>
##$USERA5= <user>
##$V9= 5
##$VALIST= <valist>
##$VCLIST= <CCCCCCCCCCCCCCC>
##$VD= 0
##$VDLIST= <DDDDDDDDDDDDDDD>
##$VPLIST= <PPPPPPPPPPPPPPP>
##$VTLIST= <TTTTTTTTTTTTTTT>
##$WBST= 1024
##$WBSW= 4
##$XGAIN= (0..3)
0 0 0 0 
##$XL= 0
##$YL= 0
##$YMAX_a= 2745
##$YMIN_a= -9811
##$ZGOPTNS= <>
##$ZL1= 120
##$ZL2= 120
##$ZL3= 120
##$ZL4= 120
##$ABSF1= 298.5841
##$ABSF2= -158.5842
##$ABSG= 5
##$ABSL= 5
##$ALPHA= 0
##$AQORDER= 0
##$ASSFAC= 0
##$ASSFACI= 0
##$ASSFACX= 0
##$ASSWID= 0
##$AUNMP= <proc_1d>
##$AXLEFT= 0
##$AXRIGHT= 0
##$AXTYPE= 0
##$AXUNIT= <>
##$AZFE= 0.1
##$AZFW= 0.5
##$BCFW= 0
##$BC_mod= 2
##$BYTORDP= 0
##$COROFFS= 0
##$CY= 12.5935478210449
##$DATMOD= 1
##$DC= 0
##$DFILT= <>
##$DTYPP= 0
##$F1P= 47.1127640792319
##$F2P= -24.0371245302204
##$FCOR= 0.5
##$FTSIZE= 32768
##$FT_mod= 6
##$GAMMA= 0
##$GB= 0
##$INTBC= 1
##$INTSCL= 7.269226e-011
##$ISEN= 30
##$LB= 10
##$LEV0= 0
##$LPBIN= 0
##$MAXI= 12.09355
##$MC2= 0
##$MEAN= 0
##$ME_mod= 0
##$MI= 0.7550151
##$NCOEF= 0
##$NC_proc= -13
##$NLEV= 6
##$NOISF1= 298.5841
##$NOISF2= 270.0111
##$NSP= 0
##$NTH_PI= 0
##$NZP= 0
##$OFFSET= 298.5841
##$PC= 1.4
##$PHC0= 205.9424
##$PHC1= 63.70457
##$PH_mod= 1
##$PKNL= yes
##$PPARMOD= 0
##$PPDIAG= 0
##$PPIPTYP= 0
##$PPMPNUM= 100
##$PPRESOL= 1
##$PSCAL= 0
##$PSIGN= 0
##$REVERSE= no
##$SF= 81.014009
##$SI= 32768
##$SIGF1= 270.0111
##$SIGF2= -158.5842
##$SINO= 77.54984
##$SIOLD= 32768
##$SREGLST= <31P.CDCl3>
##$SSB= 0
##$STSI= 32768
##$STSR= 0
##$SW_p= 37037.037037037
##$SYMM= 0
##$S_DEV= 0
##$TDeff= 32768
##$TDoff= 0
##$TI= <>
##$TILT= no
##$TM1= 0
##$TM2= 0
##$TOPLEV= 0
##$USERP1= <user>
##$USERP2= <user>
##$USERP3= <user>
##$USERP4= <user>
##$USERP5= <user>
##$WDW= 1
##$XDIM= 32768
##$YMAX_p= 561216581
##$YMIN_p= -47818358
$$ End of Bruker specific parameters
$$ ---------------------------------
##NTUPLES= NMR SPECTRUM
##VAR_NAME=  FREQUENCY,     SPECTRUM/REAL,   SPECTRUM/IMAG
##SYMBOL=    X,             R,               I
##VAR_TYPE=  INDEPENDENT,   DEPENDENT,       DEPENDENT
##VAR_FORM=  AFFN,          ASDF,            ASDF
##VAR_DIM=   32768,         32768,           32768
##UNITS=     HZ,            ARBITRARY UNITS, ARBITRARY UNITS
##FACTOR=    1.13031516577767, 1,            1
##FIRST=     37037.037037037, -20471590,     31144583
##LAST=      0,             -1284357,        28679446
##MIN=       0,             -47818358,       0
##MAX=       37037.037037037, 561216581,     0
$$ Real data points
##PAGE= N=1
##DATA TABLE= (X++(R..R)), XYDATA
$$ [...]
17776E284442j003967j62230O82090J115469J195543J005216L39157q04435j790684
17767E860601j966705j461137r37781p84224r23205j208973j491500j447527q61315
17758e221766J00470J106520J854084K016030J392701K70251o92275j041012q45611
17749a060608m81809k77490k70236k31469j1368K95982N70606P81551Q87601P91409
17739I94169M13400k43941j096302k021595k848427l365784l422790l000808k308619
17730a6900697j760342j690927k063028k545629k789924k554472j832101q31568
17722c2968688K88026J449110K487881L218212L647972L951524M153931L983101
17714i788931L081818J470191j86662j081970r63810j07926J103469K306769L074226
$$ plain form
17776 5284442 4280475 4118245 4800335 5915804 7111347 8116563 8455720 7651285 5860601
17767 5860601 3893896 2432759 1494978 710754 -212451 -1421424 -2912924 -4360451 -5221766
17758 -5221766 -5121296 -4014776 -2160692 -144662 1248039 1518290 826015 -214997 -1060608
17749 -1060608 -1542417 -1819907 -2090143 -2321612 -2332980 -2036998 -1466392 -684841 202760 994169
17739 994169 1407569 1163628 67326 -1954269 -4802696 -8168480 -11591270 -14592078 -16900697
17730 -16900697 -18661039 -20351966 -22414994 -24960623 -27750547 -30305019 -32137120 -32968688
17722 -32968688 -32680662 -31231552 -28743671 -25525459 -21877487 -17925963 -13772032 -9788931
17714 -9788931 -6707113 -5236922 -5423584 -6505554 -7469364 -7577290 -6473821 -4167052 -1092826
17705a092826L064459K298289J018856m97553j876595k800944l229091l175646
17697f291051k611114j585798k00635J314345K495301K796900K011470N30295
17689a540287q42185j439932j192059l99497P27715J989800K974705L256092K648260
17680F182612J267807m64446j913855k407049j560640L19122K317365L535978
17672G276894L548864K494732R53536m82871j449881j673662j114428j98238L15269
17663I670215j41789j314071k259165k300985j611547p76356j31736K66193L81106
17654A781865L17179K95792K88975J60685R1601L91639R22619J065671L88527
17645E704553r75097k496113l426531l214717j987358m56653O06848Q14679K52316
$$ plain form
17705 -1092826 1971633 4269922 5288778 4791225 2914630 113686 -3115405 -6291051
17697 -6291051 -8902165 -10487963 -10688598 -9374253 -6878952 -4082052 -2070582 -1540287
17689 -1540287 -2382472 -3822404 -5014463 -5413960 -4686245 -2696445 278260 3534352 6182612
17680 6182612 7450419 6985973 5072118 2665069 1104429 1423551 3740916 7276894
17672 7276894 10825758 13320490 14274026 13791155 12341274 10667612 9553184 9354946 9670215
17663 9670215 9528426 8214355 5955190 3654205 2042658 1266302 1134566 1400759 1781865
17654 1781865 2099044 2394836 2683811 2844496 2936097 3327736 4250355 5316026 5704553
17645 5704553 4729456 2233343 -1193188 -4407905 -6395263 -6851916 -6245068 -5430389 -5178073
17636e178073p07197j715561k595245l158693l242988l019090k816198k588699
17628b5021744k006591j103276k85512L37255J066801J984454K723488K995782
17620a9309343K934290K827046K869823L081329L224395L014209K343876J246692
17612B232317o040q61803r62074n51451j20311O3864l2395l64981q37427j307325
17602b747626j640123j691948j488716j351924j576957k028549k163383j656499
17594a6345725q27472j36419L71860R15085J598826K350191L002986L326119L110107
17585b634442K308785J029639m73907j692774k029839j401616m96363q6909l72122
17576e849548j089032j765948j920492j446433o73896Q0760O71678R60299R43491
$$ plain form
17636 -5178073 -5885270 -7600831 -10196076 -13354769 -16597757 -19616847 -22433045 -25021744
17628 -25021744 -27028335 -28131611 -28417123 -28079868 -27013067 -25028613 -22305125 -19309343
17620 -19309343 -16375053 -13548007 -10678184 -7596855 -4372460 -1358251 985625 2232317
17612 2232317 2226277 1364474 402400 -149051 -269362 -205498 -237893 -602874 -1440301 -2747626
17602 -2747626 -4387749 -6079697 -7568413 -8920337 -10497294 -12525843 -14689226 -16345725
17594 -16345725 -17173197 -17309616 -16937756 -16022671 -14423845 -12073654 -9070668 -5744549 -2634442
17585 -2634442 -325657 703982 230075 -1462699 -3492538 -4894154 -5390517 -5477426 -5849548
17576 -5849548 -6938580 -8704528 -10625020 -12071453 -12745349 -12664589 -11992911 -11032612 -10089121
17567a0089121Q63043R71135J302749J604373J593341J264904P39925r67r72118
17558b722736j809754k015520j576425q81337j78694M23728P23610O94972O21302
17549f720854O14596M48602N1590k41672l7695O66465J398570J697022J763063
17540c60313K128774K782117L323295L511795L231603K401805J092268l28682
17532A7782662j311812j684890j844705k010412j747317p61657M04858R64219
17524I790946O85717o1539q11791j402669j810796j844333j326137m56423K55706
17515C018681L87729j14243p92491j022561o43262N2605P39201J237408J405893
17506D268960J160857N80640j58507q50381j361261j718753j914845j889074j750933
$$ plain form
17567 -10089121 -9226078 -8254943 -6952194 -5347821 -3754480 -2489576 -1749651 -1750618 -2722736
17558 -2722736 -4532490 -6548010 -8124435 -9005772 -9184466 -8760738 -8037128 -7342156 -6720854
17549 -6720854 -6106258 -5657656 -5606066 -5847738 -5885433 -5218968 -3820398 -2123376 -360313
17540 -360313 1768461 4550578 7873873 11385668 14617271 17019076 18111344 17782662
17532 17782662 16470850 14785960 12941255 10930843 9183526 8421869 8826727 9790946
17524 9790946 10476663 10415124 9603333 8200664 6389868 4545535 3219398 2762975 3018681
17515 3018681 3406410 3292167 2499676 1477115 833853 886458 1625659 2863067 4268960
17506 4268960 5429817 6010457 5851950 5001569 3640308 1921555 6710 -1882364 -3633297
17497c633297j717230j864033k002800j858326j405262q82797n25113l38609r1789
17488a4319256L72401R48717J477935J825042J830401J432354P69833J34488k11370
17479e739455k41873j05315J30062M74215R36988J554580K288818K872059K952879
17470E122958K505574J913126J498010J243539J031914P56960K63946m42047j146452
17461A2747528j644953j854696j766969j264306l20043N73892Q48408O01927L44812
17452H265600K77503K62497L24415O22877J042187J160977O85466j58076r11392
17443A1572054j274828j187665q93251q42471j422374k561455l531594l526273
17435c667857k499096j102939R169O73747J185638J678697J838484J496518R41907
$$ plain form
17497 -3633297 -5350527 -7214560 -9217360 -11075686 -12480948 -13363745 -13888858 -14227467 -14319256
17488 -14319256 -13946855 -12998138 -11520203 -9695161 -7864760 -6432406 -5662573 -5528085 -5739455
17479 -5739455 -5981328 -6086643 -5956581 -5482366 -4545378 -2990798 -701980 2170079 5122958
17470 5122958 7628532 9541658 11039668 12283207 13315121 14072081 14336027 13893980 12747528
17461 12747528 11102575 9247879 7480910 6216604 5896561 6470453 7318861 7920788 8265600
17452 8265600 8543103 8805600 9130015 9752892 10795079 11956056 12641522 12483446 11572054
17443 11572054 10297226 9109561 8216310 7373839 5951465 3390010 -141584 -3667857
17435 -3667857 -6166953 -7269892 -7260723 -6586976 -5401338 -3722641 -1884157 -387639 554268
17426E54268M66286J9251o75772j751111k828199l168718k358000n67927J708311
17417h601611L855631N281140N543856M533582K743042J080311O0137m25108o02352
17408A3468628o23903o66578q35369j068227j256089j345901j432929j765577
17400D474055k439781l111429l195620k506023j521470q29851o64291r43717j315252
17391a2053379j353342r54768l94438L3975K66921L65839M33093O39700J002548
17382a2013851J192928J008361Q17137J128332K068147L363453M581092N300808
17374G446407N258322M452457L051842J367773k53224j638908k712181l362376
17366A3610112l547274l420710l143379k634686j813518r43027m03868k86553
$$ plain form
17426 554268 1020554 1039805 364033 -1387078 -4215277 -7383995 -9741995 -10309922 -8601611
17417 -8601611 -4745980 535160 6079016 10612598 13355640 14435951 14496088 14070980 13468628
17408 13468628 12844725 12178147 11342778 10274551 9018462 7672561 6239632 4474055
17400 4474055 2034274 -1077155 -4272775 -6778798 -8300268 -9130119 -9794410 -10738127 -12053379
17391 -12053379 -13406721 -14361489 -14755927 -14721952 -14455031 -14089192 -13656099 -13016399 -12013851
17382 -12013851 -10820923 -9812562 -8995425 -7867093 -5798946 -2435493 2145599 7446407
17374 7446407 12704729 17157186 20209028 21576801 21323577 19684669 16972488 13610112
17366 13610112 10062838 6642128 3498749 864063 -949455 -1892482 -2296350 -2582903
17358b582903m16792p07463j311845k325283l440607m091683l882172k733723
17350b1492471r38315Q00498J834219K119851J932700J330512L88500m96381r26588
17341a5447475p64101j7909J145903K362572L292597L803044L947751L861468
17333B183850L575149K993010K208281J525927J099680Q45644M65091l00791j184629
17324A3411212j664012j608628j247531q56813o31577o03624q17956j378533k095501
17315B507037k564981k535896j923807q64821K09106P79953O53435K43112K03663
17306c293199P20322J465188K076157K330469K077183J204888j99899j666863
17298D714246k614794k793327k361592j735887j335219j303033j456693j539021
$$ plain form
17358 -2582903 -2999695 -3707158 -5019003 -7344286 -10784893 -14876576 -18758748 -21492471
17350 -21492471 -22430786 -21630288 -19796069 -17676218 -15743518 -14413006 -14024506 -14520887 -15447475
17341 -15447475 -16211576 -16229485 -15083582 -12721010 -9428413 -5625369 -1677618 2183850
17333 2183850 5758999 8752009 10960290 12486217 13585897 14431541 14896632 14595841 13411212
17324 13411212 11747200 10138572 8891041 8034228 7402651 6799027 5981071 4602538 2507037
17315 2507037 -57944 -2593840 -4517647 -5382468 -5173362 -4393409 -3739974 -3496862 -3293199
17306 -3293199 -2572877 -1107689 968468 3298937 5376120 6581008 6381109 4714246
17298 4714246 2099452 -693875 -3055467 -4791354 -6126573 -7429606 -8886299 -10425320
17290a0425320j531273j606153j749991j738552j469875j029128n72679k33987
17282b0356958O9231N91832J412241K348153L097310L356535K985855K126907
17274d368894J212342P10894O48530O50788M67965K29511K80943P16422J207655
17265A756156J495198J615853J497957Q63645k12052j124446j375381r91727l52990
17256C172213K55173Q74377J572295K211383K681617K922471K629411J523907
17248A7842847p9373j411026j910788j568736p71019J5836M99231O51947P22316
17239A3991235R95578J435070J834471K164384K444666K434733J752521L25303
17231B7377961j432661k892295l603507l484853k704956j467405r6943Q69478
$$ plain form
17290 -10425320 -11956593 -13562746 -15312737 -17051289 -18521164 -19550292 -20122971 -20356958
17282 -20356958 -20287727 -19695895 -18283654 -15935501 -12838191 -9481656 -6495801 -4368894
17274 -4368894 -3156552 -2445658 -1797128 -1146340 -678375 -448864 -167921 548501 1756156
17265 1756156 3251354 4867207 6365164 7228809 7016757 5892311 4516930 3525203 3172213
17256 3172213 3427386 4301763 5874058 8085441 10767058 13689529 16318940 17842847
17248 17842847 17763474 16352448 14441660 12872924 12101905 12117741 12616972 13268919 13991235
17239 13991235 14986813 16421883 18256354 20420738 22865404 25300137 27052658 27377961
17231 27377961 25945300 23053005 19449498 15964645 13259689 11792284 11695341 12564819
17223A2564819J121825R53661Q84149R80571Q95512M75711n5862l77290m49724
17214A6993372n53632q56446j281749j784383k323089k761122l057905l197000
17206A178046k953972k151028j030294m6276N53271P74860O79242L06792l01932
17197b991291j030267j611080j784494j489715p98311J43537J076707J665262
17189f819652J688725J343882J155219J433601J988387K335293K116097J365127
17181F606679M42828l30132r22991j432217j833429j968095j764796j338033q30442
17172c370628k78763K33120N37024N96045M29541L2367m92941r94287j372067
17163d680589j471818j151008o07461k94680l64978l89232Q9830Q45594J206831
$$ plain form
17223 12564819 13686644 14640305 15524454 16505025 17400537 17876248 17820386 17443096 16993372
17214 16993372 16439740 15583294 14301545 12517162 10194073 7432951 4375046 1178046
17206 1178046 -1775926 -3926954 -4957248 -5003524 -4450253 -3675393 -2996151 -2689359 -2991291
17197 -2991291 -4021558 -5632638 -7417132 -8906847 -9705158 -9561621 -8484914 -6819652
17189 -6819652 -5130927 -3787045 -2631826 -1198225 790162 3125455 5241552 6606679
17181 6606679 7049507 6719375 5796384 4364167 2530738 562643 -1202153 -2540186 -3370628
17172 -3370628 -3649391 -3416271 -2879247 -2283202 -1853661 -1821294 -2314235 -3308522 -4680589
17163 -4680589 -6152407 -7303415 -7910876 -8205556 -8570534 -8959766 -8869936 -8024342 -6817511
17154f817511Q68100J07445o99127j305516j582265j622698j537917j339328j228991
17145a5157808j333400j369358j193990j018224p56145n2763R89737J780409J933015
17136a6178527J685591J536285J527915J250996N96397j22209o71322r81296j022488
17127a2378658q40597n60540l57238l41973m54162n30681l47926K54537J095882
17118a4461356J637829J526055J073896P82966P64145R34152J316706J965895
17110d459712K638852K731277J867120L61387j080490j912977k053814j778829
17102c687186j457475j288509j218484j145210j005349p15860j78635N82607J427776
17093h686325K188107K537810K147080J106438Q269n05565l36479K12734J025447
$$ plain form
17154 -6817511 -5949411 -5841966 -6541093 -7846609 -9428874 -11051572 -12589489 -13928817 -15157808
17145 -15157808 -16491208 -17860566 -19054556 -20072780 -20828925 -20881688 -19891951 -18111542 -16178527
17136 -16178527 -14492936 -12956651 -11428736 -10177740 -9581343 -9703552 -10374874 -11356170 -12378658
17127 -12378658 -13219255 -13779795 -14137033 -14479006 -14933168 -15463849 -15811775 -15557238 -14461356
17118 -14461356 -12823527 -11297472 -10223576 -9440610 -8676465 -7742313 -6425607 -4459712
17110 -4459712 -1820860 910417 2777537 3138924 2058434 145457 -1908357 -3687186
17102 -3687186 -5144661 -6433170 -7651654 -8796864 -9802213 -10518073 -10696708 -10114101 -8686325
17093 -8686325 -6498218 -3960408 -1813328 -706890 -698621 -1204186 -1540665 -1327931 -302484
17084c02484K091204L092618L580268L439357K972558K502476J947793J007537
17076B0331327l31962j815288l183100m165285m376691l575205k235656j349697
17068g01557j389847j974708k441402k326755j620357o70884K34616R98596J629780
17059h262518K173464K570999K668559K397541J856803J280840Q92488O91110
17051F269286M98723J79545k86834p69165j003513q82494p44890r74684j456879
17042H29095j824507j895602j782654j766932j993787k289202k330047j915422
17034a4969058j018901J33902J124360J616151J514919J009721M80220K58171
17026i850515L91103N48563K81241m11188r90199j044637o33287L1413P54003
$$ plain form
17084 -302484 1788720 4881338 8461606 11900963 14873521 17375997 19323790 20331327
17076 20331327 19999365 18184077 15000977 10835692 6459001 2883796 648140 -701557
17068 -701557 -2091404 -4066112 -6507514 -8834269 -10454626 -11125510 -10890894 -9892298 -8262518
17059 -8262518 -6089054 -3518055 -849496 1548045 3404848 4685688 5578176 6269286
17051 6269286 6768009 6947554 6660720 5891555 4888042 4005548 3260658 2285974 829095
17042 829095 -995412 -2891014 -4673668 -6440600 -8434387 -10723589 -13053636 -14969058
17034 -14969058 -15987959 -15854057 -14729697 -13113546 -11598627 -10588906 -10108686 -9850515
17026 -9850515 -9459412 -8910849 -8629608 -9040796 -10030995 -11075632 -11708919 -11677506 -10923503
17017a0923503J335535J666805J752768J587740J107475K90362o94619j406402
17009e283839j384125o34359K82067P54957O06434N1688n77483j108895j524312
17000h817867j768700j730672j312745n66594K17706P26875R52313J164314J544018
16991i591352J995432K288643K221039J806657J349271J113978J035441R17516
16983C136625P88539Q86817J223430J322768P80308k10019j151979j602969j419119
16974C754401r53544p34582r89928j538471j900616j621611p27696K52521P55846
16965c703680O02308N4904n00590q17096p98073m61825P6772O02932R32786J015126
16955b996436Q54093N15886J64909l9522q9199q4435j43991l28183n19985n48338
$$ plain form
17017 -10923503 -9587968 -7921163 -6168395 -4580655 -3473180 -3182818 -3877437 -5283839
17009 -5283839 -6667964 -7302323 -7020256 -6265299 -5658865 -5607177 -6184660 -7293555 -8817867
17000 -8817867 -10586567 -12317239 -13629984 -14196578 -13978872 -13251997 -12299684 -11135370 -9591352
16991 -9591352 -7595920 -5307277 -3086238 -1279581 69690 1183668 2219109 3136625
16983 3136625 3925164 4811981 6035411 7358179 8138487 7928468 6776489 5173520 3754401
16974 3754401 2800857 2066275 1076347 -462124 -2362740 -3984351 -4712047 -4459526 -3703680
16965 -3703680 -3101372 -3046468 -3547058 -4364154 -5162227 -5624052 -5547280 -4944348 -4011562 -2996436
16955 -2996436 -2142343 -1626457 -1461548 -1501070 -1590269 -1674704 -1818695 -2146878 -2666863 -3215201
16945c215201m61105n30453j012642j754555k064079j408140k3667J410209K315919
16936f743714K573307K592402K784055L133118L517319L890597L968098L443965
16928A9159147K501619J631415J126494Q28151L43899m41169j253971j818540
16920B2077045k181506k535902k839302k972532l003898k995517k835776k385252
16912C27360j633327o72362L00669R52959J116178J060231J157950J379761J455500
16903E444919J409296J417983J323730P89054j40308r63223j270018j130542q99877
16894E981014q30270q45948n97349J09043Q84329J086452N68535k46227q96677
16885E212902j233015j308620j169986p57103R9629J438662K848105L629476L394411
$$ plain form
16945 -3215201 -3676306 -4206759 -5219401 -6973956 -9038035 -10446175 -10469842 -9059633 -6743714
16936 -6743714 -4170407 -1578005 1206050 4339168 7856487 11747084 15715182 19159147
16928 19159147 21660766 23292181 24418675 25246826 25590725 25149556 23895585 22077045
16920 22077045 19895539 17359637 14520335 11547803 8543905 5548388 2712612 327360
16912 327360 -1305967 -1978329 -1677660 -724701 391477 1451708 2609658 3989419 5444919
16903 5444919 6854215 8272198 9595928 10384982 10244674 9281451 8011433 6880891 5981014
16894 5981014 5150744 4304796 3707447 3816490 4700819 5787271 6355806 6109579 5212902
16885 5212902 3979887 2671267 1501281 744178 843807 2282469 5130574 8760050 12154461
16876A2154461K414761J362510P43607O01494N77675J90197o79883j595481k122436
16867A3646905k246433k171688k070199j974388j778940j464201j275774j406870
16859g41588j677406j786868j699771j633674j666251j595136j302193q58931
16851a2961818l66555o4728k71038r21419j388536r94591K40559J637844K559239
16842a2531043K782304K439303J876066J471812J409286J598375J708151J329905
16834B084159L03906j063411k188616k653969k491293k019207j514930j063516
16826a0606877m41054O53233K100211L306826L745840L361204K434931J370468
16818E924782N02551n3235l13572l00203n7775K36815K40163l34283j312791k050001
$$ plain form
16876 12154461 14569222 15931732 16675339 17276833 17854508 18044705 17364822 15769341 13646905
16867 13646905 11400472 9228784 7158585 5184197 3405257 1941056 665282 -741588
16859 -741588 -2418994 -4205862 -5905633 -7539307 -9205558 -10800694 -12102887 -12961818
16851 -12961818 -13328373 -13393101 -13664139 -14585558 -15974094 -16968685 -16728126 -15090282 -12531043
16842 -12531043 -9748739 -7309436 -5433370 -3961558 -2552272 -953897 754254 2084159
16834 2084159 2388065 1324654 -863962 -3517931 -6009224 -8028431 -9543361 -10606877
16826 -10606877 -11047931 -10394698 -8294487 -4987661 -1241821 2119383 4554314 5924782
16818 5924782 6427333 6374098 6060526 5760323 5702548 5939363 6179526 5845243 4532452 2482451
16808B482451k046436j434606p70731m64243m20077k43139J35139L57533J56236
16799b247873k83252n84588n77219k37127L08110O58953N61701K77423K81253
16790a842619P23996J234150J339961R33121L32370P5372L93547J027340J623936
16781E841174J807985J224884P5590q00296q00375k00016K91915K94043m437k30617
16771G499850k91264k76363q9215M87827J395336K159076K234625J426686K1641
16762A4568199j326449j996707j915914j572120j458298j553968j394367p31065
16754B619311J06811P16815J166905J726273K344406K647486K396377J828244
16746A5552628J336130J032868Q12832N65431L11684J89043K91556N21300O73345
$$ plain form
16808 2482451 436015 -998591 -1769322 -2233565 -2653642 -2896781 -2761642 -2404109 -2247873
16799 -2247873 -2531125 -3115713 -3692932 -3930059 -3621949 -2962996 -2401295 -2123872 -1842619
16790 -1842619 -1118623 115527 1455488 2388609 2720979 2796351 3189898 4217238 5841174
16781 5841174 7649159 8874043 8949633 8149337 7348962 7148946 7440861 7734904 7730467 7499850
16771 7499850 7208586 6932223 6843008 7330835 8726171 10885247 13119872 14546558 14568199
16762 14568199 13241750 11245043 9329129 7757009 6298711 4744743 3350376 2619311
16754 2619311 2726122 3442937 4609842 6336115 8680521 11328007 13724384 15552628
16746 15552628 16888758 17921626 18734458 19299889 19611573 19800616 20092172 20613472 21286817
16737B1286817O54375N55849M33363J00301n89241j399787j915779j930657j542096
16728A5653145j026574o75060o44543q67095j161988j401660j406439j038556
16720G431230m52116J31449N67050O29191J67563n81906j055197q27481r2268
16711E917515N53982Q97598J183707J526902J816541K035875K264093K428880
16703A8625093K402455K316861K440257K599517K236273J295592L37219k16073
16695C2037194k87938k1067J50830k79943j388062k576846l034356k566837j672741
16686B0360234q73187l57427k21314o85949j706241k581062k538618j572106m17014
16677I407316J18419q0034k95160K05611J353648K353131K452129J552513J23131
$$ plain form
16737 21286817 21941192 22497041 22930404 23030705 22441464 21041677 19125898 17195241 15653145
16728 15653145 14626571 13951511 13306968 12439873 11277885 9876225 8469786 7431230
16720 7431230 6979114 7110563 7677613 8306804 8474367 7892461 6837264 6009783 5917515
16711 5917515 6471497 7369095 8552802 10079704 11896245 13932120 16196213 18625093
16703 18625093 21027548 23344409 25784666 28384183 30620456 31916048 32253267 32037194
16695 32037194 31749256 31728189 31879019 31599076 30211014 27634168 24599812 22032975 20360234
16686 20360234 19487047 19129620 18908306 18222357 16516116 13935054 11396436 9824330 9407316
16677 9407316 9525735 9445701 9150541 9356152 10709800 13062931 15515060 17067573 17190704
16668A7190704j226656k058146k258403j969050j387757o02713M60938J769811
16660I918728K931152L442818L088679K170357J363645J105821J180659J016873
16652B6218732L32598o71099j661175k418242k712134k346673j483455o29127
16644A4629425k06676k63050n48919p14981n21826l6736M77755Q25235Q41781
16635A4482008L77796n02790j367246j599523r56205O2125O06606L19321m47675
16626A0974417j197400j690363j915730k117092k509242k910108l072287l010354
16618g448159k783578k358850j821735j232544l87197P62324J875878K667882
16610a0725979L167837L550360L942410M202807L832638K552774Q80433m76235
$$ plain form
16668 17190704 15964048 13905902 11647499 9678449 8290692 7687979 8148917 9918728
16660 9918728 12849880 16292698 19381377 21551734 22915379 24021200 25201859 26218732
16652 26218732 26551330 25880231 24219056 21800814 19088680 16742007 15258552 14629425
16644 14629425 14422749 14159699 13610780 12895799 12373973 12337237 12814992 13640227 14482008
16635 14482008 14859804 14357014 12989768 11390245 10434040 10496165 11102771 11422092 10974417
16626 10974417 9777017 8086654 6170924 4053832 1544590 -1365518 -4437805 -7448159
16618 -7448159 -10231737 -12590587 -14412322 -15644866 -16032063 -15269739 -13393861 -10725979
16610 -10725979 -7558142 -4007782 -65372 4137435 7970073 10522847 11403280 10927045
16602A0927045j462667k336218l021285l231008k839703k094327j507204j369944
16594f935311j475079j446489j140612n83411J89237R83199J474181J584810J544510
16585e804965J567868J637666J647261J542301J315230J081598R76722R72262
16577D935943R50239P85484M49766Q6899j51965l07063n39197q01887q25287n07237
16567D075695j15298O9361J23430K35002M54837P98268J176496J407793J438352
16558I663936J228798O59794k40131j281935k330698l293135l960261m009621
16550c563253l202236j609296L61775K187459L511898M205047M254954L712875
16542I859223K626934J078511o34801k060217k808936k723951j892843n88384
$$ plain form
16602 10927045 9464378 7128160 4106875 875867 -1963836 -4058163 -5565367 -6935311
16594 -6935311 -8410390 -9856879 -10997491 -11580902 -11391665 -10408466 -8934285 -7349475 -5804965
16585 -5804965 -4237097 -2599431 -952170 590131 1905361 2986959 3963681 4935943
16577 4935943 5886182 6671666 7121432 7208331 7056366 6749303 6210106 5408219 4582932 4075695
16567 4075695 3960397 4029758 4153188 4388190 4843027 5641295 6817791 8225584 9663936
16558 9663936 10892734 11552528 11312397 10030462 7699764 4406629 446368 -3563253
16550 -3563253 -6765489 -8374785 -8013010 -5825551 -2313653 1891394 6146348 9859223
16542 9859223 12486157 13564668 12929867 10869650 8060714 5336763 3443920 2855536
16534B855536P36089J638072J923373J602844P30478n85095k124056l575937m549086
16525a347782m736649m115963k845630j079619R56930K771295L760819L708219
16517b928380K959860K018077J019285j10710j099663j507345j275475p65693
16509a690044l03361J57879O56133Q98256O36605j2884p37378j269179j448182
16500c112155j239225p90638m18117k93120k19092J06190O57676R94056O51233
16491c663192l85032j640550k537128k674232j900388m93429R01018J801259K267161
16482h324513K755565L578869M459442M808528M330197L132551J523643j17069
16474A6147213j360309j826168j445931n76604K42933N86294L70787j18671n89307
$$ plain form
16534 2855536 3591625 5229697 7153070 8755914 9486392 8901297 6777241 3201304 -1347782
16525 -1347782 -6084431 -10200394 -13046024 -14125643 -13168713 -10397418 -6636599 -2928380
16517 -2928380 31480 2049557 3068842 2958132 1858469 351124 -924351 -1690044
16509 -1690044 -1993405 -1835526 -1179393 -281137 355468 342584 -394794 -1663973 -3112155
16500 -3112155 -4351380 -5142018 -5560135 -5853255 -6072347 -5966157 -5308481 -4314425 -3663192
16491 -3663192 -4048224 -5688774 -8225902 -10900134 -12800522 -13293951 -12392933 -10591674 -8324513
16482 -8324513 -5568948 -1990079 2469363 7277891 11608088 14740639 16264282 16147213
16474 16147213 14786904 12960736 11514805 10938201 11181134 11767428 12138215 12019544 11430237
16465A1430237r77647j387842k002350l001860m190213m500741k689469Q19464
16457f500421L937887N079023M199884K172341M9782j341676j597509q54189J77010
16448E322132P86101R81647J182782J472200J621768J577715J656794K155501
16440A6756640K933362L528108L494589K766037J642674M41029o11397j303653
16432B9647389j396060p98651J10104N08805j79269j541201k603312k920193k668785
16423A8158827k090000j345687n86829p734K38941K76531M54034R66651J498480
16414A7563214J392426K98579j514662l358770m558272m855892m394644l575563
16406c003584k901454k629653k573128k237390j276094J61099J690043L065452
$$ plain form
16465 11430237 10452590 9064748 7062398 4060538 -129675 -4630416 -7319885 -6500421
16457 -6500421 -2562534 2516489 6716373 8888714 8938496 7596820 5999311 5145122 5322132
16448 5322132 6108233 7089880 8272662 9744862 11366630 12944345 14601139 16756640
16440 16756640 19690002 23218110 26712699 29478736 31121410 31562439 30951042 29647389
16432 29647389 28251329 27452678 27562782 28071587 27892318 26351117 23747805 20827612 18158827
16423 18158827 16068827 14723140 14136311 14128577 14367518 14644049 15098083 16064734 17563214
16414 17563214 18955640 19254219 17739557 14380787 9822515 4966623 571979 -3003584
16406 -3003584 -5905038 -8534691 -11107819 -13345209 -14621303 -14460204 -12770161 -9704709
16398i704709M173879M906358N155422M842496L931763K558943J169871M43108
16390A7477131Q88029K183676L152695K585597k1271l943219p212477q206914
16382F903247p381338o347977n757739n053142l567226j195758J546763L789134
16374a7064036M796113M431543L222047J802398M16419q52969j623646j579410
16366f451541j161382j095701j390917j337857m10249J122956K531298L272145
16358d921248L171773K412605J431610N45182j77661o48426o85235k16817N56585
16349A468368J246290J588250J640447J631279J602989J345512P01175k47620
16341A0976690j169169j652205j586729j228281p88634k74869K32147N29799N76753
$$ plain form
16398 -9704709 -5530830 -624472 4530950 9373446 13305209 15864152 17034023 17477131
16390 17477131 18365160 20548836 23701531 26287128 26265857 22322638 15110161 6903247
16382 6903247 -478091 -6826068 -12583807 -17636949 -21204175 -22399933 -20853170 -17064036
16374 -17064036 -12267923 -7836380 -4614333 -2811935 -2395516 -3248485 -4872131 -6451541
16366 -6451541 -7612923 -8708624 -10099541 -11437398 -11847647 -10724691 -8193393 -4921248
16358 -4921248 -1749475 663130 2094740 2639922 2462261 1813835 1128600 911783 1468368
16349 1468368 2714658 4302908 5943355 7574634 9177623 10523135 11224310 10976690
16341 10976690 9807521 8155316 6568587 5340306 4551672 4276803 4508950 5038749 5615502
16332E615502N31387M21153J59030r2950n0387L08918P32215J018140J187977
16323I830985J191732Q05134P332p96084j054237n98096L64883J692246L408616
16314A4852511N424239P443528R058318R575502Q043499L968560j593971o152885
16306E0619301q154498q139667p222801o010478m713570l415363k179465j051571
16298I731888q0567O66911J042902R35993N58255J78128k47972p85981j291906
16289A0707651j571306j463418r60428l15957J47257K44376k8779m95435p70332
16280E493629n95231j04208N54255J369790K205709K745721K658887J791496K83318
16271A6403366j455976k797482l214938k721643j850837j261111j225439j410553
$$ plain form
16332 5615502 6146889 6568042 6727072 6634122 6583735 6892653 7624868 8643008 9830985
16323 9830985 11022717 11827851 11835183 11039099 9984862 9386766 9751649 11443895 14852511
16314 14852511 20276750 27720278 36778596 46354098 54397597 58366157 56772186 50619301
16306 50619301 42464803 34325136 27102335 21091857 16378287 12962924 10783459 9731888
16298 9731888 9651321 10318232 11361134 12297127 12855382 13033510 12785538 11999557 10707651
16289 10707651 9136345 7672927 6712499 6396542 6543799 6788175 6759396 6263961 5493629
16280 5493629 4898398 4794190 5348445 6718235 8923944 11669665 14328552 16120048 16403366
16271 16403366 14947390 12149908 8934970 6213327 4362490 3101379 1875940 465387
16263D65387j262043n43282N08922J325813J440093Q73291n3933r83378j490651
16254B80219j276956n00348L76789R87777J089914N67209l37672j194665j789606
16245a797339k102538k001699j333255l21664M83268O15735l5845j189719k315044
16236i998100k827946k314110q04994J192865L027194M194478M445326L809918
16228G24631K551505J119455J6515n11823o65920q48126j140621j198812q18958
16219g72154k54017J87642M90769P01994O50348K01401m25928q25999q79333q76139
16209a801416j084408j480717j830490j968071j996793k132729k502652l011579
16201a7808855l315560k940356j593006L94921K149776K983624K938258K544360
$$ plain form
16263 465387 -796656 -1339938 -831016 494797 1934890 2808181 2754248 1770870 280219
16254 280219 -996737 -1497085 -1120296 -132519 957395 1524604 1186932 -7733 -1797339
16245 -1797339 -3899877 -5901576 -7234831 -7556495 -7073227 -6457492 -6493337 -7683056 -9998100
16236 -9998100 -12826046 -15140156 -15945150 -14752285 -11725091 -7530613 -3085287 724631
16228 724631 3276136 4395591 4412106 3900283 3234363 2386237 1245616 46804 -772154
16219 -772154 -1026171 -838529 -347760 354234 1004582 1205983 780055 -45944 -925277 -1801416
16209 -1801416 -2885824 -4366541 -6197031 -8165102 -10161895 -12294624 -14797276 -17808855
16201 -17808855 -21124415 -24064771 -25657777 -25262856 -23113080 -20129456 -17191198 -14646838
16193a4646838K147709J692081J156558Q11350Q95266J348120J882153K175375
16185b538226K008935J480056J058504R87111R57922O10068j7256m75007l81849
16176C690258R1792M98379P12933R78836J374543J506406J039918K69991k74080
16167I888976o13259j215106k177153l017994l247185k738568j628053j71397
16159d919739J260472K258046K563129K245129J618566J035288P42673O45479
16151G449043L32008l72921j182377j697737j770882j545492j270415j133327
16143a192100j054243p84798l40011k7767l0092j67842j39725J16546M12226N26996
16133b680810L99039N3986o16779j746252l052859l898463l908152l171325j977291
$$ plain form
16193 -14646838 -12499129 -10807048 -9650490 -8839140 -7943874 -6595754 -4713601 -2538226
16185 -2538226 -529291 950765 2009269 2996380 3954302 4564370 4547114 4072107 3690258
16176 3690258 3782050 4280429 4993362 5972198 7346741 8853147 9893065 10163056 9888976
16167 9888976 9275717 8060611 5883458 2865464 -381721 -3120289 -4748342 -4919739
16159 -4919739 -3659267 -1401221 1161908 3407037 5025603 6060891 6803564 7449043
16151 7449043 7781051 7408130 6225753 4528016 2757134 1211642 -58773 -1192100
16143 -1192100 -2246343 -3031141 -3371152 -3398919 -3429011 -3596853 -3736578 -3620032 -3207806 -2680810
16133 -2680810 -2281771 -2227785 -2844564 -4590816 -7643675 -11542138 -15450290 -18621615 -20598906
16124b0598906n71377R08790K294367L262995L486481K925794J887244P93972
16116e610640l8836m77228n79283o24158q98808j400166j810850j651780p68625
16107a3860374L08844J009941J492591K252152L286892M036996M040179L418278
16099E985499K684987K241609K063557J838908J357726O67351m4377o49347j190339
16090A4955574j692312k003979j953714j584665j089410n15299J49213Q03728
16082G069136J421366J973937K224467K018057J442203N87324m20656j293652
16074A5022182j852908k181526k241096j918381j441052j168590j281747j698802
16066A238080k035702j853030j021416J62461J176103J581755J200062K70027
$$ plain form
16124 -20598906 -21170283 -20261493 -17967126 -14704131 -11217650 -8291856 -6404612 -5610640
16116 -5610640 -5649476 -6126704 -6705987 -7330145 -8228953 -9629119 -11439969 -13091749 -13860374
16107 -13860374 -13551530 -12541589 -11048998 -8796846 -5509954 -1472958 2567221 5985499
16099 5985499 8670486 10912095 12975652 14814560 16172286 16839637 16795260 16145913 14955574
16090 14955574 13263262 11259283 9305569 7720904 6631494 6116195 6265408 7069136
16082 7069136 8490502 10464439 12688906 14706963 16149166 16736490 16315834 15022182
16074 15022182 13169274 10987748 8746652 6828271 5387219 4218629 2936882 1238080
16066 1238080 -797622 -2650652 -3672068 -3509607 -2333504 -751749 448313 718340
16058G18340n55707o87132j33741N73665Q51895M73553k31062o23528l30009M45508
16048E01782J164764J409590J106979M37994k80434p11312p69999o38281n41852
16039A679231o17765r30521j567639k506228l421876l877249l685455l017963
16031a7945465k243063j589866r53318j50903Q66664K052786L164402L916090
16023a2882673M253503M165467L571379K640939J862647J523354J402384J111601
16015G648601M92263l32101j076709j514504j720867j901374j948402j485423
16007a838516m27875P72622J525659J695748J728069K002111K204710J747737
15999I410265N46018j015748k398569l110774k972958k069329o76266P61282J874038
$$ plain form
16058 718340 162633 -524499 -658240 -84575 767320 1240873 1009811 386283 56274 501782
16048 501782 1666546 3076136 4183115 4621109 4340675 3629363 2859364 2221083 1679231
16039 1679231 1061466 130945 -1436694 -3942922 -7364798 -11242047 -14927502 -17945465
16031 -17945465 -20188528 -21778394 -22731712 -22882615 -22015951 -19963165 -16798763 -12882673
16023 -12882673 -8629170 -4463703 -892324 1748615 3611262 5134616 6537000 7648601
16015 7648601 8140864 7808763 6732054 5217550 3496683 1595309 -353093 -1838516
16007 -1838516 -2266391 -1493769 31890 1727638 3455707 5457818 7662528 9410265
15999 9410265 9956283 8940535 6541966 3431192 458234 -1611095 -2287361 -1526079 347959
15990C47959K430012K302551J610646O79132k49307j074056j653592j840213j698284
15981H54848j406608j021007n78773k11644o1793j48403l07754l88109l91698
15972c660941l21556j5868O94971J554066J982536J727365J079678M64877M3384
15963C548512j86748j52936K08674P79907J374946J933640K523950L130678L527081
15954A6687704L521542L239607K968779K834301K821742K891803K888869K623947
15946D0478294K227032K033956K128504K282831K217338J819119J212842N47611
15938E4947527j52689p97305j174909j153504q36326n33441n01678p96128j451479
15929D7550068k436158l447244m061485m042993l545993k987499k570989k093069
$$ plain form
15990 347959 2777971 5080522 6691168 7370300 7120993 6046937 4393345 2553132 854848
15981 854848 -551760 -1572767 -2151540 -2363184 -2424977 -2573380 -2881134 -3269243 -3660941
15972 -3660941 -3982497 -3998365 -3303394 -1749328 233208 1960573 3040251 3505128 3548512
15963 3548512 3361764 3208828 3417502 4197409 5572355 7505995 10029945 13160623 16687704
15954 16687704 20209246 23448853 26417632 29251933 32073675 34965478 37854347 40478294
15946 40478294 42705326 44739282 46867786 49150617 51367955 53187074 54399916 54947527
15938 54947527 54794838 53997533 52822624 51669120 50832794 50299353 49797675 49001547 47550068
15929 47550068 45113910 41666666 37605181 33562188 30016195 27028696 24457707 22364638
15921B2364638j293272k76750N18319Q30338P69181N44826K49833j48315n29913
15912B3028885m89858K40985J372600K246371K407174J774846N08508r86613k158099
15903B7944799k671939k640495k398009k099889j644418r25306q9160N01144O03243
15894A6579970K72603k98705j050818j956864k677402k728082j961117o63176
15886E516409O47565J428641J458632J087446Q81806J087240J455458J661856
15878A5225053J786251J910991J595626L44106j634762l489591m494351m585134
15870F658189m197449l729828l229655k473656j258129L13847J872530L103180
15862b940971L906931M308529M253181L569798K245257O64178o19287j308867
$$ plain form
15921 22364638 21071366 20794616 21312935 22143273 22912454 23457280 23707113 23558798 23028885
15912 23028885 22539027 22780012 24152612 26398983 28806157 30581003 31089511 30102898 27944799
15903 27944799 25272860 22632365 20234356 18134467 16490049 15564743 15475583 15976727 16579970
15894 16579970 16852573 16553868 15503050 13546186 10868784 8140702 6179585 5516409
15886 5516409 6163974 7592615 9051247 10138693 11020499 12107739 13563197 15225053
15878 15225053 17011304 18922295 20517921 20862027 19227265 15737674 11243323 6658189
15870 6658189 2460740 -1269088 -4498743 -6972399 -8230528 -7916681 -6044151 -2940971
15862 -2940971 965960 5274489 9527670 13097468 15342725 16006903 15387616 14078749
15854A4078749j316155o44275L73879J169860J537724J841263K437906L128529
15846B2607480L354294K858829J932358J044521M51426J91156J99926K89055K52694
15837C3181739J72531L27558P51402J182846J264460O97087o08278k383215l919670
15828C0666460m514783m069438k919329j360243L92689J965950K820484K660385
15820B5642175J814251J004422P81952J147350J536470J409753Q33116L92853
15812C4562342O12034J405158K135307K099001J026506p06877k487721l985358
15804C4660392n102614n597678n162092l964865k594108j509283q78461n66997
15796I284294k71840J89137Q82903J832123K791902L335120L304118K797793J852302
$$ plain form
15854 14078749 12762594 12118319 12492198 13662058 15199782 17041045 19478951 22607480
15846 22607480 25961774 28820603 30752961 31797482 32248908 32440064 32639990 32929045 33181739
15837 33181739 33354270 33681828 34433230 35616076 36880536 37577623 36969345 34586130 30666460
15828 30666460 26151677 22082239 19162910 17802667 18195356 20161306 22981790 25642175
15820 25642175 27456426 28460848 29242800 30390150 31926620 33336373 34169489 34562342
15812 34562342 35174376 36579534 38714841 40813842 41840348 41133471 38645750 34660392
15804 34660392 29557778 23960100 18798008 14833143 12239035 10729752 9851291 9284294
15796 9284294 9012454 9201591 10084494 11916617 14708519 18043639 21347757 24145550 25997852
15787B5997852N69942o51613j328957j322594r18622m39690J6047M73926R84293
15778B3380584J580111K147532K374125K028272J266523M47076j48541l31086
15770C2744596p9389L47315N42121L76707J80776L38892P80842R83283O19240
15761C6834383n5175n36322m94778Q8704R30744J543635J519760P36735n45024
15752D0022662j683661k138966j918040j430374j081930r01487n41933L12892
15744C0639163J552497K630018L042143K725478K048156J584347J612773J752011
15736D7586586J314719L8851j776703l559939m542861m231795l003082j661244
15728C0164532n71470L86337J326587K131842K631804K871185L044981L144431
$$ plain form
15787 25997852 26567794 25916181 24587224 23264630 22346008 21906318 21922365 22396291 23380584
15778 23380584 24960695 27108227 29482352 31510624 32777147 33224223 33075682 32744596
15770 32744596 32665207 33012522 33554643 33931350 34112126 34451018 35231860 36215143 36834383
15761 36834383 36779208 36242886 35748108 35836812 36767556 38311191 39830951 40567686 40022662
15752 40022662 38339001 36200035 34281995 32851621 31769691 30868204 30326271 30639163
15744 30639163 32191660 34821678 37863821 40589299 42637455 44221802 45834575 47586586
15736 47586586 48901305 48940156 47163453 43603514 39060653 34828858 31825776 30164532
15728 30164532 29593062 29979399 31305986 33437828 36069632 38940817 41985798 45130229
15720D5130229K935284K348675J595123Q97500L77969J25206K25637O85444J367730
15711E5688797K079268K687268L176040L542265L611529L173591K331957J471804
15703G7762519Q11123K76283k20541n40380l84670K72671J055067J483280J341381
15694H1856733Q42593K44866n47561j735235l143354m149376m113495k995806
15686F6259365j394190k6360P21449R40750R55411R38050Q61232O88017M52600
15677G0396324K30024K9519l13377r01968j500237j774302j719647j655238j846623
15668F0944475k189210k317597k056757j551988j002896m67599O9067N59612Q22862
15659E2809969O51066K0467p94235j357787j426175j106060o65775l51510l29158
$$ plain form
15720 45130229 48065513 50414188 52009311 52906811 53284780 53409986 53635623 54321067 55688797
15711 55688797 57768065 60455333 63631373 67173638 70785167 73958758 76290715 77762519
15703 77762519 78573642 78849925 78629384 78089004 77704334 77977005 79032072 80515352 81856733
15694 81856733 82699326 82944192 82396631 80661396 77518042 73368666 69255171 66259365
15686 66259365 64865175 64838815 65560264 66501014 67456425 68394475 69255707 69943724 70396324
15677 70396324 70626348 70655867 70342490 69440522 67940285 66165983 64446336 62791098 60944475
15668 60944475 58755265 56437668 54380911 52828923 51826027 51358428 51427495 51987107 52809969
15659 52809969 53461035 53481502 52687267 51329480 49903305 48797245 48131470 47779960 47450802
15650D7450802n23612o89235o34525k34116M53463J092287J230260O39095m36817
15641D8347602j488481k155232k257608j669894m92999R16274K219106L207933
15633D6626701L693486L552245K905322K032300J137663L27647l01641p05042
15625E9268681r21359r79295r24911q37932p00281m81360l26381l65087n31439
15616E3200636o74327n84569j83550L39323P90588J124970J391203J554023J444414
15607E8402711J090839P60319M69011o7468q45075j391590j373429j096778j055505
15598E4893035j317013j522061j235078l33459Q75020J858398K163965J685756
15590E7068563P91185R4291O2536P67410J756824K399933K500971K237499J714431
$$ plain form
15650 47450802 46927190 46237955 45603430 45369314 45822777 46915064 48145324 48784419 48347602
15641 48347602 46859121 44703889 42446281 40776387 40283388 41199662 43418768 46626701
15633 46626701 50320187 53872432 56777754 58810054 59947717 60275364 59973723 59268681
15625 59268681 58347322 57368027 56443116 55605184 54904903 54423543 54097162 53732075 53200636
15616 53200636 52526309 51941740 51758190 52097513 52888101 54013071 55404274 56958297 58402711
15607 58402711 59493550 60253869 60722880 60655412 59810337 58418747 57045318 55948540 54893035
15598 54893035 53576022 52053961 50818883 50485424 51360444 53218842 55382807 57068563
15590 57068563 57859748 57954039 58016575 58783985 60540809 62940742 65441713 67679212 69393643
15581F9393643R38448L8682p68749j350503j637841j547669j013093r1524R06912
15572F4868306J537455J536524J020139L38428l54420j160549k093833k908388
15564F2783662l262280k912914j881152n93802L98265R81175J400002J648593
15556E8561549J452821P95086m2142q12129j396901j805917k058540k012423j575655
15547E1105749q75522n8760P00865J087563Q83370K61446l37449o61220p95043
15538E1310999q59944p71541l87916J04363K02637m12629j554179k614037k949781
15529D2067972k470751j679128r86770l19035M84559J268516J678701J560740
15521D1604804J184549J008692J208821J462674J404856J167198J138334J383494
$$ plain form
15581 69393643 70332091 70370773 69602024 68251521 66613680 65066011 64052918 63961394 64868306
15572 64868306 66405761 67942285 68962424 69300852 68946432 67785883 65692050 62783662
15564 62783662 59521382 56608468 54727316 54133514 54531779 55512954 56912956 58561549
15556 58561549 60014370 60809456 60767314 59955185 58558284 56752367 54693827 52681404 51105749
15547 51105749 50230227 50171467 50872332 51959895 52843265 53104711 52767262 52106042 51310999
15538 51310999 50451055 49679514 49291598 49395961 49598598 49185969 47631790 45017753 42067972
15529 42067972 39597221 37918093 36931323 36612288 37096847 38365363 40044064 41604804
15521 41604804 42789353 43798045 45006866 46469540 47874396 49041594 50179928 51563422
15513E1563422J727716K012891J968124J395266M86567k82497n18290k05574L35026
15504E8482651P44284Q22898M71764l91353j759953l318211m469887m851967m653566
15495D1076660m232409l626355k704680j550883m66465K97588O17273M18139k29729
15486B9599139r99622j377727j009254j9260J217603K465538L499797M006664
15478C7382878L926589L569279L306147L342269L701618M253422M732430M833910
15470F9048542M339819L155000J344575p48392k510884l314910k929085j754885
15462F6629780n14930K59187M87412N10864P68755J311387J837863K165313K224068
15453G5679699J988466J702882J619762J583196J327630Q39123K50124l32256
$$ plain form
15513 51563422 53291138 55304029 57272153 58667419 59153986 58871489 58353199 58147625 58482651
15504 58482651 59226935 60049833 60521597 60130244 58370291 55052080 50582193 45730226 41076660
15495 41076660 36844251 33217896 30513216 28962333 28495868 28793456 29410729 29828868 29599139
15486 29599139 28599517 27221790 26212536 26193276 27410879 29876417 33376214 37382878
15478 37382878 41309467 44878746 48184893 51527162 55228780 59482202 64214632 69048542
15470 69048542 73388361 76543361 77887936 77139544 74628660 71313750 68384665 66629780
15462 66629780 66114850 66374037 66861449 67372313 68141068 69452455 71290318 73455631 75679699
15453 75679699 77668165 79371047 80990809 82574005 83901635 84740758 84990882 84658626
15445H4658626p63768p46059n4615J044669J896594K096166J834979J497802J278732
15436I2743126J305642J712439K411666K994495L067310K582919J760793Q95434
15428A09473824J97983l49934r34418j651811k179539j983434j091533j68038
15420A01313100K30919J02255j48391r8625L79274J051738J578137J820929J784341
15411A08013677J442809Q84289L65437J71569N04517J443568K886866M344598
15403A20057330N086962M747372L643689K433027J502479Q46610N00252O74254
15395A39491975J401493K399225L286136L808375M020213M235579M650562N177619
15387A68471177N726190O283413O700688O897538P143841P739464Q492845Q812604
$$ plain form
15445 84658626 83894858 83148799 83094184 84138853 86035447 88131613 89966592 91464394 92743126
15436 92743126 94048768 95761207 98172873 101167368 104234678 106817597 108578390 109473824
15428 109473824 109671807 109321873 108387455 106735644 104556105 102572671 101481138 101313100
15420 101313100 101544019 101646274 101497883 101399258 101778532 102830270 104408407 106229336 108013677
15411 108013677 109456486 110340775 110706212 110877781 111382298 112825866 115712732 120057330
15403 120057330 125144292 129891664 133535353 135968380 137470859 138317469 138817721 139491975
15395 139491975 140893468 143292693 146578829 150387204 154407417 158642996 163293558 168471177
15387 168471177 174197367 180480780 187181468 194079006 201222847 208962311 217455156 226267760
15379B26267760Q356336P321466O101988N086371M718791N234405O255680O935555
15371B76278352O571592N148299L322449J717828M69453n02398j258039j887531
15363B89860005k402506k667277k614800k359710k039279j625547r31682J44860
15355B75364064J388693K431178L232110M130917N397303P002050Q672634R991472
15347C17610421J0657998J0728450J0448098R887938R089778Q369835P968214
15340C84760732P554243O429966M251635J480174j080424l061877m542485n631431
15332C90160533o379746o746736o583457n836812m613427l113388j563147m5784
15324C55278036J503520L230953N318576P709284R827925J0882025J0678509R806429
$$ plain form
15379 226267760 234624096 241945562 248047550 253133921 257852712 263087117 269342797 276278352
15371 276278352 282849944 287998243 291320692 293038520 293507973 293005575 291747536 289860005
15363 289860005 287457499 284790222 282175422 279815712 277776433 276150886 275219204 275364064
15355 275364064 276752757 279183935 282416045 286546962 291944265 298946315 307618949 317610421
15347 317610421 328268419 338996869 349444967 359332905 368422683 376792518 384760732
15340 384760732 392314975 398744941 402996576 404476750 403396326 400334449 395791964 390160533
15332 390160533 383780787 377034051 370450594 364613782 360000355 356886967 355323820 355278036
15324 355278036 356781556 360012509 365331085 373040369 382868294 393750319 404428828 414235257
15316D14235257Q905274Q208828P655506P166736O734169O201793N309592M099580
15308D68516735K921620J967526J180580N41787J44833Q9427M00182J006799J819667
15299D78589156K786322L751957M342465M310511L894528L572477L720958M501812
15291E09470186N716895O799423P220126O942366O300229N545534M744515L919089
15283E56658363K958551J599667k59280k386319m413891o084226p289407p932426
15275E32851032p884792p288097o705489o673272p328605q503971r961958j1543588
15267D66961260j3019449j4083792j4718262j5136495j5452823j5693489j5888676
15260C62968274j5982164j5906392j5744589j5519378j4966417j3767429j1931700
$$ plain form
15316 414235257 423140531 431349359 439004865 446171601 452905770 459107563 464417155 468516735
15308 468516735 471438355 473405881 474586461 475128248 475273081 475362508 475762690 476769489 478589156
15299 478589156 481375478 485127435 489469900 493780411 497674939 501247416 504968374 509470186
15291 509470186 515187081 521986504 529206630 536148996 542449225 547994759 552739274 556658363
15283 556658363 559616914 561216581 560957301 558570982 554157091 548072865 540783458 532851032
15275 532851032 524966240 517678143 510972654 504299382 496970777 488466806 478504848 466961260
15267 466961260 453941811 439858019 425139757 410003262 394550439 378856950 362968274
15260 362968274 346986110 331079718 315335129 299815751 284849334 271081905 259150205
15253B59150205r832964p930733o612789o039197n887553n646514n129679m475608
15245B07595168l794249k978427j923086o87279N89020J718408K502056K774614
15237B05796225K493733J855905J211759Q21965P95631J180814J939021K973788
15229B19068841M148975N187051N729523N647285N237674M917381M737444M352569
15221B59026743L558107K583998J591273M99796o62670j832992l042637m287763
15213B57433855n448132o325966o691410o426084n776630n288366n274241n405021
15205B10798005n103931m291587l323087k421063j610923r37121m96020l23416
15197A92290857l24988l35166l97892q27785j697756k589908l121260l322432
$$ plain form
15253 259150205 249317241 241386508 234773719 228734522 222846969 217200455 212070776 207595168
15245 207595168 203800919 200822492 198899406 198212127 198801147 200519555 203021611 205796225
15237 205796225 208289958 210145863 211357622 212179587 212975218 214156032 216095053 219068841
15229 219068841 223217816 228404867 234134390 239781675 245019349 249936730 254674174 259026743
15221 259026743 262584850 265168848 266760121 267259917 266597247 264764255 261721618 257433855
15213 257433855 251985723 245659757 238968347 232542263 226765633 221477267 216203026 210798005
15205 210798005 205694074 201402487 198079400 195658337 194047414 193110293 192614273 192290857
15197 192290857 191965869 191630703 191232811 190405026 188707270 186117362 182996102 179673670
15189A79673670l393104l540155l848069m060593l875233l401549k900313k370500
15181A52284154j779577j357645j345238j744633k319302k752866k873134k466450
15173A35645309j333263L05050J900446L039949L595997L583370L132055K507109
15165A52376022J992435J698120J469639J070062M85599j2168j31581M4127J42270
15156A59134525K7025k98421j019150k147031l316669m083521m259871m062758
15148A39974129l880020l837856l688773l235963k620306k144243j881661j535790
15140A17149517r05717j67919M44979Q25269R41497Q58810N76022k8609r45701
15131A18748148j883638k332146j926949q80619J14495M26013j26274j257526
$$ plain form
15189 179673670 176280566 172740411 168892342 164831749 160956516 157554967 154654654 152284154
15181 152284154 150504577 149146932 147801694 146057061 143737759 140984893 138111759 135645309
15173 135645309 134312046 134617096 136517542 139557491 143153488 146736858 149868913 152376022
15165 152376022 154368457 156066577 157536216 158606278 159091877 159079709 158948128 158992255 159134525
15156 159134525 159161550 158863129 157843979 155696948 152380279 148296758 144036887 139974129
15148 139974129 136094109 132256253 128567480 125331517 122711211 120566968 118685307 117149517
15140 117149517 116243800 116075881 116520860 117346129 118287626 119146436 119722458 119693849 118748148
15131 118748148 116864510 114532364 112605415 111724796 111839291 112265304 112139030 110881504
15123A10881504k548180l665345m294017m259660l736666l140257k876816l154393
15115H3206170l790716m299356m328298l835802k987361k053208j181374k48639
15107F0481416Q41150J849031K375508K300624J925857J584286J365640J309393
15099G4032905J440772J600913J694176J828813J890054J442545K44801j428181
15091H2746798l101360m453419n301023n554823n196908m282835l077854k047574
15083D9731002j525641j446550j442655j210591p34091r4377O36354J347024J953104
15074D7213579K337627K350001J992575J418147P36303l7915q98051j679406k114017
15065E1318843k173806k009158j629905j067917o55132o18813o43374l20190K81258
$$ plain form
15123 110881504 108333324 104667979 100373962 96114302 92377636 89237379 86360563 83206170
15115 83206170 79415454 75116098 70787800 66951998 63964637 61911429 60730055 60481416
15107 60481416 61322566 63171597 65547105 67847729 69773586 71357872 72723512 74032905
15099 74032905 75473677 77074590 78768766 80597579 82487633 83930178 84174979 82746798
15091 82746798 79645438 75192019 69890996 64336173 59139265 54856430 51778576 49731002
15083 49731002 48205361 46758811 45316156 44105565 43371474 43277097 43913451 45260475 47213579
15074 47213579 49551206 51901207 53893782 55311929 56048232 56010317 55112266 53432860 51318843
15065 51318843 49145037 47135879 45505974 44438057 43782925 43164112 42520738 42200548 42481806
15056D2481806Q02992J049704J057452Q97945O87367O37141Q03369R86209J007592
15047E0411577Q10219L46391k54679o20921n02473p1437J22321l51917j234142
15038D8654939j888990k049179j857290j410734o70273J80869O73068N22211q7616
15029D2067005p43635j034998p61457j83839J49551j45399j052544k211250l199412
15020C2884022l821817m077458l940058l370100k528146j843822j728346k204575
15012I369700k684998k365141j182865J1750M11643j13671j121432j990391k299127
15003a964532j899668r20633L22245J503101K370382K698025K404014J687778
14995F200712Q69771K93403K12911N82232J142662J551214J536021J044451J86719
$$ plain form
15056 42481806 43284798 44334502 45391954 46289899 46977266 47614407 48417776 49403985 50411577
15047 50411577 51221796 51568187 51313508 50692587 50190114 50118677 50240998 49889081 48654939
15038 48654939 46765949 44716770 42859480 41448746 40778473 40959342 41632410 42154621 42067005
15029 42067005 41323370 40288372 39526915 39343076 39492627 39347228 38294684 36083434 32884022
15020 32884022 29062205 24984747 21044689 17674589 15146443 13302621 11574275 9369700
15012 9369700 6684702 4319561 3136696 3148446 3560089 3446418 2324986 334595 -1964532
15003 -1964532 -3864200 -4784833 -4462588 -2959487 -589105 2108920 4512934 6200712
14995 6200712 7070483 7363886 7576797 8159029 9301691 10852905 12388926 13433377 13620096
14986A3620096p17225j278711j400463j275037j113906r84578q47818o81235n99700
14977D721423p75280j212181j705522j937694j740972j276169p93852m11495k01757
14968e333499j61135r0264K36686J011431K319498L738801M586513M665498M213627
14959A5187156L390742K195296P49174n45578j349241j745843k063149k439742
14951A3378815k559364k092779j331373q01876n83624n92994r42676j526549j942699
14942A004881k012608j897604j688521j221687m60278L83643J190750J973826
14934b727598K562264K547558J721686L85560q07490j302290j020406k71551M90447
14925A578180Q50652P97292P84791J171392J773854K107472J900794J305960O68683
$$ plain form
14986 13620096 12902871 11624160 10223697 8948660 7834754 6850176 6002358 5321123 4721423
14977 4721423 3946143 2733962 1028440 -909254 -2650226 -3926395 -4720247 -5131742 -5333499
14968 -5333499 -5494634 -5584898 -5348212 -4336781 -2017283 1721518 6308031 10973529 15187156
14959 15187156 18577898 20773194 21522368 20976790 19627549 17881706 15818557 13378815
14951 13378815 10819451 8726672 7395299 6593423 6009799 5416805 4474129 2947580 1004881
14942 1004881 -1007727 -2905331 -4593852 -5815539 -6275817 -5892174 -4701424 -2727598
14934 -2727598 -165334 2382224 4103910 4489470 3681980 2379690 1359284 1087733 1578180
14925 1578180 2428832 3226124 4010915 5182307 6956161 9063633 10964427 12270387 12939070
14916A2939070J75812k65594q94547j802166k791502l483991l614329l287674
14908c024921k762023k124601j371581n48846L06763J096236J563278J515716
14900e349979R71582N0857r98582j787478k073284j773772p35521R78294K734828
14891g983055L775279L962265L776278L579096L293155K744368J895535R63937
14883A6006858L80210L98162P63125Q14552J35813r79484j912015k347162k371686
14874A0888373k091009j420263l67680P10756J376994J556530J413375R99739
14866A3066815L02888n23281j146269j311810j008190l74380M09001J082498J356954
14857A1854226J146611O21406j9405o44625j028608r34762m27972K11714O99988
$$ plain form
14916 12939070 13114882 12849288 11954741 10152575 7361073 3877082 262753 -3024921
14908 -3024921 -5786944 -7911545 -9283126 -9831972 -9525209 -8428973 -6865695 -5349979
14900 -5349979 -4378397 -4327540 -5326122 -7113600 -9186884 -10960656 -11696177 -10717883 -7983055
14891 -7983055 -4207776 -245511 3530767 7109863 10403018 13147386 15042921 16006858
14883 16006858 16387068 16785230 17548355 18362907 18498720 17519236 15607221 13260059 10888373
14874 10888373 8797364 7377101 7009421 7720177 9097171 10653701 12067076 13066815
14866 13066815 13369703 12846422 11700153 10388343 9380153 9005773 9414774 10497272 11854226
14857 11854226 13000837 13622243 13602838 12958213 11929605 10994843 10566871 10778585 11478573
14848A1478573Q29222O14527K86854m2553l90150o66061p77832o92030m58075
14839A0182475k62812k47647l38239l13569o2126K69579N26265Q09403J192024
14830A1755353J352640R04108L7142n85160n92025j93948K56529O16355Q51320
14821A4402314Q70581O02409K19701k3085j02474p8436l8914k57265r08821j760235
14811A2925775k400835k525484j998591j035938j36774M36549Q27160J111495
14803G203357J050763M99761m24588j561360k565325k868604k156971n80210J346033
14794e7144K869377L424722K929531J697811L23676n99295p31444J0447J321021
14785A1188702K431533K631572J981903J173122O41775J99254m63848j297895
$$ plain form
14848 11478573 12307795 12922322 13209176 13166623 12776473 12110412 11332580 10640550 10182475
14839 10182475 9919663 9672016 9333777 9020208 8958082 9227661 9753926 10563329 11755353
14830 11755353 13107993 14012101 14049243 13464083 12872058 12678110 12934639 13550994 14402314
14821 14402314 15272895 15875304 16095005 16071920 15969446 15891010 15852096 15594831 14686010 12925775
14811 12925775 10524940 7999456 6000865 4964927 4828153 5264702 6091862 7203357
14803 7203357 8254120 8753881 8329293 6767933 4202608 1334004 -822967 -1403177 -57144
14794 -57144 2812233 6236955 9166486 10864297 11187973 10588678 9857234 9867681 11188702
14785 11188702 13620235 16251807 18233710 19406832 20048607 20247861 19784013 18486118
14777A8486118j965572k223027k092633j730491j374173j135470q06296l49575
14769F808881j42073l73558p18219p90474o64453p27635j078299j329048j070755
14760h5633k95664O62928J403142J872816K416792L147402L707148L762362L336632
14751A9927925K684359K129008J929861J963478J780877J294725Q81079P23719
14743C3315031N93492L00160M3794J34126N06687O48789Q7497j092387k402582
14734C2134607l416608l831665l474963k375794o96915J169946K598296L225256
14726B5332160L290166L203897K921439K036081L85734j658589l416915m242830
14718B7851143l746347k095173L1070K051078L745283N031110N796344N872443
$$ plain form
14777 18486118 16520546 14297519 12204886 10474395 9100222 7964752 7158456 6808881
14769 6808881 6666808 6293250 5575031 4784557 4120104 3392469 2314170 985122 -85633
14760 -85633 -381297 281631 1684773 3557589 5974381 9121783 12828931 16591293 19927925
14751 19927925 22612284 24741292 26671153 28634631 30415508 31710233 32591312 33315031
14743 33315031 33908523 34208683 34252477 34386603 34893290 35542079 35629576 34537189 32134607
14734 32134607 28717999 24886334 21411371 19035577 18338662 19508608 22106904 25332160
14726 25332160 28622326 31826223 34747662 36783743 37169477 35510888 32093973 27851143
14718 27851143 24104796 22009623 22040693 24091771 27837054 32868164 38664508 44536951
14710D4536951N201725L986648K612898J452416P03045M27309P59832J778692
14702F1459516L059373L869192L807644K997815J860395Q12583R7711k31552k41793
14693G7490884J6082N58021J346280K194048K855301L192826L170931K917849
14685I3742222K748621K803963K850201K494015J529644K54548p56175j212961
14677A04454078j166557p35091r8250M05032M33237j74442j457871l188368m678881
14668I3792887n242931m774795l704717k582005j734819j170493q14936p08584
14660G3059607p94006p76209l73454M35886J363065K001664K090872J487941K12295
14651G8707661j352486k692911l532068l726954l233466k322302j415015p05981
$$ plain form
14710 44536951 49738676 53725324 56338222 57790638 58493683 58920992 59680824 61459516
14702 61459516 64518889 68388081 72195725 75193540 77053935 77866518 77964229 77732677 77490884
14693 77490884 77506966 78064987 79411267 81605315 84460616 87653442 90824373 93742222
14685 93742222 96490843 99294806 102145007 104639022 106168666 106423214 105667039 104454078
14677 104454078 103287521 102552430 102454180 102859212 103292449 103118007 101660136 98471768 93792887
14668 93792887 88549956 83775161 80070444 77488439 75753620 74583127 73768191 73059607
14660 73059607 72265601 71489392 71115938 71551824 72914889 74916553 77007425 78495366 78707661
14651 78707661 77355175 74662264 71130196 67403242 64169776 61847474 60432459 59726478
14643E9726478k00061P2582J6427l61801q73253j296903j433042j061467j53738
14634E4435222Q88545J548769J653398J241170L06429j019799k338321l258246
14626E3457167l587046l370909l031020l120171l644177l950290l513713k431328
14618B6808513j140170j50742R2684l79438r82814j132568p11493k4877N21031
14609B2900126P07248N80380K96962Q817j87592k93670l00721r6019M30013J143085
14599B5188629J591305J288603K48545p63483r52035l29874N34681J245020J758935
14590B9810326K186993K695718L360606L964061M116714L609456K495879Q59538
14582E3099291j089270k719477l412844l267268k920883k806786k871888k806038
$$ plain form
14643 59726478 59526417 59598999 59615426 59253625 58380372 57083469 55650427 54588960 54435222
14634 54435222 55323767 56872536 58525934 59767104 60073533 59053734 56715413 53457167
14626 53457167 49870121 46499212 43468192 40348021 36703844 32753554 29239841 26808513
14618 26808513 25668343 25517601 25610285 25230847 24248033 23115465 22403972 22379095 22900126
14609 22900126 23607374 24187754 24484716 24493533 24305941 24012271 23711550 23615531 24045544 25188629
14599 25188629 26779934 28068537 28317082 27553599 26601564 26271690 26806371 28051391 29810326
14590 29810326 31997319 34693037 38053643 42017704 46134418 49743874 52239753 53099291
14582 53099291 52010021 49290544 45877700 42610432 39689549 36882763 34010875 31204837
14574C1204837k415225j643525m43975J131102K829752M201004M874294M842137
14566D4580401M368273L705534K909952J878167O21866m83563j040737j161573
14558E5378320j191787j129566p59042j72220K58328M55695P69263J317320J735081
14549E6661392J740635J408095R10892L46834l18830j143691j895756k139192
14541E5570379j697347p37993M34468J575984K575206L342453L797462L898925
14533F8759537L699281L340779K748891J613244j36263k143533l868038m858884
14525F9155014m943780m259493l130879j929200r25653k73867l1520o8832p8517
14516E3513273J44998N38516Q98818R87103O37223q4853q92464j496794j722231
$$ plain form
14574 31204837 28789612 27146087 26702112 27833214 30662966 34863970 39738264 44580401
14566 44580401 48948674 52654208 55564160 57442327 58064193 57580630 56539893 55378320
14558 55378320 54186533 53056967 52297925 52125705 52384033 52839728 53608991 54926311 56661392
14549 56661392 58402027 59810122 60721014 61067848 60749018 59605327 57709571 55570379
14541 55570379 53873032 53135039 53569507 55145491 57720697 61063150 64860612 68759537
14533 68759537 72458818 75799597 78548488 80161732 80025469 77881936 74013898 69155014
14525 69155014 64211234 59951741 56820862 54891662 53966009 53692142 53660622 53591790 53513273
14516 53513273 53658271 54196787 55095605 56082708 56719931 56635078 55742614 54245820 52523589
14507E2523589j632247j551383j615446j578313j228270o36198m2284L61394N17030
14498D5117872L88363p4459q57031j835341k764190l347655l386860k905126k188131
14489B8147442j689629j651358j781837j549302p03115N66368J771529K473494
14481B5583592K628827K532796K458978K431528K287683J911167J311060O24622
14473D1770253J58938J217l10979j275142k691885l838613m228114l821092k868428
14464B2896155j790861r77472o55773r65258j822763k733949l109383k706629
14456H134067j730011o50097K72961J160362K042501K667198K864008K698420
14448A7459409K264997J563819O27434l72059j269457k009925k623306l005287
$$ plain form
14507 52523589 50891342 49339959 47724513 46146200 44917930 44281732 44239448 44600842 45117872
14498 45117872 45506235 45431776 44574745 42739404 39975214 36627559 33240699 30335573 28147442
14489 28147442 26457813 24806455 23024618 21475316 20772201 21338569 23110098 25583592
14481 25583592 28212419 30745215 33204193 35635721 37923404 39834571 41145631 41770253
14473 41770253 41929191 41930408 41619429 40344287 37652402 33813789 29585675 25764583 22896155
14464 22896155 21105294 20127822 19472049 18506791 16684028 13950079 10840696 8134067
14456 8134067 6404056 5753959 6026920 7187282 9229783 11896981 14760989 17459409
14448 17459409 19724406 21288225 21915659 21543600 20274143 18264218 15640912 12635625
14440A2635625k829576k003327q65329K12140R97979J340748J334859J348122
14432A2171241J580311J879284J966511J627780R42134L93140M10525R23015J573100
14423B3467041K039349K145302J893096J300927K90534j078079k408618l268706
14415B4380846l541256l357666k933983k528462k349720k438659k703325k872592
14407A655183k586669j747848n92010N88437J503801J877173J696118J221524
14399C615709P64890N48344N65456O09855N45639M04178L51954O10532J199817
14390I216374J803833K063020J901843J421392P71463J96465j55945l16177l41164
14381A6561104k33685P7578N56976R24354J001176Q81155O72578M07850J2083
$$ plain form
14440 12635625 9806049 7802722 6937393 7149533 8147512 9488260 10823119 12171241
14432 12171241 13751552 15630836 17597347 19225127 20167261 20560401 20970926 21893941 23467041
14423 23467041 25506390 27651692 29544788 30845715 31136249 30058170 27649552 24380846
14415 24380846 20839590 17481924 14547941 12019479 9669759 7231100 4527775 1655183
14407 1655183 -931486 -2679334 -3271344 -2682907 -1179106 698067 2394185 3615709
14399 3615709 4380599 4928943 5494399 6104254 6649893 7054071 7406025 8016557 9216374
14390 9216374 11020207 13083227 14985070 16406462 17177925 17374390 17218445 16902268 16561104
14381 16561104 16327419 16404997 16961973 17886327 18887503 19768658 20441236 20849086 20861169
14372B0861169p28837j813903k679635k587782j401964J72499J193655J185296
14364A4200498J96865j493559l431647m916401n241766m231211k436701o12590
14356g966512Q76813J928925K352463K015452J028298k47248j257117j621881
14348b890807j380425p95920p0681P19576J535303K244185K611242K506931K142309
14339F621713J907429J939989K037897K005127J883804J784865J663072J323852
14331B1167748O64467j76828r65120j522506j679625j321717o64196k68526m20962
14322A4812735p76096r55434r87018j026978j180343j470988j675150j485175
14314E255553r33598l11574K20277O76899J057736J290998J318568J112149P11615
$$ plain form
14372 20861169 20132332 18318429 15638794 13051012 11649048 11821547 13015202 14200498
14364 14200498 14397363 12903804 9472157 4555756 -686010 -4917221 -7353922 -7966512
14356 -7966512 -7089699 -5160774 -2808311 -792859 235439 -11809 -1268926 -2890807
14348 -2890807 -4271232 -5067152 -5137833 -4418257 -2882954 -638769 1972473 4479404 6621713
14339 6621713 8529142 10469131 12507028 14512155 16395959 18180824 19843896 21167748
14331 21167748 21832215 21655387 20690267 19167761 17488136 16166419 15502223 15233697 14812735
14322 14812735 14036639 13081205 12094187 11067209 9886866 8415878 6740728 5255553
14314 5255553 4321955 4010381 4230658 4907557 5965293 7256291 8574859 9687008 10398623
14305A0398623K38911k36537p18539j135232j256940j008015o34593l80379k87741
14296D979558j97953r80J38279J25351J74962M85274R28285J227766J230730Q56169
14286I947441J36738o21546j081184j229073j342728j664442k167864k651650
14278f74308k793864k166967p10817R72623K074255K119827J125460l69086j582156
14269b005033k085852k008032j708180j363668q93335j46034Q61768J869321K525422
14260d953623K543835J834600O51197n12273j258171j496575j422082j322270
14252e935362j361647j423519j164753m32145N58040J583879K500455L000452
14244b674600K852442K216280J439266P52018K09599k31086p26724j481904k433918
$$ plain form
14305 10398623 10637534 10400997 9682458 8547226 7290286 6282271 5647678 5267299 4979558
14296 4979558 4781605 4780625 4918904 5044255 5219217 5704491 6632776 7860542 9091272 9947441
14286 9947441 10084179 9462633 8381449 7152376 5809648 4145206 1977342 -674308
14278 -674308 -3468172 -5635139 -6345956 -5373333 -3299078 -1179251 -53791 -422877 -2005033
14269 -2005033 -4090885 -6098917 -7807097 -9170765 -10064100 -10210134 -9348366 -7479045 -4953623
14260 -4953623 -2409788 -575188 76009 -436264 -1694435 -3191010 -4613092 -5935362
14252 -5935362 -7297009 -8720528 -9885281 -10317426 -9759386 -8175507 -5675052 -2674600
14244 -2674600 177842 2394122 3833388 4585406 4795005 4563919 3837195 2355291 -78627
14235g8627l198548l321951k541749j034267N35864J410094J258815L35614p68496
14226g403251j509115j649288j227539m21543M93593J239982J718542J996330
14218f762289K067240J824370J282986O67027K73617K23585K69087n5417q81038
14209a090832j752965k172437k056986j507832o63968J43241O03209O79876L95390
14200g423304l54666j418822k197801k103601j094352K68156J338714J790893
14192a1194783J642967J104972L82529l29203r33889j477075j842747j756031
14184a4403260j220264n73841q9613K22455N25747R55865J351617J385566J007968
14175a0837760L77096m43624j354687k061588k247178j800899r12275j4942L66283
$$ plain form
14235 -78627 -3277175 -6599126 -9140875 -10175142 -9639278 -8229184 -6970369 -6634755 -7403251
14226 -7403251 -8912366 -10561654 -11789193 -12210736 -11717143 -10477161 -8758619 -6762289
14218 -6762289 -4695049 -2870679 -1587693 -920666 -647049 -423464 -154377 -209794 -1090832
14209 -1090832 -2843797 -5016234 -7073220 -8581052 -9245020 -9101779 -8498570 -7818694 -7423304
14200 -7423304 -7777970 -9196792 -11394593 -13498194 -14592546 -14324390 -12985676 -11194783
14192 -11194783 -9551816 -8446844 -8064315 -8393518 -9327407 -10804482 -12647229 -14403260
14184 -14403260 -15623524 -16197365 -16286978 -16064523 -15538776 -14582911 -13231294 -11845728 -10837760
14175 -10837760 -10460664 -10904288 -12258975 -14320563 -16567741 -18368640 -19280915 -19295857 -18929574
14166a8929574j1067q32214j556785j791650j332927l69625M72646P02549M54568
14157b3194079K53762M74572J076565J745996K121065J914763J158369L06790
14149a4142197k09923l75129l62520k03406R3102K76041J04413k46530m10070
14140a5476219l15764j64541p5814n3802j41669l65986o75841r73630j120115
14131a9363381j011797o20573J62O78293J306840K024156K904548L629248L775619
14122f676885L336888K681373K103233J684984J545513J873247K469919K736884
14114A1755156K365129J512669L20860j197152k746919l658532l603341k933994
14106A813876k074227j099623j6867R89228J720144J986151J653714Q47998j86753
$$ plain form
14166 -18929574 -18940641 -19772855 -21329640 -23121290 -24454217 -24823842 -24351196 -23648647 -23194079
14157 -23194079 -22940317 -22465745 -21389180 -19643184 -17522119 -15607356 -14448987 -14142197
14149 -14142197 -14352120 -14727249 -15089769 -15293175 -15200073 -14924032 -14819619 -15066149 -15476219
14140 -15476219 -15791983 -15956524 -16032338 -16086140 -16227809 -16593795 -17269636 -18243266 -19363381
14131 -19363381 -20375178 -20995751 -20995589 -20317296 -19010456 -16986300 -14081752 -10452504 -6676885
14122 -6676885 -3339997 -658624 1444609 3129593 4675106 6548353 9018272 11755156
14114 11755156 14120285 15632954 15953814 14756662 12009743 8351211 4747870 1813876
14106 1813876 -260351 -1359974 -1376841 -387613 1332531 3318682 4972396 5820394 5633641
14097E633641j271978k170610k553687k245779j485351q12909n83690o96011r03595
14088g089969j232269j811217k393368k391047j433831M01773K578255M254977
14080i116696M821929M157391K514070M51824j242655j922219j657818j129912
14072c124086p40320l83536M8291N72991J223569J866480K120276J647496N46404
14063C777565o95645j580917j879547j603642r02209n0053O25732Q13383L25621
14054a169712p73832k146427l198380l435744k913490k031112j034149L9547J180066
14045a5483233K342168L258288L397295K460389Q49813n39356j098538r52117
14037e765291n84855j81012M26035J226333J788263J565974M56077r70759j917244
$$ plain form
14097 5633641 4361663 2191053 -362634 -2608413 -4093764 -4906673 -5490363 -6186374 -7089969
14088 -7089969 -8322238 -10133455 -12526823 -14917870 -16351701 -15949928 -13371673 -9116696
14080 -9116696 -4294767 -137376 2376694 2828518 1585863 -336356 -1994174 -3124086
14072 -3124086 -3864406 -4247942 -4199651 -3626660 -2403091 -536611 1583665 3231161 3777565
14063 3777565 3081920 1501003 -378544 -1982186 -2884395 -2934448 -2308716 -1495333 -1169712
14054 -1169712 -1943544 -4089971 -7288351 -10724095 -13637585 -15668697 -16702846 -16663299 -15483233
14045 -15483233 -13141065 -9882777 -6485482 -4025093 -3175280 -3714636 -4813174 -5765291
14037 -5765291 -6350146 -6531158 -6105123 -4878790 -3090527 -1524553 -1068476 -2039235 -3956479
14028c956479j953947j272951m25326J83864M76891N68412N97770P14421J102126
14019c965219J804690K609714L198027L262589K606112J364140p1945j348508
14011I459600k189215k489659k452356k488852k872555l318264l181173k234940
14003a1767414r22435K68014J219960J855881J939660J452524O72308j94620r87595
13994f463717j396584j108550k02905O94118R19747M67417j66987n69403m40109
13985h266973L66875J523471K382205K620057K389972J945282J432780R11666
13977E305335M04034p9158m21365m04086R456N62555R06685Q54138M47221j78306
13967G406509r56311j870930k863555l687195l894464l306972k277480j278334
$$ plain form
14028 -3956479 -5910426 -7183377 -7608703 -7424839 -6947948 -6379536 -5781766 -5067345 -3965219
14019 -3965219 -2160529 449185 3647212 6909801 9515913 10880053 10808108 9459600
14011 9459600 7270385 4780726 2328370 -160482 -3033037 -6351301 -9532474 -11767414
14003 -11767414 -12689849 -12421835 -11201875 -9345994 -7406334 -5953810 -5281502 -5476122 -6463717
13994 -6463717 -7860301 -8968851 -9171756 -8477638 -7557891 -7090474 -7257461 -7826864 -8266973
13985 -8266973 -7900098 -6376627 -3994422 -1374365 1015607 2960889 4393669 5305335
13977 5305335 5709369 5630211 5208846 4804760 4814216 5376771 6283456 7137594 7584815 7406509
13967 7406509 6450198 4579268 1715713 -1971482 -5865946 -9172918 -11450398 -12728732
13959a2728732n72735j66216J66783N88175J043886J553375K239708K876420K898377
13950b100959K075427Q54502j21183n57847n35803l86641n13877j014947j449472
13941c750800j272260n58740N1661J24334k75980q23251j123908r57618m47425
13932i033987P0521L66805M75046O02613R75435J683683K543801L087918K913508
13923C685343K163370J439698J155743J061882O62065l7898o46581j051321j467494
13914F964807k019204k491331k433879j638108n03527J62965j06101q35858j114951
13905d015187o49350J27067Q02166J284476J550264J547720J299482Q99773M26172
13896C272583j07468o69892j051179j029074o99078l75929k72468l67716n36545
$$ plain form
13959 -12728732 -13301467 -13467683 -13300900 -12712725 -11668839 -10115464 -7875756 -4999336 -2100959
13950 -2100959 -25532 828970 707787 149940 -385863 -772504 -1286381 -2301328 -3750800
13941 -3750800 -5023060 -5581800 -5530139 -5405805 -5681785 -6505036 -7628944 -8586562 -9033987
13932 -9033987 -8963466 -8596661 -8121615 -7519002 -6543567 -4859884 -2316083 771835 3685343
13923 3685343 5848713 7288411 8444154 9506036 10168101 10130203 9483622 8432301 6964807
13914 6964807 4945603 2454272 20393 -1617715 -2121242 -1958277 -2064378 -2900236 -4015187
13905 -4015187 -4664537 -4537470 -3735304 -2450828 -900564 647156 1946638 2846411 3272583
13896 3272583 3165115 2495223 1444044 414970 -284108 -660037 -932505 -1300221 -1836766
13887a836766o86883o93090m50785k7891M70011R07247R27974K22995j070810
13878b237998k430545l184717k875831j683279l05863O03842P80885M85447K75028
13869a0573031M19766P52988J041172J201357J198580R92363N58233n1956n82374
13860e042902o86145l05239J54762K82531K32773M61580R66254J211795Q21256
13851a903335o6118j062688j830241k133829j841818j112897l76199M0965J31799
13842a0154361J42020L02323O17425R58304J214039J303830J246487J176208J135158
13833b058567R42946N26994J09182k85267r79280k084054l251113l928726l718240
13824a4726125k634596j045493N98636J844048K355467K190694J701220J175263
$$ plain form
13887 -1836766 -2523649 -3216739 -3667524 -3695415 -3225404 -2318157 -1390183 -1167188 -2237998
13878 -2237998 -4668543 -7853260 -10729091 -12412370 -12718233 -12114391 -11333506 -10848059 -10573031
13869 -10573031 -10153265 -9400277 -8359105 -7157748 -5959168 -4966805 -4408572 -4460528 -5042902
13860 -5042902 -5729047 -6034286 -5879524 -5596993 -5364220 -4902640 -3936386 -2724591 -1903335
13851 -1903335 -1969453 -3032141 -4862382 -6996211 -8838029 -9950926 -10327125 -10286160 -10154361
13842 -10154361 -10012341 -9710018 -9092593 -8134289 -6920250 -5616420 -4369933 -3193725 -2058567
13833 -2058567 -1115621 -588627 -479445 -764712 -1743992 -3828046 -7079159 -11007885 -14726125
13824 -14726125 -17360721 -18406214 -17807578 -15963530 -13608063 -11417369 -9716149 -8540886
13816h540886P32453M35047L10627K85065J94424j46765p05375j120730j218814
13807i774954j284752j526896j769673j885372j964378j954429j719281j485795
13799b3365530j687825k271965k553644j944887n61092J027502K341966L126466
13791b5889009L193299K600237J780327J157277P47526L11178k28732o82225q25835
13782a7835957p21412o95043q86833j054606q69538k34830O18841J275306J393142
13773a9010930Q81643j50919j390491k255627k277788j475007j02573J516380
13765b4265312K797160L114251K349185J008580j87047q92190j338897j856595
13757a9270865k328961k431992k059023j220028o1171J010025J626940J820331
$$ plain form
13816 -8540886 -7808433 -7373386 -7062759 -6777694 -6583270 -6730035 -7435410 -8556140 -9774954
13807 -9774954 -11059706 -12586602 -14356275 -16241647 -18206025 -20160454 -21879735 -23365530
13799 -23365530 -25053355 -27325320 -29878964 -31823851 -32384943 -31357441 -29015475 -25889009
13791 -25889009 -22695710 -20095473 -18315146 -17157869 -16410343 -16099165 -16327897 -17010122 -17835957
13782 -17835957 -18557369 -19252412 -20139245 -21193851 -22063389 -22298219 -21679378 -20404072 -19010930
13773 -19010930 -18129287 -18280206 -19670697 -21926324 -24204112 -25679119 -25781692 -24265312
13765 -24265312 -21468152 -18353901 -16004716 -14996136 -15183183 -16075373 -17414270 -19270865
13757 -19270865 -21599826 -24031818 -26090841 -27310869 -27372040 -26362015 -24735075 -22914744
13749b2914744J824433J713352J479562J216028R66885N50311q9604o13034q14307
13740a6681118q83226r30733o60831L14769J940520L656037M817279N146662M891719
13731A611078M512199M069144L151064J637386O1220j106777k066433l161319
13723H707562m122606m364376l675858k284626o25418P50667J355887J128469
13715c130299M41410k48818o70685q84462j152634j450121j406690q67740r1641
13706i461680O55891J312275J828532K070292J869881J107214q1083j267702k143192
13697d109572k700172k959453k921922k607335k083554j504715q59435N3758J217298
13688a8475102K208772K622217K461730J966669J416491J136245J154263J081308
$$ plain form
13749 -22914744 -21090311 -19376959 -17897397 -16681369 -15714484 -15164173 -15253777 -15866811 -16681118
13740 -16681118 -17564344 -18495077 -19155908 -18841139 -16900619 -13244582 -8427303 -3280641 1611078
13731 1611078 6123277 10192421 13343485 14980871 15042091 13935314 11868881 8707562
13723 8707562 4584956 220580 -3455278 -5739904 -6365322 -5614655 -4258768 -3130299
13715 -3130299 -2688889 -2937707 -3608392 -4492854 -5645488 -7095609 -8502299 -9370039 -9461680
13706 -9461680 -8805789 -7493514 -5664982 -3594690 -1724809 -617595 -698678 -1966380 -4109572
13697 -4109572 -6809744 -9769197 -12691119 -15298454 -17382008 -18886723 -19746158 -19692400 -18475102
13688 -18475102 -16266330 -13644113 -11182383 -9215714 -7799223 -6662978 -5508715 -4427407
13680d427407O64575Q7609k86526k94531j36893j47740m43995p93510q45575n82030
13670g206023l75876m68028o95962r02172j143322j261412q22346L01514J648203
13661a0925424K567096K783760K509903K084111J743064J775018K480170L716677
13653H734375M775679M940298L991839K291567M47051j137386k363022l246824
13645A8433577l689286l570684k947979j985035q28730L57080J283339J669958
13637H722240J464459Q32324p172q64885j532723j838126j715678j262827o61650
13628C135962J02300J146925K329575L254022L544810L111115K231512J302342
13620B0158563L72576q31623k278932l417314l642534k812641j445250m08828
$$ plain form
13680 -4427407 -3762832 -3675223 -3961749 -4256280 -4393173 -4540913 -4984908 -5778418 -6623993 -7206023
13670 -7206023 -7581899 -8049927 -8745889 -9648061 -10791383 -12052795 -12875141 -12573627 -10925424
13661 -10925424 -8358328 -5574568 -3064665 -980554 762510 2537528 5017698 8734375
13653 8734375 13510054 18450352 22442191 24733758 25180809 24043423 21680401 18433577
13645 18433577 14744291 11173607 8225628 6240593 5411863 5768943 7052282 8722240
13637 8722240 10186699 11019023 11011851 10146966 8614243 6776117 5060439 3797612 3135962
13628 3135962 3238262 4385187 6714762 9968784 13513594 16624709 18856221 20158563
13620 20158563 20531139 19699516 17420584 14003270 10360736 7548095 6102845 5694017
13612E694017j12042l06113p16226j177659j388418j128743o60958n71157j112478
13603a479777j924490k435259k423162k145469j936982j883307j956046k134405
13595a8318897k267449k038278j265949j70070Q32848J419913J507608J320928
13587a8979346J136838J018616R49216J040106J246118J024902r40j343016k145164
13578a6052670j963929q76878P45341K396098L477203L484692K431533R53294
13570e405316r2019r3637Q90646K184560L161789L553471L265844K342278J100804
13561A0908420Q4960l28222k01787K15324P47424J085646Q70253K00786l84934
13552A3197870l82249M20871J769802K830938K775181J625375R0881j311292k489489
$$ plain form
13612 5694017 5581975 5275862 4559636 3381977 1993559 864816 203858 -367299 -1479777
13603 -1479777 -3404267 -5839526 -8262688 -10408157 -12345139 -14228446 -16184492 -18318897
13595 -18318897 -20586346 -22624624 -23890573 -24060643 -23227795 -21807882 -20300274 -18979346
13587 -18979346 -17842508 -16823892 -15874676 -14834570 -13588452 -12563550 -12564490 -13907506 -16052670
13578 -16052670 -18016599 -18893477 -18148136 -15752038 -12274835 -8790143 -6358610 -5405316
13570 -5405316 -5497335 -5590972 -4700326 -2515766 646023 4199494 7465338 9807616 10908420
13561 10908420 10993380 10665158 10463371 10678695 11426119 12511765 13382018 13582804 13197870
13552 13197870 12815621 13236492 15006294 17837232 20612413 22237788 22328669 21017377 18527888
13543A8527888l359293l666193l138133j735507J49363J873553L013064L462296
13535A5127038L188649K226489Q10152o51658j766366k311213k196841j567622
13527A2858628r97508j123450j969522k931290l300143k767740j589086l82370
13519b202481K46944K06416j3308R5390N36278Q64792O94833Q0064o49241j261045
13509a401358j675496j808937j713983j682336j815473j852488j531714q65422
13501a4347207n4292O26234R08285Q26527Q08300J239955K062476K774899K739496
13492b415327J857687P97621K58570K80312M31443M74347O05339J063093J610347
13483D963432J650940J014555J63626m22240o19590n45474l41234o8136K69253
$$ plain form
13543 18527888 15168595 11502402 8364269 6628762 6778125 8651678 11664742 15127038
13535 15127038 18315687 20542176 21352328 20700670 18934304 16623091 14426250 12858628
13527 12858628 11861120 10737670 8768148 5836858 2536715 -231025 -1820111 -2202481
13519 -2202481 -1955537 -1749121 -1762429 -1667039 -1130761 -265969 428864 508928 -140313 -1401358
13509 -1401358 -3076854 -4885791 -6599774 -8282110 -10097583 -11950071 -13481785 -14347207
13501 -14347207 -14401499 -13775265 -12866980 -12040453 -11232153 -9992198 -7929722 -5154823 -2415327
13492 -2415327 -557640 239981 498551 778863 1210306 1684653 2289992 3353085 4963432
13483 4963432 6614372 7628927 7792553 7370313 6750723 6205249 5864015 5795879 6065132
13474F065132N98022O71326K88216l45845p29170n62348n6460L73398N62114N17079
13464G381464K72734q3041m51318o74824o34543m47108k75624j48114l2433k4143
13454D883050l68349j129449k026852k601979k484704j728282q43231l29699k81611
13445f911106l72506k95519j52657k08454m71927p64072j008972j219872j387878
13436a2792963j485828j397318r54229j58750Q18149J720132K186567J944150
13428a0120090J058163q3753j000484j356625j063999k47223Q11668J726884K317637
13419g957822K704168K944609K976394K824955K585117K213299J515151N09028
13411A0314899m08370p62987m79297l5820J1606m56469j213103k000041k601665
$$ plain form
13474 6065132 6663154 7334480 7622696 7276851 6547681 5985333 5928873 6302271 6864385 7381464
13464 7381464 7654198 7571157 7119839 6445015 5810472 5363364 5087740 4939626 4907193 4883050
13454 4883050 4514701 3385252 1358400 -1243579 -3728283 -5456565 -6299796 -6629495 -6911106
13445 -6911106 -7283612 -7579131 -7731788 -7940242 -8412169 -9176241 -10185213 -11405085 -12792963
13436 -12792963 -14278791 -15676109 -16630338 -16789088 -15970939 -14250807 -12064240 -10120090
13428 -10120090 -9061927 -9145680 -10146164 -11502789 -12566788 -12814011 -12002343 -10275459 -7957822
13419 -7957822 -5253654 -2309045 667349 3492304 6077421 8290720 9805871 10314899
13411 10314899 9906529 9143542 8664245 8628425 8640031 8183562 6970459 4970418 2368753
13402B368753k869923k790011k401182j760168r30930P7456J196312K262708L133814
13393a713171L701171L815877L288857K167697R14265k831n06163p88660j029622
13384I847420j249231j324077j172435q26249l44779J83880N79192O56441M89230
13375F839392M01723N72117R33881J417246J957049K337843K291344J755504Q83869
13366A9389968j17819j121856k080652k843060l131249k784963j940555r21800
13358D448014j9382N45715O90075N46676K82136j4791k39086l07609l54711p45001
13348D832036j539927k053775j590706l76211Q65218J794081K327493K179595
13340F437804J250404J1878r94898j563615j535169p34921N78137J690926K033091
$$ plain form
13402 2368753 -501170 -3291181 -5692363 -7452531 -8383461 -8306005 -7109693 -4846985 -1713171
13393 -1713171 1988000 5803877 9092734 11260431 12174696 12171865 11665702 10877042 9847420
13384 9847420 8598189 7274112 6101677 5275428 4930649 5114529 5693721 6350162 6839392
13375 6839392 7241115 7813232 8747113 10164359 12121408 14459251 16750595 18506099 19389968
13366 19389968 19272149 18150293 16069641 13226581 10095332 7310369 5369814 4448014
13358 4448014 4428632 4974347 5664422 6211098 6493234 6478443 6239357 5931748 5577037 4832036
13348 4832036 3292109 1238334 -352372 -728583 136635 1930716 4258209 6437804
13340 6437804 7688208 7700086 6705188 5141573 3606404 2871483 3449620 5140546 7173637
13331G173637J510217M15651p22651j394325j422656j047664o16666k09943K10383
13322C895983M72283L05629l10519q84902o91822M21739J762434K487072K294528
13313I752425J470060O04089J03337j46602m42195q16261j119454j357895j771121
13304F276383k402168k837086k620427j804711r73448o76426q82760j185443j402215
13295h508301j651588j963619k039970j461022k14759J206382K298315K799173
13287i535389K667519K097371J396307Q00217L81627J30380L0140K1012P2981
13278a937835K48777O71669J298227J760168J691882J077624K05973n36457q31432
13269C648596n59668J54717J044418J789995K127304K103202K006827J994242
$$ plain form
13331 7173637 8683854 9099505 8376854 6982529 5559873 4512209 3895543 3685600 3895983
13322 3895983 4368266 4673895 4363376 3478474 2786652 3208391 4970825 7457897 9752425
13313 9752425 11222485 11826574 11929911 11783309 11341114 10524853 9405399 8047504 6276383
13304 6276383 3874215 1037129 -1583298 -3388009 -4361457 -5037883 -5920643 -7106086 -8508301
13295 -8508301 -10159889 -12123508 -14163478 -15624500 -15839259 -14632877 -12334562 -9535389
13287 -9535389 -6867870 -4770499 -3374192 -2573975 -2192348 -2061968 -2031828 -2010816 -1937835
13278 -1937835 -1689058 -1017389 280838 2041006 3732888 4810512 5016485 4480028 3648596
13269 3648596 3088928 3243645 4288063 6078058 8205362 10308564 12315391 14309633
13261A4309633K007602J877792J414658O18853k03784p70192j088834j309118
13253A6856610j467910j455641j241417r88037q29407o71421l47534J77936P50942
13244A0784121J207427J497055J461940Q87809q7695j030842j709290k157978
13236A0852547k364715k173017j441229k03818J151330J946635J860275J246220
13228A0874228N47073j41863q61091j510631j824414j612935r10070M4520R08509
13219E513326J443708J561128J367788J097462Q93532Q17701Q92864J030167J048991
13210A5666667O60080m29568j994531l255318l722953l642671l611357l963539
13202d293190m426088m408887l650647k350224q42985N06309J381070J790637
$$ plain form
13261 14309633 16317235 18195027 19609685 20228538 20024754 19254562 18165728 16856610
13253 16856610 15388700 13933059 12691642 11703605 10874198 10202777 9855243 10033179 10784121
13244 10784121 11991548 13488603 14950543 15838352 15750657 14719815 13010525 10852547
13236 10852547 8487832 6314815 4873586 4669768 5821098 7767733 9628008 10874228
13228 10874228 11421301 11279438 10418347 8907716 7083302 5470367 4560297 4604817 5513326
13219 5513326 6957034 8518162 9885950 10983412 11876944 12694645 13587509 14617676 15666667
13210 15666667 16326747 15897179 13902648 10647330 6924377 3281706 -329651 -4293190
13202 -4293190 -8719278 -13128165 -16778812 -19129036 -19972021 -19465712 -18084642 -16294005
13194a6294005K053454K393726K705643K648105J999496J009947K76791K79159
13186b927684J055731K117844K777303K805702K456665J928793J266421M89168
13178A1969943l42684r72030r99435l43961N66941J198901J341055J057070M54310
13169A3930110k34269o91013q84874j068805j406759j800097k006184j897199
13161C940910j573927j249721j154971j462691k124165k829332l182873k896934
13153a2533704j942297o67365L16031O14909M12596J60699l0628l04265m88030
13144a4462054j61131P93155K082070L323862M198099M498118M171297L253909
13136G697325J936311O37298k68886p53947j116288j644185k244497k502000k195245
$$ plain form
13194 -16294005 -14240551 -11846825 -9141182 -6493077 -4493581 -3483634 -3206843 -2927684
13186 -2927684 -1871953 245891 3023194 5828896 8285561 10214354 11480775 11969943
13178 11969943 11627259 10655229 9655794 9311833 9878774 11077675 12418730 13475800 13930110
13169 13930110 13695841 13004828 12119954 11051149 9644390 7844293 5838109 3940910
13161 3940910 2366983 1117262 -37709 -1500400 -3624565 -6453897 -9636770 -12533704
13153 -12533704 -14476001 -15143366 -14827335 -14212426 -13799830 -13639131 -13669759 -13974024 -14462054
13144 -14462054 -14623185 -13830030 -11747960 -8424098 -4225999 272119 4443416 7697325
13136 7697325 9633636 10270934 10002048 9248101 8131813 6487628 4243131 1741131 -454114
13127d54114j566368j046990q88022j072102j396643j561557j354554q33891k07419
13118a0381660L54090P33047R82959J243342J419576J296228Q30607J15026o32817
13109d039602j020494p72274j02562M26955M15120j06413p44084r76512n02165
13100g422031M67552J399737J975440K197660K091346J658448J041181M15943
13092C825276j61796o84780j094559j240228r78806k60027Q32418J894670K292454
13083D424622J633906J42422j521169k693004k982999k485801j590745o43954
13075e716722J04838N95426J029537J617639K265438K693821K784675K685989
13067H060641K672229K779636K643437J900682O76784m98125j189262j196461
$$ plain form
13127 -454114 -2020482 -3067472 -3955494 -5027596 -6424239 -7985796 -9340350 -10174241 -10381660
13118 -10381660 -10027570 -9294523 -8311564 -7068222 -5648646 -4352418 -3521811 -3406785 -4039602
13109 -4039602 -5060096 -5832370 -5934932 -5507977 -5092857 -5199270 -5943354 -6919866 -7422031
13100 -7422031 -6954479 -5554742 -3579302 -1381642 709704 2368152 3409333 3825276
13092 3825276 3663480 2978700 1884141 643913 -334893 -594920 237498 2132168 4424622
13083 4424622 6058528 6200950 4679781 1986777 -996222 -3482023 -5072768 -5716722
13075 -5716722 -5611884 -5016458 -3986921 -2369282 -103844 2589977 5374652 8060641
13067 8060641 10732870 13512506 16155943 18056625 18733409 18235284 17046022 15849561
13059A5849561o16250l2260o2948p55244j595778j983025j717895j043876l62255
13050G680030O14j3154j74305l01464m06991n31286o26938o26640n15994k79863
13040D204009J25845O79053J065780Q62768N6262r96488j865848k188981j980232
13031c7832j641078j528576j712592j860335j471601m73310P43181J735752K207272
13022d039119K126179J668785Q95747k74135j717196k959716l513425l190969
13014a1003849k095447p07058L45720Q83942J137210J207574R83558N25724J55883
13005h566743q137k54093q39702j593111j990690j563300m35820N72290P87640
12996a3891666M06874J73668N10614J007211J002797N12052Q2159j2060M2545
$$ plain form
13059 15849561 15233311 15201051 15138103 14382859 12787081 10804056 9086161 8042285 7680030
13050 7680030 7680644 7667490 7493185 7191721 6784730 6253444 5626506 4999866 4483872 4204009
13040 4204009 4329854 5008907 6074687 6937455 6993717 5997229 4131381 1942400 -37832
13031 -37832 -1678910 -3207486 -4920078 -6780413 -8252014 -8725324 -7982143 -6246391 -4039119
13022 -4039119 -1912940 -244155 651592 377457 -1339739 -4299455 -7812880 -11003849
13014 -11003849 -13099296 -13806354 -13460634 -12576692 -11439482 -10231908 -9248350 -8722626 -8566743
13005 -8566743 -8574880 -8828973 -9668675 -11261786 -13252476 -14815776 -15251596 -14679306 -13891666
12996 -13891666 -13484792 -13311124 -12800510 -11793299 -10790502 -10278450 -10196291 -10208351 -10165806
12987a0165806K5336j18116k78337l52103m53471o29577o66763m36900K4590P56590
12977a2294557J748527K807236L603998L723834K900542J383089q1651r04340
12969B886678j136318j172301j231996j239209j093407q30072n62678l51118n7486
12960d787907N15029J488564K777417L973746M650062M633768L956688K887689
12952B0095056J827604R05857j5962q82962j359910j370192j343749j668677k128134
12943A4058931k137113j475783m57050N81662J472796K062591K271405K063996
12935A8441435J459292O99189K9642n60662j148743j700374k141110k404386k480711
12926A0193572k390337j995927j210534l17166L32309O56224P11819N51391K56014
$$ plain form
12987 -10165806 -10140470 -10258586 -10536923 -10889026 -11342497 -11972074 -12638837 -13075737 -13051147 -12294557
12977 -12294557 -10546030 -7738794 -4134796 -410962 2489580 3872669 3791018 2886678
12969 2886678 1750360 578059 -653937 -1893146 -2986553 -3816625 -4379303 -4730421 -4787907
12960 -4787907 -4272878 -2784314 -6897 3966849 8616911 13250679 17207367 20095056
12952 20095056 21922660 22828517 22812555 21929593 20569683 19199491 17855742 16187065 14058931
12943 14058931 11921818 10446035 9988985 10570647 12043443 14106034 16377439 18441435
12935 18441435 19900727 20599916 20629558 20068896 18920153 17219779 15078669 12674283 10193572
12926 10193572 7803235 5807308 4596774 4279608 4611917 5268141 5979960 6531351 6787365
12917F787365q3649m02065o64828q55495q79884o71555l88568k01735l1373J66083
12907B774296J12189m61884j380556k034938j907510j081778r7596N08713O35509
12898b933555O07687P15797J022631J380419J505225J316957J118345J150988
12890E884494J176235Q13677J47912k94912j08416N33100R99461Q67062K52028
12881A0270641n62195j360698j907618k133924k263199k368464k165936j566233
12873d057626r81067q70540j322409k170605l135285l844285m074884l821658
12865b4278359k987131j435062N32168K220287L164049L353709K997296K374485
12857a4058558J852942J815684K375711L136554L438246K928079J719910J16516
$$ plain form
12917 6787365 6703716 6301651 5636823 4781328 3901444 3229889 2841321 2639586 2608213 2774296
12907 2774296 2886485 2424601 1044045 -990893 -2898403 -3980181 -4077777 -3569064 -2933555
12898 -2933555 -2325868 -1610071 -587440 792979 2298204 3615161 4733506 5884494
12890 5884494 7060729 7874406 8022318 7727406 7618990 8152090 9151551 10018613 10270641
12881 10270641 9708446 8347748 6440130 4306206 2043007 -325457 -2491393 -4057626
12873 -4057626 -5038693 -5909233 -7231642 -9402247 -12537532 -16381817 -20456701 -24278359
12865 -24278359 -27265490 -28700552 -28168384 -25948097 -22784048 -19430339 -16433043 -14058558
12857 -14058558 -12205616 -10389932 -8014221 -4877667 -1439421 1488658 3208568 3325084
12849C325084j511408k747478l350327l372017k927352k052633r21458J4921K95184
12840a3247484j38698q23094j074462o03310K06394P72227Q73000P50545Q26720
12831a2458162J338762K212413L103115L477747K881936J441401N9583l33356
12823A723439K12282P57975N18508m70355j617707k383392k626814k620114k648576
12814i154754k599215k223878j483025m98717M72739J143953J506889J860053
12806a0975955K317661K661304K799787K869436K930750K857197K427180J533593
12798I420953L41197r06383k060334k954949l341943l051485k208027j167896
12790e928867j70932O90296J277014J495409J467263J464694J633476J746130
$$ plain form
12849 3325084 1813676 -933802 -4284129 -7656146 -10583498 -12636131 -13557589 -13542668 -13247484
12840 -13247484 -13386182 -14209276 -15283738 -15887048 -15680654 -14908427 -14035427 -13284882 -12458162
12831 -12458162 -11119400 -8906987 -5803872 -2326125 555811 1997212 2056795 1723439
12823 1723439 1935721 2693696 3212204 2741849 1124142 -1259250 -3886064 -6506178 -9154754
12814 -9154754 -11753969 -13977847 -15460872 -15959589 -15486850 -14342897 -12836008 -10975955
12806 -10975955 -8658294 -5996990 -3197203 -327767 2602983 5460180 7887360 9420953
12798 9420953 9762150 8855767 6795433 3840484 498541 -2552944 -4760971 -5928867
12790 -5928867 -6099799 -5409503 -4132489 -2637080 -1169817 294877 1928353 3674483
12782C674483J404688N31626n73027j648640k650434l416817l518215k727669
12774h924005j347039M3148R38678J138903P29090p5773r59285j606053j828869
$$ plain form
12782 3674483 5079171 5610797 5037770 3389130 738696 -2678121 -6196336 -8924005
12774 -8924005 -10271044 -10227896 -9289218 -8150315 -7421225 -7496998 -8456283 -10062336 -11891205
$$ [...]
##END NTUPLES=NMR SPECTRUM
##END=
