##TITLE=31P ikalashn
DE-75k2_TFA
15.11.2024
##JCAMPDX= 6.0         $$ Bruker NMR JCAMP-DX V2.0
##DATA TYPE= NMR SPECTRUM
##DATA CLASS= NTUPLES
##ORIGIN= UXNMR, Bruker Analytische Messtechnik GmbH
##OWNER= root
$$ TOPSPIN		Version 1.3
$$ 2024-11-15 14:07:17.687 +0400  Irina@DPX200
$$ Compression mode = diff/dup
##.OBSERVE FREQUENCY= 81.01967998063
##.OBSERVE NUCLEUS= ^31P
##.ACQUISITION MODE= SIMULTANEOUS
##.ACQUISITION SCHEME= undefined
##.AVERAGES= 128
##.DIGITISER RES= 17
##SPECTROMETER/DATA SYSTEM= spect
##.PULSE SEQUENCE= zgpg
##.SOLVENT NAME= D2O
##.SHIFT REFERENCE= INTERNAL, D2O, 1, 298.5841
##AUDIT TRAIL= $$ (NUMBER, WHEN, WHO, WHERE, WHAT)
$$ ##TITLE= Audit trail, TOPSPIN		Version 1.3
$$ ##JCAMPDX= 5.01
$$ ##ORIGIN= Bruker BioSpin GmbH
$$ ##OWNER= Irina
$$ $$ F:/spectra/data/iren/nmr/P31dec/1/pdata/1/auditp.txt
$$ ##AUDIT TRAIL=  $$ (NUMBER, WHEN, WHO, WHERE, VERSION, WHAT)
(   1,<2024-11-15 14:06:58.265 +0400>,<Irina>,<DPX200>,<TOPSPIN 1.3>,
      <created by zg
	started at 2024-11-15 14:03:39.906 +0400,
	POWCHK disabled, PULCHK disabled
       configuration hash MD5:
       BE 6D 3F 07 2A EA 11 49 91 17 2B D3 AF B3 58 0D
       data hash MD5: 32K
       23 0C 49 F3 5A BC D7 AB 3A B7 9E 4D 41 8B 63 D8>)
(   2,<2024-11-15 14:06:59.984 +0400>,<Irina>,<DPX200>,<TOPSPIN 1.3>,
      <Start of raw data processing
       efp BC_mod = 2 LB = 15 FT_mod = 6 PKNL = 1 PHC0 = 199.6774 PHC1 = 55.71121 SI = 32K 
       data hash MD5: 32K
       F2 6E CF C2 37 D2 7F 66 C3 DB C5 B8 D1 9A DE AB>)
(   3,<2024-11-15 14:07:02.156 +0400>,<Irina>,<DPX200>,<TOPSPIN 1.3>,
      <apk 
       data hash MD5: 32K
       DB A4 A7 D0 CB 40 70 5E 9D 2C 51 FD 42 5C 67 AD>)
(   4,<2024-11-15 14:07:04.671 +0400>,<Irina>,<DPX200>,<TOPSPIN 1.3>,
      <abs n ABSG = 5 
       data hash MD5: 32K
       09 53 2E 07 68 73 B7 75 9A 00 08 AE 1C 97 22 E6>)
$$ ##END=
$$ 
$$ $$ hash MD5
$$ $$ 10 5C 6B D2 DB DC F3 46 65 5B BD 51 BC C6 E0 F9
##$RELAX= 
##$RELAX= 
##$RELAX= 
##$RELAX= 
##$RELAX= 
##$RELAX= 
##$RELAX= 
##$RELAX= 
##$RELAX= 
##$RELAX= 
##$RELAX= 
$$ Bruker specific parameters
$$ --------------------------
##$DU= <F:/spectra>
##$EXPNO= 1
##$NAME= <P31dec>
##$PROCNO= 1
##$TYPE= <nmr>
##$USER= <iren>
##$AMP= (0..31)
100 100 100 100 100 100 100 100 100 100 100 100 100 100 100 100 100 100 
100 100 100 100 100 100 100 100 100 100 100 100 100 100 
##$ANAVPT= -1
##$AQSEQ= 0
##$AQ_mod= 1
##$AUNM= <au_zg>
##$AUTOPOS= <>
##$BF1= 81.014009
##$BF2= 200.13
##$BF3= 200.13
##$BF4= 200.13
##$BF5= 200.13
##$BF6= 200.13
##$BF7= 200.13
##$BF8= 200.13
##$BYTORDA= 1
##$CFDGTYP= 0
##$CFRGTYP= 5
##$CHEMSTR= <none>
##$CNST= (0..63)
1 1 145 1 1 1 1 1 1 1 1 1 1 1 1 1 1 1 1 1 1 1 1 1 1 1 1 1 1 1 1 1 1 1 
1 1 1 1 1 1 1 1 1 1 1 1 1 1 1 1 1 1 1 1 1 1 1 1 1 1 1 1 1 1 
##$CPDPRG= <waltz16>
##$CPDPRG1= <>
##$CPDPRG2= <waltz16>
##$CPDPRG3= <>
##$CPDPRG4= <mlev>
##$CPDPRG5= <mlev>
##$CPDPRG6= <mlev>
##$CPDPRG7= <mlev>
##$CPDPRG8= <mlev>
##$CPDPRGB= <>
##$CPDPRGT= <>
##$D= (0..63)
$$ [...]
##$SW_h= 37037.037037037
##$TD= 32768
##$TD0= 1
##$TE= 300
##$TE2= 300
##$TE3= 300
##$TEG= 300
##$TL= (0..7)
0 120 53 12 22 120 120 120 
##$TP= (0..7)
150 150 150 150 150 150 150 150 
##$TP07= 0
##$TPNAME0= <>
##$TPNAME1= <>
##$TPNAME2= <>
##$TPNAME3= <>
##$TPNAME4= <>
##$TPNAME5= <>
##$TPNAME6= <>
##$TPNAME7= <>
##$TPOAL= (0..7)
0.5 0.5 0.5 0.5 0.5 0.5 0.5 0.5 
##$TPOFFS= (0..7)
0 0 0 0 0 0 0 0 
##$TUNHIN= 0
##$TUNHOUT= 0
##$TUNXOUT= 0
##$USERA1= <user>
##$USERA2= <user>
##$USERA3= <user>
##$USERA4= <user>
##$USERA5= <user>
##$V9= 5
##$VALIST= <valist>
##$VCLIST= <CCCCCCCCCCCCCCC>
##$VD= 0
##$VDLIST= <DDDDDDDDDDDDDDD>
##$VPLIST= <PPPPPPPPPPPPPPP>
##$VTLIST= <TTTTTTTTTTTTTTT>
##$WBST= 1024
##$WBSW= 4
##$XGAIN= (0..3)
0 0 0 0 
##$XL= 0
##$YL= 0
##$YMAX_a= 11714
##$YMIN_a= -2063
##$ZGOPTNS= <>
##$ZL1= 120
##$ZL2= 120
##$ZL3= 120
##$ZL4= 120
##$ABSF1= 298.5841
##$ABSF2= -158.5842
##$ABSG= 5
##$ABSL= 5
##$ALPHA= 0
##$AQORDER= 0
##$ASSFAC= 0
##$ASSFACI= 0
##$ASSFACX= 0
##$ASSWID= 0
##$AUNMP= <proc_1d>
##$AXLEFT= 0
##$AXRIGHT= 0
##$AXTYPE= 0
##$AXUNIT= <>
##$AZFE= 0.1
##$AZFW= 0.5
##$BCFW= 0
##$BC_mod= 2
##$BYTORDP= 0
##$COROFFS= 0
##$CY= 12.5935478210449
##$DATMOD= 1
##$DC= 0
##$DFILT= <>
##$DTYPP= 0
##$F1P= 47.1127640792319
##$F2P= -24.0371245302204
##$FCOR= 0.5
##$FTSIZE= 32768
##$FT_mod= 6
##$GAMMA= 0
##$GB= 0
##$INTBC= 1
##$INTSCL= 7.269226e-011
##$ISEN= 30
##$LB= 15
##$LEV0= 0
##$LPBIN= 0
##$MAXI= 12.09355
##$MC2= 0
##$MEAN= 0
##$ME_mod= 0
##$MI= 0.7550151
##$NCOEF= 0
##$NC_proc= -13
##$NLEV= 6
##$NOISF1= 298.5841
##$NOISF2= 270.0111
##$NSP= 0
##$NTH_PI= 0
##$NZP= 0
##$OFFSET= 298.5841
##$PC= 1.4
##$PHC0= 180.5912
##$PHC1= 119.9369
##$PH_mod= 1
##$PKNL= yes
##$PPARMOD= 0
##$PPDIAG= 0
##$PPIPTYP= 0
##$PPMPNUM= 100
##$PPRESOL= 1
##$PSCAL= 0
##$PSIGN= 0
##$REVERSE= no
##$SF= 81.014009
##$SI= 32768
##$SIGF1= 270.0111
##$SIGF2= -158.5842
##$SINO= 77.54984
##$SIOLD= 32768
##$SREGLST= <31P.CDCl3>
##$SSB= 0
##$STSI= 32768
##$STSR= 0
##$SW_p= 37037.037037037
##$SYMM= 0
##$S_DEV= 0
##$TDeff= 32768
##$TDoff= 0
##$TI= <>
##$TILT= no
##$TM1= 0
##$TM2= 0
##$TOPLEV= 0
##$USERP1= <user>
##$USERP2= <user>
##$USERP3= <user>
##$USERP4= <user>
##$USERP5= <user>
##$WDW= 1
##$XDIM= 32768
##$YMAX_p= 458862164
##$YMIN_p= -35709159
$$ End of Bruker specific parameters
$$ ---------------------------------
##NTUPLES= NMR SPECTRUM
##VAR_NAME=  FREQUENCY,     SPECTRUM/REAL,   SPECTRUM/IMAG
##SYMBOL=    X,             R,               I
##VAR_TYPE=  INDEPENDENT,   DEPENDENT,       DEPENDENT
##VAR_FORM=  AFFN,          ASDF,            ASDF
##VAR_DIM=   32768,         32768,           32768
##UNITS=     HZ,            ARBITRARY UNITS, ARBITRARY UNITS
##FACTOR=    1.13031516577767, 1,            1
##FIRST=     37037.037037037, 4738564,       4301189
##LAST=      0,             19989500,        -6805585
##MIN=       0,             -35709159,       0
##MAX=       37037.037037037, 458862164,     0
$$ Real data points
##PAGE= N=1
##DATA TABLE= (X++(R..R)), XYDATA
$$ [...]
17548H953567P68169L22962j60469n70575q33050r38428r39585r17802r38421
17539D746368j024250j159157j304662j407481j409118j274905j021612p11846
17531d566663m21565k10895j05352p9770o2829J7747J79419L75232N38732O34205
17521c701739O69992O78264O84935O85590O45996N36570L65648J71095j3793j74572
17511E47986l02396l85883m21951m22783m03085l59146k62218p9312J96264N36770
17501a355754Q94491J211484J422640J477869J378542J181016R52652P29870N17030
17492H409840L10472J15924n4456j95018l11756m12707m90716n22177m93422m21003
17482E934981l30991k24542q4671Q4122K43211L47028L69018L01002J37517j30203
$$ y = [8953567, 9721736, 10044698, 9884229, 9313654, 8480604, 7542176, 6602591, 5684789, 4746368, 3722118, 2562961, 1258299, -149182, -1558300, -2833205, -3854817, -4566663, -4988228, -5199123, -5304475, -5384245, -5447074, -5429327, -5249908, -4874676, -4335944, -3701739, -3031747, -2353483, -1668548, -982958, -336962, 199608, 565256, 736351, 722558, 547986, 245590, -140293, -562244, -985027, -1388112, -1747258, -2009476, -2088788, -1892524, -1355754, -461263, 750221, 2172861, 3650730, 5029272, 6210288, 7162940, 7892810, 8409840, 8720312, 8836236, 8781780, 8586762, 8275006, 7862299, 7371583, 6849406, 6355984, 5934981, 5603990, 5379448, 5294777, 5378899, 5622110, 5969138, 6338156, 6639158, 6776675, 6646472]
17472F646472n00138r37091j361956j670895j785453j697510j464744j163433
17464c934748q47060n37905k40255M4959L12363N49579P37364Q51381Q66737P69904
17454a427681N74200L22748P1322j36420k84941l87836m75439n77276p07819q55890
17444c885032r79821j020759r38216p44737n07276l11018k14740k28729l19588
17435i149916m21841m47739l13777J2090M81803R94062J453442J802588K009844
17426c579444K052599J926645J662633J321583R71746O68060M45596L21481K97980
17417F088879L65513N05208O94278R18007J176205J470450J781473K056105K214600
17408A7270718K181725J928115J491587R59943M27774m3139m38291p76586j078189
$$ y = [6646472, 6146334, 5209243, 3847287, 2176392, 390939, -1306571, -2771315, -3934748, -4781808, -5319713, -5559968, -5515009, -5202646, -4653067, -3915703, -3064322, -2197585, -1427681, -853481, -530733, -459411, -595831, -880772, -1268608, -1744047, -2321323, -3029142, -3885032, -4864853, -5885612, -6823828, -7568565, -8075841, -8386859, -8601599, -8830328, -9149916, -9571757, -10019496, -10333273, -10321183, -9839380, -8845318, -7391876, -5589288, -3579444, -1526845, 399800, 2062433, 3384016, 4355762, 5023822, 5469418, 5790899, 6088879, 6454392, 6959600, 7653878, 8571885, 9748090, 11218540, 13000013, 15056118, 17270718, 19452443, 21380558, 22872145, 23832088, 24259862, 24216723, 23778432, 23001846, 21923657]
17399B1923657j336891j522932j613095j615106j567504j522200j519148j564981
17391I661800j634567j694894j720859j689919j585125j417882j233420j078021
17383b392887r63871q72871p88490p11905o48150n90049n19698m18820k77961
17374h184702j00630J00968L12983N22922P19921Q91084J017291J081903J087049
17365b551211J052093R89706Q87575P22714M97800K57604O6339k5667M600J50667
17355B052220L66952N67872O61444N99761M05276J58674l6972r5717J8138K66645
17345D964293N34854O68549N54395J89843l23107q57862j339666j752822k096829
17336E41648k356353k506317k521860k380780k072988j610073j015901l11494
$$ y = [21923657, 20586766, 19063834, 17450739, 15835633, 14268129, 12745929, 11226781, 9661800, 8027233, 6332339, 4611480, 2921561, 1336436, -81446, -1314866, -2392887, -3356758, -4229629, -5018119, -5730024, -6378174, -6968223, -7487921, -7906741, -8184702, -8285332, -8184364, -7871381, -7348459, -6628538, -5737454, -4720163, -3638260, -2551211, -1499118, -509412, 378163, 1100877, 1598677, 1856281, 1922620, 1896953, 1901553, 2052220, 2419172, 2987044, 3648488, 4248249, 4653525, 4812199, 4775227, 4679510, 4697648, 4964293, 5499147, 6167696, 6722091, 6911934, 6588827, 5730965, 4391299, 2638477, 541648, -1814705, -4321022, -6842882, -9223662, -11296650, -12906723, -13922624, -14234118]
17328a4234118M74204J273460J978093K489525K772321K851965K766442K533873
17320B905765K166631J701247J202885P38863L47717K8256k47643n03799p26744
17311G613178q63842q61627p06724m29730p5557L20694P29689J114495J428051
17302H268627J621202J661819J557459J353511J095768P94446M32200N748m45309
17293A6345471q43958j104194j168271j036062p66364m50233j77017r332K8338
17284A0818378n0038j99986l67463n15988o31610p00815o97694o01122m19732
17275F633930k01530k3842L7347n0046k47608m55173n44359l99884L3918P09453
17265E492206J474687K143394K589372K783623K760531K567165K239182J800226
$$ y = [-14234118, -13759914, -12486454, -10508361, -8018836, -5246515, -2394550, 371892, 2905765, 5072396, 6773643, 7976528, 8715391, 9063108, 9091364, 8843721, 8339922, 7613178, 6749336, 5887709, 5180985, 4751255, 4675698, 4996392, 5726081, 6840576, 8268627, 9889829, 11551648, 13109107, 14462618, 15558386, 16352832, 16785032, 16790780, 16345471, 15501513, 14397319, 13229048, 12192986, 11426622, 10976389, 10799372, 10790040, 10818378, 10768340, 10568354, 10200891, 9684903, 9053293, 8352478, 7654784, 7053662, 6633930, 6432400, 6408558, 6445905, 6395859, 6148251, 5693078, 5148719, 4748835, 4782753, 5492206, 6966893, 9110287, 11699659, 14483282, 17243813, 19810978, 22050160, 23850386]
17257B3850386J271822O92951J30697l44016o98683r57515j186099j457648j809256
17248A9492639k210417k576010k814268k865511k713557k390238j978396j585983
17240C58259j291941j107414r79459q28321n93905k67325J07719M64827P56109
17231c381451R71306J119544J195854J176359J058159Q97908P91794Q08016R40313
17222E577802J123340J281106J358011J318754J142388Q35807M53564Q7927j76128
17213A3002571l08681l50210l78385m45658n38566n92367n43496l73781j12702
17204I358725J94010N11208Q19285J107141J359437J544480J618946J550680J336236
17195A9400148R93621N45099K2050n15190r86702j338095j572137j733016j863907
$$ y = [23850386, 25122208, 25815159, 25945856, 25601840, 24903157, 23945642, 22759543, 21301895, 19492639, 17282222, 14706212, 11891944, 9026433, 6312876, 3922638, 1944242, 358259, -933682, -2041096, -3020555, -3848876, -4442781, -4710106, -4602387, -4137560, -3381451, -2410145, -1290601, -94747, 1081612, 2139771, 3037679, 3829473, 4637489, 5577802, 6701142, 7982248, 9340259, 10659013, 11801401, 12637208, 13090772, 13178699, 13002571, 12693890, 12343680, 11965295, 11519637, 10981071, 10388704, 9845208, 9471427, 9358725, 9552735, 10063943, 10883228, 11990369, 13349806, 14894286, 16513232, 18063912, 19400148, 20393769, 20938868, 20960918, 20445728, 19459026, 18120931, 16548794, 14815778, 12951871]
17186A2951871j973694k028721j970895j755185j384811r15321m21758M3383M66064
17177C010933Q46208J156912J338521J345863J195702R54253O80711L97020J12785
17168A1038908j40287l14873l85955l75752l43532l52655m35767n73511p00103
17159G416473p34771o15546l17692J37717O80284J201596J585181J743467J646589
17150A2743298J330240Q78544L89796o1213m41566p44674r62831j080580j088521
17141A0962493r96815q38405o59869n02736l94345l57045m08360n36738o86172
17132E582008p81005p75260o81941n53526m32882l21629j91663k1339J83933L99656
17122B406352N96187P43904Q20675Q25876P81434P12721O34919N59011M97696
$$ y = [12951871, 10978177, 8949456, 6978561, 5223376, 3838565, 2923244, 2501486, 2544869, 3010933, 3857141, 5014053, 6352574, 7698437, 8894139, 9848392, 10529103, 10926123, 11038908, 10898621, 10583748, 10197793, 9822041, 9478509, 9125854, 8690087, 8116576, 7416473, 6681702, 6066156, 5748464, 5886181, 6566465, 7768061, 9353242, 11096709, 12743298, 14073538, 14952082, 15341878, 15280665, 14839099, 14094425, 13131594, 12051014, 10962493, 9965678, 9127273, 8467404, 7964668, 7570323, 7213278, 6804918, 6268180, 5582008, 4801003, 4025743, 3343802, 2790276, 2357394, 2035765, 1844102, 1822763, 2006696, 2406352, 3002539, 3746443, 4567118, 5392994, 6174428, 6887149, 7522068, 8081079, 8578775]
17113H578775M57615M31086M00894L53488K91626K40058K33570K87351L71451
17104A1645914M12449L27894P6776l09972p44993j130009j394332j510633j490947
17095E882147j364437j149915q49300m66448k6527M21822Q20157J122542J312805
17086E702846J405099J428684J400484J304752J109819Q08142M33034M5605k81132
17077A3357333m78459n10697m04920k53356j72521k38656m46883p23496r75807
17068I152538j140066j198607j165347j062527r10726p31370n44374l51487j22266
17059A925768J87085N82517R93660J293358J370929J200513Q47660M21586K4532
17050H847608k73396m41187m83384m24761k92297j09003R8963K94008M30918M74316
$$ y = [8578775, 9036390, 9467476, 9868370, 10221858, 10513484, 10753542, 10987112, 11274463, 11645914, 12058363, 12386257, 12463033, 12153061, 11408068, 10278059, 8883727, 7373094, 5882147, 4517710, 3367795, 2518495, 2052047, 2025520, 2447342, 3267499, 4390041, 5702846, 7107945, 8536629, 9937113, 11241865, 12351684, 13159826, 13592860, 13638465, 13357333, 12878874, 12368177, 11963257, 11709901, 11537380, 11298724, 10851841, 10128345, 9152538, 8012472, 6813865, 5648518, 4585991, 3675265, 2943895, 2399521, 2048034, 1925768, 2112853, 2695370, 3689030, 4982388, 6353317, 7553830, 8401490, 8823076, 8847608, 8574212, 8133025, 7649641, 7224880, 6932583, 6823580, 6922543, 7216551, 7647469, 8121785]
17040H121785M15328K69351N9303j92912m59157p01808q92688j035169j153971
17031D430062j259153j328747j330236j252078j110733r38734p77197o69285o37986
17022d874087o56210o44902n23718k80278J2595K52382L79165M05606L98240M35240
17012e095967N61852P58712R47822J048589J044064R92683R72562J014559J085415
17003C330291J121014J067334R09955O89007M80708L45700K85915K51220J90718
16994H671862R4537j5286j19177k13861l03486l87628m55990m96378n12936n33661
16984E727996n87827o66304p09197o43908m38778j24202K24537N21634P05913
16975D009864P56946O79704M81887J80389j70691m79232o60490o83964n76503
$$ y = [8121785, 8537113, 8806464, 8865767, 8672855, 8213698, 7511890, 6619202, 5584033, 4430062, 3170909, 1842162, 511926, -740152, -1850885, -2789619, -3566816, -4236101, -4874087, -5530297, -6175199, -6698917, -6979195, -6966600, -6714218, -6335053, -5929447, -5531207, -5095967, -4534115, -3775403, -2827581, -1778992, -734928, 257755, 1230317, 2244876, 3330291, 4451305, 5518639, 6428594, 7117601, 7598309, 7944009, 8229924, 8481144, 8671862, 8766399, 8751113, 8631936, 8418075, 8114589, 7726961, 7270971, 6774593, 6261657, 5727996, 5140169, 4473865, 3764668, 3120760, 2681982, 2557780, 2782317, 3303951, 4009864, 4766810, 5446514, 5928401, 6108790, 5938099, 5458867, 4798377, 4114413, 3537910]
16966C537910l95701k11524r8204j10372k43825m24449n53846n72022m71544k63457
16956A92966M0926M04290P38427R31054R21263P62912O07613O06358Q06017J121361
16946G133187J396388J499745J387376J105731P53669M36133K29329J61714K12166
16937A4315438L25798M37683M89069M37390K71139J6838k79777n75351q22554
16928A4615673r56647r11580o57792k28141K87176P77175J157964J396307J496706
16919A6976841J479413J373817J215507J029517Q15818N62292K73194k2722k92373
16910B3411304n16524o85252p88176q19706p91258p31358o70961o31346o27524
16901A7149199o76669p97112j000017j277471j586763j843510j943438j812555
$$ y = [3537910, 3142209, 2930685, 2832481, 2722109, 2478284, 2053835, 1499989, 927967, 456423, 192966, 233892, 638182, 1376609, 2307663, 3228926, 3991838, 4599451, 5205809, 6011826, 7133187, 8529575, 10029320, 11416696, 12522427, 13276096, 13712229, 13941558, 14103272, 14315438, 14641236, 15078919, 15567988, 16005378, 16276517, 16293355, 16013578, 15438227, 14615673, 13659026, 12747446, 12089654, 11861513, 12148689, 12925864, 14083828, 15480135, 16976841, 18456254, 19830071, 21045578, 22075095, 22890913, 23453205, 23726399, 23703677, 23411304, 22894780, 22209528, 21421352, 20601646, 19810388, 19079030, 18408069, 17776723, 17149199, 16472530, 15675418, 14675401, 13397930, 11811167, 9967657, 8024219, 6211664]
16893F211664j452889r45306m03427Q5811M88081Q01282J020449J126775J110297
16884H042737J000691Q67168P79776P69338Q18255Q80363R14584R08952Q73730
16875A5855594Q14810P20610N72340L59153Q6776k19247n18683p67759r25484
16866A5978110r57635q50329o25281l39361o9842J08484J53795P8615o0895k04518
16856A3211143l26277m38425n56638o63563p13321o77178n86770n26770n75581
16847H146620p48965r93700j217872j320595j218815q86196l83294J59625O04101
16838B140909Q65361R31913Q33193N92640K17280k73579q25819j360360j796910
16829A324628k071268k145381k011562j694209j255476p96483m32497k38924k02683
$$ y = [6211664, 4758775, 3813469, 3410042, 3495853, 3983934, 4785216, 5805665, 6932440, 8042737, 9043428, 9910596, 10690372, 11459710, 12277965, 13158328, 14072912, 14981864, 15855594, 16670404, 17391014, 17963354, 18322507, 18409283, 18190036, 17671353, 16903594, 15978110, 15020475, 14170146, 13544865, 13205504, 13135662, 13244146, 13397941, 13476556, 13415661, 13211143, 12884866, 12446441, 11889803, 11226240, 10512919, 9835741, 9248971, 8722201, 8146620, 7397655, 6403955, 5186083, 3865488, 2646673, 1760477, 1377183, 1536808, 2140909, 3006270, 3938183, 4771376, 5364016, 5581296, 5307717, 4481898, 3121538, 1324628, -746640, -2892021, -4903583, -6597792, -7853268, -8649751, -9082248, -9321172, -9523855]
16820i523855k25656j85685p462L06113O88396J048018J312773J456609J493125
16811c637624J447663J336334J166067R49210P15176N07563L72030L46901M60036
16802C663356P23573J116928J567058J954779K161541K129134J886886J527648
16794A6730903J153440Q30198N76659L79786K09025J8872k39853n86691r82173
16785A8090166j340763j580226j660257j585560j393125j144387r13879p65370
16777G706599p33697q25509j023819j286813j551039j744673j808416j717967
16769b985334j494557j193115q75453n84909l34476j10398J17801L86923P22272
16760f351246J112233J499061J801806J951678J914740J700003J357856R62573
$$ y = [-9523855, -9749511, -9935196, -9942658, -9636545, -8948149, -7900131, -6587358, -5130749, -3637624, -2189961, -853627, 312440, 1261650, 1976826, 2484389, 2856419, 3203320, 3663356, 4386929, 5503857, 7070915, 9025694, 11187235, 13316369, 15203255, 16730903, 17884343, 18714541, 19291200, 19670986, 19880011, 19898883, 19659030, 19072339, 18090166, 16749403, 15169177, 13508920, 11923360, 10530235, 9385848, 8471969, 7706599, 6972902, 6147393, 5123574, 3836761, 2285722, 541049, -1267367, -2985334, -4479891, -5673006, -6548459, -7133368, -7467844, -7578242, -7460441, -7073518, -6351246, -5239013, -3739952, -1938146, 13532, 1928272, 3628275, 4986131, 5948704]
16752E948704N80027K46055k5070k18288l09734k83454j61078j3884O3850J027
16742E828155k22264n77675j007795j443540j812773k048178k104775j982099
16734e370944j733453j445044j189429r88264q16110o36675m33121k07308L9288
16725a2781060L12858O15565R30512J212912J394039J409766J244413R55148O50183
16716d055664M31208L42374L62863M40033N26494N96837O50266P04435P73996
16707G72842Q43145Q61754P76646N74642L04608O0162o8257l6999J41331M17270
16697D647144P26468J003403J194616J273968J252511J177433J114878J111437
16689A3501858J149074J136397R65860N98973J02365l86184p19266p98150o17252
$$ y = [5948704, 6528731, 6774786, 6749716, 6531428, 6221694, 5938240, 5777162, 5763278, 5827128, 5828155, 5605891, 5028216, 4020421, 2576881, 764108, -1284070, -3388845, -5370944, -7104397, -8549441, -9738870, -10727134, -11543244, -12179919, -12613040, -12820348, -12781060, -12468202, -11852637, -10922125, -9709213, -8315174, -6905408, -5660995, -4705847, -4055664, -3624456, -3282082, -2919219, -2479186, -1952692, -1355855, -705589, -1154, 772842, 1615987, 2477741, 3254387, 3829029, 4133637, 4193799, 4125542, 4088543, 4229874, 4647144, 5373612, 6377015, 7571631, 8845599, 10098110, 11275543, 12390421, 13501858, 14650932, 15787329, 16753189, 17352162, 17454527, 17068343, 16349077, 15550927, 14933675]
16680A4933675k68569J09747M04105N59796N67395M37256J91350j34501m94767
16671A6305487q42732j132336j318930j375292j312922j181129j045081r62389
16663G134676r62841j036387j142034j234251j285418j282847j206431j022193
16655b037726p05408k63331K67807Q36967J377021J796091J997945J934314J641407
16646F845087J223457Q01146M70003K86381K60335L44068M37378M28855K52148
16637A1348858q7808n36533j024335j471475j781622j870249j716396j375793
16629A484647r35531m59862K3924N04769R66359J382592J723745J961990K070255
16620H722888K019831J790169J388223Q59760K83471k51186o73246r50238j088568
$$ y = [14933675, 14665106, 14774853, 15178958, 15738754, 16306149, 16743405, 16934755, 16800254, 16305487, 15462755, 14330419, 13011489, 11636197, 10323275, 9142146, 8097065, 7134676, 6171835, 5135448, 3993414, 2759163, 1473745, 190898, -1015533, -2037726, -2743134, -3006465, -2738658, -1901691, -524670, 1271421, 3269366, 5203680, 6845087, 8068544, 8869690, 9339693, 9626074, 9886409, 10230477, 10667855, 11096710, 11348858, 11261050, 10724517, 9700182, 8228707, 6447085, 4576836, 2860440, 1484647, 549116, 89254, 113178, 617947, 1584306, 2966898, 4690643, 6652633, 8722888, 10742719, 12532888, 13921111, 14780871, 15064342, 14813156, 14139910, 13189672, 12101104]
16611A2101104j114969j054711r31449p85973o77868o52324p03370p77197q14580
16602D588663p85704o87198n25016l14222q3865J35656L28493M88365O02601O52375
16592D400148O31938N60628M70550L87565L30914L25253M01085N77203Q39236
16583H924520J132601J378991J508952J491425J343915J120260Q85774O94812
16575A8481250N81656N59167O14489P09003P89982Q01266O88796M18965P182m78655
16565B3173101r53319j355717j661321j868464j989305k057527k126328k233533
16557H927587k361659k440857k394091k180031j805693j315849p73721k45851
16549d590165J99839M97112O06022N43056L84424K36265J84526K48667L76345
$$ y = [12101104, 10986135, 9931424, 8999975, 8214002, 7536134, 6883810, 6180440, 5403243, 4588663, 3802959, 3115761, 2590745, 2276523, 2192658, 2328314, 2656807, 3145172, 3747773, 4400148, 5032086, 5592714, 6063264, 6450829, 6781743, 7106996, 7508081, 8085284, 8924520, 10057121, 11436112, 12945064, 14436489, 15780404, 16900664, 17786438, 18481250, 19062906, 19622073, 20236562, 20945565, 21735547, 22536813, 23225609, 23644574, 23651756, 23173101, 22219782, 20864065, 19202744, 17334280, 15344975, 13287448, 11161120, 8927587, 6565928, 4125071, 1730980, -449051, -2254744, -3570593, -4344314, -4590165, -4390326, -3893214, -3287192, -2744136, -2359712, -2123447, -1938921, -1690254, -1313909]
16540a313909M92702N64159O16664O95515Q15036R49520J059312J109550J074587
16531F063136R53473P88431O47552N74030N59630N73631N99125O23530O08010
16522A1990548M92185K38914j24041n05255p97279r38332r46510r01236q79724
16513G629270q97730r14199q96752q68292q79273r46098j027767j061373j015851
16504h78065r09920p85484o71556n67080m49624k99711j16954Q1606K66604L95747
16494c934437M19371L06478P8929j82743l78694m42724l61512j53873J53750N32356
16484c963099R47034J358564J727693K016512K189299K218557K096171J842383
16476A0433114J501705J125156P52526M00763N7114l13185p36712j197618j633248
$$ y = [-1313909, -821207, -257048, 359616, 1055131, 1870167, 2819687, 3878999, 4988549, 6063136, 7016609, 7805040, 8452592, 9026622, 9586252, 10159883, 10759008, 11382538, 11990548, 12482733, 12721647, 12597606, 12092351, 11295072, 10356740, 9410230, 8508994, 7629270, 6731540, 5817341, 4920589, 4052297, 3173024, 2226926, 1199159, 137786, -878065, -1787985, -2573469, -3245025, -3812105, -4261729, -4561440, -4678394, -4596788, -4330184, -3934437, -3515066, -3208588, -3129659, -3312402, -3691096, -4133820, -4495332, -4649205, -4495455, -3963099, -3016065, -1657501, 70192, 2086704, 4276003, 6494560, 8590731, 10433114, 11934819, 13059975, 13812501, 14213264, 14270378, 13957193, 13220481, 12022863, 10389615]
16467A0389615j967008k146725k159034k021593j767878j430829j034243o07500
16459b745195k08552Q9585K44911K64459J78778K2014j56735k79231k57122m4994
16449b892082L12069O82162R09902R01485O72704L26270j3449k52086l44998l00775
16439A202j68909n964J55497L09913M63952O20512P62582Q47612Q28779O89445
16429D504621M59686K09736K9031j0120J12033L55735O40391Q72928R82212R45553
16419I101806P87242N57453L18221J39967Q5715J79669L92241O56019Q89013J014572
16409A4121918R89083Q25078N82079L29620J16835l1806j09142j24262r6486l1689
16399A6571228Q7884K69393M71642O24872O90595O90622O78094O88032P21071
$$ y = [10389615, 8422607, 6275882, 4116848, 2095255, 327377, -1103452, -2137695, -2745195, -2953747, -2864162, -2619251, -2354792, -2176014, -2154000, -2310735, -2589966, -2847088, -2892082, -2580013, -1897851, -987949, -86464, 586240, 912510, 899061, 646975, 301977, 1202, -167707, -173671, -18174, 291739, 755691, 1376203, 2138785, 2986397, 3815176, 4504621, 4964307, 5174043, 5203074, 5192954, 5304987, 5660722, 6301113, 7174041, 8156253, 9101806, 9889048, 10446501, 10764722, 10904689, 10990404, 11170073, 11562314, 12218333, 13107346, 14121918, 15111001, 15936079, 16518158, 16847778, 16964613, 16932807, 16823665, 16699403, 16602917, 16571228, 16659112, 16928505, 17400147, 18025019, 18715614, 19406236, 20084330, 20772362, 21493433]
16390B1493433P73392Q64767J014385J179861J226870R90172M11980l68415j096259
16381B6490186j591974j854236j996954k131147k304120k496357k642193k662279
16373H810926k499186k147920j670192j172796p53324m57445k85222k28794k92423
16364f96376m74898p40015j010259j195631j237443j131322r16321o52137m05448
16355h459850k35595j67763j75632k01367j97749j51219p0532M2142K09937M63217
16345h944411P90467J112659J323925J362404J241689J028531Q01607O20176N11306
16336a51647M71962M80242N08358N31168N34919N23841N08591M81891M14213K81856
16326D585394R6610r3421k28442k68212k13238j04005J941O3231P9377Q8828J38979
$$ y = [21493433, 22266825, 23131592, 24145977, 25325838, 26552708, 27542880, 27954860, 27586445, 26490186, 24898212, 23043976, 21047022, 18915875, 16611755, 14115398, 11473205, 8810926, 6311740, 4163820, 2493628, 1320832, 567508, 110063, -175159, -403953, -696376, -1171274, -1911289, -2921548, -4117179, -5354622, -6485944, -7402265, -8054402, -8459850, -8695445, -8863208, -9038840, -9240207, -9437956, -9589175, -9659707, -9617565, -9407628, -8944411, -8153944, -7041285, -5717360, -4354956, -3113267, -2084736, -1283129, -662953, -151647, 320315, 800557, 1308915, 1840083, 2375002, 2898843, 3407434, 3889325, 4303538, 4585394, 4682004, 4588583, 4360141, 4091929, 3878691, 3774686, 3776627, 3839858, 3919235, 4008063, 4147042]
16315D147042K51789M13122N89025P46337Q55844Q84215Q02004O11206L55864
16306I656448R5892j21521k64224l10205k56278j34203k1564l2051k69510p60467
16296G582317j413800k049016k490563k669986k653323k565821k484116k392620
16288a1136928k223069j916983j456250q60065j77166N08939J082223J434984
16280a4744315J527222J406501J168874Q99766O45764M30321K81048K32764L03814
16271g848241M73518O85963Q76722J001160J045982J021957R50062Q47696P16201
16262b28980N40527L09468M1284k09953l74847m05649l04547j18287R4592K96429
16252c59963M82444O61969Q24152R26841R22293P92107N62046K94889P0415m5191
$$ y = [4147042, 4398831, 4811953, 5400978, 6147315, 7003159, 7887374, 8689378, 9300584, 9656448, 9752340, 9630819, 9366595, 9056390, 8800112, 8665909, 8644345, 8612294, 8342784, 7582317, 6168517, 4119501, 1628938, -1041048, -3694371, -6260192, -8744308, -11136928, -13359997, -15276980, -16733230, -17593295, -17770461, -17261522, -16179299, -14744315, -13217093, -11810592, -10641718, -9741952, -9096188, -8665867, -8384819, -8152055, -7848241, -7374723, -6688760, -5812038, -4810878, -3764896, -2742939, -1792877, -945181, -228980, 311547, 621015, 662299, 452346, 77499, -328150, -632697, -750984, -656392, -359963, 122481, 784450, 1608602, 2535443, 3457736, 4249843, 4811889, 5106778, 5177193, 5132002]
16242E132002l2212O6461J56598J31283p1475m27841q42564j202869j422135j455740
16232C1508j304630j014657o61595l17980k1534K31896M72660P35184J037749
16223h11399J366792J670227J868665J892174J723663J411418J044013P11832
16215A0877385M75107L48819L10356L20930L43105L49626L24929K55586J20990
16206A3726833r2443l63860o34514q35090r18055q80364p76319p04684p54907
16197G766597r45357j212968j460826j608507j607308j438262j115468o84920
16189b307019k08649K53709O54542R61653J159977J249396J236981J131392R47618
16180E079600P16146M80742K82476J50941J13655J97999M05913O85247R36213
$$ y = [5132002, 5099790, 5166251, 5322849, 5454132, 5382657, 4954816, 4112252, 2909383, 1487248, 31508, -1273122, -2287779, -2949374, -3267354, -3288888, -3056992, -2584332, -1849148, -811399, 555393, 2225620, 4094285, 5986459, 7710122, 9121540, 10165553, 10877385, 11352492, 11701311, 12011667, 12332597, 12675702, 13025328, 13350257, 13605843, 13726833, 13634390, 13270530, 12636016, 11800926, 10882871, 10002507, 9226188, 8521504, 7766597, 6821240, 5608272, 4147446, 2538939, 931631, -506631, -1622099, -2307019, -2515668, -2261959, -1607417, -645764, 514213, 1763609, 3000590, 4131982, 5079600, 5795746, 6276488, 6558964, 6709905, 6823560, 7021559, 7427472, 8112719, 9048932]
16171I048932J062989J035844R06697P59411O38074N10563K92161q7401o15385
16162A3551885j172778j589911j754009j676014j460199j219027j008717q17269
16154B853961n95906l10302K4476L52784O15760P79114Q41795Q36008Q07600P75927
16144F981217P19948O19480M98176M06346L72482L90131M38791M91773N05091
16135A1423435M24050K21816o0954l17403m25616l11116K5507N20183J070672
16126A2570574J560941J885186J972772J810305J446850R68123M55260l4888m59134
16117B2175989p77563r66068j036463j038122j038174j092323j216235j371935
16109A3639106j484933j490684j383226j225493j110918j111952j249692j488326
$$ y = [9048932, 10111921, 11147765, 12054462, 12813873, 13451947, 13962510, 14254671, 14167270, 13551885, 12379107, 10789196, 9035187, 7359173, 5898974, 4679947, 3671230, 2853961, 2258055, 1947753, 1972229, 2325013, 2940773, 3719887, 4561682, 5397690, 6205290, 6981217, 7701165, 8320645, 8818821, 9225167, 9597649, 9987780, 10426571, 10918344, 11423435, 11847485, 12069301, 12008347, 11690944, 11265328, 10954212, 10979719, 11499902, 12570574, 14131515, 16016701, 17989473, 19799778, 21246628, 22214751, 22670011, 22635123, 22175989, 21398426, 20432358, 19395895, 18357773, 17319599, 16227276, 15011041, 13639106, 12154173, 10663489, 9280263, 8054770, 6943852, 5831900, 4582208, 3093882]
16101C093882j749197j942859k006765j925568j723743j440111j104829p35611
16093i534801l46955M3666M13015P28693R50866J045019J002004Q48435O28332
16084d221726L66653N8982k95363o59537r65702j148200j166818j008229o81767
16075i721707k26099K83263P52151J114936J371731J569668J739921J857699J863534
16066F05097J716048J427636J064518P19693M73252L56135L37221L43557L01866
16057G345023J78026j032j54072j89166o2569J91968M81369O98250P60586O28527
16047I876910L07014j49617o37574j031097j235392j225170j042403p71559n09583
16038C581529l24813k20961j45274l8039J28689L49183N93227Q08790R34191R26637
$$ y = [3093882, 1344685, -598174, -2604939, -4530507, -6254250, -7694361, -8799190, -9534801, -9881756, -9838090, -9425075, -8696382, -7745516, -6700497, -5698493, -4850058, -4221726, -3855073, -3796091, -4091454, -4750991, -5716693, -6864893, -8031711, -9039940, -9721707, -9947806, -9664543, -8912392, -7797456, -6425725, -4856057, -3116136, -1258437, 605097, 2321145, 3748781, 4813299, 5532992, 6006244, 6362379, 6699600, 7043157, 7345023, 7523049, 7522017, 7367945, 7178779, 7116210, 7308178, 7789547, 8487797, 9248383, 9876910, 10183924, 10034307, 9396733, 8365636, 7130244, 5905074, 4862671, 4091112, 3581529, 3256716, 3035755, 2890481, 2852442, 2981131, 3330314, 3923541, 4732331, 5666522, 6593159]
16028F593159P83656N34916K16419j39978m95711p99854j004531j087800j060427
16019C539849r48750p73543n49156k98839o0820J25295K38376K84323K90159K92357
16009B139251L25218M13068N67335P79117J008722J195955J295546J303608J249677
16000A0277497J167682J072917R55093P82091N15080J39911l04386p33051j060312
15991A2812522j247072j321582j360266j429248j521764j551565j419843j102959
15983A858223o87582l22409j22458r9257j68361k21619j99624j12961j8163K1009
15973g3202k7727j38115k33865k37288j21362P1243K47956L16206K35719K9230
15963F8795k54751n79256r15347j213081j391858j368814j104406o32565n8313
$$ y = [6593159, 7376815, 7911731, 8128150, 7988172, 7492461, 6692607, 5688076, 4600276, 3539849, 2591099, 1817556, 1268400, 969561, 908741, 1034036, 1272412, 1556735, 1846894, 2139251, 2464469, 2877537, 3444872, 4223989, 5232711, 6428666, 7724212, 9027820, 10277497, 11445179, 12518096, 13473189, 14255280, 14770360, 14910271, 14605885, 13872834, 12812522, 11565450, 10243868, 8883602, 7454354, 5932590, 4381025, 2961182, 1858223, 1170641, 848232, 725774, 626517, 458156, 236537, 36913, -76048, -94211, -73202, -100929, -239044, -472909, -710197, -831559, -760316, -512360, -196154, 39565, 68795, -185956, -765212, -1680559, -2893640, -4285498, -5654312, -6758718, -7391283, -7449596]
15954g449596M75857Q44643R93793R54238Q00406N95941L79156J86145O8465P6138
15944b074814K19803M50743O81117Q31354Q67494Q04972O91839N88517N42354
15935C603379N60947O06764O23811N69605M22262J70618j89588o45883j151059
15926D570856j615334j928275k005620j830924j463701j010569n79118k36692
15918f099377J3717K26893M68432P55618J036825J220538J218827R77638N03016
15909C22127j13248p04487j093875j167771r11943m08890J93697P31933J072871
15900b079586J153571J006327P40289M71821K57033Q2788r1504k90688n09381
15891G40670p19970q85873r76034r80363r13197q00211o67916n43978m52918m01773
$$ y = [-7449596, -6973739, -6129096, -5135303, -4181065, -3380659, -2784718, -2405562, -2219417, -2150952, -2074814, -1855011, -1404268, -723151, 108203, 975697, 1780669, 2472508, 3061025, 3603379, 4164326, 4771090, 5394901, 5964506, 6386768, 6557386, 6367798, 5721915, 4570856, 2955522, 1027247, -978373, -2809297, -4272998, -5283567, -5862685, -6099377, -6085660, -5858767, -5390335, -4634717, -3597892, -2377354, -1158527, -180889, 322127, 208879, -495608, -1589483, -2757254, -3669197, -4078087, -3884390, -3152457, -2079586, -926015, 80312, 820601, 1292422, 1549455, 1632243, 1540739, 1250051, 740670, 20700, -865173, -1841207, -2821570, -3734767, -4534978, -5202894, -5746872, -6199790, -6601563]
15881f601563l69917l18088k16894p3270P0225J60065J55539M0491j67028m02729
15871g723169n61991n45229l20705M9642M47260P64268R46159R89625R17268P57244
15861d279628N36234K83385L9389j48309k55859l09906l72778m94018o74949q74498
15851f550937j041194j143357j184004j195844j213602j238520j228664j130531
15843a5926653r29026o74663m61093l64471l91904m79101n31123m68401k53309
15834b0479744J02315N44686R97750J380361J614378J643122J465647J152334
15826a1579151Q13183N36347L47559K27769J65134J75515K68840M11756N39983
15817h093065O11617O45149P01582Q32919J049750J317819J559170J664415J537936
$$ y = [-6601563, -6971480, -7289568, -7506462, -7579732, -7509507, -7349442, -7193903, -7153412, -7320440, -7723169, -8285160, -8830389, -9151094, -9101452, -8654192, -7889924, -6943765, -5954140, -5036872, -4279628, -3743394, -3460009, -3420620, -3568929, -3824788, -4134694, -4507472, -5001490, -5676439, -6550937, -7592131, -8735488, -9919492, -11115336, -12328938, -13567458, -14796122, -15926653, -16855679, -17530342, -17991435, -18355906, -18747810, -19226911, -19758034, -20226435, -20479744, -20377429, -19832743, -18834993, -17454632, -15840254, -14197132, -12731485, -11579151, -10765968, -10229621, -9882062, -9654293, -9489159, -9313644, -9044804, -8633048, -8093065, -7481448, -6836299, -6134717, -5301798, -4252048, -2934229, -1375059, 289356, 1827292]
15808A827292J150331N54996j28451p39617j115509j150130q49207l35115K12698
15799e72712O42194Q80324R36341Q78413P96689P62321Q04846R19668J091801
15790G139885J310354J558272J795304J966919K033084J981931J817912J543429
15782B1147090J156546O70288J25842m31618r92315j579131k195762k781318l216200
15773A1903422l377599l209222k754975k130006j453951q00373j96028L45850
15765a672882Q01246J140774J345534J408522J325712J097196P40312K97095j73927
15756F309582o16079r90082j276194j463128j535552j475205j276604r57907n52493
15747c833662r5354L76437Q17132J180994J447048J636033J795559J958162K109035
$$ y = [1827292, 2977623, 3532619, 3404168, 2664551, 1549042, 398912, -450295, -785410, -572712, 69482, 949806, 1886147, 2764560, 3561249, 4323570, 5128416, 6048084, 7139885, 8450239, 10008511, 11803815, 13770734, 15803818, 17785749, 19603661, 21147090, 22303636, 22973924, 23099766, 22668148, 21675833, 20096702, 17900940, 15119622, 11903422, 8525823, 5316601, 2561626, 431620, -1022331, -1822704, -2018732, -1672882, -871636, 269138, 1614672, 3023194, 4348906, 5446102, 6186414, 6483509, 6309582, 5693503, 4703421, 3427227, 1964099, 428547, -1046658, -2323262, -3281169, -3833662, -3929016, -3552579, -2735447, -1554453, -107405, 1528628, 3324187, 5282349, 7391384]
15738G391384K195921K172535K035237J820958J570757J296184R86220O49575
15730B0118771L41753J37004O7061R0738J27875J19897N5326m7960j63275k58622
15720B0588568k99244k61897j50928l80J43203K53672L54518N10315P73885J132929
15710B3044641J502124J758263J786602J524283R99228L41608k62120o59635q00202
15701B9234792p25328n12887k38978L2376K57234M19009N21277N71724N73829
15692C0133048N28567M38760L14017J71573K6674j20820k92118n22631q37812
15683B9839258j219829j594369j856840j921366j757028j391756q94533l57774
15675A8845763J18089M53500O27505O89073P16851P51926P66252P01275N34259
$$ y = [7391384, 9587305, 11759840, 13795077, 15616035, 17186792, 18482976, 19469196, 20118771, 20460524, 20597528, 20664589, 20755327, 20883202, 21003099, 21058425, 21010465, 20847190, 20588568, 20289324, 20027427, 19876499, 19876119, 20019322, 20272994, 20627512, 21137827, 21911712, 23044641, 24546765, 26305028, 28091630, 29615913, 30615141, 30956749, 30694629, 30034994, 29234792, 28509464, 27996577, 27757599, 27789975, 28047209, 28466218, 28987495, 29559219, 30133048, 30661615, 31100375, 31414392, 31585965, 31612639, 31491819, 31199701, 30677070, 29839258, 28619429, 27025060, 25168220, 23246854, 21489826, 20098070, 19203537, 18845763, 18963852, 19417352, 20044857, 20733930, 21450781, 22202707, 22968959, 23670234, 24204493]
15666B4204493L00068N6631j53631l08612l90744l80778k71832q6148J26664L06345
15656B3402456M04314M12398L82958M10678N71865Q62669J193280J449148J564332
15647C0654098J542978J421757J225161R59812O38156K94533k5082k92116n13911
15638C5905386p16556r09508j073144j179153j215720j189771j112031r92670
15630B7516833q51824p17009o00324m88081l59302k08633n1987P8882J42354R8497
15620B4559406o2419k90119m87290n73917n44585m57364l66599k74727j46706
15611B1355680N0311L27944O71516J037058J367928J629649J821500J949495J997712
15602C2208793J929423J712543J346115Q66972L34709j86652o37577r73319j182248
$$ y = [24204493, 24504561, 24561192, 24407561, 24098949, 23708205, 23327427, 23055595, 22969447, 23096111, 23402456, 23806770, 24219168, 24602126, 25012804, 25584669, 26447338, 27640618, 29089766, 30654098, 32197076, 33618833, 34843994, 35803806, 36441962, 36736495, 36711413, 36419297, 35905386, 35188830, 34279322, 33206178, 32027025, 30811305, 29621534, 28509503, 27516833, 26665009, 25948000, 25347676, 24859595, 24500293, 24291660, 24239673, 24318555, 24460909, 24559406, 24496987, 24206868, 23719578, 23145661, 22601076, 22143712, 21777113, 21502386, 21355680, 21405991, 21733935, 22405451, 23442509, 24810437, 26440086, 28261586, 30211081, 32208793, 34138216, 35850759, 37196874, 38063846, 38398555, 38211903, 37574326, 36601007, 35418759]
15593C5418759j287597j315947j265773j117719q76653n98149l70303k68008l13002
15584B8005608m52922n71362n44155l14928P0591M93468Q21029R61549R03311
15575B9372189P28584N85160O18124Q98479J393253J989791K544469K922260L026069
15566D4078378K822511K350887J703776R90337L06596k74702p03156r48154r94483
15557D9331990q42871n23229j06172L08101O25615P99880Q47754Q24929P80513
15548E2046510P24360O30097M73943K75106R5913M788L7446J77765L64890N24610
15538E5355428O03954N86951M95310L80901K97862K59928K24491J27419o2662
15529E8269582l21961n93468q20278r60939r91281r06943p26725m87730k31287
$$ y = [35418759, 34131162, 32815215, 31549442, 30431723, 29555070, 28956921, 28586618, 28318610, 28005608, 27552686, 26981324, 26437169, 26122241, 26192832, 26686300, 27507329, 28468878, 29372189, 30100773, 30685933, 31304057, 32202536, 33595789, 35585580, 38130049, 41052309, 44078378, 46900889, 49251776, 50955552, 51945889, 52252485, 51977783, 51274627, 50326473, 49331990, 48489119, 47965890, 47859718, 48167819, 48793434, 49593314, 50441068, 51265997, 52046510, 52770870, 53400967, 53874910, 54150016, 54245929, 54250717, 54288163, 54465928, 54830818, 55355428, 55959382, 56546333, 57041643, 57422544, 57720406, 57980334, 58204825, 58332244, 58269582, 57947621, 57354153, 56533875, 55572936, 54581655, 53674712, 52947987, 52460257, 52228970]
15520E2228970J0713K22044L95003N08154N16823L84515J26710j82009m40794
15511E3770129n65384n17849l16755l1129K38804L93116L68458J63604j61299
15502E3341695n15167q20857j046912j203471j306213j344871j290923j133974
15494D4679307r06218o71609m94023m12496m28741n03174n70404n77525n21645
15485C9593472m52400m33009m96110o26621p70235q61967q68422q13551p53256
15476C3517901p11800o47153m87692j98246J90913O02523R46168J150956J195367
15467C5558937J115847R77725Q30673O89494N53277M34484L60309L49820M05543
15458D1276109N28430P24904R89864J284576J536158J670483J659637J544777
$$ y = [52228970, 52239683, 52461727, 52856730, 53364884, 53881707, 54266222, 54392932, 54210923, 53770129, 53204745, 52686896, 52370141, 52339012, 52577816, 52970932, 53339390, 53502994, 53341695, 52826528, 52005671, 50958759, 49755288, 48449075, 47104204, 45813281, 44679307, 43773089, 43101480, 42607457, 42194961, 41766220, 41263046, 40692642, 40115117, 39593472, 39141072, 38708063, 38211953, 37585332, 36815097, 35953130, 35084708, 34271157, 33517901, 32806101, 32158948, 31671256, 31473010, 31663923, 32266446, 33212614, 34363570, 35558937, 36674784, 37652509, 38483182, 39172676, 39725953, 40160437, 40520746, 40870566, 41276109, 41804539, 42529443, 43519307, 44803883, 46340041, 48010524, 49670161, 51214938]
15450E1214938J416365J365474J429333J563594J672175J678764J581012J448298
15442F3369953J370315J393248J487438J565415J531970J335692R98491O10803
15434G3663325K91687J27612J21718J91262K21512J35460o9301l27063n41381
15425G3814831o39335o10379m98677l65174k57288j94449j63306j28721n8447
15416G0899055N9304K15177L86729N51501P02810Q52857J010253J151206J221843
15407G7050735J170354R70849O27312J72115l38113q35245j258969j571452j758929
15398G4228657j825399j787196j668241j494342j288592j067115q35204n89483
15390F3673085l25261m1018K57580N47247P84075R24329R51762Q80795P39041
$$ y = [51214938, 52631303, 53996777, 55426110, 56989704, 58661879, 60340643, 61921655, 63369953, 64740268, 66133516, 67620954, 69186369, 70718339, 72054031, 73052522, 73663325, 73955012, 74082624, 74204342, 74395604, 74617116, 74752576, 74683275, 74356212, 73814831, 73175496, 72565117, 72066440, 71701266, 71443978, 71249529, 71086223, 70957502, 70899055, 70958359, 71173536, 71560265, 72111766, 72814576, 73667433, 74677686, 75828892, 77050735, 78221089, 79191938, 79819250, 79991365, 79653252, 78818007, 77559038, 75987586, 74228657, 72403258, 70616062, 68947821, 67453479, 66164887, 65097772, 64262568, 63673085, 63347824, 63306806, 63564386, 64111633, 64895708, 65820037, 66771799, 67652594, 68391635]
15381F8391635N55982L63152J90349N6834k8193n8646l6707J6523P3067J32063
15371F9656059K38453M62062Q50103J383424J968658K484438K858271L113746
15363H3015214L349216L670316M133381M737405N454459O261635P150205Q113091
15355A25884922R127727J0143505J1065123J1734408J1931772J1405645R929589
15348B01222691P400856L962720N3987l704942o746997q762639r754892r945335
15340A73725449r617952q997797q213554p328160o384254n421044m462013l500902
15332A19799773k505530j442045l03635Q79494K050277L141306M099193M920751
15324A30639584N678317O500771P509311Q750940J0174529J1648798J2987194
$$ y = [68391635, 68947617, 69310769, 69501118, 69557952, 69529759, 69471113, 69434406, 69450929, 69523996, 69656059, 69894512, 70356574, 71206677, 72590101, 74558759, 77043197, 79901468, 83015214, 86364430, 90034746, 94168127, 98905532, 104359991, 110621626, 117771831, 125884922, 135012649, 145156154, 156221277, 167955685, 179887457, 191293102, 201222691, 208623547, 212586267, 212640254, 208935312, 202188315, 193425676, 183670784, 173725449, 164107497, 155109700, 146896146, 139567986, 133183732, 127762688, 123300675, 119799773, 117294243, 115852198, 115548563, 116428057, 118478334, 121619640, 125718833, 130639584, 136317901, 142818672, 150327983, 159078923, 169253452, 180902250, 193889444]
15317A93889444J3959418J4301273J3746790J2103945R373798N852752K111412
15310B65338832j191512l557534m797294n008495m438607l346377j947563m44292
15302B40607158R30342J909985K238216J733213L57111j728177m159153o458647
15294B35430048q190579r106706r212922q724228p940949p123640o422988n867316
15286A72840720n388420m874159m232307l434619k520184j565434o35860K61136
15278A50450873J186470K224879L422949M764560O191367P628650Q990501J0184331
15270A95044580J1133520J1791922J2119383J2033418J1384586R996927P780212
15263B71284548M866147J667153j231963l318750m372614m511349m063839l385638
$$ y = [193889444, 207848862, 222150135, 235896925, 248000870, 257374668, 263227420, 265338832, 264147320, 260589786, 255792492, 250783997, 246345390, 242999013, 241051450, 240607158, 241537500, 243447485, 245685701, 247418914, 247776025, 246047848, 241888695, 235430048, 227239469, 218132763, 208919841, 200195613, 192254664, 185131024, 178708036, 172840720, 167452300, 162578141, 158345834, 154911215, 152391031, 150825597, 150189737, 150450873, 151637343, 153862222, 157285171, 162049731, 168241098, 175869748, 184860249, 195044580, 206178100, 217970022, 230089405, 242122823, 253507409, 263504336, 271284548, 276150695, 277817848, 276585885, 273267135, 268894521, 264383172, 260319333, 256933695]
15255B56933695k737670k272145k077039k200246k623837l225060l786877m079439
15247B33931382l959101l416730k568693j627525q65740n58696r04921j946540
15239B18083436l522370n287379o819306p781905q056132p754409p115291o363652
15231A65382992n621309m889307m086949l127160j985024p05926O43482K015957
15223A47626756L374069M654670N749397O508846O755746O311424N051606K981760
15215A89014274K90892k662675n446805p689454r177119r869412r843133r223261
15207A35393307q150414o787538n322438l928840k714641j721336r75826n23476
15199A05268798m01044n88019r93467j488117j948204k285406k462068k492867
$$ y = [256933695, 254196025, 251923880, 249846841, 247646595, 245022758, 241797698, 238010821, 233931382, 229972281, 226555551, 223986858, 222359333, 221493593, 220934897, 220029976, 218083436, 214561066, 209273687, 202454381, 194672476, 186616344, 178861935, 171746644, 165382992, 159761683, 154872376, 150785427, 147658267, 145673243, 144967317, 145610799, 147626756, 151000825, 155655495, 161404892, 167913738, 174669484, 180980908, 186032514, 189014274, 189305166, 186642491, 181195686, 173506232, 164329113, 154459701, 144616568, 135393307, 127242893, 120455355, 115132917, 111204077, 108489436, 106768100, 105792274, 105268798, 104867754, 104279735, 103286268, 101798151, 99849947, 97564541, 95102473, 92609606]
15191I2609606k431922k346667k283951k245886k193912k079140j874185j580997
15183G5572946j217810q06393l66025Q8327N41316R70199J350013J675718J980641
15174G9788932K321559K733958L200427L663027M067938M407765M731305N117225
15166A10032136N635087O312580P108637P899419Q500200Q721202Q419829P525623
15158A70154713O052225M109679J894816l62022k468384m310743n842421p040214
15150A62187649p875938q321962q374296q075074p516099o811665o064403n353609
15142A03794603m734509m230956l833365l510384l224272k945181k663645k388333
15134G6263958k123288j848651j532357j159634p39567k82529K12735P42452J275829
$$ y = [92609606, 90177684, 87831017, 85547066, 83301180, 81107268, 79028128, 77153943, 75572946, 74355136, 73548743, 73182718, 73271045, 73812361, 74782560, 76132573, 77808291, 79788932, 82110491, 84844449, 88044876, 91707903, 95775841, 100183606, 104914911, 110032136, 115667223, 121979803, 129088440, 136987859, 145488059, 154209261, 162629090, 170154713, 176206938, 180316617, 182211433, 181849411, 179381027, 175070284, 169227863, 162187649, 154311711, 145989749, 137615453, 129540379, 122024280, 115212615, 109148212, 103794603, 99060094, 94829138, 90995773, 87485389, 84261117, 81315936, 78652291, 76263958, 74140670, 72292019, 70759662, 69600028, 68860461, 68577932, 68790667, 69533119, 70808948]
15125G0808948J749873K083220K209281K113898J843584J474411J075450O99771
15117H4058436L93189J95490J32318K03284L69916N61659P10892P91487Q28432
15108H8245103Q77675R94298J199452J454927J665805J724804J578038J267534
15100I9007636R17427O66725N90190O62196P85090Q55087Q20603P01891N64456
15091A05571301M67208M28097M32006M59862N08643N95983P43385R40823J135109
15082A11282417J266797J315435J311147J314957J384661J542181J767150K023167
15074A23207912K284821K542488K798581L062830L336983L598256L802666L905366
15066A48539903L877894L716718L449994L137565K853573K660038K592946K669378
$$ y = [70808948, 72558821, 74642041, 76851322, 78965220, 80808804, 82283215, 83358665, 84058436, 84451625, 84647115, 84779433, 84982717, 85352633, 85914292, 86625184, 87416671, 88245103, 89122778, 90117076, 91316528, 92771455, 94437260, 96162064, 97740102, 99007636, 99925063, 100591788, 101181978, 101844174, 102629264, 103484351, 104304954, 105006845, 105571301, 106038509, 106466606, 106898612, 107358474, 107867117, 108463100, 109206485, 110147308, 111282417, 112549214, 113864649, 115175796, 116490753, 117875414, 119417595, 121184745, 123207912, 125492733, 128035221, 130833802, 133896632, 137233615, 140831871, 144634537, 148539903, 152417797, 156134515, 159584509, 162722074, 165575647, 168235685, 170828631, 173498009]
15058A73498009K901083L293768L835784M502205N275360O146983P092263Q059843
15050B14605298R011233R966630J0988771J2111643J3283206J4358790J5128647
15043B99454218J5357197J4821767J3343154J0816193P262699K901116j830710
15036C62125634o362190j0162469j2903695j4531077j5214243j5218048j4774174
15029B72959738j4020741j3016893j1794987j0405835q930120p460963o082242
15022B01247957m854166l802328k917297k172131j538668r79965m32404J92801
15014A84743799R83076J984525L168218M437770N697735O938743Q255862R774748
15006B25984476J1556006J3556759J5656265J7703668J9552173K1068667K2123482
$$ y = [173498009, 176399092, 179692860, 183528644, 188030849, 193306209, 199453192, 206545455, 214605298, 223616531, 233583161, 244571932, 256683575, 269966781, 284325571, 299454218, 314811415, 329633182, 342976336, 353792529, 361055228, 363956344, 362125634, 355763444, 345600975, 332697280, 318166203, 302951960, 287733912, 272959738, 258938997, 245922104, 234127117, 223721282, 214791162, 207330199, 201247957, 196393791, 192591463, 189674166, 187502035, 185963367, 184983402, 184550998, 184743799, 185726875, 187711400, 190879618, 195317388, 201015123, 207953866, 216209728, 225984476, 237540482, 251097241, 266753506, 284457174, 304009347, 325078014, 347201496]
14999C47201496K2567915K2215374K0853264J8299224J4484224R520929L719738
14992D58862164k450724q439684j3721305j7918870k0881974k2658648k3397287
14985C49393672k3268530k2442044k1081861j9334391j7327541j5191213j3068763
14978B17679329j1092525r345173p847432o575669n482410m508501l600937k743947
14970A66482735j982562j411075j128080j190772j594776k273677l104638l929100
14962A49868055m598575n019846n166450n060616m748593m283869l725098l142204
14954A14122804k609752k179037j853900j596403j352691j077013p50961l96523
14946A02306524o6776J89813L66202N03370O59254Q68454J133267J450269J834705
$$ y = [347201496, 369769411, 391984785, 412838049, 431137273, 445621497, 455142426, 458862164, 456411440, 447971756, 434250451, 416331581, 395449607, 372790959, 349393672, 326125142, 303683098, 282601237, 263266846, 245939305, 230748092, 217679329, 206586804, 197241631, 189394199, 182818530, 177336120, 172827619, 169226682, 166482735, 164500173, 163089098, 161961018, 160770246, 159175470, 156901793, 153797155, 149868055, 145269480, 140249634, 135083184, 130022568, 125273975, 120990106, 117265008, 114122804, 111513052, 109334015, 107480115, 105883712, 104531021, 103454008, 102703047, 102306524, 102239748, 102429561, 102795763, 103299133, 103958387, 104826841, 105960108, 107410377, 109245082]
14937A09245082K313776K900202L575461M298427N028454N732114O365827O870482
14929A46329825P201606P367411P434886P493497P597643P728360P810208P775610
14921B06739046P619259P392559P151975O915175O647548O266516N661769M735449
14913B59129296L445840J834460K8829j784726l414409m714183n601479o039073
14905B42884555o007782n500056m543562l231869j727056k27635J062713J940158
14897B24649466K208866J729596M93902j330734l435312n481161p213877q505457
14889B03115289r331188r728086r760149r497804r009125q352577p568910o680625
14881A33186825n704269m668476l625658k653888j847903j292272j021069r91674
$$ y = [109245082, 111558858, 114459060, 118034521, 122332948, 127361402, 133093516, 139459343, 146329825, 153531431, 160898842, 168333728, 175827225, 183424868, 191153228, 198963436, 206739046, 214358305, 221750864, 228902839, 235818014, 242465562, 248732078, 254393847, 259129296, 262575136, 264409596, 264438425, 262653699, 259239290, 254525107, 248923628, 242884555, 236876773, 231376717, 226833155, 223601286, 221874230, 221646595, 222709308, 224649466, 226858332, 228587928, 229081830, 227751096, 224315784, 218834623, 211620746, 203115289, 193784101, 184056015, 174295866, 164798062, 155788937, 147436360, 139867450, 133186825, 127482556, 122814080, 119188422, 116534534, 114686631, 113394359, 112373290, 111381616]
14873A11381616j102984j255225j404726j565084j760563j984084k191459k318803
14865I7798688k308457k137252j825545j412409r22044l59050K64118R00537J471156
14856I1469742J892154K108409K116498J960844J696802J346093Q90441L15025
14848A03796008l51506j051967j742282k397081k982647l453353l780425l964111
14840H4072636m011439l919772l693877l366957k988543k592716k183469j745874
14832E9569989j271132p84241l54052o6269K7934n0007k10926l44351l76915l10932
14822E5829098k19775j95539k84539m62258o61006q18279r06543r30361r08806
14813E0441992q70613q60113r23489j068434j238974j345981j332629j210824
$$ y = [111381616, 110278632, 109023407, 107618681, 106053597, 104293034, 102308950, 100117491, 97798688, 95490231, 93352979, 91527434, 90115025, 89192981, 88833931, 89098049, 89998586, 91469742, 93361896, 95470305, 97586803, 99547647, 101244449, 102590542, 103480983, 103796008, 103444502, 102392535, 100650253, 98253172, 95270525, 91817172, 88036747, 84072636, 80061197, 76141425, 72447548, 69080591, 66092048, 63499332, 61315863, 59569989, 58298857, 57514616, 57160564, 57094295, 57122229, 57072222, 56861296, 56516945, 56140030, 55829098, 55609323, 55413784, 55129245, 54666987, 54005981, 53187702, 52281159, 51350798, 50441992, 49571379, 48711266, 47787777, 46719343, 45480369, 44134388, 42801759, 41590935]
14805D1590935j037206q64820p28243o66043p28305r41857j271120j621455j882576
14796C1849310j977760j893569j673682j375913j030749o42506k20051K06039
14788B3241119N93111R04296J116842J218933J205670J087481R05038P24040O01652
14779C1598182N49909N25809M60188L09961R1403j37972l28636m63791n37822
14770C2067231n30459m17599k01375P7778L51130N38431N74256M49759K35525
14761C3144677M2175n8127p5501p5060j11158j82139k37395k26139j50260p4525
14751C1996548p4237j62575k71829l10159k34767p1538J27156L33342N50455P83967
14741C2666363J022254J243634J428501J563778J643630J666859J631251J534298
$$ y = [41590935, 40553729, 39688909, 38960666, 38294623, 37566318, 36624461, 35353341, 33731886, 31849310, 29871550, 27977981, 26304299, 24928386, 23897637, 23255131, 23035080, 23241119, 23834230, 24738526, 25855368, 27074301, 28279971, 29367452, 30272490, 30996530, 31598182, 32148091, 32673900, 33134088, 33444049, 33535452, 33397480, 33068844, 32605053, 32067231, 31536772, 31119173, 30917798, 30995576, 31346706, 31885137, 32459393, 32909152, 33144677, 33186852, 33128725, 33053224, 32978164, 32867006, 32684867, 32447472, 32221333, 32071073, 31996548, 31922311, 31759736, 31487907, 31177748, 30942981, 30871443, 30998599, 31331941, 31882396, 32666363, 33688617, 34932251, 36360752, 37924530, 39568160, 41235019, 42866270, 44400568]
14733D4400568J383463J203635J034272R24308R25092J069577J344382J679435
14725E3964732J968991K115812K075758J876252J591025J287023R89310O82283
14717F6551186L26655j14437o36071j166897j597539j847939j907865j816583
14709E7790510j619547j347777j022966o71712l37512p7673O4858R6203P1516
14700E2945900M9284M7085M3323Q032p6676k13549l92777n93303p83070r27549
14690E0106700j008450j029719r94944q84968o74269l69596j7541L25679O20391
14681D6073283Q47350J003635J098116J145580J161586J159882J151710J147579
14673E4788721J164723J233272J384480J625126J925542K234659K503916K700486
$$ y = [44400568, 45784031, 46987666, 48021938, 48946246, 49871338, 50940915, 52285297, 53964732, 55933723, 58049535, 60125293, 62001545, 63592570, 64879593, 65868903, 66551186, 66877841, 66763404, 66127333, 64960436, 63362897, 61514958, 59607093, 57790510, 56170963, 54823186, 53800220, 53128508, 52790996, 52713323, 52778181, 52874384, 52945900, 52995184, 53042269, 53085592, 53093624, 53016948, 52803399, 52410622, 51817319, 51034249, 50106700, 49098250, 48068531, 47073587, 46188619, 45514350, 45144754, 45127213, 45452892, 46073283, 46920633, 47924268, 49022384, 50167964, 51329550, 52489432, 53641142, 54788721, 55953444, 57186716, 58571196, 60196322, 62121864, 64356523, 66860439, 69560925]
14665F9560925K814271K869222K927209L065051L334679L740456M247917M803336
14657I7363066N346450N823206O202093O479428O662995O742516O667816O354635
14649A47642205N720379M730398L426591J921876L66348j097330k372099l424587
14641A56913781m275583m963857n503439n869674o020139n917837n543417m912138
14633A13907697m091282l192401k327564j555589q68552k32662L63203R00330
14625A02903180J361807J761856K141024K533113K934744L299280L553501L627707
14617A24116212L481223L098372K463152J558106M02275r17285k260931l486409
14609A28454715m497907n266116n810889o166713o360640o409914o327889o131441
$$ y = [69560925, 72375196, 75244418, 78171627, 81236678, 84571357, 88311813, 92559730, 97363066, 102709516, 108532722, 114734815, 121214243, 127877238, 134619754, 141287570, 147642205, 153362584, 158092982, 161519573, 163441449, 163807797, 162710467, 160338368, 156913781, 152638198, 147674341, 142170902, 136301228, 130281089, 124363252, 118819835, 113907697, 109816415, 106624014, 104296450, 102740861, 101872309, 101639647, 102002850, 102903180, 104264987, 106026843, 108167867, 110700980, 113635724, 116935004, 120488505, 124116212, 127597435, 130695807, 133158959, 134717065, 135119340, 134202055, 131941124, 128454715, 123956808, 118690692, 112879803, 106713090, 100352450, 93942536, 87614647, 81483206]
14601H1483206n845803n500610n122083m730204m333973l920872l457802k911474
14593D5660385k268788j543370p79748n7288N28187R06110J059701J017701Q29489
14584D5352379N49972K29360r9974m22456p13980r16937r48936p50545l37690
14575D1941193J89197O90361J050800J220735J211406J057059P86351M34888O9617
14566D8651607k25005l89141m09070l11778j61389n2428p1480k41867n00192p25642
14556D5563615p98669o50988k86179K27241P81506J267233J612285J804811J886385
14547E1407240J917495J937287J947595J934844J907732J910759K002971K228324
14539F7194247K597718L084414L633474M178166M654616N019311N263363N401369
$$ y = [81483206, 75637403, 70136793, 65014710, 60284506, 55950533, 52029661, 48571859, 45660385, 43391597, 41848227, 41068479, 41011191, 41539378, 42445488, 43505189, 44522890, 45352379, 45902351, 46131711, 46031737, 45609281, 44895301, 43978364, 43029428, 42278883, 41941193, 42130390, 42820751, 43871551, 45092286, 46303692, 47360751, 48147102, 48581990, 48651607, 48426602, 48037461, 47628391, 47316613, 47155224, 47102796, 47031316, 46789449, 46289257, 45563615, 44764946, 44113958, 43827779, 44055020, 44836526, 46103759, 47716044, 49520855, 51407240, 53324735, 55262022, 57209617, 59144461, 61052193, 62962952, 64965923, 67194247, 69791965, 72876379, 76509853, 80688019, 85342635, 90361946, 95625309, 101026678]
14531A01026678N438461N346291N062379M507529L622894K419421J001976m61156
14523A27964473j801347k899749l705661m225645m490493m523168m333518l938703
14515I8046189l384412k743280k091409j486659r64134n40558k15439K8474K16552
14506H6865324L66345M74869N18887M71036L21490Q4016k21278n86208j013592
14497H7280889j507448k063573k653366l210483l643255l871938l867590l666339
14489F2796897l344735k979640k631887k347679k148396k020786j935064j875297
14481D3513413j847330j861410j913163j980613k034542k046450j986581j823524
14473B8019800j537013j139340o87750k65623O1837K70881L57746L13872J40835
$$ y = [101026678, 106465139, 111811430, 116873809, 121381338, 125004232, 127423653, 128425629, 127964473, 126163126, 123263377, 119557716, 115332071, 110841578, 106318410, 101984892, 98046189, 94661777, 91918497, 89827088, 88340429, 87376295, 86835737, 86620298, 86648772, 86865324, 87231669, 87706538, 88225425, 88696461, 89017951, 89101967, 88880689, 88294481, 87280889, 85773441, 83709868, 81056502, 77846019, 74202764, 70330826, 66463236, 62796897, 59452162, 56472522, 53840635, 51492956, 49344560, 47323774, 45388710, 43513413, 41666083, 39804673, 37891510, 35910897, 33876355, 31829905, 29843324, 28019800, 26482787, 25343447, 24655697, 24390074, 24451911, 24722792, 25080538, 25394410, 25535245]
14464B5535245j13017l44056m35069l19580j9573L65417P05953R07941R62839
14455B7246100R34630Q85332Q15639O75367M14014J8791m76861j004219j476395
14446B8032398j804365j915648j783506j449973j009346n54759j34163K47303
14438A9627941N90472Q76042J079607J206831J299903J402545J519905J612758
14430B9216004J630651J550240J382184J150016Q69006N35815J29093l74553r76671
14421C5111785j640870k291304k832182l185171l311565l197791k837800k248997
14413A3566105j499799p06984QN23298Q25361R23003Q50602O33905L02498q7317
14403A5330680m59418p51786r39106j019338r85790q20529n14983r6950L60844
$$ y = [25535245, 25422228, 25078172, 24643103, 24323523, 24303950, 24669367, 25375320, 26283261, 27246100, 28180730, 29066062, 29881701, 30557068, 30971082, 30989873, 30513012, 29508793, 28032398, 26228033, 24312385, 22528879, 21078906, 20069560, 19514801, 19380638, 19627941, 20218413, 21094455, 22174062, 23380893, 24680796, 26083341, 27603246, 29216004, 30846655, 32396895, 33779079, 34929095, 35798101, 36333916, 36463009, 36088456, 35111785, 33470915, 31179611, 28347429, 25162258, 21850693, 18652902, 15815102, 13566105, 12066306, 11359322, 11359330, 11882628, 12707989, 13630992, 14481594, 15115499, 15417997, 15330680, 14871262, 14119476, 13180370, 12161032, 11175242, 10354713, 9839730, 9742780, 10103624]
14394A0103624P64462J043658J184171J219820J192700J120880J004635Q58300
14386A8492250P24127O49385O56032P34081Q50318R54325R90343R22337P47184
14377B5720382M79878J43672k07693m73284n47072l98034j06200J83787L48437
14368B5143873L47228K26705P1729n4253j30122j54754j25605m3459P8071K12182
14358B5571595L15671L26200J79363j55143o42458j179602j629067j876536j878975
14349A9031048j675669j361996j040819p79383o03200n20684n35947o32666p62771
14340A1117913q67163r05151q60609p36460n62332l97472k95965k56394k16834
14331F019533j08522Q8160L42178O13895Q79231J107536J236074J190974R42797
$$ y = [10103624, 10868086, 11911744, 13095915, 14315735, 15508435, 16629315, 17633950, 18492250, 19216377, 19865762, 20521794, 21255875, 22106193, 23060518, 24050861, 24973198, 25720382, 26200260, 26343932, 26136239, 25662955, 25115883, 24717849, 24611649, 24795436, 25143873, 25491101, 25717806, 25789535, 25735282, 25605160, 25450406, 25324801, 25281342, 25359413, 25571595, 25887266, 26213466, 26392829, 26237686, 25595228, 24415626, 22786559, 20910023, 19031048, 17355379, 15993383, 14952564, 14173181, 13569981, 13049297, 12513350, 11880684, 11117913, 10250750, 9345599, 8484990, 7748530, 7186198, 6788726, 6492761, 6236367, 6019533, 5911011, 5999171, 6341349, 6955244, 7834475, 8942011, 10178085, 11369059, 12311856]
14322A2311856N42016J03031k48219m28789m28909l08510j64364q0362q5935j51213
14312A1060602k19927k50525k40782k29260k72302m06752o24838q75670j085515
14303F855031j187169j143756r50687o26942k17451K04126N55393P78294Q58543
14294E125382Q21423P11224N69384M21402K71456J04295j03759l64323o51009
14285F905475q90477r94158r12911o69035l43852l2306K08004L79069N18289O54424
14275D822522P90438R23297J065521J237702J446052J676085J898273K067598
14267A5927488K135495K085448J949750J776855J580669J323008R50783M56567
14259B8186063j00041o30663j067953j379686j555860j598026j519171j348252
$$ y = [12311856, 12853872, 12956903, 12708684, 12279895, 11850986, 11542476, 11378112, 11297750, 11211815, 11060602, 10840675, 10590150, 10349368, 10120108, 9847806, 9441054, 8816216, 7940546, 6855031, 5667862, 4524106, 3573419, 2946477, 2729026, 2933152, 3488545, 4266839, 5125382, 5946805, 6658029, 7227413, 7648815, 7920271, 8024566, 7920807, 7556484, 6905475, 6014998, 5020840, 4107929, 3438894, 3095042, 3062736, 3270740, 3649809, 4168098, 4822522, 5612960, 6536257, 7601778, 8839480, 10285532, 11961617, 13859890, 15927488, 18062983, 20148431, 22098181, 23875036, 25455705, 26778713, 27729496, 28186063, 28086022, 27455359, 26387406, 25007720, 23451860, 21853834, 20334663, 18986411]
14251A8986411j126725q90754o58717m44253k81639k31489l47642o20878r51860
14242A3432454j191180j221335j019434o61009k68887N4500K66874L81145M33841
14233A0206969M55314M56469M32006L74870K89268J89328Q8972l060q1998j46013
14223A2262125j99075k54756l34675m62012o52126q96904j152590j354266j452955
14214E502766j441799j353615j239758j144151j081070j029567r54362q37913
14206c579469o89404n21864l33024j24704N8853J29231Q416l03179p03952j034170
14196g093266j150681r83550n56538K5593O19855J102291J410140J551112J583044
14187c492000J576258J575313J577106J536383J396979J132017P70090L86996
$$ y = [18986411, 17859686, 16968932, 16310215, 15865962, 15584323, 15352834, 15005192, 14384314, 13432454, 12241274, 11019939, 10000505, 9339496, 9070609, 9125109, 9391983, 9773128, 10206969, 10662283, 11118752, 11550758, 11925628, 12214896, 12404224, 12493196, 12490136, 12408138, 12262125, 12063050, 11808294, 11473619, 11011607, 10359481, 9462577, 8309987, 6955721, 5502766, 4060967, 2707352, 1467594, 323443, -757627, -1787194, -2741556, -3579469, -4268873, -4790737, -5123761, -5248465, -5189612, -5060381, -5051965, -5355144, -6059096, -7093266, -8243947, -9227497, -9784035, -9758442, -9138587, -8036296, -6626156, -5075044, -3492000, -1915742, -340429, 1236677, 2773060, 4170039, 5302056, 6072146, 6459142]
14179F459142O0975j72574l26020m29502m99881n34494n32497n16043n24026n90256
14169B394824p29431r27627j131352j254638j220889j015777p06434m07492k12338
14160e211154j39186j42056j74071k30289l26546m47963n31170n03250l36434
14151h042119o5184K36427M80707N82949M87440K05808j68865n05624p07665p47379
14141h243505o49587m62799k40430k1876J85902M07071O66673R52777J208632
14132f197142J363477J372253J237541J006467P47706N24848L79077L20523L30600
14123A085350L79760M42160M87653M75064L76658K13069N6205r312O5110K72299
14113C844016N64489Q75045J128214J250035J191726R48143N56269Q4921l76798
$$ y = [6459142, 6520117, 6347543, 6021523, 5592021, 5092140, 4557646, 4025149, 3509106, 2985080, 2394824, 1665393, 737766, -393586, -1648224, -2869113, -3884890, -4591324, -4998816, -5211154, -5350340, -5492396, -5666467, -5896756, -6223302, -6671265, -7202435, -7705685, -8042119, -8107303, -7870876, -7390169, -6807220, -6319780, -6113972, -6282837, -6788461, -7496126, -8243505, -8893092, -9355891, -9596321, -9618197, -9432295, -9025224, -8358551, -7405774, -6197142, -4833665, -3461412, -2223871, -1217404, -469698, 55150, 434227, 754750, 1085350, 1465110, 1907270, 2394923, 2869987, 3246645, 3459714, 3515919, 3506607, 3571717, 3844016, 4408505, 5283550, 6411764, 7661799, 8853525, 9801668, 10357937, 10442858, 10066060]
14104A0066060p41163r54419j023237j013589j015250j087533j218117j327946
14096A684806j325908j170307q85862n33041j68271J75449M83012P38671R19799
14087h1652J012003J020322R60015Q46528P01231N56462M39303L48416K54647
14078F057275J29821k0531j51937k13325j89190j15067n3064m5779q9071j46585
14068E162547j83279j77679j10637L2959K42352M75957O85986Q37643R06647Q82466
14058H754962P82529O43443M83956K83651J2181l15642o19061p92006p75602o04704
14048G853707l84261k09376j03304k9037N3982J54611K57397L43914M02388M27218
14038H767239M16749L73039L05695K33238J74334J33384R0093J623j77764m67046
$$ y = [10066060, 9324897, 8370478, 7347241, 6333652, 5318402, 4230869, 3012752, 1684806, 358898, -811409, -1697271, -2230312, -2398583, -2223134, -1740122, -1001451, -81652, 930351, 1950673, 2910688, 3757216, 4458447, 5014909, 5454212, 5802628, 6057275, 6187096, 6166565, 6014628, 5801303, 5612113, 5497046, 5443982, 5398203, 5309132, 5162547, 4979268, 4801589, 4690952, 4723911, 4966263, 5442220, 6128206, 6965849, 7872496, 8754962, 9537491, 10180934, 10664890, 10948541, 10960722, 10645080, 10026019, 9234013, 8458411, 7853707, 7469446, 7260070, 7156766, 7127729, 7181711, 7336322, 7593719, 7937633, 8340021, 8767239, 9183988, 9557027, 9862722, 10095960, 10270294, 10403678, 10493771, 10495394, 10317630, 9850584]
14028I850584q36474j209560j494552j633954j639101j576913j517201j488258
14020a545429j471608j421764j289998j050034p16223l37433K4563L13439M93247
14011g001240N58640N32293M52048L55099K65993J94267J40065J02834R0737J26080
14001d183184K38843M46365P32264J046470J331901J549639J676168J689129J571851
13992F099446J333841J019817O92808M00910J51323q1942l15534n23291o52710
13983H124668o70086n80893m10741j79642R8239L93208O46652P87655P72638O16872
13973I598570L87556J58754l1890j81015k80681k98049k02181j460K55881N13412
13963I918897P31591Q89463R79548J011622J013644J012010J003529R49130P98231
$$ y = [9850584, 9014110, 7804550, 6309998, 4676044, 3036943, 1460030, -57171, -1545429, -3017037, -4438801, -5728799, -6778833, -7495056, -7832489, -7807926, -7494487, -7001240, -6442600, -5910307, -5458259, -5103160, -4837167, -4642900, -4502835, -4400001, -4309264, -4183184, -3944341, -3497976, -2765712, -1719242, -387341, 1162298, 2838466, 4527595, 6099446, 7433287, 8453104, 9145912, 9546822, 9698145, 9616203, 9300669, 8777378, 8124668, 7454582, 6873689, 6462948, 6283306, 6381545, 6774753, 7421405, 8209060, 8981698, 9598570, 9986126, 10144880, 10112990, 9931975, 9651294, 9353245, 9151064, 9149604, 9405485, 9918897, 10650488, 11539951, 12519499, 13531121, 14544765, 15556775, 16560304, 17509434, 18307665]
13954A8307665N27218J59392k56557o83138j099807j482647j798673k021540k138752
13945I513161k142524k026370j793865j461895j051392n82930r2189L52992O71523
13936A386511Q25115Q57566Q71486R62373J168686J466279J790654K066735K235130
13927A3630535K261853K130436J833814J381076Q13634K08105l45935p77361j055890
13918B0080267j200854j269967j327858j411712j513767j593944j619350j599003
13910H543812j576545j583769j606097j599997j537815j425787j281196j102526
13902c169920q68907n65391k01729J95055O04955J030889J486465J959383K376967
13893B847767K609054K523718K064097J292673L77390m71873j088268j412621
$$ y = [18307665, 18834883, 18994275, 18737718, 18054580, 16954773, 15472126, 13673453, 11651913, 9513161, 7370637, 5344267, 3550402, 2088507, 1037115, 454185, 361996, 714988, 1386511, 2211626, 3069192, 3940678, 4903051, 6071737, 7538016, 9328670, 11395405, 13630535, 15892388, 18022824, 19856638, 21237714, 22051348, 22259453, 21913518, 21136157, 20080267, 18879413, 17609446, 16281588, 14869876, 13356109, 11762165, 10142815, 8543812, 6967267, 5383498, 3777401, 2177404, 639589, -786198, -2067394, -3169920, -4038827, -4604218, -4805947, -4610892, -4005937, -2975048, -1488583, 470800, 2847767, 5456821, 7980539, 10044636, 11337309, 11714699, 11242826, 10154558, 8741937]
13885H741937j498893j458155j390414j358084j396444j515558j681989j816924
13877c374524j832061j675975j355585r31766n00821j58059M9151J41037J72516
13868i466087J76238J36797K0890j67651l63836m71455m20692k12884P1729L10009
13858a0386942L98233L01407O0940k34779m88967o20918n79152l54975J0664M38112
13848a1456377Q31562J104809J207260J137904R33226O40578L02632m0594l39228
13839e678228n22704n15062k76888J65131P22491J271163J694000J927627J978688
13830G66218J895533J728197J513782J286027J082298R35031Q59857Q53323Q94590
13821A1814856R41074R28114P93523N20644J62249j79965m09800m86908m31667
$$ y = [8741937, 7243044, 5784889, 4394475, 3036391, 1639947, 124389, -1557600, -3374524, -5206585, -6882560, -8238145, -9169911, -9670732, -9828791, -9779640, -9638603, -9466087, -9289849, -9153052, -9132162, -9299813, -9663649, -10135104, -10555796, -10768680, -10696951, -10386942, -9988709, -9687302, -9626362, -9861141, -10350108, -10971026, -11550178, -11905153, -11894489, -11456377, -10624815, -9520006, -8312746, -7174842, -6241616, -5601038, -5298406, -5339000, -5678228, -6200932, -6715994, -6992882, -6827751, -6105260, -4834097, -3140097, -1212470, 766218, 2661751, 4389948, 5903730, 7189757, 8272055, 9207086, 10066943, 10920266, 11814856, 12755930, 13684044, 14477567, 14998211, 15160460, 14980495, 14570695, 14083787, 13652120]
13812A3652120k88087r4620J13550K97586M24623M80613M68318L94348K62147
13803A5710598P6652j50294m01617o56368q78722j002949r46367o61810j89060
13794A0900063L45672P86591J020163J013681Q02918M52761K7229m16982q23280
13785A4108816j127394j256282j143517p65509j79580M70042R94309J232083J118114
13776A3451082P07679J38279m42197r25476j251860j402702j396323j281389j122568
13767F474525r85164r19609r48320j061809j220208j359203j410321j330123j114892
13758c875124p93565m15117l9028K78224N00342O22173O70643O95984P51119Q61506
13748g42843J005202J127462J181482J157358J074678R52681P95717O10985M28708
$$ y = [13652120, 13364033, 13269413, 13382963, 13680549, 14105172, 14585785, 15054103, 15448451, 15710598, 15787250, 15636956, 15235339, 14578971, 13700249, 12697300, 11750933, 11089123, 10900063, 11245735, 12032326, 13052489, 14066170, 14869088, 15321849, 15349078, 14932096, 14108816, 12981422, 11725140, 10581623, 9816114, 9636534, 10106576, 11100885, 12332968, 13451082, 14158761, 14297040, 13854843, 12929367, 11677507, 10274805, 8878482, 7597093, 6474525, 5489361, 4569752, 3621432, 2559623, 1339415, -19788, -1430109, -2760232, -3875124, -4668689, -5083806, -5122834, -4844610, -4344268, -3722095, -3051452, -2355468, -1604349, -742843, 262359, 1389821, 2571303, 3728661, 4803339, 5756020, 6551737, 7162722, 7591430]
13739G591430K88119K00910J32887K0026j95355n31527r52587j370839j666033
13730C517031j728832j515593j080698n63310j25360J33141K22088K35037K81376
13721f25120M31540O93577J011540J276119J353584J145634O58842K5656n57582
13712E413790r38597j076400j017815q29519n65581k82726n2748N4192r529k58758
13702D36309o60928j125110j523796j741890j719553j470215j069737o22827k30339
13693i728086K8537J15065N8545l9428n2262R9077M03781P75249J103397J311346
13683e924779J389934J391520J383061J390629J376744J268336J014231O24820
13675C914496J67202k67739o03154q07646r00859r22381q92453q02186o31890
$$ y = [7591430, 7879549, 8080459, 8213346, 8233372, 8038017, 7506490, 6553903, 5183064, 3517031, 1788199, 272606, -808092, -1371402, -1496762, -1363621, -1141533, -906496, -625120, -193580, 499997, 1511537, 2787656, 4141240, 5286874, 5945716, 5971372, 5413790, 4475193, 3398793, 2380978, 1551459, 985878, 703152, 650404, 704596, 695067, 436309, -224619, -1349729, -2873525, -4615415, -6334968, -7805183, -8874920, -9497747, -9728086, -9699549, -9584484, -9525939, -9565367, -9617629, -9518552, -9114771, -8339522, -7236125, -5924779, -4534845, -3143325, -1760264, -369635, 1007109, 2275445, 3289676, 3914496, 4081698, 3813959, 3210805, 2403159, 1502300, 579919, -312534, -1114720, -1746610]
13666a746610l70311k6986L54003O92269R03382R47708Q51287O86084N36574M71404
13656C298804N17874O45096P69525P83993O02431K05486l44825r40194j475877
13647D062313j871558k073661k067324j888092j606624j288096r59105o09856
13639h302003k25546J80799N57256Q34438R71149R84739R30604Q54400P64408
13630b449756O32430M16957J05873k54606n81710q10057r27898r75409j016832
13621e861008j099530j215098j287590j201292q57596k39122N52230J318789J851774
13612h038443K024078J829886J360239P52066J46688l38576o36102p42827p06609
13603d349600n89298m36186k73022j21312p198M7427M0471n919n8770r2608r2114
$$ y = [-1746610, -2116921, -2143907, -1789904, -1097635, -194253, 753455, 1604742, 2290826, 2827400, 3298804, 3816678, 4461774, 5231299, 6015292, 6617723, 6823209, 6478384, 5538190, 4062313, 2190755, 117094, -1950230, -3838322, -5444946, -6733042, -7692147, -8302003, -8527549, -8346750, -7789494, -6955056, -5983907, -4999168, -4068564, -3214164, -2449756, -1817326, -1400369, -1294496, -1549102, -2130812, -2940869, -3868767, -4844176, -5861008, -6960538, -8175636, -9463226, -10664518, -11522114, -11761236, -11209006, -9890217, -8038443, -6014365, -4184479, -2824240, -2072174, -1925486, -2264062, -2900164, -3642991, -4349600, -4938898, -5375084, -5648106, -5769418, -5776616, -5729189, -5688718, -5694637, -5753407, -5846015, -5938129]
13592e938129m1699P5605K58345M56756N69669M96754K10009k22302o71482j007284
13582e813758j148650j085812q64803n57578k48968l1452K1241j03328l35634
13573a0168742n53060o43173n52985k93959P9650M87991Q40428J068601J165663
13564h569586J187049J197326J210138J180480J055053Q29511N54346K85650L5964
13555a034069k25285n29486q72227j217462j531316j800477k012038k129518k111267
13546a3463145j957660j727300j497244j307508j138884r31185o23054j93456
13538b2839436L18993Q36167J280941J598460J748216J694914J422920R63610
13530a2975215M07072j18256m94745o66151o52376n22170l49844j79342j1534
$$ y = [-5938129, -5979828, -5904223, -5645878, -5189122, -4619453, -4122699, -3912690, -4134992, -4806474, -5813758, -6962408, -8048220, -8913023, -9470601, -9719569, -9751021, -9729780, -9833108, -10168742, -10721802, -11364975, -11917960, -12211919, -12132269, -11644278, -10803850, -9735249, -8569586, -7382537, -6185211, -4975073, -3794593, -2739540, -1910029, -1355683, -1070033, -1034069, -1259354, -1788840, -2661067, -3878529, -5409845, -7210322, -9222360, -11351878, -13463145, -15420805, -17148105, -18645349, -19952857, -21091741, -22022926, -22645980, -22839436, -22520443, -21684276, -20403335, -18804875, -17056659, -15361745, -13938825, -12975215, -12568143, -12686399, -13181144, -13847295, -14499671, -15021841, -15371685, -15551027, -15562561]
13521a5562561J75235L87634N94579P37842P70941O93697N51616M08794L24615
13512a0917608L44179M90936P54179J082373J401320J652880J820828J920364
13504a450549J962059J923671J762091J461194J068246O82233M07440L12041M14899
13495H543325O90157J069940J452184J736591J879596J916905J921080J931782
13487B1141560J923498J831350J602568J229495P50603K34093k44306o26709q91945
13478B6950207j058007j170503j279119j407056j535619j618995j617509j527520
13470A5735879j388052j254575j161505j113832j109613j151162j227682j300464
13462F028994j315047j228189j028663p42063m22699j41942K9215N2578m8485
$$ y = [-15562561, -15387326, -14999692, -14405113, -13667271, -12896330, -12202633, -11651017, -11242223, -10917608, -10573429, -10082493, -9328314, -8245941, -6844621, -5191741, -3370913, -1450549, 511510, 2435181, 4197272, 5658466, 6726712, 7408945, 7816385, 8128426, 8543325, 9233482, 10303422, 11755606, 13492197, 15371793, 17288698, 19209778, 21141560, 23065058, 24896408, 26498976, 27728471, 28479074, 28713167, 28468861, 27842152, 26950207, 25892200, 24721697, 23442578, 22035522, 20499903, 18880908, 17263399, 15735879, 14347827, 13093252, 11931747, 10817915, 9708302, 8557140, 7329458, 6028994, 4713947, 3485758, 2457095, 1715032, 1292333, 1150391, 1179606, 1232184, 1183699]
13453A183699k00212l24828l73823l24374j68133Q1269L80337O73690R24188J118934
13443B970747J247353J289222J239387J140383J068148J071103J128302J169895
13435A2324540J131197R88882P60898M84932K00813m7889k06629k25335r4204
13426A5317205J36885L81457N66040O63272O83477O44112N52653M08716K11854
13417A9565671k4923k59642m25443m61496l47013j08979K00898N34369Q54969
13408A9528411J128581J312226J355299J223098R31704N57998K03316o6808k58678
13399B5915147m34450o64949r91473j411070j875343k300345k597571k718206
13391A2921740k675132k522745k320026k108894j905549j693535j430750j081630
$$ y = [1183699, 983487, 658659, 284836, -39538, -207671, -126402, 253935, 927625, 1851813, 2970747, 4218100, 5507322, 6746709, 7887092, 8955240, 10026343, 11154645, 12324540, 13455737, 14444619, 15205517, 15690449, 15891262, 15843373, 15636744, 15411409, 15317205, 15454090, 15835547, 16401587, 17064859, 17748336, 18392448, 18945101, 19353817, 19565671, 19540748, 19281106, 18855663, 18394167, 18047154, 17938175, 18139073, 18673442, 19528411, 20656992, 21969218, 23324517, 24547615, 25479319, 26037317, 26240633, 26173825, 25915147, 25480697, 24815748, 23824275, 22413205, 20537862, 18237517, 15639946, 12921740, 10246608, 7723863, 5403837, 3294943, 1389394, -304141, -1734891, -2816521]
13383b816521o54670k14525J40260L18424K73530K5427l40255p02279r54788j047555
13373e972952r93363q41984o36818l89591r6622K26740N32943P61548Q72721Q66299
13363e671079P72779O28291M56069K67703Q1666n7504q3052N8101L62136P59151
13353b425739J152119J472740J710954J898325K058928K169635K165844J986745
13345A2189551J621428J123117N86928J08487k52507m86673o22592o94580p15152
13336A2858007o81729o08404n39336n26638n93796p12353q10848q13602o82165
13327F889136m33698j29740J55691L70368N01300N64825N79504N52688M97409
13318I547483M52516M66073N45724O29626O20532M53204J31078k83296p00520
$$ y = [-2816521, -3471191, -3685716, -3545456, -3227032, -2953502, -2928075, -3268330, -3970609, -4925397, -5972952, -6966315, -7808299, -8445117, -8834708, -8931330, -8704590, -8171647, -7410099, -6537378, -5671079, -4898300, -4270009, -3813940, -3546237, -3464571, -3522075, -3605127, -3547026, -3184890, -2425739, -1273620, 199120, 1910074, 3808399, 5867327, 8036962, 10202806, 12189551, 13810979, 14934096, 15521024, 15629511, 15377004, 14890331, 14267739, 13573159, 12858007, 12176278, 11567874, 11028538, 10501900, 9908104, 9195751, 8384903, 7571301, 6889136, 6455438, 6325698, 6481389, 6851757, 7353057, 7917882, 8497386, 9050074, 9547483, 9999999, 10466072, 11011796, 11641422, 12261954, 12715158, 12846236, 12562940, 11862420]
13309A1862420j040746j257969j341989j304591j165756r56529p32141n59557
13301C503142m70404m26273l42707j55598J33057M66557P76731J016781J173319
13292E674605J266627J342531J456271J652754J949255K326446K730897L083886
13284B1483272L292560L270057K963695K377316J578007O84023j63562q36701
13276C4648667j254465j402832j327672j106041q17310n28995k96350j69681j97119
13267B7548202m07870p83090j246149j693398k049086k299990k480848k628306
13259A3959465k743291k786114k703636k466937k088671j610524j085483n75265
13251b100456j46973J49491L05057L47272L11173K16213O9133j21360l40769n74599
$$ y = [11862420, 10821674, 9563705, 8221716, 6917125, 5751369, 4794840, 4062699, 3503142, 3032738, 2606465, 2263758, 2108160, 2241217, 2707774, 3484505, 4501286, 5674605, 6941232, 8283763, 9740034, 11392788, 13342043, 15668489, 18399386, 21483272, 24775832, 28045889, 31009584, 33386900, 34964907, 35648930, 35485368, 34648667, 33394202, 31991370, 30663698, 29557657, 28740347, 28211352, 27915002, 27745321, 27548202, 27140332, 26357242, 25111093, 23417695, 21368609, 19068619, 16587771, 13959465, 11216174, 8430060, 5726424, 3259487, 1170816, -439708, -1525191, -2100456, -2247429, -2097938, -1792881, -1445609, -1134436, -918223, -849090, -970450, -1311219, -1885818]
13241a885818q08791j022511j184313j259224j223544j077601q46381n67556k77811
13232a0153550p764K14353L60155M06178L40462J66632q9381l74775o21298p69522
13222a0528510p85238o59616m05879n9092L30108P12262J055714J350281J593769
13213g396201J766991J821098J704090J408335R82114M87938m4699o22543j244655
13204a137532j852555k329395k563210k519095k246754j819441j276937o31534
13196a6376453Q5439P99093J408399J815509J949511J797263J431324R91805O11432
13187e486678L43294J59359R598j29378k51752l43797m05386m60502n40745o45525
13177g751512p20638o85715m86529j27838L32631Q17346J259250J606414J806950
$$ y = [-1885818, -2694609, -3717120, -4901433, -6160657, -7384201, -8461802, -9308183, -9875739, -10153550, -10161314, -9946961, -9586806, -9180628, -8840166, -8673534, -8762915, -9137690, -9758988, -10528510, -11313748, -11973364, -12379243, -12438335, -12108227, -11395965, -10340251, -8989970, -7396201, -5629210, -3808112, -2104022, -695687, 286427, 774365, 729666, 107123, -1137532, -2990087, -5319482, -7882692, -10401787, -12648541, -14467982, -15744919, -16376453, -16291014, -15491921, -14083522, -12268013, -10318502, -8521239, -7089915, -6098110, -5486678, -5143384, -4984025, -4974427, -5103805, -5355557, -5699354, -6104740, -6565242, -7105987, -7751512, -8472150, -9157865, -9644394, -9772232, -9439601, -8622255, -7363005, -5756591, -3949641]
13168c949641J803168J556123J083717M72514j55789o99777j112036j390090j541975
13159c933786j561641j433816j159977p79940l65356J2210L08694N10357O24251
13150g779004O72923O86715O87397O79557O61189O39519O31996O53053P05240
13141a761415P81274Q64421R20277Q92151P18950L76338q9619n72553r57079j170012
13131B733j198700j080667q85040o95180n90905o27664q17566j126131j486526
13122h505646j818355k046872k122883k032769j787863j402097q81862k39346
13114b0837693M85710J218091J861036K329575K587463K652116K554904K303702
13106d845096J896806J368693Q03054K89188j26552m39860o52430p47497o98380
$$ y = [-3949641, -2146473, -590350, 493367, 965881, 810092, 110315, -1001721, -2391811, -3933786, -5495427, -6929243, -8089220, -8869160, -9234516, -9222306, -8913612, -8403255, -7779004, -7106081, -6419366, -5731969, -5052412, -4391223, -3751704, -3119708, -2466655, -1761415, -980141, -115720, 804557, 1696708, 2415658, 2791996, 2702377, 2129824, 1172745, 2733, -1195967, -2276634, -3161674, -3856854, -4447759, -5075423, -5892989, -7019120, -8505646, -10324001, -12370873, -14493756, -16526525, -18314388, -19716485, -20598347, -20837693, -20351983, -19133892, -17272856, -14943281, -12355818, -9703702, -7148798, -4845096, -2948290, -1579597, -776543, -487355, -613907, -1053767, -1706197, -2453694, -3152074]
13097c152074m96199j67699K29800O27325R63569J195539J300901J276672J133498
13088B911332Q88331N63256J87986j97967n39867p70608q38287p37571n11549
13079I55056k30899K7382K02732K76963K81701K69285K68815K72033K59180K28692
13069B810940K02653K16507L06376M94053P71174J094594J404001J650010J808437
13060A0758745J875134J850119J718914J447399J006779M14615k49663q73578
13052A7948464j357155j640857j714592j617946j423533j199467r72961p25000
13044G296953m25415p9487K61145N33309O99755P50467O83393M99221K07948j73182
13034A0254107o24736j112692j564635j873439j952903j804536j520040j207492
$$ y = [-3152074, -3648273, -3815972, -3586172, -2958847, -1995278, -799739, 501162, 1777834, 2911332, 3799663, 4362919, 4550905, 4352938, 3813071, 3042463, 2204176, 1466605, 955056, 724157, 751539, 954271, 1231234, 1512935, 1782220, 2051035, 2323068, 2582248, 2810940, 3013593, 3230100, 3536476, 4030529, 4801703, 5896297, 7300298, 8950308, 10758745, 12633879, 14483998, 16202912, 17650311, 18657090, 19071705, 18822042, 17948464, 16591309, 14950452, 13235860, 11617914, 10194381, 8994914, 8021953, 7296953, 6871538, 6792051, 7053196, 7586505, 8286260, 9036727, 9720120, 10219341, 10427289, 10254107, 9629371, 8516679, 6952044, 5078605, 3125702, 1321166, -198874, -1406366]
13026a406366r14680o20042k87605O9920L75434N31833M83018K38762j40928n68973
13016b239627r48841j204192j315428j319878j262661j149302r49246o38913k35085
13007a1263173K10914O45074J034976J366499J625576J792355J855145J827691
12999i04943J749560J662892J582910J487227J329288J065615O83125K07343l16320
12990H546697q43070j329056j726024j988193k089888k043885j899304j709618
12982e082341j503994j291523j077884q66419o51500m24078j86701L8581K14292
12973a0831567K96775K46388M2220k95998o92765j034814j225427j234573j098128
12964a5827889q69136n73152k06674K32748P19663J194469J570202J750962J676984
$$ y = [-1406366, -2321046, -2941088, -3228693, -3158773, -2783339, -2251506, -1768488, -1529726, -1670654, -2239627, -3188468, -4392660, -5708088, -7027966, -8290627, -9439929, -10389175, -11028088, -11263173, -11052259, -10407185, -9372209, -8005710, -6380134, -4587779, -2732634, -904943, 844617, 2507509, 4090419, 5577646, 6906934, 7972549, 8655674, 8863017, 8546697, 7703627, 6374571, 4648547, 2660354, 570466, -1473419, -3372723, -5082341, -6586335, -7877858, -8955742, -9822161, -10473661, -10897739, -11084440, -11045859, -10831567, -10534792, -10288404, -10246184, -10542182, -11234947, -12269761, -13495188, -14729761, -15827889, -16697025, -17270177, -17476851, -17244103, -16524440, -15329971, -13759769, -12008807, -10331823]
12955a0331823J379206R85450O53412M81130M69277N57941O93263Q59369J056220
12946c196555J264481J443717J561182J611568J603009J527424J357584J084941
12938H257351P56330M64242L01827L20521N01574P43761Q89620Q00037M38631
12929A3473894r6523o19257r45851r74805p17448k70226K45578P31818J124022
12920A1951202J381328J485269J447491J301892J074309P58859L34148j90875
12912A9543623p55018j274233j681825j938698k027560j954089j749929j465067
12904F697204j152235q55008o02107m03414k49236j19295n444O9627O9607j1243
12894C438456j27515k08281k02513j11268J1478R2810Q8590R729q8536j40066
$$ y = [-10331823, -8952617, -7967167, -7313755, -6832625, -6363348, -5805407, -5112144, -4252775, -3196555, -1932074, -488357, 1072825, 2684393, 4287402, 5814826, 7172410, 8257351, 9013681, 9477923, 9779750, 10100271, 10601845, 11345606, 12235226, 13035263, 13473894, 13377371, 12758114, 11812263, 10837458, 10120010, 9849784, 10095362, 10827180, 11951202, 13332530, 14817799, 16265290, 17567182, 18641491, 19400350, 19734498, 19543623, 18788605, 17514372, 15832547, 13893849, 11866289, 9912200, 8162271, 6697204, 5544969, 4689961, 4087854, 3684440, 3435204, 3315909, 3310465, 3380092, 3449699, 3438456, 3310941, 3102660, 2900147, 2788879, 2800357, 2893167, 2981757, 2991486, 2902950, 2762884]
12884B762884r9451M1121K51468M78756O72601Q06063Q80514R11554R03380Q31518
12874H440408O57094L67326K432l58045o36086p91710q30271p79013o62408n03714
12864D906013l40894k26048k01353k72780m10170n79327p73559j008522j285886
12855a92526j565992j777852j856411j776053j558333j253159r09416n53404j83819
12846a1626965K15841O49550J082961J447332J676382J748301J700053J601082
12838a505463J507130J427139J323124J147387Q90230N92320L13977R9461l7922
12829E757383j15301j66638k17302k71446l27644l96772m93333o12137p27361
12820B429449q22520r07685r89988j040373j014008q97762p18053n03775k55738
$$ y = [2762884, 2663433, 2704554, 2956022, 3434778, 4107379, 4913442, 5793956, 6705510, 7608890, 8440408, 9097502, 9464828, 9467260, 9109215, 8473129, 7681419, 6851148, 6072135, 5409727, 4906013, 4565119, 4339071, 4137718, 3864938, 3454768, 2875441, 2101882, 1093360, -192526, -1758518, -3536370, -5392781, -7168834, -8727167, -9980326, -10889742, -11443146, -11626965, -11411124, -10761574, -9678613, -8231281, -6554899, -4806598, -3106545, -1505463, 1667, 1428806, 2751930, 3899317, 4789547, 5381867, 5695844, 5795305, 5757383, 5642082, 5475444, 5258142, 4986696, 4659052, 4262280, 3768947, 3156810, 2429449, 1606929, 699244, -290744, -1331117, -2345125, -3242887, -3960940, -4464715, -4720453]
12811d720453L9862L66109O48746P90497P48023N80207M15040L58695M28747N68055
12801B23528P09425Q19257Q94102R36738R38694Q78959P40338N31639K94099Q6790
12791G053569l7830o4062l5431l5006j20230k70954m06963m59329m26587l70836
12781D826341l73515m94948p53583j117806j511244j835847k004854j972514j744843
12772f982813j362310q72819l23276K26050O89938R76081J025148Q42644M99953
12763e281404R7009k90406o29975r03806j070789j069356q70923n34688j92886
12754a0747224L9480J42803J78015K10531K66889L52105M74199O38146Q27628
12745g617428R98380J090918J060531R01216O41917L25635p709l26547o05277
$$ y = [-4720453, -4680591, -4314482, -3665736, -2875239, -2127216, -1547009, -1131969, -773274, -344527, 223528, 932953, 1752210, 2646312, 3583050, 4521744, 5400703, 6141041, 6672680, 6966779, 7053569, 7015739, 6951677, 6916246, 6881240, 6761010, 6490056, 6083093, 5623764, 5197177, 4826341, 4452826, 3957878, 3204295, 2086489, 575245, -1260602, -3265456, -5237970, -6982813, -8345123, -9217942, -9541218, -9315168, -8625230, -7649149, -6624001, -5781357, -5281404, -5184395, -5474801, -6104776, -7008582, -8079371, -9148727, -10019650, -10554338, -10747224, -10707744, -10564941, -10386926, -10176395, -9909506, -9557401, -9083202, -8445056, -7617428, -6619048, -5528130, -4467599, -3566383, -2924466, -2598831, -2606540, -2933087, -3538364]
12736c538364q25181r78981j068274j094232j054335r48040p79897n55455k81907
12727a1124666K1256L14349N43241O61632O62344N85739M87036L98871L28356
12718g121842K76147K46209K38375K37262K15473J53871N8315m9723j58837k74333
12708f179083l95117m92376n20929m51911k91827p8114J31967K75233L10720K49074
12698g442363J47875O7144K8798J9861K5120M7622R7927J67352K17933K08187
12688f414544J32228K6334o5643j24322j54672j73526k04670k71041l72132m64226
12678h086214m77033l63025j28130J86147N39222R03376J246859J517535J650138
12669c011125J591799J325810Q81890L31579k29099p05826j033297j189697j193429
$$ y = [-3538364, -4363545, -5342526, -6410800, -7505032, -8559367, -9507407, -10287304, -10842759, -11124666, -11103410, -10789061, -10245820, -9584188, -8921844, -8336105, -7849069, -7450198, -7121842, -6845695, -6599486, -6361111, -6123849, -5908376, -5754505, -5696190, -5745913, -5904750, -6179083, -6574200, -7066576, -7587505, -8039416, -8331243, -8409357, -8277390, -8002157, -7691437, -7442363, -7294488, -7227344, -7198546, -7178685, -7153565, -7105943, -7008016, -6840664, -6622731, -6414544, -6282316, -6255982, -6321625, -6445947, -6600619, -6774145, -6978815, -7249856, -7621988, -8086214, -8563247, -8926272, -9054402, -8868255, -8329033, -7425657, -6178798, -4661263, -3011125, -1419326, -93516, 788374, 1119953, 890854, 185028, -848269, -2037966, -3231395]
12660c231395j091253r40401p90486o79271o29763o30286o24371n40408l35436
12651i493070j1891L92515Q16537J181784J409443J451425J311079J032687O74552
12642a234939K95639m0851k71609l56507k98908j42749M3518J87070K39793K01150
12632a378393J10303J5821m6850o1042k8241L5012J05402J66613K20870K81804
12622e78701L49835M00255L99707L25567J66114q4697m17671p88005j110396j291176
12612b629168j280222j097900q14238n03412k17747J1122J78595L24390N17580
12603e511000Q03757J167281J540579J838859J990963J962445J776412J515045
12595G084341J276294J108186R82139Q29072N97552K82277q9450m87275q90805
$$ y = [-3231395, -4322648, -5263049, -6053535, -6732806, -7362569, -7992855, -8617226, -9157634, -9493070, -9504961, -9112446, -8295909, -7114125, -5704682, -4253257, -2942178, -1909491, -1234939, -939300, -980151, -1251760, -1608267, -1907175, -2049924, -2006406, -1819336, -1579543, -1378393, -1268090, -1252269, -1299119, -1360161, -1388402, -1353390, -1247988, -1081375, -860505, -578701, -228866, 171389, 571096, 896663, 1062777, 978080, 560409, -227596, -1337992, -2629168, -3909390, -5007290, -5821528, -6324940, -6542687, -6531565, -6352970, -6028580, -5511000, -4707243, -3539962, -1999383, -160524, 1830439, 3792884, 5569296, 7084341, 8360635, 9468821, 10450960, 11280032, 11877584, 12159861, 12070411, 11583136, 10692331]
12586A0692331j277611j603924j800272j790181j523309j007427l21923M04203
12578A771887J049110J549933J900307K103282K144115K010665J718071J299036
12570A5546406P80886J85620m52097j078850j635063k068586k340048k430475
12562F507793k355467k167145j930917j694846j478583j284805j114093r72200
12554f490263q76340q59732r56789j167199j434498j670271j798470j775292j590439
12545a8619293j271918q78582m67590o2906L46186P77932J227529J657284K010792
12536a5280566K237613K317712K275475K167642K044597J915194J753522J543710
12528I74899J307430J079517Q65146O27760L19495p0867m92581q51718j057901
$$ y = [10692331, 9414720, 7810796, 6010524, 4220343, 2697034, 1689607, 1367684, 1771887, 2820997, 4370930, 6271237, 8374519, 10518634, 12529299, 14247370, 15546406, 16327292, 16512912, 16060815, 14981965, 13346902, 11278316, 8938268, 6507793, 4152326, 1985181, 54264, -1640582, -3119165, -4403970, -5518063, -6490263, -7366603, -8226335, -9183124, -10350323, -11784821, -13455092, -15253562, -17028854, -18619293, -19891211, -20769793, -21237383, -21300289, -20954103, -20176171, -18948642, -17291358, -15280566, -13042953, -10725241, -8449766, -6282124, -4237527, -2322333, -568811, 974899, 2282329, 3361846, 4226992, 4854752, 5174247, 5103380, 4610799, 3759081, 2701180]
12519B701180j069536r15704o80371m56997l09019k60089l00540l96740n11187
12510b199003o25299p37671q38199q91038q49617o91152m39617j59160P3138J94437
12500g163181J75517L2969j74964l75902n17472n81172n69123m82156l11652n2792
12490a0019928K71710N97006Q28479Q87413P64949N32817K93249J14180K410p6270
12480e803985j57662k55388l60231m44971m72938m23089l19152k27590k11717
12471h676723k78812l72406m13047l42633j43693J57150M86673P33725P93617
12462h056149O32788L11563o4201m10002o81926q54883r09460q38595o52622l73363
12452a1896850k4018L70955P72246J117450J332710J358020J174372Q21173L91373
$$ y = [2701180, 1631644, 715940, 35569, -421428, -730447, -990536, -1291076, -1687816, -2199003, -2824302, -3561973, -4400172, -5291210, -6140827, -6831979, -7271596, -7430756, -7357618, -7163181, -6987664, -6954695, -7129659, -7505561, -8023033, -8604205, -9173328, -9655484, -9967136, -10019928, -9748218, -9151212, -8322733, -7435320, -6670371, -6137554, -5844305, -5730125, -5727715, -5803985, -5961647, -6217035, -6577266, -7022237, -7495175, -7918264, -8237416, -8465006, -8676723, -8955535, -9327941, -9740988, -10083621, -10227314, -10070164, -9583491, -8849766, -8056149, -7423361, -7111798, -7175999, -7586001, -8267927, -9122810, -10032270, -10870865, -11523487, -11896850, -11920868, -11549913, -10777667, -9660217, -8327507, -6969487, -5795115, -4973942, -4582569]
12443d582569R38k49562k98334j28951K25955O79619J098132J338525J315754
12434f00493J057296O93743L83260K25489K22660L06411M03202M85293N76479
12425C753340P20384R34845J183009J382941J446412J325626J050259P26764M82658
$$ y = [-4582569, -4581631, -4831193, -5129527, -5258478, -5032523, -4352904, -3254772, -1916247, -600493, 456803, 1150546, 1533806, 1759295, 1981955, 2288366, 2691568, 3176861, 3753340, 4473724, 5408569, 6591578, 7974519, 9420931, 10746557, 11796816, 12523580, 13006238]
$$ [...]
##END NTUPLES=NMR SPECTRUM
##END=
