##TITLE=31P ikalashn
DE-75_oil
11.11.2024
##JCAMPDX= 6.0         $$ Bruker NMR JCAMP-DX V2.0
##DATA TYPE= NMR SPECTRUM
##DATA CLASS= NTUPLES
##ORIGIN= UXNMR, Bruker Analytische Messtechnik GmbH
##OWNER= root
$$ TOPSPIN		Version 1.3
$$ 2024-11-11 16:25:21.796 +0400  Irina@DPX200
$$ Compression mode = diff/dup
##.OBSERVE FREQUENCY= 81.01967998063
##.OBSERVE NUCLEUS= ^31P
##.ACQUISITION MODE= SIMULTANEOUS
##.ACQUISITION SCHEME= undefined
##.AVERAGES= 64
##.DIGITISER RES= 17
##SPECTROMETER/DATA SYSTEM= spect
##.PULSE SEQUENCE= zgpg
##.SOLVENT NAME= D2O
##.SHIFT REFERENCE= INTERNAL, D2O, 1, 298.5841
##AUDIT TRAIL= $$ (NUMBER, WHEN, WHO, WHERE, WHAT)
$$ ##TITLE= Audit trail, TOPSPIN		Version 1.3
$$ ##JCAMPDX= 5.01
$$ ##ORIGIN= Bruker BioSpin GmbH
$$ ##OWNER= Irina
$$ $$ F:/spectra/data/iren/nmr/P31dec/1/pdata/1/auditp.txt
$$ ##AUDIT TRAIL=  $$ (NUMBER, WHEN, WHO, WHERE, VERSION, WHAT)
(   1,<2024-11-11 16:23:19.453 +0400>,<Irina>,<DPX200>,<TOPSPIN 1.3>,
      <acquisition in progress>)
(   2,<2024-11-11 16:25:02.625 +0400>,<Irina>,<DPX200>,<TOPSPIN 1.3>,
      <Start of raw data processing
       efp BC_mod = 2 LB = 15 FT_mod = 6 PKNL = 1 PHC0 = 68.65067 PHC1 = 290.4213 SI = 32K 
       data hash MD5: 32K
       16 BA 8D E1 7F B1 6B 7F B9 35 E0 D3 1F 98 AA C5>)
(   3,<2024-11-11 16:25:05.109 +0400>,<Irina>,<DPX200>,<TOPSPIN 1.3>,
      <apk 
       data hash MD5: 32K
       0B 3C 76 A1 F3 B1 8B A9 14 E4 C3 5D E3 13 D2 7D>)
(   4,<2024-11-11 16:25:07.046 +0400>,<Irina>,<DPX200>,<TOPSPIN 1.3>,
      <abs n ABSG = 5 
       data hash MD5: 32K
       95 F5 27 E6 DB 44 48 53 CB A0 A4 FD F1 B9 2C 8F>)
$$ ##END=
$$ 
$$ $$ hash MD5
$$ $$ 4D 48 16 76 AB 53 E4 E0 1C F8 94 E6 98 D2 C7 7A
##$RELAX= 
##$RELAX= 
##$RELAX= 
##$RELAX= 
##$RELAX= 
##$RELAX= 
##$RELAX= 
##$RELAX= 
##$RELAX= 
##$RELAX= 
##$RELAX= 
$$ Bruker specific parameters
$$ --------------------------
##$DU= <F:/spectra>
##$EXPNO= 1
##$NAME= <P31dec>
##$PROCNO= 1
##$TYPE= <nmr>
##$USER= <iren>
##$AMP= (0..31)
100 100 100 100 100 100 100 100 100 100 100 100 100 100 100 100 100 100 
100 100 100 100 100 100 100 100 100 100 100 100 100 100 
##$ANAVPT= -1
##$AQSEQ= 0
##$AQ_mod= 1
##$AUNM= <au_zg>
##$AUTOPOS= <>
##$BF1= 81.014009
##$BF2= 200.13
##$BF3= 200.13
##$BF4= 200.13
##$BF5= 200.13
##$BF6= 200.13
##$BF7= 200.13
##$BF8= 200.13
##$BYTORDA= 1
##$CFDGTYP= 0
##$CFRGTYP= 5
##$CHEMSTR= <none>
##$CNST= (0..63)
1 1 145 1 1 1 1 1 1 1 1 1 1 1 1 1 1 1 1 1 1 1 1 1 1 1 1 1 1 1 1 1 1 1 
1 1 1 1 1 1 1 1 1 1 1 1 1 1 1 1 1 1 1 1 1 1 1 1 1 1 1 1 1 1 
##$CPDPRG= <waltz16>
##$CPDPRG1= <>
##$CPDPRG2= <waltz16>
##$CPDPRG3= <>
##$CPDPRG4= <mlev>
##$CPDPRG5= <mlev>
##$CPDPRG6= <mlev>
##$CPDPRG7= <mlev>
##$CPDPRG8= <mlev>
##$CPDPRGB= <>
##$CPDPRGT= <>
##$D= (0..63)
0 1 0 0 0 0 0 0 0 0.06 0 0.03 2e-005 3e-006 0 0 0.0002 0 0 0 0 0 0 0 0 
0 0 0 0 0 0 0 0 0 0 0 0 0 0 0 0 0 0 0 0 0 0 0 0 0 0 0 0 0 0 0 0 0 0 0 
0 0 0 0 
##$DATE= 1731327898
##$DBL= (0..7)
120 120 120 11 120 120 24 19 
##$DBP= (0..7)
$$ [...]
##$SW_h= 37037.037037037
##$TD= 32768
##$TD0= 1
##$TE= 300
##$TE2= 300
##$TE3= 300
##$TEG= 300
##$TL= (0..7)
0 120 53 12 22 120 120 120 
##$TP= (0..7)
150 150 150 150 150 150 150 150 
##$TP07= 0
##$TPNAME0= <>
##$TPNAME1= <>
##$TPNAME2= <>
##$TPNAME3= <>
##$TPNAME4= <>
##$TPNAME5= <>
##$TPNAME6= <>
##$TPNAME7= <>
##$TPOAL= (0..7)
0.5 0.5 0.5 0.5 0.5 0.5 0.5 0.5 
##$TPOFFS= (0..7)
0 0 0 0 0 0 0 0 
##$TUNHIN= 0
##$TUNHOUT= 0
##$TUNXOUT= 0
##$USERA1= <user>
##$USERA2= <user>
##$USERA3= <user>
##$USERA4= <user>
##$USERA5= <user>
##$V9= 5
##$VALIST= <valist>
##$VCLIST= <CCCCCCCCCCCCCCC>
##$VD= 0
##$VDLIST= <DDDDDDDDDDDDDDD>
##$VPLIST= <PPPPPPPPPPPPPPP>
##$VTLIST= <TTTTTTTTTTTTTTT>
##$WBST= 1024
##$WBSW= 4
##$XGAIN= (0..3)
0 0 0 0 
##$XL= 0
##$YL= 0
##$YMAX_a= 3947
##$YMIN_a= -9788
##$ZGOPTNS= <>
##$ZL1= 120
##$ZL2= 120
##$ZL3= 120
##$ZL4= 120
##$ABSF1= 298.5841
##$ABSF2= -158.5842
##$ABSG= 5
##$ABSL= 5
##$ALPHA= 0
##$AQORDER= 0
##$ASSFAC= 0
##$ASSFACI= 0
##$ASSFACX= 0
##$ASSWID= 0
##$AUNMP= <proc_1d>
##$AXLEFT= 0
##$AXRIGHT= 0
##$AXTYPE= 0
##$AXUNIT= <>
##$AZFE= 0.1
##$AZFW= 0.5
##$BCFW= 0
##$BC_mod= 2
##$BYTORDP= 0
##$COROFFS= 0
##$CY= 12.5935478210449
##$DATMOD= 1
##$DC= 0
##$DFILT= <>
##$DTYPP= 0
##$F1P= 47.1127640792319
##$F2P= -24.0371245302204
##$FCOR= 0.5
##$FTSIZE= 32768
##$FT_mod= 6
##$GAMMA= 0
##$GB= 0
##$INTBC= 1
##$INTSCL= 7.269226e-011
##$ISEN= 30
##$LB= 15
##$LEV0= 0
##$LPBIN= 0
##$MAXI= 12.09355
##$MC2= 0
##$MEAN= 0
##$ME_mod= 0
##$MI= 0.7550151
##$NCOEF= 0
##$NC_proc= -15
##$NLEV= 6
##$NOISF1= 298.5841
##$NOISF2= 270.0111
##$NSP= 0
##$NTH_PI= 0
##$NZP= 0
##$OFFSET= 298.5841
##$PC= 1.4
##$PHC0= 9.529949
##$PHC1= 359.2318
##$PH_mod= 1
##$PKNL= yes
##$PPARMOD= 0
##$PPDIAG= 0
##$PPIPTYP= 0
##$PPMPNUM= 100
##$PPRESOL= 1
##$PSCAL= 0
##$PSIGN= 0
##$REVERSE= no
##$SF= 81.014009
##$SI= 32768
##$SIGF1= 270.0111
##$SIGF2= -158.5842
##$SINO= 77.54984
##$SIOLD= 32768
##$SREGLST= <31P.CDCl3>
##$SSB= 0
##$STSI= 32768
##$STSR= 0
##$SW_p= 37037.037037037
##$SYMM= 0
##$S_DEV= 0
##$TDeff= 32768
##$TDoff= 0
##$TI= <>
##$TILT= no
##$TM1= 0
##$TM2= 0
##$TOPLEV= 0
##$USERP1= <user>
##$USERP2= <user>
##$USERP3= <user>
##$USERP4= <user>
##$USERP5= <user>
##$WDW= 1
##$XDIM= 32768
##$YMAX_p= 229513138
##$YMIN_p= -127369092
$$ End of Bruker specific parameters
$$ ---------------------------------
##NTUPLES= NMR SPECTRUM
##VAR_NAME=  FREQUENCY,     SPECTRUM/REAL,   SPECTRUM/IMAG
##SYMBOL=    X,             R,               I
##VAR_TYPE=  INDEPENDENT,   DEPENDENT,       DEPENDENT
##VAR_FORM=  AFFN,          ASDF,            ASDF
##VAR_DIM=   32768,         32768,           32768
##UNITS=     HZ,            ARBITRARY UNITS, ARBITRARY UNITS
##FACTOR=    1.13031516577767, 1,            1
##FIRST=     37037.037037037, 26682413,      103366467
##LAST=      0,             46059191,        -188593504
##MIN=       0,             -127369092,      0
##MAX=       37037.037037037, 229513138,     0
$$ Real data points
##PAGE= N=1
##DATA TABLE= (X++(R..R)), XYDATA
$$ [...]
##PAGE= N=2
##DATA TABLE= (X++(I..I)), XYDATA
$$ plain form
28375 158348183 153668191 147032245 139414848 131757715 124698296 118511977 113190366 108545734
28367 108545734 104326967 100391408 96896732 94362013 93486426 94810911 98448047 104047154
28359 104047154 111004771 118784420 127097581 135774537 144487643 152681318 159810179 165644963
28351 165644963 170365014 174357260 177872807 180795277 182688463 183077282 181731294 178751725
28343 178751725 174485565 169421470 164136287 159238461 155252603 152474081 150891989 150254276
28335 150254276 150249770 150708996 151705716 153478446 156220739 159892695 164151931 168404667 171951122
28326 171951122 174199994 174904060 174312686 173114711 172154544 172081164 173148817 175265365 178197464
28317 178197464 181743176 185741408 189963581 194060845 197669098 200586031 202844350 204616953
$$ packed form
28375A58348183m679992o635946p617397p657133p059419o186319n321611m644632
28367A08545734m218767l935559l494676k534719q75587J324485L637136N599107
28359A04047154O957617P779649Q313161Q676956Q713106Q193675P128861N834784
28351A65644963M720051L992246L515547K922470J893186L88819j345988k979569
28343A78751725m266160n064095n285183m897826l985858k778522j582092o37713
28335A50254276m506M59226R96720J772730K742293L671956M259236M252736L546455
28326A71951122K248872P04066n91374j197975r60167p3380J067653K116548K932099
28317A78197464L545712L998232M222173M097264L608253K916933K258319J772603
$$ plain form
28309 204616953 206082771 207410245 208843998 210752357 213557129 217598498 223013469 229647499
28301 229647499 237014770 244353835 250786430 255513878 257984742 258016411 255835669 251959074
28293 251959074 246910949 240956337 234074000 226174850 217345306 207944142 198555707 189869790
28285 189869790 182548555 177115430 173877651 172901072 174034842 176923335 180955237 185205608
28277 185205608 188499538 189684461 188072618 183844731 178110243 172504134 168553437 167158565
28269 167158565 168372360 171517076 175585943 179732383 183574099 187179734 190836976 194784986
28261 194784986 199034377 203335475 207290448 210518035 212775415 214019199 214410002 214240354
28253 214240354 213797604 213236484 212541353 211602176 210355726 208894521 207463255 206341797
$$ packed form
28309B04616953J465818J327474J433753J908359K804772M041369N414971O634030
28301B29647499P367271P339065O432595M727448K470864L1669k180742l876595
28293B51959074n048125n954612o882337p899150q829544r401164r388435q685917
28285A89869790p321235n433125l237779r76579J133770K888493M031902M250371
28277A85205608L293930J184923j611843m227887n734488n606109l950697j394872
28269A67158565J213795L144716M068867M146440L841716L605635L657242L948010
28261A94784986M249391M301098L954973L227587K257380J243784L90803j69648
28253B14240354m42750n61120o95131r39177j246450j461205j431266j121458
$$ plain form
28245 206341797 205686887 205427719 205287308 204933949 204167569 203004045 201621840 200267815 199192265
28236 199192265 198569273 198383891 198387485 198201956 197503337 196156408 194239336 191957575 189482749
28227 189482749 186806430 183729536 180037309 175736067 171133386 166696649 162848610 159865063
28219 159865063 157890719 156994036 157179976 158352617 160307406 162809614 165704992 168971538
28211 168971538 172673699 176841645 181354291 185917273 190142418 193651372 196170056 197652033
28203 197652033 198398657 199025477 200189936 202223273 204931887 207701864 209810029 210751667
28195 210751667 210451272 209285272 207888833 206822442 206287522 206061823 205670179 204652493
28187 204652493 202758718 199994209 196563190 192798610 189118344 185985419 183813628 182805178
$$ packed form
28245B06341797o54910k59168j40411l53359p66380j163524j382205j354025j075550
28236A99192265o22992j85382L594j85529o98619j346929j917072k281761k474826
28227A89482749k676319l076894l692227m301242m602681m436737l848039k983547
28219A59865063j974344q96683J85940J172641J954789K502208K895378L266546
28211A68971538L702161M167946M512646M562982M225145L508954K518684J481977
28203A97652033P46624O26820J164459K033337K708614K769977K108165R41638
28195B10751667l00395j166000j396439j066391n34920k25699l91644j017686
28187B04652493j893775k764509l431019l764580l680266l132925k171791j008450
$$ plain form
28179 182805178 182827446 183465224 184251786 184935446 185614467 186665236 188508116 191333300 194938503
28170 194938503 198798111 202337262 205203403 207335526 208843786 209863465 210487972 210759497
28162 210759497 210676927 210236438 209511574 208707568 208113408 207971669 208369370 209200675 210168605
28153 210168605 210826095 210695639 209421587 206842915 202961813 197893451 191865696 185257486
28145 185257486 178610112 172540790 167569013 163963365 161693853 160483253 159916605 159573895
28137 159573895 159152180 158542865 157837967 157272550 157143789 157741231 159297999 161951744 165680717
28128 165680717 170210282 174974411 179213977 182173416 183289667 182312279 179353738 174877646
28120 174877646 169609241 164362532 159837420 156463351 154329040 153222815 152791698 152741906
$$ packed form
28179A82805178K2268O37778P86562O83660O79021J050769J842880K825184L605203
28170A94938503L859608L539151K866141K132123J508260J019679O24507K71525
28162B10759497q2570m40489p24864q04006n94160j41739L97701Q31305R67930
28153B10168605O57490j30456j274052k578672l881102n068362o027755o608210
28145A85257486o647374o069322m971777l605648k269512j210600n66648l42710
28137A59573895m21715o09315p04898n65417j28761N97442J556768K653745L728973
28128A65680717M529565M764129M239566K959439J116251r77388k958541m476092
28120A74877646n268405n246709m525112l374069k134311j106225m31117m9792
$$ plain form
28112 152741906 152946974 153409502 154152639 155143851 156285631 157467268 158652819 159930197
28104 159930197 161447327 163265522 165246479 167066537 168366524 168955254 168934799 168666105
28096 168666105 168622245 169228097 170723627 173072843 175966205 178908634 181349055 182857859
28088 182857859 183320159 182990661 182311417 181629403 181058602 180578465 180230007 180203979 180753152
28079 180753152 182016577 183890322 186050393 188126172 189868828 191148110 191810299 191597989
28071 191597989 190250227 187703053 184224781 180368128 176754036 173848269 171890444 170972634
28063 170972634 171152881 172520101 175187658 179223951 184558848 190921648 197841760 204717020
28055 204717020 210938911 216028911 219718159 221932318 222728408 222303340 221100020 219834057
$$ packed form
28112A52741906K05068M62528P43137R91212J141780J181637J185551J277378
28104A59930197J517130J818195J980957J820058J299987N88730k0455k68694
28096A68666105m3860O05852J495530K349216K893362K942429K440421J508804
28088A82857859M62300l29498o79244o82014n70801m80137l48458k6028N49173
28079A80753152J263425J873745K160071K075779J742656J279282O62189k12310
28071A91597989j347762k547174l478272l856653l614092k905767j957825r17810
28063A70972634J80247J367220K667557M036293N334897O362800O920112O875260
28055B04717020O221891N090000L689248K214159P96090m25068j203320j265963
$$ plain form
28047 219834057 219273156 219868335 221519061 223648581 225511641 226502109 226294222 224828753
28039 224828753 222247671 218839895 214977431 211011444 207184857 203650666 200568813 198155573
28031 198155573 196625598 196087438 196481647 197593608 199125749 200807297 202491741 204171258
28023 204171258 205889322 207595605 209027467 209729539 209259727 207469775 204652922 201440790
28015 201440790 198527410 196405949 195246011 194939195 195268536 196064604 197204495 198494875
28007 198494875 199626493 200279376 200268134 199589647 198355175 196701958 194779986 192794859
27999 192794859 190993260 189557004 188513385 187746572 187066369 186253843 185073682 183307092
27991 183307092 180830857 177687190 174071890 170231228 166340620 162474083 158695369 155170427
$$ packed form
28047B19834057n60901N95179J650726K129520J863060R90468k07887j465469
28039B24828753k581082l407776l862464l965987l826587l534191l081853k413240
28031A98155573j529975n38160L94209J111961J532141J681548J684444J679517
28023B04171258J718064J706283J431862P02072m69812j789952k816853l212132
28015B01440790k913380k121461j159938l06816L29341P96068J139891J290380
28007A98494875J131618O52883j1242o78487j234472j653217j921972j985127
27999A92794859j801599j436256j043619p66813o80203q12526j180161j766590
27991A83307092k476235l143667l615300l840662l890608l866537l778714l524942
$$ plain form
27983 155170427 152173891 149973590 148695669 148275302 148500493 149083160 149718742 150148846 150231240
27974 150231240 149983952 149572942 149248792 149267689 149836672 151087332 153043003 155584107 158485403
27965 158485403 161540333 164649673 167773066 170823945 173658177 176146582 178185999 179635113
27957 179635113 180320080 180148623 179202707 177713912 175961227 174177486 172510542 171053350
27949 171053350 169924952 169313468 169394569 170174596 171405815 172655889 173475697 173546101 172722751
27940 172722751 170977328 168308347 164718305 160284594 155246716 149998374 144950312 140366140
27932 140366140 136329798 132877940 130147295 128386449 127851438 128702330 130951752 134425815
27924 134425815 138722269 143238653 147327935 150525037 152724073 154200783 155435517 156816370
$$ packed form
27983A55170427k996536k200301j277921m20367K25191N82667O35582M30104Q2394
27974A50231240k47288m11010l24150J8897N68983J250660J955671K541104K901296
27965A58485403L054930L109340L123393L050879K834232K488405K039417J449114
27957A79635113O84967j71457r45916j488795j752685j783741j666944j457192
27949A71053350j128398o11484Q1101P80027J231219J250074Q19808P0404q23350
27940A72722751j745423k668981l590042m433711n037878n248342n048062m584172
27932A40366140m036342l451858k730645j760846n35011Q50892K249422L474063
27924A34425815M296454M516384M089282L197102K199036J476710J234734J380853
$$ plain form
27916 156816370 158423245 160055149 161448405 162460181 163068282 163276630 163109715 162717896
27908 162717896 162440705 162718689 163905297 166103788 169127622 172603295 176134272 179427405
27900 179427405 182358196 184983246 187480897 190023080 192648938 195225220 197515675 199301049
27892 199301049 200451832 200901152 200580642 199427704 197468117 194873715 191929262 188940723
27884 188940723 186154492 183710771 181604584 179661278 177595381 175182058 172451379 169752668
27876 169752668 167602080 166394936 166195505 166764707 167789511 169124590 170877801 173326483
27868 173326483 176769664 181388371 187105244 193476447 199739622 205064138 208853760 210888957
27860 210888957 211240064 210074636 207538718 203789640 199113600 193986725 188991688 184632547
$$ packed form
27916A56816370J606875J631904J393256J011776O08101K08348j66915l91819
27908A62717896k77191K77984J186608K198491L023834L475673L530977L293133
27900A79427405K930791K625050K497651K542183K625858K576282K290455J785374
27892A99301049J150783M49320l20510j152938j959587k594402k944453k988539
27884A88940723k786231k443721k106187j943306k065897k413323k730679k698711
27876A69752668k150588j207144j99431N69202J024804J335079J753211K448682
27868A73326483L443181M618707N716873O371203O263175N324516L789622K035197
27860B10888957L51107j165428k535918l749078m676040n126875m995037m359141
$$ plain form
27852 184632547 181172710 178600256 176725424 175317060 174185583 173208161 172357375 171753271
27844 171753271 171662504 172377150 174030829 176476168 179288538 181882367 183693784 184360744
27836 184360744 183817234 182257557 180010633 177418609 174782413 172357905 170347131 168863684
27828 168863684 167909254 167404197 167262873 167452126 167980038 168837137 169958106 171230908 172519540
27819 172519540 173662831 174468629 174755160 174436853 173583159 172391872 171105083 169956772
27811 169956772 169191766 169093744 169940101 171892841 174919446 178800832 183199148 187756638
27803 187756638 192214281 196488113 200625210 204657426 208460459 211705410 213920615 214628869
27795 214628869 213484311 210340160 205254272 198483836 190459507 181679750 172564169 163407574
$$ packed form
27852A84632547l459837k572454j874832j408364j131477r77422q50786o04104
27844A71753271r0767P14646J653679K445339K812370K593829J811417O66960
27836A84360744n43510j559677k246924k592024k636196k424508k010774j483447
27828A68863684r54430n05057j41324J89253N27912Q57099J120969J272802J288632
27819A72519540J143291Q05798K86531l18307q53694j191287j286789j148311
27811A69956772p65006r8022Q46357J952740L026605L881386M398316M557490
27803A87756638M457643M273832M137097M032216L803033L244951K215205P08254
27795B14628869j144558l144151n085888o770436q024329q779757r115581r156595
$$ plain form
27787 163407574 154470753 146069756 138541311 132110187 126763646 122223031 118059731 113919901
27779 113919901 109721418 105694689 102265369 99879623 98875932 99445958 101650497 105416593
27771 105416593 110493755 116449768 122780624 129059659 134976209 140248209 144548148 147553615
27763 147553615 149093362 149281856 148549362 147522833 146792642 146695419 147249435 148264945 149524991
27754 149524991 150906856 152408361 154126750 156208727 158764153 161784800 165118452 168492189
27746 168492189 171555074 173941665 175367384 175717245 175059700 173581744 171521606 169153825
27738 169153825 166798238 164792340 163395055 162654133 162344576 162068022 161462907 160377095
27730 160377095 158909216 157329836 155941693 154951993 154425110 154327374 154602965 155227971 156247188
$$ packed form
27787A63407574q936821q400997p528445o431124n346541m540615m163300m139830
27779A13919901m198483m026729l429320k385746j003691N70026K204539L766096
27771A05416593N077162N956013O330856O279035N916550N272000M299939L005467
27763A47553615J539747J88494p32494j026529p30191r7223N54016J015510J260046
27754A49524991J381865J501505J718389K081977K555426L020647L333652L373737
27746A68492189L062885K386591J425719L49861o57545j477956k060138k367781
27738A69153825k355587k005898j397285p40922l09557k76554o05115j085812
27730A60377095j467879j579380j388143r89700n26883r7736K75591O25006J019217
$$ plain form
27721 156247188 157779462 159936666 162673437 165688006 168469560 170467048 171274642 170731639
27713 170731639 168897259 165949021 162092452 157527836 152464744 147161638 141969167 137336194
27705 137336194 133728530 131470848 130612881 130924175 132016166 133486394 134995797 136294784
27697 136294784 137257013 137923825 138507418 139323195 140685783 142820157 145808002 149577498
27689 149577498 153949999 158727385 163764255 168978931 174298107 179571158 184521943 188785926
27681 188785926 192004578 193914340 194403134 193528376 191493466 188592808 185133273 181353167
27673 181353167 177396130 173373040 169448844 165837131 162679101 159934765 157409279 154882282
27665 154882282 152214418 149369868 146395884 143393617 140462101 137624000 134788951 131794262
$$ packed form
27721A56247188J532274K157204K736771L014569K781554J997488Q07594n43003
27713A70731639j834380k948238l856569m564616n063092n303106n192471m632973
27705A37336194l607664k257682q57967L11294J091991J470228J509403J298987
27697A36294784R62229O66812N83593Q15777J362588K134374K987845L769496
27689A49577498M372501M777386N036870N214676N319176N273051M950785M263983
27681A88785926L218652J909762M88794q74758k034910k900658l459535l780106
27673A81353167l957037m023090l924196l611713l158030k744336k525486k526997
27665A54882282k667864k844550k973984l002267k931516k838101k835049k994689
$$ plain form
27657 131794262 128508027 124927461 121200037 117563435 114272886 111570032 109677223 108771643
27649 108771643 108926968 110063059 111967137 114394861 117168124 120182499 123332553 126448973
27641 126448973 129326639 131826153 133966575 135936056 137992227 140300713 142829070 145379559
27633 145379559 147726303 149746111 151458533 152975787 154412957 155792789 156974803 157660490
27625 157660490 157501051 156261031 153934816 150734519 146973502 142946822 138877120 134932752
27617 134932752 131284883 128142845 125725361 124174812 123469228 123411528 123738074 124294384 125146014
27608 125146014 126515175 128565386 131182756 133907185 136067031 137054934 136593254 134829583
27600 134829583 132215987 129266522 126337240 123539998 120820331 118119586 115499955 113181955
$$ packed form
27657A31794262l286235l580566l727424l636602l290549k702854j892809r05580
27649A08771643J55325J136091J904078K427724K773263L014375L150054L116420
27641A26448973K877666K499514K140422J969481K056171K308486K528357K550489
27633A45379559K346744K019808J712422J517254J437170J379832J182014O85687
27625A57660490j59439j240020k326215l200297l761017m026680m069702l944368
27617A34932752l647869l142038k417484j550549p05584n7700L26546N56310Q51630
27608A25146014J369161K050211K617370K724429K159846R87903m61680j763671
27600A34829583k613596k949465k929282k797242k719667k700745k619631k318000
$$ plain form
27592 113181955 111503235 110796687 111226741 112706529 114976512 117771636 120926897 124350901
27584 124350901 127937010 131526153 134942869 138037530 140710205 142953489 144889391 146720879
27576 146720879 148610289 150603899 152677646 154830261 157094442 159455252 161790440 163903305
27568 163903305 165591623 166682706 167062094 166743447 165925274 164950585 164192397 163953289 164416809
27559 164416809 165636734 167548176 169978587 172636795 175115893 176990736 178014628 178289451
27551 178289451 178257384 178476692 179311787 180752042 182477374 184090408 185331990 186158803 186686259
27542 186686259 187064706 187342187 187360808 186767865 185190943 182490646 178909992 175005722 171407194
27533 171407194 168552330 166532644 165100418 163811410 162213971 160001724 157105461 153714907
$$ packed form
27592A13181955j678720p06548M30054J479788K269983K795124L155261L424004
27584A24350901L586109L589143L416716L094661K672675K243284J935902J831488
27576A46720879J889410J993610K073747K152615K264181K360810K335188K112865
27568A63903305J688318J091083L79388l18647q18173r74689p58188k39108M63520
27559A64416809J219925J911442K430411K658208K479098J874843J023892K74823
27551A78289451l2067K19308Q35095J440255J725332J613034J241582Q26813N27456
27542A86686259L78447K77481J8621n92943j576922k700297l580654l904270l598528
27533A71407194k854864k019686j432226j289008j597439k212247k896263l390554
$$ plain form
27525 153714907 150219679 147093058 144754721 143443141 143154086 143695109 144813031 146281166
27517 146281166 147898908 149477232 150886241 152132538 153380571 154883025 156857375 159376176
27509 159376176 162316851 165383412 168196038 170420176 171880819 172610954 172803525 172672772
27501 172672772 172300302 171571859 170238553 168043397 164841116 160686641 155893855 151035984
27493 151035984 146833253 143935233 142711199 143167533 144995460 147671041 150558619 153015014
27485 153015014 154499731 154678879 153473976 151020722 147599573 143630721 139701116 136493812
27477 136493812 134584923 134234778 135331528 137531962 140488476 143984621 147910232 152175232
27469 152175232 156671743 161278373 165859130 170256300 174291786 177778693 180563445 182609572
$$ packed form
27525A53714907l495228l126621k338337j311580k89055N41023J117922J468135
27517A46281166J617742J578324J409009J246297J248033J502454J974350K518801
27509A59376176K940675L066561K812626K224138J460643P30135J92571j30753
27501A72672772l72470p28443j333306k195156l202281m154475m792786m857871
27493A51035984m202731k898020j224034M56334J827927K675581K887578K456395
27485A53015014J484717J79148j204903k453254l421149l968852l929605l207304
27477A36493812j908889l50145J096750K200434K956514L496145L925611M265000
27469A52175232M496511M606630M580757M397170M035486L486907K784752K046127
$$ plain form
27461 182609572 184055651 185151106 186083828 186831506 187137916 186597353 184782171 181388802
27453 181388802 176387556 170107766 163193279 156453956 150693971 146556074 144372719 144056676
27445 144056676 145123570 146882614 148701621 150198014 151280591 152078877 152819067 153675467
27437 153675467 154658780 155607316 156249448 156262062 155322636 153199366 149870277 145589154 140832241
27428 140832241 136151780 132021300 128741811 126426955 125046882 124501902 124688593 125509335
27420 125509335 126817114 128377306 129939143 131379577 132771340 134301009 136124224 138284533
27412 138284533 140726811 143344291 145995343 148495600 150642149 152285970 153394450 154057545
27404 154057545 154460168 154850638 155489646 156564802 158116339 160033289 162115869 164171175
$$ packed form
27461A82609572J446079J095455R32722P47678L06410n40563j815182l393369
27453A81388802n001246o279790o914487o739323n759985m137897k183355l16043
27445A44056676J066894J759044J819007J496393J082577P98286P40190Q56400
27437A53675467R83313R48536O42132J2614r39426k123270l329089m281123m756913
27428A40832241m680461m130480l279489k314856j380073n44980J86691Q20742
27420A25509335J307779J560192J561837J440434J391763J529669J823215K160309
27412A38284533K442278K617480K651052K500257K146549J643821J108480O63095
27404A54057545M02623L90470O39008J075156J551537J916950K082580K055306
$$ plain form
27396 164171175 166124025 168089067 170322522 173060311 176359542 180040625 183729841 186958164
27388 186958164 189281544 190394013 190196779 188799251 186475870 183613974 180643055 177928870
27380 177928870 175670007 173869316 172414316 171211152 170266447 169663605 169476515 169704718
27372 169704718 170280536 171134151 172249150 173652369 175360751 177346071 179534464 181822947
27364 181822947 184098931 186249645 188162101 189737864 190917275 191666978 191935625 191648788
27356 191648788 190773908 189402005 187768592 186180244 184881681 183935567 183182691 182316582
27348 182316582 181025034 179095519 176455402 173199772 169603195 166050470 162895587 160350894
27340 160350894 158483960 157292487 156762320 156858808 157496111 158555127 159949643 161668203
$$ packed form
27396A64171175J952850J965042K233455K737789L299231L681083L689216L228323
27388A86958164K323380J112469j97234j397528k323381k861896k970919k714185
27380A77928870k258863j800691j455000j203164r44705o02842j87090K28203
27372A69704718N75818Q53615J114999J403219J708382J985320K188393K288483
27364A81822947K275984K150714J912456J575763J179411P49703K68647k86837
27356A91648788q74880j371903j633413j588348j298563r46114p52876q66109
27348A82316582j291548j929515k640117l255630l596577l552725l154883k544693
27340A60350894j866934j191473n30167R6488O37303J059016J394516J718560
$$ plain form
27332 161668203 163742930 166176115 168878030 171640547 174163126 176136769 177347814 177739418
27324 177739418 177403547 176532524 175371275 174181464 173204116 172604544 172404689 172442485 172397295
27315 172397295 171875494 170526473 168173652 164926716 161189706 157503564 154295668 151711734
27307 151711734 149633049 147816477 146034494 144150842 142127709 139997376 137837643 135751025
27299 135751025 133828863 132108641 130554836 129094495 127704730 126492041 125692383 125574651
27291 125574651 126302060 127848326 130043161 132718916 135819553 139361081 143289877 147385808
27283 147385808 151309426 154765298 157651057 160061701 162135014 163876806 165143663 165802194
27275 165802194 165896856 165676615 165491241 165659003 166379627 167697747 169497598 171538883 173542626
$$ packed form
27332A61668203K074727K433185K701915K762517K522579J973643J211045L91604
27324A77739418l35871q71023j161249j189811r77348n99572j99855L7796m5190
27315A72397295n21801j349021k352821l246936l737010l686142l207896k583934
27307A51711734k078685j816572j781983j883652k023133k130333k159733k086618
27299A35751025j922162j720222j553805j460341j389765j212689p99658j17732
27291A25574651P27409J546266K194835K675755L100637L541528L928796M095931
27283A47385808L923618L455872K885759K410644K073313J741792J266857O58531
27275A65802194R4662k20241j85374J67762P20624J318120J799851K041285K003743
$$ plain form
27266 173542626 175292817 176708892 177865093 178955381 180226819 181905226 184114212 186792076
27258 186792076 189649426 192232119 194104130 195052752 195163947 194722050 194043187 193370358 192853287
27249 192853287 192557400 192469646 192524091 192658166 192853683 193111432 193371311 193439809 192973034 191519804
27239 191519804 188607360 183875029 177267542 169210606 160604085 152558407 146005500 141407315
27231 141407315 138710157 137547645 137545095 138516479 140452105 143367360 147151660 151515346
27223 151515346 156057105 160406439 164357487 167912480 171199568 174315499 177202465 179634858
27215 179634858 181318629 182054051 181871518 181050344 180002235 179098842 178558791 178435394 178662917
27206 178662917 179127780 179749739 180531800 181541336 182830741 184350251 185936439 187417173
$$ packed form
27266A73542626J750191J416075J156201J090288J271438J678407K208986K677864
27258A86792076K857350K582693J872011R48622J11195m41897o78863o72829n17071
27249A92853287k95887q7754N4445J34075J95517K57749K59879O8498m66775j453230
27239A91519804k912444m732331o607487q056936q606521q045678o552907m598185
27231A41407315k697158j162512k550R71384J935626K915255L784300M363686
27223A51515346M541759M349334L951048L554993L287088L115931K886966K432393
27215A79634858J683771P35422j82533q21174j048109r03393n40051j23397K27523
27206A78662917M64863O21959P82061J009536J289405J519510J586188J480734
$$ plain form
27198 187417173 188738275 189971278 191208566 192486683 193817841 195257192 196893237 198753279
27190 198753279 200711582 202483418 203729931 204214788 203886203 202819142 201111600 198873932
27182 198873932 196315128 193795856 191750129 190523396 190252004 190849694 192075646 193621617
27174 193621617 195163659 196365949 196875820 196354121 194552437 191414382 187137231 182124580
27166 182124580 176843417 171687731 166937853 162824037 159629356 157725747 157475064 159056098
27158 159056098 162372912 167124312 172940629 179447092 186238684 192853156 198804922 203682548
27150 203682548 207274808 209663617 211215742 212445952 213818938 215625135 217994454 220966038
27142 220966038 224499049 228411847 232337117 235780347 238268545 239482932 239300866 237775205
$$ packed form
27198A87417173J321102J233003J237288J278117J331158J439351J636045J860042
27190A98753279J958303J771836J246513M84857l28585j067061j707542k237668
27182A98873932k558804k519272k045727j226733k71392N97690J225952J545971
27174A93621617J542042J202290N09871n21699j801684l138055m277151n012651
27166A82124580n281163n155686m749878m113816l194681j903609k50683J581034
27158A59056098L316814M751400N816317O506463O791592O614472N951766M877626
27150B03682548L592260K388809J552125J230210J372986J806197K369319K971584
27142B20966038L533011L912798L925270L443230K488198J214387j82066j525661
$$ plain form
27134 237775205 235106352 231609065 227641919 223489347 219244265 214783163 209886567 204437855
27126 204437855 198550163 192531164 186739514 181460102 176869942 173054425 169983205 167440268
27118 167440268 165032933 162371140 159314092 156078243 153103130 150762202 149123501 147917333
27110 147917333 146706098 145127288 143073214 140731671 138484856 136729548 135710399 135442449
27102 135442449 135747864 136366703 137084724 137836314 138724646 139932614 141607994 143821939 146578324
27093 146578324 149799416 153291947 156750447 159822861 162217844 163808739 164671428 165014115
27085 165014115 165040577 164848888 164437018 163801704 163028609 162264665 161595798 160971739 160258565
27076 160258565 159347991 158195044 156749737 154881194 152402098 149186309 145282695 140940885
$$ packed form
27134B37775205k668853l497287l967146m152572m245082m461102m896596n448712
27126B04437855n887692o018999n791650n279412m590160l815517l071220k542937
27118A67440268k407335k661793l057048l235849k975113k340928j638701j206168
27110A47917333j211235j578810k054074k341543k246815j755308j019149k67950
27102A35442449L05415O18839P18021P51590Q88332J207968J675380K213945K756385
27093A46578324L221092L492531L458500L072414K394983J590895Q62689L42687
27085A65014115K6462j91689m11870o35314p73095p63944o68867o24059p13174
27076A60258565r10574j152947j445307j868543k479096l215789l903614m341810
$$ plain form
27068 140940885 136531521 132419274 128885186 126141838 124396846 123887828 124838008 127347990
27060 127347990 131302921 136370298 142095583 148024841 153768793 159000560 163453634 166964518
27052 166964518 169525230 171277421 172436083 173195658 173656479 173777253 173380727 172235201
27044 172235201 170168455 167148842 163320808 159013858 154707652 150910496 147976967 145970532
27036 145970532 144659636 143649444 142569112 141212777 139584588 137869468 136379654 135502724
27028 135502724 135644991 137159047 140252178 144898238 150820303 157592700 164798521 172112530
27020 172112530 179250114 185836473 191322487 195068561 196592658 195830176 193235282 189654549
27012 189654549 186039551 183154608 181399164 180760199 180873438 181188665 181196436 180601917 179356460
$$ packed form
27068A40940885m409364m112247l534088k743348j744992n09018R50180K509982
27060A27347990L954931N067377N725285N929258N743952N231767M453074L510884
27052A66964518K560712J752191J158662P59575M60821J20774l96526j145526
27044A72235201k066746l019613l828034m306950m306206l797156k933529k006435
27036A45970532j310896j010192j080332j356335j628189j715120j489814q76930
27028A35502724J42267J514056L093131M646060N922065O772397P205821P314009
27020A72112530P137584O586359N486014L746074J524097p62482k594894l580733
27012A89654549l614998k884943j755444o38965J13239L15227P771n94519j245457
$$ plain form
27003 179356460 177577623 175452273 173171542 170887181 168676893 166540982 164462629 162506295
26995 162506295 160857105 159732811 159229197 159239156 159511214 159790584 159958732 160117183 160565881
26986 160565881 161651944 163559625 166192840 169250206 172439071 175667048 179055670 182741842
26978 182741842 186631020 190337415 193356294 195287624 195940489 195322957 193607060 191100969
26970 191100969 188204253 185328378 182800011 180799709 179375800 178497156 178072821 177943221
26962 177943221 177917208 177872316 177832640 177938434 178325980 179016796 179898902 180804187 181613897 182319618
26952 182319618 183022302 183883592 185034467 186465927 187964048 189145872 189603853 189094011
26944 189094011 187645144 185503919 182969325 180265643 177539011 174935440 172668246 171002566
$$ packed form
27003A79356460j778837k125350k280731k284361k210288k135911k078353j956334
26995A62506295j649190j124294n03614R959K72058K79370J68148J58451M48698
26986A60565881J086063J907681K633215L057366L188865L227977L388622L686172
26978A82741842L889178L706395L018879J931330O52865o17532j715897k506091
26970A91100969k896716k875875k528367k000302j423909q78644m24335j29600
26962A77943221k6013m4892l9676J05794L87546O90816Q82106R05285Q09710P05721
26952A82319618P02684Q61290J150875J431460J498121J181824M57981n09842
26944A89094011j448867k141225k534594k703682k726632k603571k267194j665680
$$ plain form
26936 171002566 170148966 170148195 170841053 171921963 173009229 173701623 173630628 172510120 170186810
26927 170186810 166698946 162313694 157479185 152681903 148303801 144580999 141661895 139688408
26919 139688408 138843332 139330640 141270020 144564124 148855966 153618571 158297176 162400870
26911 162400870 165518452 167320133 167615437 166460376 164233238 161606917 159408089 158410856
26903 158410856 159147706 161811894 166265595 172109847 178769401 185589874 191970168 197512603
26895 197512603 202107453 205860136 208862453 210969452 211799846 210993433 208514737 204764196
26887 204764196 200425017 196149718 192284368 188801119 185450793 181982311 178276425 174381030
26879 174381030 170508555 166989260 164125984 161987301 160302478 158596570 156502259 154010060
$$ packed form
26936A71002566q53600p71O92858J080910J087266O92394p0995j120508k323310
26927A70186810l487864m385252m834509m797282m378102l722802k919104j973487
26919A39688408q45076M87308J939380L294104M291842M762605M678605M103694
26911A62400870L117582J801681K95304j155061k227138k626321k198828r97233
26903A58410856P36850K664188M453701N844252O659554O820473O380294N542435
26895A97512603M594850L752683L002317K106999Q30394q06413k478696l750541
26887B04764196m339179m275299l865350l483249l350326l468482l705886l895395
26879A74381030l872475l519295k863276k138683j684823j705908k094311k492199
$$ plain form
26871 154010060 151476234 149415727 148232344 148032371 148606288 149571023 150574082 151439374
26863 151439374 152202644 153064832 154303967 156163423 158747410 161971423 165579902 169203017
26855 169203017 172432910 174915442 176433454 176937199 176503264 175250755 173266009 170574963
26847 170574963 167167136 163039320 158225519 152821147 147037045 141271716 136114516 132217415
26839 132217415 130101369 130023086 131943880 135554853 140319609 145536535 150444635 154380342
26831 154380342 156938006 158055440 157980925 157150531 156052629 155130586 154718028 154996582 155989857
26822 155989857 157595493 159627964 161852433 164022569 165931993 167453070 168533791 169170758
26814 169170758 169409732 169386087 169340822 169540155 170120669 170973919 171774130 172150598 171893326
$$ packed form
26871A54010060k533826k060507j183383j99973N73917R64735J003059Q65292
26863A51439374P63270Q62188J239135J859456K583987L224013L608479L623115
26855A69203017L229893K482532J518012N03745m33935j252509j984746k691046
26847A70574963l407827m127816m813801n404372n784102n765329n157200l897101
26839A32217415k116046p8283J920794L610973M764756N216926M908100L935707
26831A54380342K557664J117434p4515q30394j097902r22043m12558K78554R93275
26822A55989857J605636K032471K224469K170136J909424J521077J080721O36967
26814A69170758K38974k3645m5265J99333N80514Q53250Q00211L76468k57272
$$ plain form
26805 171893326 171055302 169905237 168793068 168022931 167779335 168082478 168747702 169390275 169533024
26796 169533024 168788427 166997907 164240222 160733993 156718448 152382364 147886640 143466465
26788 143466465 139502105 136455041 134720879 134541367 136022395 139180866 143946690 150131597
26780 150131597 157415832 165384195 173615150 181780975 189686346 197220010 204267284 210649257
26772 210649257 216125563 220457214 223497713 225268799 225961926 225819953 224960643 223308981
26764 223308981 220725671 217221742 213075777 208775161 204838349 201635412 199312380 197854213
26756 197854213 197208019 197334872 198159590 199518359 201186479 202964914 204756620 206584599
26748 206584599 208547213 210737804 213169673 215751566 218325572 220723412 222793574 224392612
$$ packed form
26805A71893326q38024j150065j112169p70137k43596L03143O65224O42573J42749
26796A69533024p44597j790520k757685l506229m015545m336084m495724m420175
26788A43466465l964360l047064j734162j79512J481028L158471M765824O184907
26780A50131597P284235P968363Q230955Q165825P905371P533664P047274O381973
26772B10649257N476306M331651L040499J771086O93127j41973q59310j651662
26764B23308981k583310l503929m145965m300616l936812l202937k323032j458167
26756A97854213o46194J26853Q24718J358769J668120J778435J791706J827979
26748B06584599J962614K190591K431869K581893K574006K397840K070162J599038
$$ plain form
26740 224392612 225360415 225520599 224750252 223090592 220787479 218195556 215618162 213209016
26732 213209016 210981066 208872223 206790002 204611892 202199680 199456235 196347475 192844271
26724 192844271 188888186 184490459 179880045 175504064 171844476 169214419 167665904 167002033
26716 167002033 166854255 166812971 166580729 166075774 165424701 164852943 164540113 164514278 164643661
26707 164643661 164742073 164724108 164702366 164968729 165879950 167704196 170493485 174042408 177961644
26698 177961644 181841118 185418493 188643386 191586294 194258189 196478163 197877313 198031269
26690 198031269 196659252 193788549 189785132 185251994 180891266 177375892 175182198 174397846
26682 174397846 174671031 175430462 176251970 177087805 178209771 179963313 182527147 185806509
$$ packed form
26740B24392612R67803J60184p70347j659660k303113k591923k577394k409146
26732B13209016k227950k108843k082221k178110k412212k743445l108760l503204
26724A92844271l956085m397727m610414m375981l659588k630057j548515o63871
26716A67002033j47778m1284k32242n04955o51073n71758l12830k5835J29383
26707A64643661R8412j7965k1742K66363R11221J824246K789289L548923L919236
26698A77961644L879474L577375L224893K942908K671895K219974J399150J53956
26690A98031269j372017k870703m003417m533138m360728l515374k193694p84352
26682A74397846K73185P59431Q21508Q35835J121966J753542K563834L279362
$$ plain form
26674 185806509 189472458 193071022 196119084 198173011 198901049 198164570 196076025 192993026
26666 192993026 189424363 185864547 182627441 179775945 177186778 174680085 172122079 169480391
26658 169480391 166835128 164334924 162130381 160344110 159073379 158377068 158252391 158652878
26650 158652878 159543047 160912645 162716078 164814319 167001383 169086846 170951935 172552052
26642 172552052 173891851 175000054 175930123 176793496 177757231 178929042 180191684 181152859
26634 181152859 181296172 180252345 178008091 174913562 171516107 168371160 165924796 164443013
26626 164443013 163962963 164301829 165139029 166132620 167033208 167772926 168488269 169434200 170802845
26617 170802845 172546807 174339873 175723387 176356049 176223332 175690207 175358683 175798438 177313990
$$ packed form
26674A85806509L665949L598564L048062K053927P28038p36479k088545l082999
26666A92993026l568663l559816l237106k851496k589167k506693k558006k641688
26658A69480391k645263k500204k204543j786271j270731o96311j24677M00487
26650A58652878Q90169J369598J803433K098241K187064K085463J865089J600117
26642A72552052J339799J108203R30069Q63373R63735J171811J262642R61175
26634A81152859J43313j043827k244254l094529l397455l144947k446364j481783
26626A64443013m80050L38866Q37200R93591R00588P39718P15343R45931J368645
26617A70802845J743962J793066J383514O32662j32717n33125l31524M39755J515552
$$ plain form
26608 177313990 179889576 183296546 187227281 191362097 195390837 199050279 202181088 204744160
26600 204744160 206757833 208206105 208996128 208981076 208017202 206023027 203016000 199117815
26592 199117815 194547363 189619333 184718258 180216142 176388042 173405487 171381286 170368219
26584 170368219 170301623 170971420 172055603 173177666 173990000 174294999 174132690 173750569 173469926
26575 173469926 173531801 174006287 174820445 175882924 177195726 178861405 181008499 183704580
26567 183704580 186870664 190219012 193306912 195729870 197301793 198061498 198142457 197667806
26559 197667806 196738482 195447543 193864368 192030580 190024254 188038279 186344591 185129441
26551 185129441 184354952 183787373 183159875 182327418 181313660 180248616 179249259 178318655 177352240
$$ packed form
26608A77313990K575586L406970L930735M134816M028740L659442L130809K563072
26600B04744160K013673J448272P90023j5052r63874j994175l007027l898185
26592A99117815m570452m928030m901075m502116l828100k982555k024201j013067
26584A70368219o6596O69797J084183J122063Q12334L04999j62309l82121k80643
26575A73469926O1875M74486Q14158J062479J312802J665679K147094K696081
26567A83704580L166084L348348L087900K422958J571923P59705Q0959m74651
26559A97667806r29324j290939j583175j833788k006326j985975j693688j215150
26551A85129441p74489n67579o27498q32457j013758j065044r99357r30604r66415
$$ plain form
26542 177352240 176276764 175210040 174477623 174457647 175390785 177284015 179915728 182889697
26534 182889697 185707107 187872415 189059350 189282101 188932196 188609396 188833297 189793731 191270499
26525 191270499 192772425 193810788 194119735 193682684 192587455 190868421 188482448 185414155
26517 185414155 181778050 177817647 173807631 169913851 166084826 162062784 157536590 152327763
26509 152327763 146468266 140154409 133662320 127265786 121163690 115465548 110241144 105562272
26501 105562272 101515533 98221757 95851349 94602912 94645432 96047560 98730526 102480403
26493 102480403 107013594 112036322 117257010 122385991 127171057 131444227 135120935 138163862
26485 138163862 140578434 142453607 143986616 145440319 147052746 148954607 151130693 153446033
$$ packed form
26542A77352240j075476j066724p32417j9976R33138J893230K631713K973969
26534A82889697K817410K165308J186935K22751l49905l22800K23901R60434J476768
26525A91270499J501926J038363L08947m37051j095229j719034k385973l068293
26517A85414155l636105l960403m010016l893780l829025m022042m526194n208827
26509A52327763n859497o313857o492089o396534o102096n698142n224404m678872
26501A05562272m046739l293776k370408j248437M2520J402128K682966L749877
26493A02480403M533191N022728N220688N128981M785066M273170L676708L042927
26485A38163862K414572J875173J533009J453703J612427J901861K176086K315340
$$ plain form
26477 153446033 155745938 157970992 160180405 162469542 164889096 167444866 170138174 172977435
26469 172977435 175958997 179044691 182132531 185029696 187474078 189213008 190088506 190070490
26461 190070490 189207095 187519894 184920938 181222280 176261964 170094171 163124881 156094323
26453 156094323 149911162 145427851 143244815 143585512 146256085 150703286 156156841 161780282
26445 161780282 166768675 170422749 172243988 172016411 169814250 165945928 160893347 155269485
26437 155269485 149778559 145165491 142134379 141221466 142671553 146393189 151998262 158881805
26429 158881805 166334871 173696757 180486829 186439118 191447749 195492005 198592889 200815059
26421 200815059 202278685 203119816 203407826 203106321 202115185 200343245 197767247 194471650
$$ packed form
26477A53446033K299905K225054K209413K289137K419554K555770K693308K839261
26469A72977435K981562L085694L087840K897165K444382J738930Q75498j8016
26461A90070490q63395j687201k598956l698658m960316o167793o969290p030558
26453A56094323o183161m483311k183036L40697K670573M447201N453555N623441
26445A61780282M988393L654074J821239k27577k202161l868322n052581n623862
26437A55269485n490926m613068l031112r12913J450087L721636N605073O883543
26429A58881805P453066P361886O790072N952289N008631M044256L100884K222170
26421B00815059J463626Q41131K88010l01505r91136j771940k575998l295597
$$ plain form
26413 194471650 190641336 186470782 182035562 177233682 171842574 165644729 158555392 150709170
26405 150709170 142482979 134451653 127284941 121611682 117903094 116403665 117076533 119545713
26397 119545713 123096132 126793918 129695099 131036807 130337053 127434769 122538891 116252546
26389 116252546 109464157 103098468 97858648 94095196 91844567 90990312 91431903 93135085
26381 93135085 96044476 99976570 104619714 109641600 114784886 119852982 124617855 128761429
26373 128761429 131928279 133877444 134640729 134565212 134184039 133997610 134304454 135145513 136347743
26364 136347743 137625834 138694970 139366957 139612698 139562515 139445478 139514880 139985433 140963166
26355 140963166 142368544 143911794 145184258 145843469 145772311 145096531 144066667 142924838
$$ packed form
26413A94471650l830314m170554m435220m801880n391108o197845p089337p846222
26405A50709170q226191q031326p166712n673259l708588j499429O72868K469180
26397A19545713L550419L697786K901181J341708o99754k902284m895878o286345
26389A16252546o788389o365689n239820l763452k250629q54255M41591J703182
26381I3135085K909391L932094M643144N021886N143286N068096M764873M143574
26373A28761429L166850J949165P63285p5517l81173j86429L06844Q41059J202230
26364A36347743J278091J069136O71987K45741n0183j17037O9402M70553R77733
26355A40963166J405378J543250J272464O59211p1158o75780j029864j141829
$$ plain form
26347 142924838 141850879 140970563 140359351 140021735 139894188 139909990 140074913 140467185 141163178
26338 141163178 142185967 143538229 145257789 147401306 149966040 152845495 155859946 158805251
26330 158805251 161473935 163674068 165266859 166191527 166460043 166156540 165458334 164629831 163947675
26321 163947675 163594759 163591068 163790981 163945251 163802623 163199441 162102825 160608204 158890748
26312 158890748 157124734 155429291 153888165 152617189 151809732 151710356 152521314 154315426
26304 154315426 157024478 160474708 164408448 168498719 172388651 175746805 178319861 179992781
26296 179992781 180855562 181221177 181535946 182212322 183489585 185395552 187803088 190526279
26288 190526279 193375831 196131478 198501788 200175383 200952606 200837561 199997954 198625021
$$ packed form
26347A42924838j073959q80316o11212l37616j27547J5802J64923L92272O95993
26338A41163178J022789J352262J719560K143517K564734K879455L014451K945305
26330A58805251K668684K200133J592791R24668K68516l03503o98206q28503o82156
26321A63947675l52916l691J99913J54270j42628o03182j096616j494621j717456
26312A58890748j766014j695443j541126j270976q07457r9376Q10958J794112
26304A54315426K709052L450230L933740M090271L889932L358154K573056J672920
26296A79992781Q62781L65615L14769O76376J277263J905967K407536K723191
26288A90526279K849552K755647K370310J673595P77223j15045q39607j372933
$$ plain form
26280 198625021 196814676 194556001 191817269 188662848 185321866 182153157 179526916 177706227
26272 177706227 176787453 176707294 177306748 178421330 179936472 181759121 183721988 185509740
26264 185509740 186704948 186965116 186230352 184814804 183294621 182255400 182071243 182828039
26256 182828039 184367114 186375909 188474837 190278156 191440719 191712635 190995778 189373989
26248 189373989 187093654 184494538 181924536 179678739 177952034 176771592 175950235 175149169
26240 175149169 174038706 172433883 170324749 167817903 165032645 162001242 158630686 154760208
26232 154760208 150304492 145411828 140530053 136325258 133484839 132487806 133444802 136079360
26224 136079360 139836104 144037285 148027808 151302302 153613590 155019496 155812092 156340673
$$ packed form
26280A98625021j810345k258675k738732l154421l340982l168709k626241j820689
26272A77706227r18774q0159N99454J114582J515142J822649J962867J787752
26264A85509740J195208K60168p34764j415548j520183j039221j84157P56796
26256A82828039J539075K008795K098928J803319J162563K71916p16857j621789
26248A89373989k280335k599116k570002k245797j726705j180442q21357q01066
26240A75149169j110463j604823k109134k506846k785258l031403l370556l870478
26232A54760208m455716m892664m881775m204795k840419r97033R56996K634558
26224A36079360L756744M201181L990523L274494K311288J405906P92596N28581
$$ plain form
26216 156340673 156826759 157286074 157595385 157625414 157326834 156742228 155990338 155248045 154715628
26207 154715628 154566633 154918318 155845522 157416980 159710247 162772676 166534748 170735001
26199 170735001 174939123 178685031 181684305 183949634 185752310 187424201 189147827 190892173
26191 190892173 192493108 193749794 194471839 194514094 193823583 192466804 190612610 188490611
26183 188490611 186342613 184367186 182682771 181338567 180354033 179734088 179436676 179346258 179317508
26174 179317508 179249051 179100544 178856999 178501515 178017020 177404177 176692109 175916632 175093858
26165 175093858 174255112 173529334 173167405 173442152 174486735 176223034 178471425 181142598
26157 181142598 184299359 188005615 192118644 196246970 199916912 202788844 204760843 205943832
$$ packed form
26216A56340673M86086M59315L09311L0029k98580n84606p51890p42293n32417
26207A54715628j48995L51685R27204J571458K293267L062429L762072M200253
26199A70735001M204122L745908K999274K265329J802676J671891J723626J744346
26191A90892173J600935J256686P22045M2255o90511j356779j854194k121999
26183A88490611k147998j975427j684415j344204r84534o19945k97412r0418k8750
26174A79317508o8457j48507k43545l55484m84495o12843p12068p75477q22774
26165A75093858q38746p25778l61929K74747J044583J736299K248391K671173
26157A81142598L156761L706256M113029M128326L669942K871932J971999J182989
$$ plain form
26149 205943832 206592207 207054202 207737142 209036210 211200096 214205311 217747570 221349847
26141 221349847 224491997 226705134 227636615 227093561 225067025 221751736 217553045 213031016
26133 213031016 208761763 205170929 202416392 200359728 198637972 196844259 194761641 192497001
26125 192497001 190401169 188832611 187935797 187569284 187396372 187046809 186234461 184784410 182631263
26116 182631263 179876048 176877145 174236305 172603533 172417422 173764413 176407188 179909523
26108 179909523 183783336 187613746 191147956 194363723 197494539 200933033 205013729 209830957
26100 209830957 215243028 221025178 227001136 233045242 238997035 244615607 249650078 253963313
26092 253963313 257576121 260586178 263048906 264929825 266146208 266629787 266355452 265351954
$$ packed form
26149B05943832O48375M61995O82940J299068K163886L005215L542259L602277
26141B21349847L142150K213137R31481n43054k026536l315289m198691m522029
26133B13031016m269253l590834k754537k056664j721756j793713k082618k264640
26125A92497001k095832j568558q96814l66513j72912l49563q12348j450051k153147
26116A82631263k755215k998903k640840j632772j86111J346991K642775L502335
26108A79909523L873813L830410L534210L215767L130816L438494M080696M817228
26100B09830957N412071N782150N975958O044106N951793N618572N034471M313235
26092B53963313L612808L010057K462728J880919J216383M83579k74335j003498
$$ plain form
26084 265351954 263719817 261630102 259273138 256777025 254143752 251236502 247843419 243825637
26076 243825637 239266269 234484127 229899600 225878459 222645628 220266645 218670859 217695473
26068 217695473 217133674 216798779 216613789 216659700 217107815 218075732 219510612 221161195 222651372
26059 222651372 223627648 223899524 223483586 222539956 221271489 219851434 218389158 216912343
26051 216912343 215354800 213581667 211497856 209191850 206968357 205207999 204169954 203872491
26043 203872491 204073571 204330313 204132339 203065053 200917518 197704168 193650681 189174814
26035 189174814 184813103 181060480 178204494 176275693 175138394 174634782 174674546 175231332
26027 175231332 176288912 177796252 179657443 181756559 183995604 186297619 188554154 190573272
$$ packed form
26084B65351954j632137k089715k356964k496113k633273k907250l393083m017782
26076B43825637m559368m782142m584527m021141l232831k378983j595786r75386
26068B17695473n61799l34895j84990M5911M48115R67917J434880J650583J490177
26059B22651372R76276K71876m15938r43630j268467j420055j462276j476815
26051B16912343j557543j773133k083811k306006k223493j760358j038045k97463
26043B03872491K01080K56742j97974j067286k147535l213350m053487m475867
26035A89174814m361711l752623k855986j928801j137299n03612L9764N56786
26027A75231332J057580J507340J861191K099116K239045K302015K256535K019118
$$ plain form
26019 190573272 192093314 192854436 192682765 191560895 189660007 187307907 184908433 182852640
26011 182852640 181432547 180764001 180775379 181310471 182278075 183714874 185720731 188342696 191490337
26002 191490337 194907305 198202100 200949312 202836666 203769040 203851218 203271945 202189549
25994 202189549 200688712 198786459 196420832 193417562 189528024 184594998 178736777 172391190
25986 172391190 166195758 160783006 156562511 153571505 151494430 149861840 148302518 146698605
25978 146698605 145198301 144137802 143918614 144844733 146946474 149889281 153066617 155846025
25970 155846025 157813968 158899922 159375735 159759148 160625514 162363975 164984160 168091883
25962 168091883 171067634 173350383 174653775 174999272 174606534 173768099 172766651 171815517
$$ packed form
26019A90573272J520042P61122j71671j121870j900888k352100k399474k055793
26011A82852640j420093o68546J1378N35092R67604J436799K005857K621965L147641
26002A91490337L416968L294795K747212J887354R32374Q2178n79273j082396
25994B02189549j500837j902253k365627l003270l889538m933026n858221o345587
25986A72391190o195432n412752m220495k991006k077075j632590j559322j603913
25978A46698605j500304j060499k19188R26119K101741K942807L177336K779408
25970A55846025J967943J085954M75813L83413Q66366J738461K620185L107723
25962A68091883K975751K282749J303392L45497l92738q38435j001448r51134
$$ plain form
25954 171815517 171033638 170486873 170249835 170394843 170897359 171562165 172079385 172196104 171864697
25945 171864697 171247502 170609912 170232063 170380302 171254730 172872502 174982343 177123936 178813485
25936 178813485 179722119 179744262 178955207 177523557 175655663 173600374 171664219 170178680
25928 170178680 169430492 169602566 170743612 172742444 175295892 177934595 180171159 181709310
25920 181709310 182579288 183123454 183836262 185124361 187105430 189554438 192014769 193984197
25912 193984197 195058158 194998649 193775658 191588003 188809181 185854018 183053212 180618559
25904 180618559 178684207 177331112 176542991 176152391 175866562 175384679 174529379 173301537 171830957
25895 171830957 170271083 168713539 167163700 165553367 163750042 161571507 158847437 155530862
$$ packed form
25954A71815517p81879n46765k37038J45008N02516O64806N17220J16719l31407
25945A71864697o17195o37590l77849J48239Q74428J617772K109841K141593J689549
25936A78813485R08634K2143p89055j431650j867894k055289j936155j485539
25928A70178680p48188J72074J141046J998832K553448K638703K236564J538151
25920A81709310Q69978N44166P12808J288099J981069K449008K460331J969428
25912A93984197J073961n9509j222991k187655k778822k955163k800806k434653
25904A80618559j934352j353095p88121l90600k85829m81883q55300j227842j470580
25895A71830957j559874j557544j549839j610333j803325k178535k724070l316575
$$ plain form
25887 155530862 151780611 147918600 144270573 141009979 138110676 135408701 132698197 129800165
25879 129800165 126616111 123214900 119928980 117349557 116158155 116873980 119669005 124344360
25871 124344360 130442076 137388199 144588535 151470901 157501266 162215486 165308363 166748570
25863 166748570 166807585 165945694 164635905 163243125 161993750 161003386 160323914 159983703 160021439
25854 160021439 160520720 161604685 163352283 165698061 168416498 171194175 173720649 175761864
25846 175761864 177206528 178060561 178372808 178126502 177185409 175365638 172597776 169059004
25838 169059004 165178762 161510646 158548461 156592284 155718969 155835423 156749475 158218852
25830 158218852 160005101 161953751 164060710 166477372 169431889 173064717 177251260 181558945
$$ packed form
25887A55530862l750251l862011l648027l260594k899303k701975k710504k898032
25879A29800165l184054l401211l285920k579423j191402P15825K795025M675355
25871A24344360O097716O946123P200336O882366O030365M714220L092877J440207
25863A66748570N9015q61891j309789j392780j249375r90364o79472l40211L7736
25854A60021439M99281J083965J747598K345778K718437K777677K526474K041215
25846A75761864J444664Q54033L12247k46306r41093j819771k767862l538772
25838A69059004l880242l668116k962185j956177q73315J16454R14052J469377
25830A58218852J786249J948650K106959K416662K954517L632828M186543M307685
$$ plain form
25822 181558945 185394130 188205795 189593584 189329984 187385520 183950705 179388040 174127781
25814 174127781 168589752 163180077 158337914 154544440 152218926 151555926 152464260 154659358
25806 154659358 157760650 161280122 164606011 167116753 168374040 168257188 166986573 165050167
25798 165050167 163051846 161525123 160789121 160915274 161814869 163372891 165526353 168260394
25790 168260394 171564450 175365317 179434171 183332556 186488710 188380746 188698436 187400011
25782 187400011 184676381 180867241 176373840 171614899 167027653 163042354 159978757 157931283
25774 157931283 156751813 156141147 155766615 155340925 154668349 153682901 152453045 151117247 149799797
25765 149799797 148602039 147667757 147210645 147434909 148423805 150108954 152333879 154941336
$$ packed form
25822A81558945L835185K811665J387789k63600j944464l434815m562665n260259
25814A74127781n538029n409675m842163l793474k325514o63000R08334K195098
25806A54659358L101292L519472L325889K510742J257287j16852j270615j936406
25798A65050167j998321j526723p36002J26153Q99595J558022K153462K734041
25790A68260394L304056L800867M068854L898385L156154J892036L17690j298425
25782A87400011k723630l809140m493401m758941m587246l985299l063597k047474
25774A57931283j179470o10666l74532m25690o72576r85448j229856j335798j317450
25765A49799797j197758r34282m57112K24264R88896J685149K224925K607457
$$ plain form
25757 154941336 157814930 160856153 163927149 166821302 169328821 171388014 173201893 175198918
25749 175198918 177836731 181370250 185727150 190541236 195290942 199462303 202671311 204703291
25741 204703291 205480548 205023276 203436027 200876435 197492919 193418454 188873204 184261595
25733 184261595 180107057 176840726 174622909 173333763 172710482 172521728 172682379 173251203
25725 173251203 174322860 175906204 177880638 180041011 182172031 184090457 185648461 186727634
25717 186727634 187224591 187027780 186036064 184247428 181844285 179177220 176647650 174585897
25709 174585897 173207223 172638960 172961601 174223563 176413409 179389754 182806251 186103532
25701 186103532 188610698 189727824 189116061 186808271 183177775 178778117 174139206 169626769
$$ packed form
25757A54941336K873594L041223L070996K894153K507519K059193J813879J997025
25749A75198918K637813L533519M356900M814086M749706M171361L209008K031980
25741B04703291P77257m57272j587249k559592l383516m074465m545250m611609
25733A84261595m154538l266331k217817j289146o23281j88754J60651N68824
25725A73251203J071657J583344J974434K160373K131020J918426J558004J079173
25717A86727634M96957j96811r91716j788636k403143k667065k529570k061753
25709A74585897j378674n68263L22641J261962K189846K976345L416497L297281
25701A86103532K507166J117126o11763k307790l630496m399658m638911m512437
$$ plain form
25693 169626769 165433755 161678195 158501423 156085153 154591891 154080471 154459877 155525207
25685 155525207 157043499 158802018 160583804 162129000 163163721 163504246 163150444 162289644
25677 162289644 161226243 160291557 159750813 159711087 160067640 160545015 160843873 160820643 160601010
25668 160601010 160568950 161221807 162950778 165867047 169758931 174163521 178490089 182160934
25660 182160934 184747172 186058008 186151366 185264094 183678544 181571381 178929016 175595937
25652 175595937 171433728 166490437 161075131 155701247 150952230 147341565 145199802 144612807
25644 144612807 145434437 147353274 149961734 152813523 155500508 157752262 159508073 160919830
25636 160919830 162304545 164079557 166661093 170310026 174990238 180331083 185731945 190584780
$$ packed form
25693A69626769m193014l755560l176772k416270j493262n11420L79406J065330
25685A55525207J518292J758519J781786J545196J034721L40525l53802q60800
25677A62289644j063401r34686n40744l9726L56553M77375K98858k3230k19633
25668A60601010l2060O52857J728971K916269L891884M404590M326568L670845
25660A82160934K586238J310836R3358q87272j585550k107163k642365l333079
25652A75595937m162209m943291n415306n373884m749017l610665k141763n86995
25644A44612807Q21630J918837K608460K851789K686985K251754J755811J411757
25636A60919830J384715J775012K581536L648933M680212N340845N400862M852835
$$ plain form
25628 190584780 194520135 197538680 199955955 202205922 204605568 207182303 209638061 211457451
25620 211457451 212090702 211126614 208414839 204118473 198669942 192639614 186591059 181000454
25612 181000454 176247682 172615641 170239631 169033591 168699903 168877910 169323332 169966034
25604 169966034 170847115 172058729 173735587 176034608 179073116 182880286 187389339 192424929
25596 192424929 197667388 202654411 206869050 209873047 211412094 211476338 210325418 208440278
25588 208440278 206371934 204555456 203197773 202270088 201555030 200715219 199398143 197365308
25580 197365308 194579688 191201321 187499441 183725538 180005239 176311635 172551001 168711908
25572 168711908 164962460 161601727 158887695 156883632 155455794 154410576 153635149 153136915
$$ packed form
25628A90584780L935355L018545K417275K249967K399646K576735K455758J819390
25620B11457451O33251r64088k711775m296366n448531o030328o048555n590605
25612A81000454m752772l632041k376010j206040l33688J78007M45422O42702
25604A69966034Q81081J211614J676858K299021L038508L807170M509053N035590
25596A92424929N242459M987023M214639L003997J539047O4244j150920j885140
25588B08440278k068344j816478j357683r27685p15058q39811j317076k032835
25580A97365308k785620l378367l701880l773903l720299l693604l760634l839093
25572A68711908l749448l360733k714032k004063j427838j045218p75427m98234
$$ plain form
25564 153136915 152997800 153312272 154138094 155459317 157178955 159144697 161158805 162939709
25556 162939709 164090108 164163159 162850754 160198273 156685608 153089986 150205184 148586759
25548 148586759 148454007 149762005 152354527 156072620 160736822 166037146 171480668 176516017
25540 176516017 180766987 184180223 186976798 189471267 191888374 194249875 196336963 197730155
25532 197730155 197937784 196583330 193575989 189180736 183924747 178362033 172846316 167476451
25524 167476451 162225690 157113416 152272643 147870474 143956060 140385136 136923128 133451123
25516 133451123 130093678 127186283 125133330 124223937 124468431 125555935 126990942 128320447
25508 128320447 129288107 129836228 130021903 129967167 129865052 129968190 130524677 131692597 133480124
$$ packed form
25564A53136915j39115L14472Q25822J321223J719638J965742K014108J780904
25556A62939709J150399P3051j312405k652481l512665l595622k884802j618425
25548A48586759j32752J307998K592522L718093M664202N300324N443522N035349
25540A76516017M250970L413236K796575K494469K417107K361501K087088J393192
25532A97730155K07629j354454l007341m395253n255989n562714n515717n369865
25524A67476451n250761n112274m840773m402169l914414l570924l462008l472005
25516A33451123l357445k907395k052953r09393K44494J087504J435007J329505
25508A28320447R67660N48121J85675n4736j02115J03138N56487J167920J787527
$$ plain form
25499 133480124 135756919 138334249 141037120 143720457 146277799 148694790 151113704 153826624
25491 153826624 157156251 161271079 166050413 171098083 175892386 179961202 182986483 184827124
25483 184827124 185492916 185090889 183759236 181616951 178761174 175321851 171532858 167740581
25475 167740581 164308680 161474574 159268776 157567803 156240151 155253500 154652002 154444459
25467 154444459 154508528 154585950 154389297 153762110 152771411 151664550 150739211 150219112 150197243
25458 150197243 150662788 151566278 152835465 154309069 155660246 156415491 156108312 154499714
25450 154499714 151723441 148244889 144664764 141506532 139086384 137473213 136515135 135918608
25442 135918608 135373300 134695756 133922984 133290186 133099116 133562579 134723021 136472487 138632503
$$ packed form
25499A33480124K276795K577330K702871K683337K557342K416991K418914K712920
25491A53826624L329627M114828M779334N047670M794303M068816L025281J840641
25483A84827124O65792m02027j331653k142285k855777l439323l788993l792277
25475A67740581l431901k834106k205798j700973j327652r86651o01498k07543
25467A54444459O4069P7422j96653o27187r90699j106861r25339n20099k1869
25458A50197243M65545R03490J269187J473604J351177P55245l07179j608598
25450A54499714k776273l478552l580125l158232k420148j613171r58078n96527
25442A35918608n45308o77544p72772o32798j91070M63463J160442J749466K160016
$$ plain form
25433 138632503 141045384 143636746 146425108 149498076 152989692 157057932 161837060 167358741
25425 167358741 173474204 179829342 185923248 191240635 195410231 198301035 199987603 200620505
25417 200620505 200303633 199040569 196764319 193440977 189181515 184257837 178992458 173614448
25409 173614448 168201306 162738710 157237503 151822009 146742811 142316550 138814478 136340877
25401 136340877 134768489 133786043 133044885 132314126 131558137 130937144 130774422 131487431 133455584
25392 133455584 136855931 141563327 147195882 153271094 159327845 164928179 169619823 172977266
25384 172977266 174711937 174739277 173142873 170106115 165910471 160990167 155930881 151346573
25376 151346573 147718658 145321025 144234882 144386472 145585816 147571391 150044935 152684743
$$ packed form
25433A38632503K412881K591362K788362L072968L491616M068240M779128N521681
25425A67358741O115463O355138O093906N317387M169596K890804J686568O32902
25417B00620505l16872j263064k276250l323342m259462m923678n265379n378010
25409A73614448n413142n462596n501207n415494n079198m426261l502072k473601
25401A36340877j572388r82446p41158p30759p55989o20993j62722P13009J968153
25392A33455584L400347M707396N632555O075212O056751N600334M691644L357443
25384A72977266J734671K7340j596404l036758m195644m920304n059286m584308
25376A51346573l627915k397633j086143J51590J199344J985575K473544K639808
$$ plain form
25368 152684743 155156523 157154966 158486105 159152540 159369053 159464979 159725418 160287325 161143727
25359 161143727 162189980 163251356 164151450 164865579 165626666 166823518 168737698 171326645
25351 171326645 174215533 176888108 178911539 180031269 180127838 179158448 177178287 174414721
25343 174414721 171301992 168425825 166386500 165608717 166167648 167743404 169757375 171623260
25335 171623260 172986829 173845660 174487826 175273967 176398320 177795485 179238416 180511451
25327 180511451 181519171 182286624 182885525 183356510 183697910 183936467 184208213 184755831 185832357
25318 185832357 187587953 190015737 192966992 196206383 199491044 202649468 205606058 208327038
25310 208327038 210737119 212672049 213884631 214105223 213160570 211091422 208161314 204742711
$$ packed form
25368A52684743K471780J998443J331139O66435K16513R5926K60439N61907Q56402
25359A61143727J046253J061376R00094P14129P61087J196852J914180K588947
25351A71326645K888888K672575K023431J119730R6569r69390j980161k763566
25343A74414721l112729k876167k039325p77783N58931J575756K013971J865885
25335A71623260J363569Q58831O42166P86141J124353J397165J442931J273035
25327A80511451J007720P67453N98901M70985L41400K38557K71746N47618J076526
25318A85832357J755596K427784K951255L239391L284661L158424K956590K720980
25310B08327038K410081J934930J212582K20592r44653k069148k930108l418603
$$ plain form
25302 204742711 201189120 197780995 194737722 192254916 190535290 189778001 190103797 191445523
25294 191445523 193475919 195628945 197221743 197638824 196514625 193847449 189989707 185506154
25286 185506154 180975334 176846188 173388399 170691900 168690842 167232727 166175649 165445617
25278 165445617 165020291 164878315 164968775 165216512 165548006 165911159 166269588 166580762 166785242
25269 166785242 166822121 166657075 166291153 165733083 164955364 163880962 162428338 160581922 158421448
25260 158421448 156081028 153672526 151238617 148781455 146333180 143967456 141716653 139486202
25252 139486202 137068154 134261166 131022659 127548047 124210627 121399086 119363168 118155272
25244 118155272 117688323 117876553 118768932 120558085 123437172 127423369 132288105 137613874
$$ packed form
25302B04742711l553591l408125l043273k482806j719626p57289L25796J341726
25294A91445523K030396K153026J592798M17081j124199k667176l857742m483553
25286A85506154m530820m129146l457789k696499k001058j458115j057078p30032
25278A65445617m25326j41976R0460K47737L31494L63153L58429L11174K04480
25269A66785242L6879j65046l65922n58070p77719j074402j452624j846416k160474
25260A58421448k340420k408502k433909k457162k448275k365724k250803k230451
25252A39486202k418048k806988l238507l474612l337420k811541k035918j207896
25244A18155272m66949J88230Q92379J789153K879087L986197M864736N325769
$$ plain form
25236 137613874 142908292 147720875 151735278 154804505 156910007 158077414 158321753 157671312
25228 157671312 156252733 154371095 152516075 151266455 151125556 152362065 154936030 158562454
25220 158562454 162888218 167668460 172822520 178334104 184074718 189697478 194686800 198512087
25212 198512087 200781360 201327189 200196341 197573599 193724145 188998855 183856120 178831002
25204 178831002 174441231 171075717 168915872 167923971 167911499 168660832 170035365 172010096
25196 172010096 174609084 177814001 181515501 185511977 189525195 193235949 196360995 198734537
25188 198734537 200317193 201122925 201139993 200333676 198751367 196632608 194386351 192424106
25180 192424106 190985861 190084744 189571583 189248710 188969148 188669160 188325615 187917566 187458757
$$ packed form
25236A37613874N294418M812583M014403L069227K105502J167407K44339o50441
25228A57671312j418579j881638j855020j249620j40899J236509K573965L626424
25220A58562454M325764M780242N154060N511584N740614N622760M989322L825287
25212A98512087K269273N45829j130848k622742l849454m725290n142735n025118
25204A78831002m389771l365514k159845r91901j2472P49333J374533J974731
25196A72010096K598988L204917L701500L996476M013218L710754L125046K373542
25188A98734537J582656Q05732J7068q06317j582309k118759k246257j962245
25180A92424106j438245r01117n13161l22873k79562k99988l43545m08049m58809
$$ plain form
25171 187458757 187033554 186746962 186640257 186676111 186797346 186987992 187277825 187685695 188151878
25162 188151878 188520668 188590739 188196600 187268335 185843767 184045533 182049173 180050781 178224298
25153 178224298 176666993 175364736 174223259 173155762 172137767 171171543 170234660 169316255
25145 169316255 168504598 168005976 168074877 168928962 170688016 173328316 176653898 180305429 183819427
25136 183819427 186739783 188758477 189803976 190008884 189611840 188898994 188184966 187762585 187827613
25127 187827613 188457381 189652642 191349035 193353035 195306778 196800663 197583813 197695975
25119 197695975 197407616 197021182 196705774 196498530 196422524 196557615 197004879 197819895 198980951
25110 198980951 200400132 201951685 203472634 204731565 205431400 205289250 204146779 202036716
$$ packed form
25171A87458757m25203k86592j06705L5854J21235J90646K89833M07870M66183
25162A88151878L68790P0071l94139r28265j424568j798234j996360j998392j826483
25153A78224298j557305j302257j141477j067497j017995r66224r36883r18405
25145A69316255q11657m98622O8901Q54085J759054K640300L325582L651531L513998
25136A83819427K920356K018694J045499K04908l97044p12846p14028m22381O5028
25127A87827613O29768J195261J696393K004000J953743J493885P83150J12162
25119A97695975k88359l86434l15408k07244p6006J35091M47264Q15016J161056
25110A98980951J419181J551553J520949J258931O99835j42150j142471k110063
$$ plain form
25102 202036716 199182450 195953231 192790276 190107053 188190554 187143610 186881081 187171574
25094 187171574 187716365 188238147 188535079 188484719 188029684 187193934 186127993 185107364 184442978
25085 184442978 184369267 184980721 186222939 187937719 189967501 192268738 194945096 198172211
25077 198172211 202069167 206577811 211383597 215920028 219490585 221473016 221519079 219672225
25069 219672225 216347295 212165238 207738316 203533655 199834588 196736952 194170818 191979063
25061 191979063 190018970 188206412 186479486 184743114 182876240 180823819 178694522 176740490
25053 176740490 175198744 174137217 173464581 173092279 173072387 173567463 174698647 176419855 178484504
25044 178484504 180492429 182016668 182789852 182857473 182600187 182602018 183413565 185315479 188216476
$$ packed form
25102B02036716k854266l229219l162955k683223j916499j046944k62529K90493
25094A87171574N44791N21782K96932n0360m55035q35750j065941j020629o64386
25085A84442978p3711O11454J242218J714780K029782K301237K676358L227115
25077A98172211L896956M508644M805786M536431L570557J982431M6063j846854
25069B19672225l324930m182057m426922m204661l699067l097636k566134k191755
25061A91979063j960093j812558j726926j736372j866874k052421k129297j954032
25053A76740490j541746j061527o72636l72302j9892M95076J131184J721208K064649
25044A78484504K007925J524239P73184O7621k57286J831Q11547J901914K900997
$$ plain form
25035 188216476 191745611 195452038 198969187 202076567 204672318 206690704 208019640 208489530
25027 208489530 207963395 206476392 204311805 201933948 199819239 198304584 197523854 197414232
25019 197414232 197761714 198284905 198731940 198928607 198766753 198195614 197249289 196064783 194837898
25010 194837898 193726615 192759198 191791004 190530359 188646292 185926547 182391613 178275097
25002 178275097 173878456 169418302 164981343 160594450 156331568 152366293 148927676 146195118
24994 146195118 144216265 142910904 142145972 141802013 141787462 142043685 142575540 143466334 144833395
24985 144833395 146746377 149159631 151891342 154670226 157247634 159510874 161516106 163435785
24977 163435785 165472799 167770952 170328139 172950256 175314040 177134491 178315004 178956743
$$ packed form
25035A88216476L529135L706427L517149L107380K595751K018386J328936M69890
25027B08489530n26135j487003k164587k377857k114709j514655p80730j09622
25019A97414232L47482N23191M47035J96667j61854n71139r46325j184506j226885
25010A94837898j111283r67417r68194j260645j884067k719745l534934m116516
25002A78275097m396641m460154m436959m386893m262882l965275l438617k732558
24994A46195118j978853j305361p64932l43959j4551K56223N31855Q90794J367061
24985A44833395J912982K413254K731711K778884K577408K263240K005232J919679
24977A63435785K037014K298153K557187K622117K363784J820451J180513O41739
$$ plain form
24969 178956743 179225623 179199009 178826374 178032101 176869098 175583574 174514000 173900693 173772044
24960 173772044 173980220 174310947 174570924 174631105 174438533 173989540 173270093 172210715 170690741
24951 170690741 168585631 165842142 162552350 158963304 155376087 151984258 148771467 145538943
24943 145538943 142033342 138086608 133678324 128905781 123938333 119014840 114461113 110680538
24935 110680538 108081844 106933615 107219808 108622989 110663230 112885808 114984789 116830068
24927 116830068 118427085 119863103 121282344 122877676 124851279 127346010 130418657 134090464
24919 134090464 138400744 143383563 148994836 155066323 161315876 167392011 172914345 177486619
24911 177486619 180706518 182239369 181974765 180150250 177288708 173970435 170647651 167640839
$$ packed form
24969A78956743K68880k6614l72635p94273j163003j285524j069574o13307j28649
24960A73772044K08176L30727K59977O0181j92572m48993p19447j059378j519974
24951A70690741k105110k743489l289792l589046l587217l391829l212791l232524
24943A45538943l505601l946734m408284m772543m967448m923493m553727l780575
24935A10680538k598694j148229K86193J403181K040241K222578K098981J845279
24927A16830068J597017J436018J419241J595332J973603K494731L072647L671807
24919A34090464M310280M982819N611273O071487O249553O076135N522334M572274
24911A77486619L219899J532851k64604j824515k861542l318273l322784l006812
$$ plain form
24903 167640839 165220470 163607967 162884665 162922726 163408415 163929131 164071792 163521356 162172413
24894 162172413 160212371 158077320 156261753 155100732 154651256 154708304 154928391 154999332 154765810
24885 154765810 154248663 153574671 152876743 152221774 151607191 151016764 150465729 149988367 149613552
24876 149613552 149389293 149421313 149842203 150720041 152016956 153660864 155653200 158087836 161050126
24867 161050126 164479294 168105852 171510035 174252967 176011667 176695484 176511976 175922298
24859 175922298 175491894 175718132 176910504 179157287 182364647 186318128 190737378 195337369
24851 195337369 199899411 204321154 208619959 212894440 217264036 221800173 226450512 230972347
24843 230972347 234926866 237778342 239080267 238667658 236757051 233902785 230828697 228194258
$$ packed form
24903A67640839k420369j612503p23302L8061M85689N20716J42661n50436j348943
24894A62172413j960042k135051j815567j161021m49476N7048K20087P0941k33522
24885A54765810n17147o73992o97928o54969o14583n90427n51035m77362l74815
24876A49613552k24259L2020M20890Q77838J296915J643908J992336K434636K962290
24867A61050126L429168L626558L404183K742932J758700O83817j83508n89678
24859A75922298m30404K26238J192372K246783L207360L953481M419250M599991
24851A95337369M562042M421743M298805M274481M369596M536137M650339M521835
24843B30972347L954519K851476J301925m12609j910607k854266l074088k634439
$$ plain form
24835 228194258 226377906 225373260 224856017 224393024 223666406 222558864 221070234 219186414
24827 219186414 216825286 213884053 210341441 206352599 202272680 198569600 195662497 193779270
24819 193779270 192885657 192674434 192634966 192261007 191337643 190097443 189102554 188955286 190077660
24810 190077660 192672908 196764069 202173177 208457222 214924850 220794237 225409170 228380042
24802 228380042 229600236 229188599 227418602 224637387 221169344 217248503 213018930 208574370
24794 208574370 203987565 199317230 194595234 189805118 184893140 179824539 174627225 169377701
24786 169377701 164165577 159103833 154384356 150297736 147161719 145193692 144403579 144571948
24778 144571948 145328821 146282869 147148505 147839394 148465244 149196345 150083457 150973472 151588577
$$ packed form
24835B28194258j816352j004646n17243m62993p26618j107542j488630j883820
24827B19186414k361128k941233l542612l988842m079919l703080k907103j883227
24819A93779270q93613k11223l9468l73959r23364j240200r94889j47268J122374
24810A90077660K595248M091161N409108O284045O467628N869387M614933K970872
24802B28380042J220194m11637j769997k781215l468043l920841m229573m444560
24794B08574370m586805m670335m721996m790116m911978n068601n197314n249524
24786A69377701n212124n061744m719477m086620l136017j968027p90113J68369
24778A44571948P56873R54048Q65636O90889O25850P31101Q87112Q90015O15105
$$ plain form
24769 151588577 151721659 151410407 150959585 150805579 151341586 152813103 155285503 158637562 162575364
24760 162575364 166675533 170444660 173386660 175079385 175250363 173829136 170958672 166978043
24752 166978043 162396735 157842309 153944708 151168412 149675380 149316658 149771122 150734691
24744 150734691 152030771 153617119 155566553 158048944 161261330 165308666 170120880 175452674
24736 175452674 180932809 186126706 190603524 193994420 196026459 196542666 195532160 193160454
24728 193160454 189750757 185692203 181323334 176865229 172432171 168093280 163943066 160150825
24720 160150825 156972068 154716765 153674427 153996565 155577337 158022391 160755986 163215583
24712 163215583 165024188 166054805 166374998 166127781 165439882 164405629 163097032 161533307
$$ packed form
24769A51588577J33082l11252m50822j54006N36007J471517K472400L352059L937802
24760A62575364M100169L769127K942000J692725J70978j421227k870464l980629
24752A66978043m581308m554426l897601k776296j493032l58722M54464R63569
24744A50734691J296080J586348J949434K482391L212386M047336M812214N331794
24736A75452674N480135N193897M476818L390896K032039N16207j010506k371706
24728A93160454l409697m058554m368869m458105m433058m338891m150214l792241
24720A60150825l178757k255303j042338L22138J580772K445054K733595K459597
24712A63215583J808605J030617L20193k47217o87899j034253j308597j563725
$$ plain form
24704 161533307 159632519 157237440 154258717 150840714 147380696 144339664 141978552 140222530
24696 140222530 138736120 137144816 135282965 133336193 131792712 131247213 132189622 134869690
24688 134869690 139240524 144961353 151472798 158153118 164500174 170243121 175328992 179816073
24680 179816073 183758989 187152157 189944728 192104922 193700449 194949623 196189392 197744317
24672 197744317 199765978 202156728 204622963 206794628 208327779 208959850 208523511 206940829
24664 206940829 204232465 200564200 196297799 191957807 188074871 185008334 182887565 181672865
24656 181672865 181229315 181372559 181933700 182837712 184116786 185842723 188044499 190653437
24648 190653437 193475631 196194299 198406103 199691495 199729110 198444476 196111551 193296457
$$ packed form
24704A61533307j900788k395079k978723l418003l460018l041032k361112j756022
24696A40222530j486410j591304j861851j946772j543481n45499R42409K680068
24688A34869690M370834N720829O511445O680320O347056N742947N085871M487081
24680A79816073L942916L393168K792571K160194J595527J249174J239769J554925
24672A97744317K021661K390750K466235K171665J533151O32071m36339j582682
24664B06940829k708364l668265m266401m339992l882936l066537k120769j214700
24656A81672865m43550J43244N61141R04012J279074J725937K201776K608938
24648A90653437K822194K718668K211804J285392L7615j284634k332925k815094
$$ plain form
24640 193296457 190641470 188638155 187542049 187431100 188292402 190039749 192458931 195166912
24632 195166912 197676685 199549698 200517738 200500210 199553317 197819641 195509635 192908146
24624 192908146 190362009 188209261 186687473 185900629 185862233 186557441 187961172 190005470
24616 190005470 192546183 195371619 198239361 200905972 203151545 204819016 205859389 206368988
24608 206368988 206621929 207065340 208199317 210327264 213308890 216506471 218997790 219946964
24600 219946964 218939607 216137755 212213102 208093692 204609186 202180725 200722372 199817535
24592 199817535 199059576 198342504 197925023 198248457 199653449 202174492 205502524 209103849
24584 209103849 212429691 215126258 217137707 218635397 219816893 220694257 220987657 220187535
$$ packed form
24640A93296457k654987k003315j096106j10949Q61302J747347K419182K707981
24632A95166912K509773J873013R68040j7528r46893j733676k310006k601489
24624A92908146k546137k152748j521788p86844l8396O95208J403731K044298
24616A90005470K540713K825436K867742K666611K245573J667471J040373N09599
24608B06368988K52941M43411J133977K127947K981626L197581K491319R49174
24600B19946964j007357k801852l924653m119410l484506k428461j458353r04837
24592A99817535p57959p17072m17481L23434J404992K521043L328032L601325
24584B09103849L325842K696567K011449J497690J181496Q77364K93400q00122
$$ plain form
24576 220187535 217755371 213353491 206987403 198997736 189937582 180449608 171202273 162830142
24568 162830142 155843312 150572725 147198625 145807398 146406802 148883110 152924025 157973046
24560 157973046 163298933 168198522 172226731 175285635 177513543 179099286 180183527 180866385
24552 180866385 181221250 181262315 180925233 180122660 178831033 177115199 175088219 172888511 170696862
24543 170696862 168732619 167204577 166256861 165937931 166190503 166859422 167712982 168477457 168900815
24534 168900815 168842196 168331253 167528821 166593772 165553665 164271599 162521611 160140724 157200168
24525 157200168 154091717 151449493 149938350 150009147 151727316 154767432 158579183 162607138
24517 162607138 166442107 169877385 172888059 175541298 177876942 179841433 181318043 182211240
$$ packed form
24576B20187535k432164m401880o366088p989667r060154r487974r247335q372131
24568A62830142o986830n270587l374100j391227N99404K476308M040915N049021
24560A57973046N325887M899589M028209L058904K227908J585743J084241O82858
24552A80866385L54865M1065l37082q02573j291627j715834k026980k199708k191649
24543A70696862j964243j528042r47716l18930K52572O68919Q53560P64475M23358
24534A68900815n8619n10943q02432r35049j040107j282066j749988k380887k940556
24525A57200168l108451k642224j511143P0797J718169L040116L811751M027955
24517A62607138L834969L435278L010674K653239K335644J964491J476610Q93197
$$ plain form
24509 182211240 182513435 182315016 181767867 181039340 180284591 179644901 179264771 179309986 179977509
24500 179977509 181505745 184171691 188219646 193701994 200330104 207475869 214349192 220234455
24492 220234455 224646769 227360084 228354934 227757205 225800216 222799500 219119680 215123093
24484 215123093 211111376 207299174 203851110 200947166 198790660 197526118 197143852 197470448
24476 197470448 198244612 199183187 199977942 200275385 199728491 198132033 195548551 192314523 188910110
24467 188910110 185777440 183179549 181137766 179460599 177862289 176127124 174245506 172441818
24459 172441818 171056441 170352761 170382847 170979814 171852699 172732381 173505373 174244448 175085471
24450 175085471 176046134 176962465 177591536 177756985 177418765 176668462 175693732 174711004 173858849
$$ packed form
24509A82211240L02195j98419n47149p28527p54749o39690l80130M5215O67523
24500A79977509J528236K665946M047955N482348O628110P145765O873323N885263
24492B20234455M412314K713315R94850n97729j956989l000716l679820l996587
24484B15123093m011717l812202l448064k903944k156506j264542l82266L26596
24476A97470448P74164R38575P94755K97443n46894j596458k583482l234028l404413
24467A88910110l132670k597891k041783j677167j598310j735165j881618j803688
24459A72441818j385377p03680L0086N96967Q72885Q79682P72992P39075Q41023
24450A75085471R60663R16331O29071J65449l38220p50303r74730r82728q52155
$$ plain form
24441 173858849 173114552 172340626 171470378 170673677 170333281 170854812 172476964 175179850 178673896
24432 178673896 182461957 186004789 188933962 191157855 192791330 194011905 194965438 195734793
24424 195734793 196341027 196784767 197118629 197474891 197996061 198726532 199566924 200320626 200787574
24415 200787574 200848500 200487875 199733853 198575777 196950891 194810679 192196855 189260558
24407 189260558 186210572 183235352 180466645 177997563 175906295 174263245 173143273 172630027
24399 172630027 172770973 173506310 174653626 175985660 177343669 178693089 180097581 181663187
24391 181663187 183484636 185579027 187808397 189841529 191212295 191471491 190351966 187860802
24383 187860802 184285192 180138168 176036196 172503212 169783033 167799944 166316465 165162696
$$ packed form
24441A73858849p44297p73926q70248p96701l40396N21531J622152K702886L494046
24432A78673896L788061L542832K929173K223893J633475J220575R53533P69355
24424A95734793O06234M43740L33862L56262N21170P30471Q40392P53702M66948
24415B00787574O0926l60625p54022j158076j624886k140212k613824k936297
24407A89260558l049986k975220k768707k469082k091268j643050j119972n13246
24399A72630027J40946P35337J147316J332034J358009J349420J404492J565606
24391A81663187J821449K094391K229370K033132J370766K59196j119525k491164
24383A87860802l575610m147024m101972l532984k720179j983089j483479j153769
$$ plain form
24375 165162696 164368419 164152528 164811547 166552355 169347413 172906171 176779651 180537997
24367 180537997 183940776 187010099 189933692 192833433 195571945 197758749 198935151 198777577
24359 198777577 197195736 194305758 190330849 185522174 180148557 174492765 168785843 163134696
24351 163134696 157538250 151974162 146469919 141130759 136149983 131817236 128509664 126636505
24343 126636505 126543715 128424297 132250337 137721855 144283242 151265250 158097420 164432323
24335 164432323 170065986 174733045 178021264 179547140 179232718 177403284 174629854 171481168
24327 171481168 168368898 165542089 163169146 161392798 160297126 159852085 159936261 160422010
24319 160422010 161213467 162202221 163222748 164083840 164663618 164987809 165211196 165503341 165932035
$$ packed form
24375A65162696p94277k15891O59019J740808K795058L558758L873480L758346
24367A80537997L402779L069323K923593K899741K738512K186804J176402j57574
24359A98777577j581841k889978l974909m808675n373617n655792n706922n651147
24351A63134696n596446n564088n504243n339160m980776m332747l307572j873159
24343A26636505r2790J880582L826040N471518O561387O982008O832170O334903
24335A64432323N633663M667059L288219J525876l14422j829434k773430l148686
24327A71481168l112270k826809k372943j776348j095672m45041Q4176M85749
24319A60422010P91457R88754J020527Q61092N79778L24191K23387K92145M28694
$$ plain form
24310 165932035 166443345 166953372 167468006 168114837 169056910 170386887 172103411 174168289 176588131
24301 176588131 179445521 182808184 186564321 190357841 193714041 196253569 197841326 198614548
24293 198614548 198920387 199203881 199873608 201180586 203161913 205671768 208454550 211197023
24285 211197023 213557704 215223311 216009045 215937696 215207537 214048371 212578648 210774724
24277 210774724 208553322 205885044 202872545 199778203 197002587 195000182 194115765 194380344
24269 194380344 195383278 196330541 196288442 194500183 190640115 184921257 178026701 170880233
24261 170880233 164337918 158940570 154837176 151886907 149856788 148603655 148168370 148758805
24253 148758805 150622249 153855323 158255430 163309137 168331159 172674315 175906737 177902679
$$ packed form
24310A65932035N11310N10027N14634O46831R42073J329977J716524K064878K419842
24301A76588131K857390L362663L756137L793520L356200K539528J587757P73222
24293A98614548L05839K83494O69727J306978J981327K509855K782782K742473
24285B11197023K360681J665607P85734p1349p30159j159166j469723j803924
24277B10774724k221402k668278l012499l094342k775616k002405q84417K64579
24269A94380344J002934R47263m2099j788259l860068n718858o894556p146468
24261A70880233o542315n397348m103394k950269k030119j253133m35285N90435
24253A48758805J863444L233074M400107N053707N022022M343156L232422J995942
$$ plain form
24245 177902679 178836236 179087169 179114774 179379037 180313574 182273044 185428094 189698983 194814100
24236 194814100 200454346 206370385 212385453 218291043 223757133 228364613 231729097 233631537
24228 233631537 234116566 233514546 232330399 231031159 229859610 228770057 227485686 225636248
24220 225636248 222933351 219311998 214953562 210175467 205271800 200420812 195714488 191255462
24212 191255462 187210234 183773393 181098814 179258819 178222975 177826628 177753129 177591390
24204 177591390 176975281 175717880 173859080 171642980 169470965 167815680 167077180 167444243
24196 167444243 168855236 171067577 173754778 176561362 179116471 181046497 182016113 181799649
24188 181799649 180361360 177895963 174783836 171490860 168488334 166199219 164930986 164809871
$$ packed form
24245A77902679R33557K50933K7605K64263R34537J959470L155050M270889N115117
24236A94814100N640246N916039O015068N905590N466090M607480L364484J902440
24228B33631537M85029o02020j184147j299240j171549j089553j284371j849438
24220B25636248k702897l621353m358436m778095m903667m850988m706324m459026
24212A91255462m045228l436841k674579j839995j035844l96347p3499j61739
24204A77591390o16109j257401j858800k216100k172015j655285p38500L67063
24196A67444243J410993K212341K687201K806584K555109J930026R69616k16464
24188A81799649j438289k465397l112127l292976l002526k289115j268233j21115
$$ plain form
24180 164809871 165764365 167567101 169906867 172456789 174918257 177041946 178638303 179593489
24172 179593489 179902539 179695801 179215148 178743660 178541248 178833878 179862090 181923693 185307237
24163 185307237 190110234 196085217 202649768 209046594 214543742 218587140 220872499 221339548
24155 221339548 220113946 217444486 213691612 209372241 205173228 201834248 199924551 199665940
24147 199665940 200929339 203371655 206568896 210052886 213279602 215624478 216486674 215498411
24139 215498411 212724791 208708765 204314278 200451025 197806530 196673152 196908137 198027176
24131 198027176 199394400 200430996 200749933 200180208 198737303 196600633 194058547 191361860
24123 191361860 188560205 185466135 181779458 177279337 171972753 166127594 160182276 154594277
$$ packed form
24180A64809871R54494J802736K339766K549922K461468K123689J596357R55186
24172A79593489L09050k06738m80653m71488k02412K92630J028212K061603L383544
24163A85307237M802997N974983O564551O396826N497148M043398K285359M67049
24155B21339548j225602k669460l752874m319371m199013l338980j909697k58611
24147A99665940J263399K442316L197241L483990L226716K344876Q62196r88263
24139B15498411k773620m016026m394487l863253k644495j133378K34985J119039
24131A98027176J367224J036596L18937n69725j442905k136670k542086k696687
24123A91361860k801655l094070l686677m500121n306584n845159n945318n587999
$$ plain form
24115 154594277 149714188 145734309 142706639 140586847 139271028 138646045 138678376 139492017
24107 139492017 141354863 144567227 149315906 155545568 162885397 170699039 178295112 185190346
24099 185190346 191219789 196413450 200788051 204251157 206660028 207942166 208176951 207595830
24091 207595830 206505844 205168518 203704192 202098236 200304614 198360289 196441489 194855881
24083 194855881 193981571 194147721 195467604 197708847 200332657 202721018 204428031 205287135
24075 205287135 205373608 204922894 204254310 203676988 203370132 203300667 203252399 202951463 202188258 200857503
24065 200857503 198925674 196383187 193221974 189453811 185176345 180655283 176338203 172758792
24057 172758792 170392538 169534124 170214371 172172942 174921267 177893348 180621735 182859865
$$ packed form
24115A54594277m880089l979879l027670k119792j315819o24983L2331Q13641
24107A39492017J862846L212364M748679O229662P339829P813642P596073O895234
24099A85190346O029443N193661M374601L463106K408871J282138K34785n81121
24091B07595830j089986j337326j464326j605956j793622j944325j918800j585608
24083A94855881q74310J66150J319883K241243K623810K388361J707013Q59104
24075B05287135Q6473m50714o68584n77322l06856o9465m8268l00936p63205j330755
24065B00857503j931829k542487l161213l768163m277466m521062m317080l579411
24057A72758792k366254q58414O80247J958571K748325K972081K728387K238130
$$ plain form
24049 182859865 184604234 186024468 187350551 188755777 190252528 191641042 192563169 192654977
24041 192654977 191722450 189842318 187316424 184501106 181640432 178810798 175962305 173002888
24033 173002888 169907828 166812940 164008435 161808304 160375641 159626738 159287542 159064308
24025 159064308 158810483 158590651 158613239 159085671 160102877 161628545 163522916 165569761 167519663
24016 167519663 169161353 170376042 171126260 171404444 171217207 170632086 169830229 169087024 168667163
24007 168667163 168721640 169286798 170355798 171896525 173775533 175692242 177237084 178056224
23999 178056224 177999170 177150890 175743240 174010851 172082228 169971227 167662092 165217404
23991 165217404 162827532 160753959 159190563 158141483 157404967 156662971 155616580 154101491
$$ packed form
24049A82859865J744369J420234J326083J405226J496751J388514R22127R1808
24041A92654977r32527j880132k525894k815318k860674k829634k848493k959417
24033A73002888l095060l094888k804505k200131j432663p48903l39196k23234
24025A59064308k53825k19832K2588M72432J017206J525668J894371K046845J949902
24016A67519663J641690J214689P50218K78184j87237n85121q01857p43205m19861
24007A68667163N4477N65158J069000J540727J879008J916709J544842Q19140
23999A78056224n7054q48280j407650j732389j928623k111001k309135k444688
23991A65217404k389872k073573j563396j049080p36516p41996j046391j515089
$$ plain form
23983 154101491 152121536 149783406 147204940 144491747 141781680 139268963 137156928 135571226
23975 135571226 134486927 133721246 133044403 132376030 131908307 132034850 133150066 135470567 138948290
23966 138948290 143261327 147872008 152150889 155531423 157643949 158401196 158021774 156973416
23958 156973416 155834483 155119519 155143077 155970967 157455634 159317242 161228571 162885394
23950 162885394 164071635 164710207 164851037 164592136 164020336 163245217 162481529 162060093 162318676
23941 162318676 163467887 165539899 168394067 171705877 174961484 177540430 178910928 178845529
23933 178845529 177510093 175375635 173045139 171105403 170035369 170143799 171510887 173957721
23925 173957721 177094668 180450320 183625999 186427413 188944205 191527927 194633898 198607708
$$ packed form
23983A54101491j979955k338130k578466k713193k710067k512717k112035j585702
23975A35571226j084299p65681o76843o68373m67723J26543J115216K320501L477723
23966A38948290M313037M610681M278881L380534K112526P57247l79422j048358
23958A56973416j138933p14964K3558Q27890J484667J861608J911329J656823
23950A62885394J186241O38572J40830k58901n71800p75119p63688m21436K58583
23941A62318676J149211K072012K854168L311810L255607K578946J370498o5399
23933A78845529j335436k134458k330496j939736j070034J08430J367088K446834
23925A73957721L136947L355652L175679K801414K516792K583722L105971L973810
$$ plain form
23917 198607708 203570193 209450823 216078864 223228414 230585001 237676183 243857223 248414823
23909 248414823 250739505 250452862 247459594 241986658 234610623 226183628 217629992 209710197
23901 209710197 202874059 197247626 192703464 188947730 185621988 182444366 179348658 176524948
23893 176524948 174320372 173061659 172903358 173771685 175398764 177391479 179300351 180699878
23885 180699878 181289949 180987833 179962065 178577689 177259813 176328179 175877433 175759555 175687692
23876 175687692 175413465 174855349 174081271 173179815 172146742 170879646 169269695 167295049
23868 167295049 165030009 162598391 160168281 157992282 156392476 155635717 155777132 156601699
23860 156601699 157707832 158672277 159214806 159303807 159168707 159219167 159900306 161535634 164224171
$$ packed form
23917A98607708M962485N880630O628041P149550P356587P091182O181040M557600
23909B48414823K324682k86643k993268n472936p376035q426995q553636p919795
23901B09710197o836138n626433m544162l755734l325742l177622l095708k823710
23893A76524948k204576j258713j58301Q68327J627079J992715J908872J399527
23885A80699878N90071l02116j025768j384376j317876r31634m50746j17878p1863
23876A75687692k74227n58116p74078r01456j033073j267096j609951j974646
23868A67295049k265040k431618k430110k175999j599806p56759J41415Q24567
23860A56601699J106133R64445N42529Q9001j35100N0460O81139J635328K688537
$$ plain form
23851 164224171 167837594 172104218 176706273 181325474 185650504 189387584 192272853 194081861
23843 194081861 194657967 193959490 192078127 189178213 185380921 180717054 175239205 169202499
23835 169202499 163134466 157727271 153630251 151263952 150731868 151834834 154153365 157158865
23827 157158865 160319737 163191828 165498077 167167263 168287734 169002537 169431759 169670006
23819 169670006 169835455 170116574 170764836 171999777 173855574 176091643 178270349 179940388
23811 179940388 180777581 180627364 179496510 177546198 175094380 172602619 170607928 169572597
23803 169572597 169700737 170844672 172577695 174381313 175821545 176630195 176709036 176118400 175055848
23794 175055848 173782916 172518637 171391335 170469263 169780633 169278866 168827319 168273367 167570336
$$ packed form
23851A64224171L613423M266624M602055M619201M325030L737080K885269J809008
23843A94081861N76106o98477j881363k899914l797292m663867n477849o036706
23835A69202499o068033n407195m097020k366299n32084J102966K318531L005500
23827A57158865L160872K872091K306249J669186J120471P14803M29222K38247
23819A69670006J65449K81119O48262J234941J855797K236069K178706J670039
23811A79940388Q37193j50217j130854j950312k451818k491761j994691j035331
23803A69572597J28140J143935J733023J803618J440232Q08650P8841n90636j062552
23794A75055848j272932j264279j127302r22072o88630n01767m51547n53952p03031
$$ plain form
23785 167570336 166849179 166383825 166450282 167126100 168139694 168896751 168722973 167221402 164538133
$$ packed form
23785A67570336p21157m65354O6457O75818J013594P57057j73778j501571k683269
$$ [...]
##END NTUPLES=NMR SPECTRUM
##END=
