##TITLE=31P ikalashn
DE-75_k_TFA
13.11.2024
##JCAMPDX= 6.0         $$ Bruker NMR JCAMP-DX V2.0
##DATA TYPE= NMR SPECTRUM
##DATA CLASS= NTUPLES
##ORIGIN= UXNMR, Bruker Analytische Messtechnik GmbH
##OWNER= root
$$ TOPSPIN		Version 1.3
$$ 2024-11-13 15:17:54.656 +0400  Irina@DPX200
$$ Compression mode = diff/dup
##.OBSERVE FREQUENCY= 81.01967998063
##.OBSERVE NUCLEUS= ^31P
##.ACQUISITION MODE= SIMULTANEOUS
##.ACQUISITION SCHEME= undefined
##.AVERAGES= 64
##.DIGITISER RES= 17
##SPECTROMETER/DATA SYSTEM= spect
##.PULSE SEQUENCE= zgpg
##.SOLVENT NAME= D2O
##.SHIFT REFERENCE= INTERNAL, D2O, 1, 298.5841
##AUDIT TRAIL= $$ (NUMBER, WHEN, WHO, WHERE, WHAT)
$$ ##TITLE= Audit trail, TOPSPIN		Version 1.3
$$ ##JCAMPDX= 5.01
$$ ##ORIGIN= Bruker BioSpin GmbH
$$ ##OWNER= Irina
$$ $$ F:/spectra/data/iren/nmr/P31dec/1/pdata/1/auditp.txt
$$ ##AUDIT TRAIL=  $$ (NUMBER, WHEN, WHO, WHERE, VERSION, WHAT)
(   1,<2024-11-13 15:15:56.046 +0400>,<Irina>,<DPX200>,<TOPSPIN 1.3>,
      <acquisition in progress>)
(   2,<2024-11-13 15:17:38.328 +0400>,<Irina>,<DPX200>,<TOPSPIN 1.3>,
      <Start of raw data processing
       efp BC_mod = 2 LB = 12 FT_mod = 6 PKNL = 1 PHC0 = 90.17021 PHC1 = 285.1274 SI = 32K 
       data hash MD5: 32K
       F9 94 8E E7 B5 36 5A A2 6E 8F BF 38 66 44 69 E9>)
(   3,<2024-11-13 15:17:40.843 +0400>,<Irina>,<DPX200>,<TOPSPIN 1.3>,
      <apk 
       data hash MD5: 32K
       F8 F3 21 4C 3D 58 F8 35 34 DB 83 B6 29 03 0A 88>)
(   4,<2024-11-13 15:17:43.031 +0400>,<Irina>,<DPX200>,<TOPSPIN 1.3>,
      <abs n ABSG = 5 
       data hash MD5: 32K
       9C 56 56 F0 BE 16 1A B3 D2 3C 53 F5 C7 1A FA 37>)
$$ ##END=
$$ 
$$ $$ hash MD5
$$ $$ 53 7C 50 EF D8 4C 1B 35 D7 2D D8 F2 C4 1E 58 07
##$RELAX= 
##$RELAX= 
##$RELAX= 
##$RELAX= 
##$RELAX= 
##$RELAX= 
##$RELAX= 
##$RELAX= 
##$RELAX= 
##$RELAX= 
##$RELAX= 
$$ Bruker specific parameters
$$ --------------------------
##$DU= <F:/spectra>
##$EXPNO= 1
##$NAME= <P31dec>
##$PROCNO= 1
##$TYPE= <nmr>
##$USER= <iren>
##$AMP= (0..31)
100 100 100 100 100 100 100 100 100 100 100 100 100 100 100 100 100 100 
100 100 100 100 100 100 100 100 100 100 100 100 100 100 
##$ANAVPT= -1
##$AQSEQ= 0
##$AQ_mod= 1
##$AUNM= <au_zg>
##$AUTOPOS= <>
##$BF1= 81.014009
##$BF2= 200.13
##$BF3= 200.13
##$BF4= 200.13
##$BF5= 200.13
##$BF6= 200.13
##$BF7= 200.13
##$BF8= 200.13
##$BYTORDA= 1
##$CFDGTYP= 0
##$CFRGTYP= 5
##$CHEMSTR= <none>
##$CNST= (0..63)
1 1 145 1 1 1 1 1 1 1 1 1 1 1 1 1 1 1 1 1 1 1 1 1 1 1 1 1 1 1 1 1 1 1 
1 1 1 1 1 1 1 1 1 1 1 1 1 1 1 1 1 1 1 1 1 1 1 1 1 1 1 1 1 1 
##$CPDPRG= <waltz16>
##$CPDPRG1= <>
##$CPDPRG2= <waltz16>
##$CPDPRG3= <>
##$CPDPRG4= <mlev>
##$CPDPRG5= <mlev>
##$CPDPRG6= <mlev>
##$CPDPRG7= <mlev>
##$CPDPRG8= <mlev>
##$CPDPRGB= <>
##$CPDPRGT= <>
##$D= (0..63)
0 1 0 0 0 0 0 0 0 0.06 0 0.03 2e-005 3e-006 0 0 0.0002 0 0 0 0 0 0 0 0 
0 0 0 0 0 0 0 0 0 0 0 0 0 0 0 0 0 0 0 0 0 0 0 0 0 0 0 0 0 0 0 0 0 0 0 
0 0 0 0 
##$DATE= 1731496655
##$DBL= (0..7)
120 120 120 11 120 120 24 19 
##$DBP= (0..7)
$$ [...]
##$SW_h= 37037.037037037
##$TD= 32768
##$TD0= 1
##$TE= 300
##$TE2= 300
##$TE3= 300
##$TEG= 300
##$TL= (0..7)
0 120 53 12 22 120 120 120 
##$TP= (0..7)
150 150 150 150 150 150 150 150 
##$TP07= 0
##$TPNAME0= <>
##$TPNAME1= <>
##$TPNAME2= <>
##$TPNAME3= <>
##$TPNAME4= <>
##$TPNAME5= <>
##$TPNAME6= <>
##$TPNAME7= <>
##$TPOAL= (0..7)
0.5 0.5 0.5 0.5 0.5 0.5 0.5 0.5 
##$TPOFFS= (0..7)
0 0 0 0 0 0 0 0 
##$TUNHIN= 0
##$TUNHOUT= 0
##$TUNXOUT= 0
##$USERA1= <user>
##$USERA2= <user>
##$USERA3= <user>
##$USERA4= <user>
##$USERA5= <user>
##$V9= 5
##$VALIST= <valist>
##$VCLIST= <CCCCCCCCCCCCCCC>
##$VD= 0
##$VDLIST= <DDDDDDDDDDDDDDD>
##$VPLIST= <PPPPPPPPPPPPPPP>
##$VTLIST= <TTTTTTTTTTTTTTT>
##$WBST= 1024
##$WBSW= 4
##$XGAIN= (0..3)
0 0 0 0 
##$XL= 0
##$YL= 0
##$YMAX_a= 5043
##$YMIN_a= -4198
##$ZGOPTNS= <>
##$ZL1= 120
##$ZL2= 120
##$ZL3= 120
##$ZL4= 120
##$ABSF1= 298.5841
##$ABSF2= -158.5842
##$ABSG= 5
##$ABSL= 5
##$ALPHA= 0
##$AQORDER= 0
##$ASSFAC= 0
##$ASSFACI= 0
##$ASSFACX= 0
##$ASSWID= 0
##$AUNMP= <proc_1d>
##$AXLEFT= 0
##$AXRIGHT= 0
##$AXTYPE= 0
##$AXUNIT= <>
##$AZFE= 0.1
##$AZFW= 0.5
##$BCFW= 0
##$BC_mod= 2
##$BYTORDP= 0
##$COROFFS= 0
##$CY= 12.5935478210449
##$DATMOD= 1
##$DC= 0
##$DFILT= <>
##$DTYPP= 0
##$F1P= 47.1127640792319
##$F2P= -24.0371245302204
##$FCOR= 0.5
##$FTSIZE= 32768
##$FT_mod= 6
##$GAMMA= 0
##$GB= 0
##$INTBC= 1
##$INTSCL= 7.269226e-011
##$ISEN= 30
##$LB= 12
##$LEV0= 0
##$LPBIN= 0
##$MAXI= 12.09355
##$MC2= 0
##$MEAN= 0
##$ME_mod= 0
##$MI= 0.7550151
##$NCOEF= 0
##$NC_proc= -13
##$NLEV= 6
##$NOISF1= 298.5841
##$NOISF2= 270.0111
##$NSP= 0
##$NTH_PI= 0
##$NZP= 0
##$OFFSET= 298.5841
##$PC= 1.4
##$PHC0= 91.0315
##$PHC1= 322.7153
##$PH_mod= 1
##$PKNL= yes
##$PPARMOD= 0
##$PPDIAG= 0
##$PPIPTYP= 0
##$PPMPNUM= 100
##$PPRESOL= 1
##$PSCAL= 0
##$PSIGN= 0
##$REVERSE= no
##$SF= 81.014009
##$SI= 32768
##$SIGF1= 270.0111
##$SIGF2= -158.5842
##$SINO= 77.54984
##$SIOLD= 32768
##$SREGLST= <31P.CDCl3>
##$SSB= 0
##$STSI= 32768
##$STSR= 0
##$SW_p= 37037.037037037
##$SYMM= 0
##$S_DEV= 0
##$TDeff= 32768
##$TDoff= 0
##$TI= <>
##$TILT= no
##$TM1= 0
##$TM2= 0
##$TOPLEV= 0
##$USERP1= <user>
##$USERP2= <user>
##$USERP3= <user>
##$USERP4= <user>
##$USERP5= <user>
##$WDW= 1
##$XDIM= 32768
##$YMAX_p= 342044191
##$YMIN_p= -29136736
$$ End of Bruker specific parameters
$$ ---------------------------------
##NTUPLES= NMR SPECTRUM
##VAR_NAME=  FREQUENCY,     SPECTRUM/REAL,   SPECTRUM/IMAG
##SYMBOL=    X,             R,               I
##VAR_TYPE=  INDEPENDENT,   DEPENDENT,       DEPENDENT
##VAR_FORM=  AFFN,          ASDF,            ASDF
##VAR_DIM=   32768,         32768,           32768
##UNITS=     HZ,            ARBITRARY UNITS, ARBITRARY UNITS
##FACTOR=    1.13031516577767, 1,            1
##FIRST=     37037.037037037, -3136888,      -13475735
##LAST=      0,             13224596,        11681016
##MIN=       0,             -29136736,       0
##MAX=       37037.037037037, 342044191,     0
$$ Real data points
##PAGE= N=1
##DATA TABLE= (X++(R..R)), XYDATA
$$ [...]
19844 11351018 11988034 12321570 12237933 11822281 11242013 10605241 9907337 9081346 8103988
19835 8103988 7067274 6136501 5439507 5008507 4808712 4791760 4902434 5039878 5038846 4713443
19825 4713443 3944983 2772861 1425497 210281 -670900 -1175101 -1333181 -1208786 -922521
19816 -922521 -637408 -499742 -586835 -903761 -1426435 -2110384 -2848488 -3487828 -3921067 -4132810
19806 -4132810 -4188392 -4230629 -4454789 -5020373 -5948964 -7098889 -8236722 -9116913 -9517033
19797 -9517033 -9290648 -8462361 -7263053 -6017331 -4963252 -4173963 -3623283 -3276488 -3112437
19788 -3112437 -3109700 -3235289 -3415426 -3518878 -3396049 -2945030 -2175973 -1240814 -381324 190339
19778 190339 411141 392044 300615 232669 212136 248071 358342 566890 857258 1105905
19768 1105905 1083740 526693 -758376 -2738295 -5074574 -7293628 -9039151 -10131939 -10496643
19759 -10496643 -10139180 -9182518 -7874026 -6517086 -5344197 -4437437 -3793859 -3452076 -3514963
19750 -3514963 -4048720 -4968658 -6011487 -6832245 -7159424 -6865889 -5926095 -4373955 -2317111
19741 -2317111 41073 2429908 4580035 6264217 7304417 7594145 7144357 6127257
19733 6127257 4867647 3733402 2977116 2640178 2568893 2515046 2254496 1668330 770177
19724 770177 -320636 -1448885 -2486985 -3372275 -4127713 -4839857 -5603026 -6478131 -7463374
19715 -7463374 -8490576 -9483656 -10403211 -11181341 -11632514 -11508122 -10686354 -9308964 -7730534
19706 -7730534 -6337057 -5390214 -4967008 -4970596 -5196186 -5426467 -5503098 -5363877 -5075427 -4818543
19696 -4818543 -4774455 -4979651 -5278557 -5421930 -5220902 -4640984 -3792398 -2843692 -1939851 -1139601
19686 -1139601 -361270 549296 1609364 2586451 3142590 3091278 2522444 1693309 809799
19677 809799 -82926 -1052751 -2187369 -3506661 -4873418 -5979135 -6475769 -6155803 -5038656
19668 -5038656 -3347161 -1418583 418253 1936619 3010888 3562591 3561238 3083370 2316575
19659 2316575 1471142 717432 206931 83157 428345 1174818 2056681 2714683 2924759
19650 2924759 2728329 2334140 1940311 1655162 1481053 1302959 940076 235846 -903084
19641 -903084 -2472557 -4310473 -6129336 -7660473 -8763995 -9442584 -9809455 -10024581 -10219694
19632 -10219694 -10466220 -10782831 -11125510 -11353198 -11259584 -10709433 -9758369 -8628526 -7563201
19623 -7563201 -6697225 -6041957 -5548500 -5155222 -4814489 -4535191 -4402592 -4539446 -5028925
19614 -5028925 -5833865 -6776757 -7624838 -8214268 -8495537 -8478159 -8176689 -7649266 -7068229 -6692418
19604 -6692418 -6743599 -7280144 -8161105 -9166775 -10168293 -11155945 -12137268 -13056789 -13806611
19595 -13806611 -14307562 -14570465 -14645944 -14541649 -14241188 -13766406 -13160360 -12451990 -11720817
19586 -11720817 -11182544 -11126503 -11719268 -12871699 -14295816 -15666317 -16749633 -17436953 -17673836
19577 -17673836 -17388909 -16555415 -15314614 -13956448 -12742667 -11769922 -10994407 -10319338 -9636762
19568 -9636762 -8873350 -8059030 -7323934 -6811356 -6598447 -6674916 -6970347 -7398042 -7859660 -8201892
19558 -8201892 -8225706 -7812287 -7035909 -6114725 -5258964 -4564691 -3996679 -3423161 -2692495 -1761140
19548 -1761140 -788485 -57457 249000 188485 -24164 -215672 -365701 -547178 -803507 -1125179
19538 -1125179 -1536014 -2130093 -2988587 -4104143 -5396514 -6757518 -8066936 -9203958 -10076916
19529 -10076916 -10630780 -10830621 -10668289 -10187866 -9477526 -8598061 -7520449 -6174220 -4561086
19520 -4561086 -2798117 -1075515 381833 1340806 1622364 1198933 277888 -741083 -1476450
19511 -1476450 -1771921 -1721333 -1547788 -1454560 -1514352 -1646218 -1690777 -1524869 -1139356 -631596
19501 -631596 -119074 343969 776312 1219756 1682865 2109099 2369663 2299525 1790913 876484
19491 876484 -292095 -1556842 -2833107 -4092352 -5320426 -6506570 -7639907 -8714588
19483 -8714588 -9733931 -10680405 -11492018 -12090312 -12435643 -12557061 -12517043 -12342815 -12016989
19474 -12016989 -11556245 -11081727 -10767225 -10694903 -10787581 -10890564 -10878845 -10701178 -10383449 -9977176
19464 -9977176 -9473313 -8779210 -7777795 -6410097 -4740897 -2977814 -1407991 -277976
19456 -277976 281725 259539 -242461 -1022801 -1831221 -2426567 -2629715 -2359583 -1632485 -555476
19446 -555476 679717 1838706 2709841 3153614 3103574 2514925 1349221 -341571 -2321475
19437 -2321475 -4189005 -5522111 -6043605 -5703685 -4666565 -3217017 -1625551 -59279
19429 -59279 1428888 2863744 4278005 5658561 6957456 8125514 9109747 9833200 10222419
19420 10222419 10274641 10068974 9705785 9236073 8613924 7713300 6423207 4734499 2730501
19411 2730501 533588 -1684849 -3685857 -5254258 -6328828 -7018026 -7508006 -7960209 -8441524
19402 -8441524 -8910148 -9261881 -9398849 -9278157 -8930539 -8451176 -7959836 -7558098 -7316165
19393 -7316165 -7266426 -7392720 -7634458 -7886628 -8014443 -7928116 -7671724 -7443332 -7490325 -7923628
19383 -7923628 -8628686 -9376086 -10002881 -10487653 -10910932 -11386620 -11984163 -12657797 -13266277
19374 -13266277 -13686038 -13898745 -13968627 -13959629 -13893723 -13764375 -13567582 -13332188 -13113265 -12926160
19364 -12926160 -12666405 -12081180 -10862920 -8863789 -6257554 -3474628 -980456 882689
19356 882689 1901560 1959697 1092768 -428563 -2128660 -3491175 -4171491 -4119357 -3502908
19347 -3502908 -2506189 -1205581 375776 2118879 3728847 4845052 5273957 5126336 4724861
19338 4724861 4380377 4249554 4343693 4589468 4862505 4999234 4842163 4333257 3555986 2674448
19328 2674448 1871521 1351700 1315413 1839648 2777824 3814985 4624315 4976375 4779102
19319 4779102 4114366 3241511 2472541 1991472 1805820 1845981 2061063 2428357 2919606 3453797
19309 3453797 3841484 3806663 3154049 1936282 417253 -1094813 -2348934 -3184467 -3566265
19300 -3566265 -3592103 -3422363 -3177635 -2882393 -2467499 -1846812 -1061239 -352488 -40058 -301504
19290 -301504 -1082813 -2193871 -3424473 -4577775 -5503373 -6176410 -6718318 -7283364 -7915977
19281 -7915977 -8536899 -9050771 -9434677 -9729528 -9966953 -10121552 -10151467 -10052308 -9840863 -9533601
19271 -9533601 -9174441 -8856009 -8698857 -8813514 -9249236 -9923782 -10582612 -10878661 -10586831
19262 -10586831 -9781017 -8770895 -7852201 -7122873 -6493841 -5803061 -4893024 -3639403 -2016743
19253 -2016743 -172230 1616828 3083042 4073705 4570387 4663880 4507389 4256352 4027884
19244 4027884 3886710 3840244 3854977 3912943 4061385 4383498 4907968 5552054 6159747 6603242
19234 6603242 6861363 7014182 7173613 7402216 7660494 7826156 7774232 7464845 6999212 6581382
19224 6581382 6378350 6410653 6568258 6694421 6680101 6537097 6376187 6302254 6333073 6384270
19214 6384270 6300640 5925109 5192128 4190866 3138595 2286338 1830017 1845903 2251008
19205 2251008 2827828 3317741 3525071 3391299 3005707 2531967 2103378 1761385 1457358
19196 1457358 1092493 593029 9187 -456905 -565326 -227484 392756 978557 1272073
19187 1272073 1196346 827605 295566 -330363 -1090859 -2044538 -3122293 -4108437 -4763218
19178 -4763218 -4953996 -4709077 -4195278 -3649551 -3276396 -3143071 -3144930 -3053360 -2608111 -1645648
19168 -1645648 -208254 1469566 3085466 4380646 5182543 5437365 5235602 4751460 4145555
19159 4145555 3558499 3166662 3164460 3661383 4624217 5926323 7411423 8895797 10156247
19150 10156247 10956581 11101422 10491455 9167600 7315410 5196303 3045609 1007838
19142 1007838 -866966 -2587266 -4183616 -5670724 -6975986 -7876933 -8059852 -7286854 -5538285
19133 -5538285 -3058196 -286192 2286295 4257472 5405683 5681659 5120821 3801266
19125 3801266 1900624 -257293 -2288254 -3931562 -5139759 -5990601 -6575715 -6968373 -7203442
19116 -7203442 -7259850 -7098635 -6725858 -6209998 -5622127 -4949160 -4073030 -2831402 -1125797
19107 -1125797 970187 3197236 5238862 6887088 8090575 8869861 9239354 9225156 8888576
19098 8888576 8271216 7352280 6128926 4771707 3673273 3260555 3702323 4790803 6082398
19089 6082398 7137769 7671675 7575999 6898987 5801028 4464636 3044070 1718611 722876
19080 722876 229911 205392 441246 742764 1033060 1281522 1436827 1489348 1530162 1675885
19070 1675885 1939233 2203882 2346435 2380909 2465521 2765496 3299517 3901221 4320949 4367501
19060 4367501 3989089 3262726 2337343 1402033 662268 281561 348105 893615 1893289 3223640
19050 3223640 4640903 5840648 6599958 6923016 7030354 7147767 7312005 7392320 7260746
19041 7260746 6923106 6498679 6085989 5658083 5080203 4218851 3053885 1724044 492306
19032 492306 -361129 -669748 -426775 275430 1301044 2481872 3647960 4686275 5579345
19023 5579345 6384836 7159756 7898396 8534233 8982516 9197918 9217411 9137712 9030902 8879768
19013 8879768 8598960 8100912 7322842 6211864 4743155 2981339 1115147 -546290 -1619753
19004 -1619753 -1779319 -909865 852127 3204551 5793783 8276250 10348745 11808647
18996 11808647 12620225 12910173 12868645 12625031 12179600 11431250 10293212 8796403 7084619
18987 7084619 5351127 3807407 2649541 2004502 1913974 2351233 3252906 4543941 6114660
18978 6114660 7791562 9360428 10613942 11397231 11658097 11468895 10993681 10440440 10001857
18969 10001857 9770838 9696745 9641069 9487154 9213970 8914590 8768653 8951538 9525993 10396710
18959 10396710 11340142 12093947 12469267 12411508 11983365 11311952 10518436 9636635 8589247
18950 8589247 7281341 5738312 4134477 2679971 1486759 528394 -285676 -1016983 -1694292
18941 -1694292 -2357074 -3046499 -3743037 -4337719 -4706377 -4822821 -4798732 -4839625 -5151100 -5837731
18931 -5837731 -6871679 -8130801 -9419665 -10460267 -10940180 -10660747 -9670074 -8222350 -6599842
18922 -6599842 -4977843 -3428284 -2031225 -982724 -554220 -899124 -1923751 -3371299
18914 -3371299 -4994817 -6639696 -8199887 -9555038 -10599944 -11314031 -11753660 -11974087 -11984673
18905 -11984673 -11785409 -11406186 -10884475 -10247274 -9531989 -8789903 -8069737 -7419261 -6904512
18896 -6904512 -6630183 -6735048 -7327064 -8386870 -9737634 -11129310 -12361945 -13328735 -13971545
18887 -13971545 -14253198 -14183993 -13830960 -13259406 -12455460 -11333172 -9836817 -8024183 -6067638
18878 -6067638 -4205514 -2672242 -1614670 -1033497 -831461 -932727 -1318807 -1962356 -2773576
18869 -2773576 -3613919 -4334733 -4790578 -4855570 -4479591 -3739801 -2831742 -2003439 -1482145 -1429949
18859 -1429949 -1901481 -2805914 -3936206 -5061627 -6011098 -6720910 -7247646 -7714606 -8189224
18850 -8189224 -8576738 -8649620 -8225868 -7344766 -6271006 -5332503 -4743061 -4521632 -4518654 -4498325
18840 -4498325 -4226575 -3559422 -2510012 -1236030 54083 1201796 2148476 2933924 3653698
18831 3653698 4387890 5132955 5779268 6153465 6104052 5575899 4617632 3334434 1844129
18822 1844129 246625 -1400653 -3080164 -4776024 -6434931 -7962806 -9250277 -10199658
18814 -10199658 -10727792 -10743368 -10148202 -8913207 -7186552 -5313502 -3716930 -2739883 -2555373
18805 -2555373 -3129501 -4242188 -5596713 -6931794 -8056978 -8856813 -9294406 -9391509 -9202936
18796 -9202936 -8795709 -8211923 -7452659 -6529490 -5523044 -4582900 -3893228 -3600910 -3709757
18787 -3709757 -4050715 -4390934 -4573096 -4563425 -4421762 -4244095 -4090690 -3953358 -3795561 -3587526
18777 -3587526 -3273371 -2745850 -1931429 -912637 86164 842795 1244852 1294489 1055738
18768 1055738 602864 8031 -644812 -1239613 -1639810 -1755496 -1592153 -1229960 -773652
18759 -773652 -304136 161799 667640 1231899 1727619 1869970 1373394 135044 -1700514
18750 -1700514 -3802233 -5792813 -7389750 -8468360 -9040186 -9202630 -9097721 -8855296 -8532257
18741 -8532257 -8122723 -7616980 -7002544 -6217712 -5174261 -3872708 -2477292 -1251428 -426075
18732 -426075 -104646 -224550 -554966 -733562 -363351 837336 2889020 5512152 8247128
18723 8247128 10660346 12512166 13798620 14653766 15200212 15479910 15507351 15346015 15086310
18714 15086310 14764779 14379559 13997320 13776906 13841006 14143707 14491260 14673294 14559725
18705 14559725 14136559 13541325 13038860 12860572 13037677 13404326 13753473 13977271 14065340
18696 14065340 14015208 13795634 13384824 12797823 12070573 11233167 10294975 9269065 8242063
18687 8242063 7399024 6918542 6845295 7121260 7703199 8566693 9639345 10817480 12034480
18678 12034480 13259702 14441852 15500136 16383586 17106549 17711327 18234295 18685844 18994102
18669 18994102 19002134 18585472 17756790 16644802 15394295 14075486 12663236 11109723 9455316
18660 9455316 7866225 6561524 5697994 5298776 5248919 5323776 5263262 4903518 4264838 3505429
18650 3505429 2789356 2193654 1721124 1367276 1157219 1127834 1275115 1517554 1755974 1973964
18640 1973964 2217416 2490267 2725698 2853156 2872958 2856636 2863077 2864818 2777221 2555275 2251227
18629 2251227 1986815 1880186 1987116 2272535 2609646 2823015 2761076 2338840 1533979 368471
18619 368471 -1102430 -2773485 -4469587 -5997326 -7240004 -8187417 -8873799 -9280176 -9285377
18610 -9285377 -8735269 -7592287 -6037922 -4441282 -3203930 -2583989 -2624088 -3210695 -4170448
18601 -4170448 -5296430 -6324193 -6982398 -7134619 -6855666 -6334646 -5692987 -4888746 -3785402
18592 -3785402 -2306796 -518759 1427528 3380229 5197111 6731178 7847261 8439311
18584 8439311 8443356 7881275 6898876 5718037 4506069 3285772 2001846 687299 -466716
18575 -466716 -1233935 -1520284 -1379015 -891965 -89318 1020008 2376706 3834654 5179766
18566 5179766 6165543 6565150 6264469 5318049 3900992 2211154 412349 -1348830 -2919506
18557 -2919506 -4194114 -5193156 -6033801 -6796150 -7431808 -7824685 -7944284 -7922095 -7969598 -8236396
18547 -8236396 -8755444 -9468859 -10240344 -10866399 -11157694 -11049093 -10635398 -10102652 -9611781
18538 -9611781 -9234049 -8981651 -8864102 -8863894 -8850234 -8580747 -7845410 -6629566 -5150046 -3724240
18528 -3724240 -2584530 -1796028 -1308796 -1076722 -1144770 -1627054 -2610535 -4066677 -5816948
18519 -5816948 -7562371 -8949935 -9669810 -9583859 -8801519 -7610445 -6303933 -5049119 -3890576
18510 -3890576 -2827460 -1857507 -983970 -226512 358617 687717 711817 471004 77229
18501 77229 -351250 -753399 -1133278 -1505162 -1859439 -2201939 -2617669 -3270585 -4306401 -5734995
18491 -5734995 -7413439 -9148874 -10805788 -12318906 -13641878 -14719399 -15488372 -15879203
18483 -15879203 -15839824 -15371668 -14535753 -13427717 -12161578 -10883974 -9774443 -9005406 -8687192
18474 -8687192 -8819241 -9288224 -9929664 -10600599 -11219159 -11750117 -12152616 -12381561 -12454978 -12461543
18464 -12461543 -12485292 -12564991 -12718761 -12958020 -13248603 -13457422 -13374557 -12851323 -11934807 -10828745
18454 -10828745 -9721635 -8685894 -7728079 -6888641 -6260251 -5919581 -5880963 -6110020 -6527266
18445 -6527266 -6973214 -7206262 -6992841 -6230223 -4987240 -3435538 -1763615 -150927 1237572
18436 1237572 2289177 2973157 3294622 3240785 2841192 2272142 1852910 1917405 2653364 4015407
18426 4015407 5758638 7555153 9100231 10143405 10507820 10167011 9290804 8166619 7063890
18417 7063890 6132619 5355260 4586444 3687150 2638986 1513771 364354 -784909 -1858498
18408 -1858498 -2713100 -3204064 -3235794 -2754406 -1749640 -305079 1390718 3126052 4740273
18399 4740273 6123076 7209753 8005378 8577876 8985536 9189624 9068007 8550517 7693129
18390 7693129 6590442 5285544 3798552 2197354 605908 -855610 -2126953 -3205961
18382 -3205961 -4135232 -5036171 -6098591 -7432838 -8921053 -10251304 -11110136 -11351151 -11033568
18373 -11033568 -10378061 -9674319 -9159404 -8934834 -8953208 -9072375 -9160466 -9171812 -9111123 -8944286
18363 -8944286 -8585868 -7967332 -7087015 -6010200 -4856523 -3780107 -2940634 -2465497 -2394285
18354 -2394285 -2653331 -3103749 -3609343 -4053570 -4317685 -4278988 -3858298 -3086295 -2110842 -1134492
18344 -1134492 -338225 192401 509997 779193 1192000 1846959 2651235 3343987 3662507
18335 3662507 3521103 3051087 2505708 2142318 2159608 2691556 3816652 5542529 7766962
18326 7766962 10244823 12598413 14415242 15412504 15562727 15084095 14287276 13384367 12415794
18317 12415794 11337392 10137227 8848852 7493457 6070232 4617574 3250501 2103149
18309 2103149 1234212 600072 103763 -343712 -777515 -1148692 -1327533 -1163971 -577023
18300 -577023 394757 1590748 2753375 3594187 3906303 3664428 3007135 2123239 1196148
18291 1196148 412155 -86165 -279618 -269964 -180595 -55241 163563 584111 1289021 2250517
18281 2250517 3277567 4079461 4417470 4195360 3456145 2366876 1188867 202987 -356813
18272 -356813 -327574 343100 1526893 2921561 4194103 5130824 5635214 5633448 5081479 4073529
18262 4073529 2841686 1588863 362017 -894643 -2224497 -3633902 -5115396 -6638369
18254 -6638369 -8155007 -9629324 -11026766 -12285945 -13321277 -14051682 -14438718 -14498644 -14267125
18245 -14267125 -13763765 -13000914 -12026226 -10964089 -10011101 -9363201 -9125312 -9279300 -9710172
18236 -9710172 -10235247 -10633150 -10711152 -10397804 -9774878 -8989185 -8116853 -7117457 -5908871
18227 -5908871 -4465587 -2849890 -1188410 340335 1501772 2047532 1828948 890571 -574841
18218 -574841 -2374191 -4398495 -6572946 -8772440 -10816517 -12541139 -13872707 -14837573
18210 -14837573 -15511094 -15987846 -16398385 -16877636 -17437933 -17888697 -17966537 -17573474 -16849484
18201 -16849484 -16017452 -15218470 -14511469 -13952655 -13585256 -13339368 -12996644 -12316498 -11210546
18192 -11210546 -9796363 -8309492 -6975815 -5939863 -5257878 -4929479 -4933089 -5215710 -5669984
18183 -5669984 -6182375 -6714220 -7311706 -8033523 -8864211 -9685348 -10330743 -10684614 -10741775 -10579564
18173 -10579564 -10277245 -9870121 -9375566 -8827796 -8265001 -7709163 -7187992 -6762413 -6493897
18164 -6493897 -6397280 -6445744 -6581425 -6720816 -6780520 -6690448 -6408781 -5959407 -5428810 -4900659
18154 -4900659 -4396156 -3868248 -3224322 -2353013 -1176730 279219 1854561 3301430 4402988
18145 4402988 5078793 5398631 5511428 5538474 5497159 5314781 4922084 4347475 3723036 3201094
18135 3201094 2884705 2832550 3076417 3586919 4240606 4848116 5213885 5207611 4831033 4229035
18125 4229035 3621090 3172489 2893640 2683486 2478464 2323410 2287391 2340321 2341692 2156403
18115 2156403 1756972 1190110 463850 -487964 -1727988 -3224767 -4799470 -6117118 -6783150
18106 -6783150 -6538783 -5405495 -3676309 -1788761 -176290 839664 1124122 737839 -167947
18097 -167947 -1480846 -3141129 -5045871 -6994121 -8757020 -10152393 -11017406 -11190455 -10616485
18088 -10616485 -9471262 -8135587 -7015147 -6371558 -6281633 -6663262 -7291815 -7860305 -8120542
18079 -8120542 -8004830 -7615210 -7090383 -6493780 -5837396 -5165855 -4554767 -4031801 -3563228
18070 -3563228 -3128090 -2740032 -2377675 -1963947 -1457285 -920437 -482164 -284344 -463054
18061 -463054 -1094160 -2110405 -3292017 -4352592 -5036136 -5174765 -4723335 -3769778 -2521915
18052 -2521915 -1273601 -325494 125945 60659 -382176 -964849 -1410233 -1499843 -1176965 -545151
18042 -545151 222262 961009 1546921 1906947 2028160 1953069 1752217 1472103 1091520 549153
18032 549153 -173379 -1027959 -1974045 -3025480 -4178261 -5304798 -6166357 -6544714 -6337085
18023 -6337085 -5552107 -4283502 -2697301 -1017338 506893 1666675 2391183 2816681 3226277
18014 3226277 3871615 4845632 6092964 7458320 8730483 9758178 10587536 11445914 12552407
18005 12552407 13942587 15456577 16850905 17913494 18520314 18644503 18349467 17790360 17205284
17996 17205284 16835161 16785941 16952923 17099420 16998679 16502045 15568954 14308237 12959174
17987 12959174 11791571 11017348 10752027 10982082 11534189 12100502 12363697 12160231 11536609
17978 11536609 10656964 9676399 8689080 7740111 6849321 6051133 5433405 5105799 5086299
17969 5086299 5200292 5115052 4530361 3391555 1941115 568178 -393520 -768387 -533120
17960 -533120 239211 1433629 2924956 4600987 6357974 8049473 9482438 10524030
17952 10524030 11191423 11609684 11896188 12079172 12084443 11754449 10891211 9344639 7133781
17943 7133781 4518281 1921362 -240937 -1691361 -2358680 -2380247 -2020918 -1554572 -1177869
17934 -1177869 -972342 -905953 -876383 -757183 -398103 376269 1695869 3532205 5665045
17925 5665045 7769802 9534741 10746442 11345576 11428483 11182099 10787402 10338867 9825759
17916 9825759 9171641 8292201 7151143 5777487 4228521 2567003 887350 -674775
17908 -674775 -1994243 -3035846 -3900307 -4768072 -5735719 -6700777 -7433697 -7767858 -7742918
17899 -7742918 -7598100 -7608541 -7890588 -8362940 -8859882 -9242338 -9443115 -9468378 -9392782 -9350746
17889 -9350746 -9487322 -9898704 -10611074 -11579421 -12698077 -13835664 -14888586 -15827870 -16678839
17880 -16678839 -17432541 -17987936 -18199215 -17989861 -17425246 -16689475 -15993055 -15461226 -15090105
17871 -15090105 -14810832 -14589135 -14464163 -14495309 -14711184 -15110367 -15640952 -16164391 -16482739
17862 -16482739 -16434057 -15977796 -15207067 -14301941 -13465119 -12860435 -12544656 -12410705 -12213891
17853 -12213891 -11704255 -10785602 -9571351 -8290790 -7140931 -6207807 -5483294 -4888676 -4255817
17844 -4255817 -3354973 -2023086 -284679 1645041 3468718 4952726 6011196 6687361
17836 6687361 7077484 7247276 7185998 6844226 6220891 5394235 4445598 3365978 2103643
17827 2103643 705812 -671197 -1896905 -2935787 -3779947 -4396459 -4790972 -5083220 -5449709
17818 -5449709 -5972668 -6557906 -6974977 -6973328 -6430160 -5432015 -4200473 -2933244 -1715814
17809 -1715814 -581007 360173 885348 790771 63505 -1059754 -2174806 -2855646 -2806588
17800 -2806588 -1987258 -644432 791123 1892342 2408917 2355891 1990061 1676906 1697073
17791 1697073 2099722 2709743 3268268 3571661 3521681 3112455 2403733 1484966 442683
17782 442683 -642168 -1679070 -2558403 -3153782 -3336458 -2999265 -2100852 -731947 865776
17773 865776 2392639 3618131 4430782 4821976 4844346 4552129 3992027 3284606 2662109
17764 2662109 2334929 2311187 2384358 2282796 1816939 939077 -268919 -1670579 -3165244
17755 -3165244 -4692205 -6173775 -7511813 -8605893 -9332619 -9584601 -9390327 -8936821 -8427158
17746 -8427158 -7940692 -7441341 -6899712 -6366525 -5896949 -5447900 -4906402 -4186438 -3266704
17737 -3266704 -2173394 -957622 302400 1474693 2366834 2766979 2502384 1495202 -171521
17728 -171521 -2214148 -4205372 -5724144 -6501104 -6472981 -5770155 -4677383 -3539282 -2623933
17719 -2623933 -2029455 -1684184 -1412222 -1025881 -408461 468215 1565810 2772938 3916470
17710 3916470 4847998 5526326 5990982 6265555 6323760 6151814 5821546 5499666 5376112 5562949
17700 5562949 6058663 6795733 7681890 8587598 9353873 9883216 10240767 10640717 11287059
17691 11287059 12183174 13093401 13691012 13748494 13239192 12302779 11106519 9721439 8136201
17682 8136201 6392539 4680913 3269799 2331044 1851027 1727308 1932091 2550952 3656104
17673 3656104 5146385 6708021 7934090 8491605 8205605 7063025 5200589 2877367
17665 2877367 388945 -2050040 -4339354 -6400215 -8081857 -9201864 -9663432 -9498012
17657 -9498012 -8821124 -7801153 -6660631 -5632569 -4854992 -4299298 -3795962 -3145249 -2278165
17648 -2278165 -1346081 -616156 -264374 -276656 -508727 -784674 -951057 -906509 -634846 -224813
17638 -224813 163608 379994 352477 118379 -189778 -430674 -577302 -757251 -1178100 -2014849
17628 -2014849 -3290589 -4810962 -6250258 -7316272 -7842553 -7823695 -7451963 -7074574 -7035684
17619 -7035684 -7523303 -8530220 -9913842 -11450908 -12845493 -13773746 -13973304 -13296035 -11755377
17610 -11755377 -9607701 -7343747 -5503588 -4454425 -4288805 -4843338 -5795506 -6807270
17602 -6807270 -7641808 -8182034 -8388292 -8292928 -8022945 -7771332 -7704435 -7855173 -8072616 -8085049
17592 -8085049 -7660685 -6751815 -5512814 -4198131 -3016680 -2026210 -1125218 -138125 1074647
17583 1074647 2563204 4304341 6230121 8237365 10202767 12021534 13639656 15023507
17575 15023507 16090073 16714564 16828597 16481669 15796111 14861371 13666994 12137088 10219994
17566 10219994 7962926 5564179 3372224 1759931 916829 718796 786597 709627 279165
17557 279165 -444131 -1247755 -1938999 -2446502 -2820903 -3165652 -3559284 -4039727 -4636578 -5370491
17547 -5370491 -6215894 -7082986 -7835515 -8328492 -8463220 -8256231 -7849417 -7410301 -7016683
17538 -7016683 -6648320 -6266753 -5875100 -5512868 -5214579 -5003322 -4930102 -5072915 -5466746 -6035884
17528 -6035884 -6599086 -6944988 -6934637 -6580291 -6052349 -5614140 -5517765 -5886285 -6629086 -7474850
17518 -7474850 -8137724 -8490304 -8597608 -8616713 -8664954 -8750435 -8798369 -8690710 -8271149 -7406695
17508 -7406695 -6104038 -4516423 -2807305 -1059342 666115 2249312 3528382 4371083
17500 4371083 4734001 4674705 4325194 3858773 3434401 3124999 2902821 2690999 2407827 1998881
17490 1998881 1491055 1006725 681934 550331 490302 286364 -227735 -1061517 -2076573
17481 -2076573 -3063192 -3808437 -4161001 -4088113 -3657921 -2957050 -2052152 -1032138 -58118
17472 -58118 652567 921627 703186 58676 -945525 -2271039 -3873610 -5675469 -7542331
17463 -7542331 -9283172 -10694229 -11619376 -12014523 -11990034 -11782166 -11652787 -11768418 -12129757
17454 -12129757 -12587695 -12934396 -13028510 -12861359 -12507428 -12044928 -11517346 -10901416 -10101778
17445 -10101778 -9019701 -7637766 -6044277 -4394207 -2848315 -1530709 -491655 327437
17437 327437 1052999 1759878 2398011 2842965 3018612 2985995 2939819 3130310 3742327 4782733
17427 4782733 6080230 7418374 8652065 9685319 10378654 10519415 9899452 8457978 6379974
17418 6379974 4027778 1739462 -332060 -2237677 -4128701 -6101672 -8083745 -9833755
17410 -9833755 -11067104 -11626229 -11561746 -11069645 -10372688 -9623562 -8850546 -7966735 -6830318
17401 -6830318 -5329310 -3456176 -1316396 919525 3061312 4929230 6397924 7434956
17393 7434956 8069493 8312884 8137947 7555133 6681301 5695691 4737493 3861617 3043870
17384 3043870 2173310 1083030 -327062 -1976339 -3647113 -5152742 -6430589 -7482930
17376 -7482930 -8281074 -8744928 -8805626 -8471858 -7828224 -6988123 -6053895 -5102641 -4198119 -3423372
17366 -3423372 -2891367 -2672894 -2705148 -2812673 -2812342 -2585717 -2098308 -1389016 -519286 492579
17356 492579 1663754 2974192 4346867 5695906 6952092 8049199 8924270 9532815 9858680
17347 9858680 9933937 9846769 9696041 9532755 9354661 9147874 8908513 8615154 8212766 7647326
17337 7647326 6913985 6078602 5253631 4550617 4059737 3839436 3869655 4016709 4083312 3928178
17327 3928178 3550725 3060358 2587902 2231059 2049689 2084655 2362320 2885278 3632223 4549316
17317 4549316 5525197 6382103 6918904 7009739 6686150 6116312 5505066 5006884 4701858 4620088
17307 4620088 4755699 5041639 5332152 5448250 5275067 4827528 4218707 3568158 2945332
17298 2945332 2397518 1992296 1786673 1776023 1903680 2089150 2255365 2393301 2592333 2970493
17288 2970493 3588807 4434067 5434622 6459670 7340374 7950393 8282204 8435922 8550065
17279 8550065 8755764 9157624 9810293 10709579 11798994 12938405 13885309 14385611 14282918
17270 14282918 13533908 12176378 10304406 8043225 5535820 2985812 711202 -938890
17262 -938890 -1798430 -1998114 -1849987 -1632426 -1462305 -1316988 -1132582 -876177 -558727 -220681
17252 -220681 79032 268011 262938 -13741 -597100 -1451583 -2464894 -3481667 -4399636 -5254503
17242 -5254503 -6175228 -7219565 -8256901 -9055111 -9508829 -9762815 -10095546 -10677181 -11431181
17233 -11431181 -12100343 -12410819 -12213726 -11549203 -10588675 -9498922 -8369237 -7225564 -6024185
17224 -6024185 -4624990 -2857764 -679987 1729513 4047481 5990440 7458126 8528906
17216 8528906 9312666 9800723 9858200 9359988 8340022 7007186 5608478 4264175 2914250
17207 2914250 1410469 -337535 -2280796 -4265540 -6135044 -7807611 -9283200 -10586750
17199 -10586750 -11689227 -12472232 -12794023 -12619133 -12094163 -11490041 -11045251 -10837365 -10769029
17190 -10769029 -10660965 -10382620 -9912430 -9311408 -8708172 -8320173 -8400596 -9051248 -10066450
17181 -10066450 -11016378 -11501158 -11331644 -10552088 -9360016 -7983133 -6598779 -5334360 -4288731
17172 -4288731 -3520924 -3029911 -2777414 -2738670 -2911681 -3277085 -3757135 -4207171 -4456072 -4376814
17162 -4376814 -3920440 -3088400 -1925162 -570401 730144 1729396 2319769 2577912 2680472
17153 2680472 2782324 2950298 3165328 3386586 3637427 4019352 4629355 5460410 6360569
17144 6360569 7065340 7294467 6875005 5812035 4259515 2433912 559625 -1146566 -2505427
17135 -2505427 -3406037 -3795943 -3669518 -3105882 -2295439 -1473135 -825691 -487012 -575621 -1175539
17125 -1175539 -2270305 -3704932 -5210708 -6476116 -7266772 -7547848 -7469793 -7208043 -6828436
17116 -6828436 -6290655 -5547236 -4628895 -3655973 -2792092 -2161044 -1776035 -1550914 -1372109
17107 -1372109 -1176141 -1012086 -1017477 -1275222 -1715411 -2191717 -2625957 -3067272 -3628391 -4359311
17097 -4359311 -5162991 -5836707 -6214190 -6270217 -6115455 -5930077 -5856823 -5892553 -5910678 -5823238
17087 -5823238 -5693985 -5683508 -5891837 -6235212 -6460647 -6288425 -5568659 -4343783 -2787383
17078 -2787383 -1092699 584993 2136666 3501557 4639794 5489998 5972467 6040800 5731454
17069 5731454 5184108 4631667 4329131 4431057 4906431 5536724 5989376 5959894 5313022 4129286
17059 4129286 2656941 1225266 132762 -484660 -709711 -735699 -680246 -512467 -158111
17050 -158111 355893 886479 1308638 1649266 2065035 2682286 3464035 4218759 4716591 4817243
17040 4817243 4536970 3993749 3256133 2274256 984868 -562406 -2205169 -3767794 -5158220
17031 -5158220 -6380138 -7468841 -8455241 -9383919 -10305601 -11249308 -12237865 -13301993 -14435756
17022 -14435756 -15546379 -16439978 -16867740 -16667092 -15878389 -14677941 -13209306 -11516630 -9607723
17013 -9607723 -7513079 -5298865 -3091344 -1085464 527788 1671684 2425514 2951981
17005 2951981 3362209 3625996 3607678 3192929 2378889 1255818 -72047 -1527571 -3018469
16996 -3018469 -4393682 -5491819 -6235608 -6685994 -7022362 -7436416 -7993397 -8588300 -9047618
16987 -9047618 -9275699 -9323925 -9362146 -9607598 -10254193 -11399993 -12984007 -14785014 -16494653
16978 -16494653 -17801804 -18445194 -18257726 -17224026 -15516557 -13443972 -11321811 -9375142
16970 -9375142 -7742042 -6523177 -5779521 -5488657 -5551298 -5843528 -6237924 -6594137 -6777466
16961 -6777466 -6689576 -6261680 -5424209 -4094175 -2198530 270738 3191751 6301278 9272939
16952 9272939 11816822 13722796 14868570 15258552 15063808 14535525 13826393 12957971 11970555
16943 11970555 11007372 10220729 9653168 9225279 8811486 8332412 7802746 7294447 6856042
16934 6856042 6466533 6022429 5362898 4365635 3050560 1593376 226765 -889413 -1712964
16925 -1712964 -2287044 -2713203 -3134357 -3698509 -4522350 -5685037 -7220204 -9071340 -11062571
16916 -11062571 -12951255 -14534053 -15716860 -16498860 -16901040 -16913352 -16494325 -15607350 -14258120
16907 -14258120 -12515037 -10537151 -8600157 -7058487 -6245240 -6379552 -7491373 -9358591
16899 -9358591 -11532831 -13488881 -14798286 -15247667 -14907203 -14102245 -13224168 -12492296 -11872810
16890 -11872810 -11191012 -10293523 -9124720 -7726118 -6225329 -4784944 -3482376 -2239201
16882 -2239201 -918227 502180 1871965 2961346 3566008 3547699 2843925 1486166 -399796
16873 -399796 -2649309 -5125826 -7729945 -10346176 -12775713 -14729077 -15931537 -16283019
16865 -16283019 -15912184 -15054312 -13895647 -12535297 -11025703 -9397599 -7666291 -5853932
16857 -5853932 -4017355 -2241872 -612323 787407 1849610 2439243 2427040 1751413 488164
16848 488164 -1126057 -2771454 -4185786 -5238051 -5900147 -6204211 -6225744 -6057718 -5758361
16839 -5758361 -5312261 -4667928 -3838956 -2947068 -2137187 -1445821 -758026 90860 1148273
16830 1148273 2263968 3183059 3719650 3842717 3636321 3209901 2640807 1984812 1317594
16821 1317594 761705 487397 660911 1333454 2359933 3460416 4402230 5127163 5697207
16812 5697207 6151164 6434172 6437044 6085927 5395529 4453738 3402112 2429384 1705912 1290670
16802 1290670 1132762 1165600 1369414 1726481 2149244 2493015 2627008 2487535 2091590 1511035
16792 1511035 832768 138271 -538336 -1289202 -2320283 -3791921 -5690467 -7874866 -10180703
16783 -10180703 -12432158 -14423006 -15956739 -16909069 -17269513 -17153686 -16750958 -16202124 -15501729
16774 -15501729 -14522676 -13143626 -11371413 -9361202 -7335519 -5500246 -4032617 -3105445
16766 -3105445 -2847011 -3231416 -4044792 -4999267 -5866760 -6530762 -6976498 -7228369 -7270492 -7049931
16756 -7049931 -6564314 -5912096 -5234049 -4636265 -4195600 -3987306 -4051405 -4332010 -4678467 -4937629
16746 -4937629 -5049686 -5054044 -5046570 -5147240 -5450981 -5980552 -6690208 -7483809 -8212391 -8692356
16736 -8692356 -8763296 -8354578 -7533949 -6506378 -5558878 -4973232 -4900458 -5257462 -5770760 -6147317
16726 -6147317 -6211520 -5917922 -5294839 -4403530 -3334528 -2194164 -1033979 219133 1730950
16717 1730950 3628103 5878653 8279938 10528648 12303490 13342918 13523561 12893008
16709 12893008 11614929 9900687 7991707 6132615 4510326 3222161 2290488 1686020
16701 1686020 1327237 1080494 815529 475842 71942 -378634 -865748 -1346767 -1706083
16692 -1706083 -1752901 -1280080 -177142 1468542 3378237 5201403 6643892 7522422 7767414
16683 7767414 7427697 6670822 5730765 4817830 4062518 3496373 3039071 2514952 1714584
16674 1714584 479816 -1206921 -3177011 -5119261 -6676363 -7560771 -7690423 -7262599 -6661417
16665 -6661417 -6253151 -6249601 -6716781 -7617793 -8800674 -10008755 -10990488 -11635598 -12010927
16656 -12010927 -12269551 -12532615 -12838063 -13141693 -13338337 -13318088 -13047731 -12604658 -12105345
16647 -12105345 -11588054 -10987371 -10238924 -9388455 -8594434 -8044090 -7833955 -7892050 -8027761
16638 -8027761 -8067584 -7958894 -7784720 -7703922 -7861205 -8321548 -9063095 -10006967 -11046466 -12070417
16628 -12070417 -12972229 -13643538 -13995740 -14013347 -13768779 -13379504 -12968187 -12641619 -12457120
16619 -12457120 -12403068 -12412561 -12377146 -12177119 -11750558 -11153368 -10550998 -10149510 -10113040 -10468792
16609 -10468792 -11042043 -11519875 -11620646 -11235717 -10447504 -9416796 -8221123 -6796294 -5061005
16600 -5061005 -3090411 -1145392 454812 1476023 1820064 1492992 555278 -888260 -2648726
16591 -2648726 -4464635 -6106961 -7429032 -8301151 -8581144 -8213761 -7337240 -6235387 -5172514
16582 -5172514 -4291488 -3650895 -3306786 -3330336 -3760427 -4576251 -5750243 -7298112 -9204662
16573 -9204662 -11308271 -13343650 -15129865 -16679093 -18109472 -19476420 -20702405 -21660309
16565 -21660309 -22273303 -22506172 -22328242 -21759430 -20936479 -20068989 -19302594 -18634966 -17965018
16556 -17965018 -17201855 -16320522 -15338578 -14261001 -13056559 -11689052 -10166626 -8564306
16548 -8564306 -7013799 -5671477 -4678315 -4130862 -4066570 -4451161 -5169384 -6045858 -6915603
16539 -6915603 -7704875 -8453401 -9234198 -10028336 -10712786 -11182562 -11454747 -11662727 -11959166
16530 -11959166 -12419714 -13021018 -13648969 -14113608 -14195988 -13696044 -12457948 -10411362 -7638208
16521 -7638208 -4392337 -1023028 2140809 4832085 6798782 7827136 7894686 7230833 6171365
16512 6171365 5000046 3901207 2959080 2168283 1468852 775984 -6191 -963265 -2143055
16503 -2143055 -3516399 -4934720 -6153862 -6959410 -7306098 -7336124 -7251231 -7159573 -7022597
16494 -7022597 -6742329 -6303911 -5796011 -5254780 -4507736 -3222826 -1145410 1673702 4838902
16485 4838902 7781443 10003769 11243601 11491279 10902031 9708279 8180505 6610299
16477 6610299 5278725 4389705 4001651 4032260 4345627 4839629 5455329 6118551 6707524
16468 6707524 7101002 7224225 7013930 6367572 5193789 3560328 1768192 211454 -858669
16459 -858669 -1415971 -1556655 -1389667 -997416 -416692 340830 1196602 1942334 2315662 2170485
16449 2170485 1604693 954454 647113 990811 2025968 3506360 5021126 6189053 6785741
16440 6785741 6753332 6156149 5138531 3896422 2665675 1689403 1117158 893222 758756
16431 758756 398138 -380760 -1532695 -2755292 -3654002 -4067160 -4208875 -4459800 -5087820
16422 -5087820 -6150889 -7541325 -9058187 -10463447 -11542164 -12191966 -12484834 -12614034 -12757001
16413 -12757001 -12967857 -13169574 -13238216 -13114876 -12877014 -12720186 -12840748 -13301031 -13988712
16404 -13988712 -14689272 -15202481 -15424176 -15356180 -15059901 -14626404 -14206255 -14023345 -14295234
16395 -14295234 -15104617 -16331869 -17725513 -19081049 -20374349 -21722949 -23240250 -24907882
16387 -24907882 -26450637 -27236385 -26466812 -23760325 -19602022 -15061693 -11041521 -7862903
16379 -7862903 -5446179 -3649477 -2374860 -1481403 -769070 -89886 619668 1440490 2518878
16370 2518878 3962595 5715894 7559887 9216336 10463921 11212292 11502388 11439764 11115966
16361 11115966 10567615 9791456 8782515 7550740 6143706 4686305 3391674 2520549
16353 2520549 2280000 2705295 3631987 4786252 5907515 6822485 7439627 7693522 7505849
16344 7505849 6806253 5606218 4029711 2240623 387998 -1337267 -2659938 -3312872
16336 -3312872 -3179484 -2340955 -1006525 577654 2183745 3646606 4885801 5861317 6518600
16327 6518600 6826144 6854931 6760256 6683256 6716644 6951493 7474116 8289747 9312454 10476069
16317 10476069 11828277 13487374 15513276 17822824 20213194 22463827 24410772 25888368
16309 25888368 26605613 26194017 24498033 21779123 18572617 15378151 12464794 9873591
16301 9873591 7531474 5357049 3293624 1295748 -669142 -2607617 -4493979 -6258478
16293 -6258478 -7799013 -9026967 -9907922 -10488319 -10885522 -11195263 -11384857 -11340191 -11061783
16284 -11061783 -10772497 -10799070 -11362758 -12455155 -13838376 -15142350 -16002932 -16190469 -15704689
16275 -15704689 -14786523 -13807996 -13085351 -12734552 -12679500 -12793662 -13017673 -13346157 -13756078
16266 -13756078 -14195134 -14614229 -14967550 -15207312 -15319080 -15327987 -15224357 -14917916 -14327334 -13518452
16256 -13518452 -12723413 -12199948 -12054197 -12165649 -12254691 -12061465 -11530910 -10856619 -10353401
16247 -10353401 -10264685 -10631164 -11305905 -12083554 -12804810 -13365120 -13685098 -13708212 -13425651 -12867511
16237 -12867511 -12053329 -10988436 -9729823 -8440994 -7355630 -6652407 -6342426 -6287915 -6351563
16228 -6351563 -6529199 -6928999 -7621830 -8514079 -9370027 -9969585 -10243389 -10257610 -10119425 -9924073
16218 -9924073 -9725876 -9497170 -9140565 -8580929 -7842551 -7024050 -6203292 -5364202 -4414445
16209 -4414445 -3298518 -2113426 -1130500 -688775 -1005742 -2057617 -3613525 -5324520 -6796414
16200 -6796414 -7698912 -7884333 -7392106 -6329651 -4771684 -2791656 -550856 1718585 3828973
16191 3828973 5692247 7277018 8569137 9553963 10182002 10369501 10059753 9249863 7957736
16182 7957736 6227431 4181208 2021993 -50192 -1922287 -3572714 -5042036 -6404948
16174 -6404948 -7702214 -8855822 -9677970 -10002728 -9808548 -9219223 -8418214 -7567291 -6769947
16165 -6769947 -6020127 -5129067 -3785673 -1783457 794571 3583198 6104525 8004676
16157 8004676 9214655 9916665 10369458 10731140 10993296 11078130 10961983 10664313 10180421
16148 10180421 9499827 8666833 7764006 6837829 5858464 4734538 3390195 1862055 305145
16139 305145 -1082056 -2110382 -2625346 -2555853 -1952614 -963747 223150 1422069 2475782
16130 2475782 3279912 3764705 3850693 3488174 2782160 2020751 1540501 1570697 2132377 3003101
16120 3003101 3816394 4281121 4351480 4205700 4082288 4139350 4406077 4782117 5091527 5193094
16110 5193094 5040591 4644195 4021894 3220689 2345863 1488538 613484 -426088 -1715675
16101 -1715675 -3118561 -4334599 -5132421 -5472869 -5419274 -5015671 -4294683 -3368426 -2438922
16092 -2438922 -1671727 -1061379 -438696 380907 1435833 2563100 3483960 3962783 3920254
16083 3920254 3449986 2776702 2181346 1892331 2017810 2584469 3582600 4922876 6380256
16074 6380256 7625331 8345395 8410121 7984612 7464317 7246726 7514864 8194413 9086148
16065 9086148 10021817 10927415 11805565 12674110 13497372 14166417 14556927 14629852 14495195 14383198
16055 14383198 14521899 14996057 15712007 16495639 17207591 17770063 18126205 18194391 17852924
16046 17852924 16974573 15504630 13530443 11261656 8933502 6737341 4815713 3278637
16038 3278637 2199027 1559398 1182463 757034 -4340 -1210847 -2774626 -4501479 -6230743
16029 -6230743 -7927232 -9612061 -11249298 -12756113 -14058814 -15086866 -15754570 -15982283
16021 -15982283 -15726458 -14993175 -13847396 -12412992 -10856837 -9381048 -8210158 -7524810
16013 -7524810 -7362730 -7572053 -7880035 -8054380 -8039828 -7971164 -8066186 -8461624 -9098441 -9760948
16003 -9760948 -10240407 -10470673 -10527601 -10539254 -10604345 -10724638 -10775433 -10586109 -10081318 -9357121
15993 -9357121 -8623137 -8038861 -7592850 -7140994 -6556623 -5873426 -5307194 -5119515 -5432036
15984 -5432036 -6155478 -7080617 -8023391 -8894567 -9663043 -10276293 -10632466 -10648070 -10346592 -9872213
15974 -9872213 -9429238 -9200351 -9293840 -9747948 -10556879 -11676688 -13005360 -14342856 -15400777
15965 -15400777 -15911656 -15747309 -14958374 -13752919 -12461127 -11484298 -11166531 -11622252 -12670078
15956 -12670078 -13910475 -14843926 -14975532 -13948133 -11688363 -8445828 -4693043 -983721
15948 -983721 2161786 4328309 5245727 4828167 3194078 613955 -2583781 -6071845 -9538027
15939 -9538027 -12713414 -15454426 -17779378 -19755913 -21361940 -22483488 -23012330 -22919696 -22246499
15930 -22246499 -21066586 -19518731 -17858838 -16386321 -15274182 -14485132 -13828860 -13086509
15922 -13086509 -12115634 -10869121 -9346799 -7574870 -5657715 -3802317 -2215698 -986747
15914 -986747 -128444 283962 102705 -728443 -2034830 -3456154 -4618980 -5285124 -5402643
15905 -5402643 -5070492 -4457934 -3722511 -2956649 -2189559 -1421520 -631755 218445 1138706
15896 1138706 2081183 3006085 3973479 5121019 6517898 8042049 9386374 10174758 10134023
15887 10134023 9240620 7740406 6025325 4458861 3255975 2475170 2085980 2007360 2085604
15878 2085604 2097527 1822543 1115322 -71068 -1685581 -3585237 -5566374 -7419682 -8960994
15869 -8960994 -10006541 -10348672 -9834696 -8515393 -6675682 -4710468 -3007154 -1876538
15861 -1876538 -1483643 -1826324 -2782173 -4185924 -5867165 -7605189 -9139364 -10315214 -11174250
15852 -11174250 -11866684 -12519678 -13185247 -13870376 -14597586 -15403652 -16239902 -16879572 -16966247
15843 -16966247 -16182955 -14389887 -11655239 -8239064 -4552609 -1054474 1888418 4095332
15835 4095332 5574116 6467370 7002462 7434329 7947366 8580860 9272044 9962268 10653157
15826 10653157 11393144 12222687 13114688 13968452 14686007 15269257 15788187 16224474 16448227
15817 16448227 16397560 16205068 16115815 16328871 16908658 17746383 18581966 19115005 19087485 18314682
15807 18314682 16784098 14740404 12590653 10723719 9427147 8866002 9005994 9555588
15799 9555588 10074440 10191929 9732263 8696008 7207522 5477332 3739084 2155367 748875
15790 748875 -582398 -1919439 -3142234 -3961876 -4182737 -3890691 -3377972 -2931240 -2675539
15781 -2675539 -2525064 -2220620 -1459464 -76833 1841993 3987443 5961023 7451282 8348773
15772 8348773 8762294 8972904 9305560 9924052 10674030 11120291 10799644 9468003 7131271
15763 7131271 3960870 252155 -3590344 -7094832 -9798955 -11370280 -11742877 -11160598
15755 -11160598 -10052957 -8856341 -7936715 -7573305 -7918460 -8955814 -10495368 -12216144
15747 -12216144 -13757336 -14830240 -15301438 -15206174 -14661935 -13742104 -12441163 -10743997 -8674799
15738 -8674799 -6270321 -3560304 -634252 2268914 4804474 6712341 7959423 8696970
15730 8696970 9108734 9309048 9345925 9242798 9021215 8704786 8306197 7803238 7151697 6355278
15720 6355278 5492330 4628695 3730235 2705376 1550024 446008 -317432 -535927 -172011
15711 -172011 738603 2196513 4227651 6786102 9681223 12573195 15076362 16948947
15703 16948947 18185297 18938135 19410613 19805565 20286264 20955753 21899602 23214076 24947762
15694 24947762 27043387 29380913 31867423 34450344 37032159 39370726 41094297 41881340
15686 41881340 41653602 40583832 38913289 36794569 34329162 31684709 29094634 26768684
15678 26768684 24861558 23476785 22634947 22271371 22297348 22630568 23148639 23693518 24202873
15669 24202873 24800358 25683148 26898459 28236476 29338644 29890712 29746991 28979757 27843615
15660 27843615 26620575 25455124 24343497 23253134 22180423 21099103 19963325 18796499
15652 18796499 17692804 16716187 15864065 15101874 14371674 13623280 12914427 12468233 12593618
15643 12593618 13524832 15292444 17669513 20201568 22358347 23733674 24140768 23592737
15635 23592737 22238169 20267192 17813534 14961706 11882986 8921111 6480327 4807833
15627 4807833 3887685 3537746 3582153 3953993 4719959 6039186 8038713 10673361 13703771
15618 13703771 16815016 19731562 22205819 23970764 24787487 24562163 23440555 21784371
15610 21784371 19998637 18343469 16888344 15592616 14386321 13187164 11897737 10455619
15602 10455619 8906393 7405868 6137590 5219778 4728962 4817082 5675598 7304055 9393486
15593 9393486 11539540 13562819 15546561 17593950 19652616 21534043 23014245 23946192
15585 23946192 24307433 24142988 23492010 22366579 20771758 18781225 16617807 14577275
15577 14577275 12848364 11484357 10531516 10091619 10261587 11075534 12489756 14345788 16324181
15568 16324181 17991727 18951831 18972593 18034722 16349644 14327182 12412353 10834163 9485868
15559 9485868 8075014 6388067 4426708 2322976 194980 -1828923 -3488121 -4428457
15551 -4428457 -4423739 -3515017 -1921579 96948 2258622 4267864 5922884 7191047 8152232
15542 8152232 8914018 9602555 10379725 11390527 12666756 14078676 15364117 16209626 16349385
15533 16349385 15669198 14275475 12432026 10388565 8273466 6092435 3741873 1084082
15525 1084082 -1834210 -4606467 -6605824 -7376384 -6929647 -5715660 -4323325 -3140462
15517 -3140462 -2210881 -1336582 -240151 1349414 3603779 6458445 9574039 12478583
15509 12478583 14783209 16316020 17116397 17316146 17001255 16195892 14978942 13555596 12186703
15500 12186703 11053645 10167004 9376880 8485154 7414054 6331722 5602083 5536401 6137298
15491 6137298 7069970 7875298 8197553 7851102 6787323 5093989 3014001 866122 -1114910
15482 -1114910 -2857641 -4370894 -5563431 -6139657 -5754247 -4357680 -2367927 -431863
15474 -431863 1001631 1887716 2447890 2902254 3303476 3541965 3495003 3202141 2888373 2782858
15464 2782858 2903046 3015783 2803967 2081841 905146 -453337 -1626579 -2321793 -2454328
15455 -2454328 -2160669 -1698261 -1344017 -1317660 -1658613 -2158633 -2519781 -2584107 -2354237 -1885916
15445 -1885916 -1285468 -745295 -436191 -326121 -156015 358650 1287190 2431174 3487356
15436 3487356 4278781 4881289 5557233 6551879 7912605 9455168 10873498 11912186 12509634
15427 12509634 12805937 13009470 13286310 13740450 14389943 15167214 15997698 16825584 17538843
15418 17538843 17952907 17923619 17427585 16516991 15287295 13907873 12586017 11456630 10543774
15409 10543774 9822919 9243609 8700638 8115763 7550514 7102815 6729546 6308657 5844094
15400 5844094 5516272 5541871 5988087 6683950 7331175 7741744 7972801 8246526 8772832 9644608
15390 9644608 10874979 12499392 14590644 17171725 20153689 23364802 26623833 29793331
15382 29793331 32790413 35555208 38012855 40116398 41977110 43917783 46354128 49613156
15374 49613156 53832680 58987349 64961449 71576920 78601529 85746250 92615036 98698556
15366 98698556 103483682 106567723 107702239 106865995 104353000 100705423 96499602 92179597
15358 92179597 88035676 84233221 80816872 77744373 74934818 72258793 69561315 66798070
15350 66798070 64140997 61930060 60532932 60223224 61155917 63439014 67186838 72465924
15342 72465924 79209998 87222391 96253326 106055726 116374646 126890262 137116124 146300418
15334 146300418 153512005 157954884 159260433 157562889 153407474 147592049 140964285 134219933
15326 134219933 127803851 121917048 116570865 111682747 107208422 103251973 100054664 97827473
15318 97827473 96552467 95945722 95645228 95481326 95641132 96618813 98983804 103155975 109314591
15309 109314591 117399635 127148780 138144802 149843456 161558028 172446529 181632318
15302 181632318 188472739 192795797 194965891 195753399 196033094 196472787 197423891 199034891
15294 199034891 201428557 204785493 209305684 215142444 222382543 231036452 241003416 252023331
15286 252023331 263643016 275300388 286543775 297203867 307372488 317167796 326396620
15279 326396620 334363223 339967808 342044191 339851952 333529595 324161618 313333316 302523042
15271 302523042 292770729 284683811 278522845 274214352 271399362 269577183 268203643 266651364
15263 266651364 264164366 259973561 253532283 244680103 233667027 221107480 207839144
15256 207839144 194670126 182166997 170594943 159964191 150148441 141037360 132610686
15249 132610686 124907778 117957770 111725285 106122078 101059556 96460764 92248964 88391694
15241 88391694 84985506 82269664 80520342 79897871 80343351 81569513 83121934 84455532
15233 84455532 85050419 84621633 83302088 81561202 79894455 78626897 77959531 78044071 78956119
15224 78956119 80669456 83113516 86210311 89809131 93638929 97400069 100934531 104328445
15216 104328445 107858228 111779134 116068668 120326271 123921917 126297439 127252612 127039377
15208 127039377 126202973 125315902 124809931 124970202 125997844 128015489 130989636 134656480
15200 134656480 138545624 142124987 144983486 146936235 148029190 148462712 148463318 148184106 147666039
15191 147666039 146803468 145340105 142997632 139679872 135568126 131035415 126470810 122146061
15183 122146061 118189242 114596379 111199201 107682641 103762667 99393531 94775554 90171948
15175 90171948 85741702 81480570 77228752 72765473 67983840 63025663 58284989 54283114
15167 54283114 51469971 50051948 49971745 51058086 53182523 56260136 60165428 64712777
15159 64712777 69684094 74849301 79987388 84898790 89382346 93214907 96201709 98252148
15151 98252148 99384206 99669297 99195960 98054583 96321934 94092213 91547632 88974947
15143 88974947 86669725 84778076 83230542 81856738 80549242 79302262 78173019 77325421
15135 77325421 77083196 77798070 79617044 82390312 85760093 89317546 92724449 95741574
15127 95741574 98211887 100076924 101377112 102157298 102346716 101762873 100239662 97739234
15119 97739234 94373773 90371718 86041485 81735498 77763908 74268550 71175900 68315366
15111 68315366 65610058 63146384 61072648 59479266 58382476 57740146 57394999 57034291
15103 57034291 56351189 55298133 54102690 53053501 52339319 51997356 51864628 51615696 50981573
15094 50981573 49978007 48922345 48234968 48194590 48816963 49889652 51078578 52052029 52594590
15085 52594590 52645790 52258939 51572484 50806909 50183973 49783140 49513013 49261467 49075877
15076 49075877 49181208 49791572 50900587 52259936 53518942 54366884 54605745 54153689 53004157
15067 53004157 51195039 48818991 46060962 43250465 40880075 39492985 39425701 40578579
15059 40578579 42418834 44242916 45507039 45968276 45631088 44699062 43554117 42620126 42129450
15050 42129450 41987996 41869692 41463849 40671070 39632646 38603848 37759277 37092837 36461908
15041 36461908 35670563 34551585 33062142 31342392 29676475 28378148 27698932 27774065 28551351
15032 28551351 29780602 31132397 32322917 33151841 33529217 33544389 33455898 33539785 33953329
15023 33953329 34711293 35730246 36887267 38038122 39031719 39801107 40415424 40968273 41461325
15014 41461325 41814298 41912587 41651279 40993307 39985721 38702359 37169455 35342253 33153029
15005 33153029 30586789 27734602 24824917 22218416 20320927 19432672 19619102 20668066
14997 20668066 22141790 23531014 24465138 24821716 24643951 23981960 22835282 21237331 19357584
14988 19357584 17476161 15867269 14725407 14138593 14057908 14339649 14901967 15791588 17027668
14979 17027668 18447784 19775516 20802080 21463350 21773029 21734711 21327098 20561061 19555692
14970 19555692 18546542 17801809 17512204 17676267 18023853 18110556 17548872 16165085 14022629
14961 14022629 11411803 8829481 6847504 5858951 5915504 6810418 8287320 10150560 12203674
14952 12203674 14186172 15858492 17132905 18108691 19031287 20228990 22004176 24462318
14944 24462318 27375079 30229701 32470437 33776579 34219464 34195033 34149229 34297247 34541835
14935 34541835 34593383 34152621 33049162 31317417 29224234 27231958 25839528 25336850 25648039
14926 25648039 26387017 27088237 27465414 27515939 27401173 27234009 26945220 26292590 25004570
14917 25004570 22982446 20425742 17793461 15633351 14381255 14205575 14953593 16225545
14909 16225545 17526467 18441343 18779789 18583823 18000212 17185541 16298695 15489028 14863028
14900 14863028 14482780 14413610 14792957 15828226 17660878 20194356 23030532 25558837 27163654
14891 27163654 27472000 26491328 24559597 22186661 19862761 17895241 16352433 15111980
14883 15111980 13962880 12728256 11371123 10037643 9009285 8580799 8906595 9882680
14875 9882680 11150394 12213259 12603133 12069511 10692564 8813425 6818592 4947084
14867 4947084 3276281 1859577 878697 665932 1494291 3286597 5561908 7661109 9031293
14858 9031293 9443619 9083220 8367834 7575405 6681266 5533876 4079844 2436542 822525
14849 822525 -614628 -1967708 -3530361 -5503105 -7736991 -9806510 -11311696 -12099066
14841 -12099066 -12277076 -12100969 -11809879 -11499679 -11108542 -10511437 -9635293 -8493596 -7163521
14832 -7163521 -5808432 -4698167 -4085883 -3974637 -4007416 -3662255 -2601940 -824940 1481273
14823 1481273 4119446 6856972 9312215 11021578 11708623 11490032 10805975 10176127 9991773
14814 9991773 10403518 11320395 12534583 13856724 15144745 16268564 17090081 17480436 17407465
14805 17407465 17051890 16777285 16942328 17755334 19224931 21131052 23056896 24532874 25219259
14796 25219259 25027359 24094471 22620597 20726920 18454304 15864763 13155405 10671380
14788 10671380 8731595 7407864 6532334 5913363 5467138 5152454 4860923 4417257 3691301
14779 3691301 2694602 1570857 516047 -305839 -804043 -955685 -794481 -397540 136179
14770 136179 674486 1043263 1120115 954694 784113 937232 1681489 3127867 5268222
14761 5268222 8037947 11283972 14701234 17880562 20475310 22348484 23594684 24467074
14753 24467074 25277425 26267295 27450517 28549944 29156301 28983125 27976444 26245959 23975482
14744 23975482 21403853 18777544 16238012 13791670 11408567 9113812 6969490 4986415
14736 4986415 3087888 1166965 -828375 -2862197 -4879528 -6883619 -8890163 -10821959
14728 -10821959 -12451524 -13417173 -13355202 -12133632 -10025531 -7644993 -5676207 -4585978
14720 -4585978 -4472130 -5101744 -6060070 -6887965 -7201911 -6806523 -5715909 -4055457 -1960943
14711 -1960943 406487 2780344 4818777 6265847 7065547 7345101 7321634 7178852 6958625
14702 6958625 6554240 5865627 4964959 4056139 3304852 2769431 2488677 2579746 3178105 4267812
14692 4267812 5613300 6889634 7899289 8682203 9433267 10345622 11534309 13029451 14780225
14683 14780225 16678349 18606757 20483767 22253014 23829654 25098077 25997314 26631477
14675 26631477 27307485 28408777 30173508 32585099 35421966 38341872 40973850 43062246
14667 43062246 44587844 45777349 47016644 48689223 51003388 53954062 57430596 61332522
14659 61332522 65641415 70435930 75799762 81648263 87606854 93082857 97523112 100665459
14651 100665459 102592401 103530588 103567143 102572429 100381181 97040128 92929612 88647472
14643 88647472 84696755 81241976 78173912 75370767 72833066 70572192 68453531 66243430
14635 66243430 63811360 61202873 58522179 55859444 53340668 51133236 49363812 48089255
14627 48089255 47366912 47313948 48089429 49817037 52487357 55920219 59776118 63520747 66449697
14618 66449697 67932067 67699465 65911445 62993508 59426376 55623805 51890854 48399607
14610 48399607 45199308 42302486 39803527 37918728 36861976 36625747 36882089 37116470
14602 37116470 36880346 35991575 34615054 33176332 32074503 31403940 30969950 30534114 29997917
14593 29997917 29384621 28668876 27637464 25994367 23621165 20658675 17339818 13833762
14585 13833762 10271522 6864340 3957030 1939001 1054854 1256337 2193123 3358722
14577 3358722 4355777 5117630 5904429 7079521 8829991 11025670 13301258 15261377 16649670
14568 16649670 17428011 17774813 17978871 18277808 18749428 19275242 19569584 19282808 18147597
14559 18147597 16134752 13560665 11000768 9013755 7915539 7715324 8161543 8885064
14551 8885064 9559660 9972326 10064749 9992896 10105743 10811130 12414503 15029138 18594167
14542 18594167 22898434 27536358 31922141 35483233 37923817 39335559 40061475 40434895
14534 40434895 40618280 40655243 40619061 40660232 40928784 41522036 42527570 44059087 46198287
14525 46198287 48906827 52013337 55260270 58325202 60841508 62494534 63139313 62849898
14517 62849898 61893764 60627003 59320343 58016216 56556182 54760366 52580958 50147943
14509 50147943 47733226 45622058 43916385 42462589 41024299 39498449 37961248 36576383
14501 36576383 35475909 34679330 34100586 33638162 33274614 33093170 33156312 33380443 33619746
14492 33619746 33863013 34220134 34672355 34961043 34818913 34260327 33594165 33167889 33107593
14483 33107593 33245917 33203398 32567562 31120737 28951140 26383581 23846683 21743480 20321720
14474 20321720 19603195 19410040 19401997 19138893 18280487 16800162 14958780 13038493 11123140
14465 11123140 9138990 7030896 4822989 2545791 198935 -2179936 -4450514 -6438861
14457 -6438861 -8063937 -9334097 -10237720 -10704584 -10637968 -9921756 -8468275 -6343079 -3798287
14448 -3798287 -1108792 1611871 4405055 7327085 10368896 13456080 16412868 18932586
14440 18932586 20692207 21543907 21588645 21078536 20276927 19394433 18562547 17778738 16903607
14431 16903607 15797762 14486102 13179390 12164077 11671644 11793271 12475455 13566626
14423 13566626 14843616 16018658 16788524 16965973 16620952 16048767 15539983 15181849 14861263
14414 14861263 14421925 13816002 13101105 12291703 11279931 9968618 8470116 7127578 6261088
14405 6261088 5853970 5564559 5099070 4526689 4196419 4377800 5016492 5821545 6519199
14396 6519199 6980096 7177344 7133761 6907792 6551891 6063955 5399776 4508181 3309637
14387 3309637 1661144 -578627 -3397157 -6558678 -9693933 -12416999 -14381396 -15328168
14379 -15328168 -15166658 -14044703 -12298511 -10264589 -8132633 -5973201 -3869637 -2006939
14371 -2006939 -619995 151642 351844 171175 -156975 -457425 -688159 -945556 -1369271
14362 -1369271 -2017930 -2796915 -3463747 -3736437 -3459382 -2688897 -1629517 -479991 687377
14353 687377 1920871 3282217 4758551 6277916 7737064 8951973 9667436 9712970 9157528
14344 9157528 8311054 7581602 7302749 7609513 8388604 9345741 10164046 10617199 10561805 9894593
14334 9894593 8606480 6877176 5031742 3390563 2192313 1611336 1728520 2437413 3444805
14325 3444805 4391408 4968417 4998845 4484941 3585637 2539397 1538240 597687 -424551
14316 -424551 -1649878 -3045870 -4458685 -5716882 -6694017 -7340787 -7704019 -7874845 -7899137
14307 -7899137 -7772697 -7521745 -7257820 -7138718 -7267765 -7628661 -8146001 -8809539 -9643870
14298 -9643870 -10511127 -11058985 -10967102 -10206436 -9030136 -7799417 -6841337 -6355731 -6367170
14289 -6367170 -6734995 -7244808 -7785271 -8409676 -9140939 -9792725 -10071604 -9799827 -8971048
14280 -8971048 -7619348 -5722673 -3253638 -257957 3106259 6511874 9476418 11563500
14272 11563500 12585098 12575863 11680809 10160165 8358821 6544256 4823712 3226337 1834920
14263 1834920 843114 462483 757489 1600077 2769219 4053474 5300251 6408572 7266733
14254 7266733 7750279 7849363 7768864 7852245 8390596 9451002 10818352 12111846 13023276
14245 13023276 13495365 13696485 13816998 13863310 13657974 13054220 12127333 11163718 10501095
14236 10501095 10376471 10870809 11941037 13460736 15204506 16852035 18103631 18809455
14228 18809455 18984332 18744084 18233125 17571914 16849738 16140506 15510081 15019572 14709031
14219 14709031 14552783 14451404 14300082 14056356 13715110 13238686 12577184 11769326 10965377
14210 10965377 10343945 10015776 9944959 9953551 9878129 9716376 9553731 9371791 9042527 8548928
14200 8548928 8102820 7950915 8090829 8235609 8069767 7529943 6857296 6431272 6540257
14191 6540257 7225728 8296414 9468935 10479846 11125717 11286544 10950930 10229621 9329432
14182 9329432 8471484 7808797 7426199 7393176 7752393 8435306 9226352 9849105 10089945 9838560
14172 9838560 9064780 7823918 6287663 4700713 3265251 2096455 1277850 880640 900360
14163 900360 1228131 1735298 2371530 3138227 4017087 5011053 6206150 7690238 9406527
14154 9406527 11094568 12354112 12831859 12438184 11399288 10104512 8905041 7975605 7268167
14145 7268167 6580969 5713996 4602166 3340462 2135022 1233395 830693 971139 1529906
14136 1529906 2340985 3344290 4574577 6063406 7784144 9588149 11161781 12166150
14128 12166150 12468245 12199238 11590161 10779783 9789674 8648674 7451345 6251558 4982167
14119 4982167 3550931 1990183 472879 -859682 -2107890 -3573822 -5430048 -7475612
14111 -7475612 -9274230 -10457158 -10836028 -10353767 -9124522 -7527734 -6120540 -5377496 -5489355
14102 -5489355 -6365145 -7744288 -9249502 -10411245 -10809220 -10265808 -8890369 -6964753 -4799429
14093 -4799429 -2665541 -836527 381465 739993 170587 -1171694 -2939331 -4676707
14085 -4676707 -5950674 -6507907 -6387308 -5900843 -5506741 -5632597 -6439164 -7653286 -8729447
14076 -8729447 -9270039 -9279634 -9054745 -8932010 -9142543 -9782359 -10831612 -12205554 -13795342
14067 -13795342 -15465304 -17070138 -18519347 -19792534 -20872600 -21684505 -22110154 -22047599 -21444716
14058 -21444716 -20322647 -18803334 -17092895 -15428922 -14028340 -13037613 -12504471 -12379547
14050 -12379547 -12520611 -12699965 -12633603 -12029522 -10674368 -8552922 -5893818 -3072618 -448548
14041 -448548 1737328 3365527 4442396 5164894 5903885 6975412 8384816 9836548 11006917
14032 11006917 11809547 12398531 12935357 13404257 13665057 13625334 13295099 12683643 11705315
14023 11705315 10211530 8104815 5452469 2537686 -220263 -2453499 -3964014 -4661232
14015 -4661232 -4458185 -3299985 -1280492 1277479 3848850 5858329 6873014 6687606
14007 6687606 5282431 2796973 -429558 -3876413 -7004706 -9481178 -11288755 -12655341
13999 -12655341 -13891889 -15220196 -16617236 -17769265 -18237114 -17748095 -16366041 -14399976
13991 -14399976 -12193896 -10015416 -8065757 -6481524 -5261864 -4243459 -3238637 -2225041
13983 -2225041 -1395696 -1009879 -1225477 -2082486 -3527559 -5368026 -7244205 -8734488 -9512471
13974 -9512471 -9425263 -8544419 -7158700 -5595355 -4034626 -2535173 -1184826 -153772 385757
13965 385757 344844 -225118 -1095253 -1924509 -2412297 -2401049 -1878009 -948209 164087 1165907
13955 1165907 1850106 2197252 2307078 2265077 2102293 1853738 1616245 1572676 1988362 3160100
13945 3160100 5294754 8345248 11914448 15350258 18005469 19474544 19711988 19048971
13937 19048971 18055703 17268859 16947792 16996714 17080914 16835305 16012122 14521738 12420898
13928 12420898 9865113 7009333 3918403 609434 -2805156 -6065155 -8851881 -10896453
13920 -10896453 -12020402 -12132720 -11242421 -9486037 -7142689 -4615761 -2328851 -523208
13912 -523208 860631 2008951 2956483 3579001 3796564 3655656 3246541 2604994 1694288
13903 1694288 513889 -763040 -1834339 -2481214 -2682498 -2558744 -2318603 -2217739 -2420939
13894 -2420939 -2868592 -3297471 -3360722 -2721886 -1117663 1562160 5202776 9445504 13732097
13885 13732097 17435425 20085230 21544764 21958136 21549584 20520032 19111524 17670321
13877 17670321 16536912 15893389 15793462 16276194 17343859 18841437 20448475 21837873 22837330
13868 22837330 23441981 23716588 23686775 23270621 22342349 20920063 19235261 17575934 16115680
13859 16115680 14884962 13840829 12947026 12232906 11812030 11830802 12367454 13364877 14674340
13850 14674340 16184327 17900115 19866607 22046007 24334031 26633728 28806080 30568831
13842 30568831 31535084 31408640 30170543 28096222 25643393 23329485 21607002 20743671
13834 20743671 20762557 21438389 22352366 23062195 23299953 23021790 22330598 21431750 20602907
13825 20602907 20078141 19929846 20055658 20250413 20309462 20119993 19699170 19146583 18567652
13816 18567652 18076487 17831784 17962636 18399239 18809695 18761538 17976910 16480205 14553592
13807 14553592 12544633 10660911 8886633 7055033 4996507 2683775 322879 -1722600
13799 -1722600 -3148692 -3797356 -3564266 -2428732 -652989 1198198 2504559 2786448 1759231
13790 1759231 -606580 -4070178 -8221280 -12576950 -16625170 -19923311 -22210643 -23392728
13782 -23392728 -23454682 -22418951 -20392646 -17653382 -14609586 -11622593 -8870321 -6359157
13774 -6359157 -4015412 -1751155 489287 2679282 4706091 6422937 7695850 8438465
13766 8438465 8671983 8567715 8426401 8568664 9133317 9965064 10730425 11077420 10672822
13757 10672822 9251418 6752477 3387989 -421115 -4151858 -7328066 -9697408 -11279078
13749 -11279078 -12256448 -12823706 -13027394 -12680930 -11469106 -9202452 -6018804 -2385545 1091568
13740 1091568 3961835 6115430 7692725 8854736 9651798 10028119 9865479 9050159 7607378
13731 7607378 5800011 4035405 2651068 1795654 1439574 1392252 1366287 1206494 1093800
13722 1093800 1441470 2624896 4831840 7981538 11645817 15157146 17916660 19661834
13714 19661834 20548687 21056689 21787066 23205201 25390834 27981097 30381274 32069617
13706 32069617 32810736 32668387 31844433 30570857 29170258 28085855 27709081 28137391 29115876
13697 29115876 30269579 31449102 32850542 34764492 37193537 39713239 41696639 42657155
13689 42657155 42394684 40983519 38768495 36246298 33775232 31376566 28835703 26016844
13681 26016844 23099210 20493651 18543394 17382910 17059908 17636856 19107292 21245836
13673 21245836 23555636 25403865 26264394 25871272 24235005 21635519 18584482 15654112
13665 15654112 13279803 11694528 10960517 11005109 11634999 12541689 13296597 13374176 12277217
13656 12277217 9740696 5892923 1278123 -3284625 -6987371 -9361191 -10435595 -10613255
13648 -10613255 -10392284 -10175032 -10216459 -10593608 -11198220 -11831398 -12296526 -12403140 -12048594
13639 -12048594 -11413884 -10939505 -10961700 -11437269 -12034933 -12376665 -12190051 -11361130 -9951268
13630 -9951268 -8160304 -6245201 -4462607 -3011198 -1957364 -1221393 -640265 -56477 593928
13621 593928 1241544 1763710 2177107 2766827 3942572 5902578 8434455 10988030 12904049
13612 12904049 13709182 13349923 12147299 10482093 8508967 6149207 3361077 410790
13604 410790 -2191117 -4058247 -5203138 -5955845 -6672394 -7507510 -8391383 -9223182 -10068278
13595 -10068278 -11118315 -12482389 -14017960 -15347051 -16073117 -16035081 -15395520 -14491774 -13569841
13586 -13569841 -12624946 -11481330 -10027461 -8363487 -6722687 -5292736 -4114711 -3081655
13578 -3081655 -2002186 -756800 534867 1548535 1995593 1845548 1385405 1069536 1205261
13569 1205261 1768946 2550949 3372009 4121485 4712157 5126670 5479588 5868815 6120492
13560 6120492 5806252 4611444 2677389 562178 -1136993 -2158628 -2592131 -2560247 -2051676
13551 -2051676 -1110088 48570 1252932 2556709 4118110 5993608 8033083 9913665
13543 9913665 11306982 12052774 12178852 11796409 11036239 10001185 8652792 6780593 4138733
13534 4138733 572114 -3963439 -9335762 -15121586 -20649956 -25186423 -28120537 -29136736
13526 -29136736 -28265843 -25767961 -22045754 -17657443 -13258182 -9423440 -6509395 -4638775
13518 -4638775 -3720142 -3449888 -3373268 -3032348 -2171948 -911679 299093 961288 803015
13509 803015 -157778 -1705399 -3459167 -4863363 -5357906 -4706023 -3128217 -1112451 820802
13500 820802 2227452 2822276 2591030 1807401 852104 -25236 -814066 -1732276 -3153147
13491 -3153147 -5431687 -8644196 -12443978 -16192200 -19233093 -21074084 -21442658 -20375360
13483 -20375360 -18307956 -15955127 -13991014 -12741717 -12065580 -11529058 -10737115 -9467930
13475 -9467930 -7553253 -4794999 -1090362 3377013 8124458 12595547 16443377 19599597
13467 19599597 22057600 23676663 24253040 23685858 22061652 19724302 17261619 15267302
13459 15267302 14031921 13413501 12954554 12138094 10599932 8207426 5068195 1494725
13451 1494725 -2110608 -5416333 -8261032 -10639297 -12650948 -14458899 -16216322 -17996795
13443 -17996795 -19766810 -21384922 -22697345 -23673336 -24367371 -24775948 -24828589 -24523675 -24038196
13434 -24038196 -23665710 -23621868 -23894161 -24259281 -24473172 -24502471 -24574583 -24981562 -25817680 -26879534
13424 -26879534 -27781730 -28100171 -27479913 -25822759 -23407942 -20723532 -18166148 -15918294
13416 -15918294 -14046727 -12620612 -11719782 -11393930 -11654190 -12474410 -13764303 -15349013 -16993859
13407 -16993859 -18461272 -19595159 -20385927 -20917060 -21232777 -21271582 -20927630 -20175223 -19147586
13398 -19147586 -18114951 -17361222 -16996301 -16847945 -16586216 -16034367 -15373277 -14996921 -15184034
13389 -15184034 -15935825 -17055622 -18308476 -19553559 -20810095 -22209349 -23810028 -25406257
13381 -25406257 -26570127 -26914327 -26274959 -24734464 -22612601 -20383473 -18466731 -17019146
13373 -17019146 -15916561 -14931716 -13887082 -12704612 -11427902 -10190528 -9115321 -8233606
13365 -8233606 -7496036 -6833784 -6150788 -5235042 -3778543 -1635916 899374 3179878 4665419
13356 4665419 5288519 5383884 5373414 5566173 6198773 7501884 9579884 12252751 15064255
13347 15064255 17425976 18830007 19068134 18293832 16866881 15129016 13239261 11120891
13339 11120891 8568650 5473955 1983603 -1565105 -4845528 -7643959 -9815729 -11273677
13331 -11273677 -12049699 -12252908 -11938359 -11097902 -9793358 -8241112 -6718780 -5415562 -4406000
13322 -4406000 -3699542 -3245177 -2926239 -2634293 -2360557 -2149186 -1947883 -1582117 -913774
13313 -913774 29016 1122977 2313759 3657384 5180161 6719158 7964747 8693861 8930814
13304 8930814 8852673 8538575 7868254 6716723 5191758 3624039 2371970 1638966 1393092
13295 1393092 1440536 1620601 1974107 2767219 4336839 6822280 9991579 13305884 16142163
13286 16142163 18036466 18858038 18857880 18557944 18486895 18898860 19685022 20503629 20975719 20842748
13276 20842748 20069180 18847302 17453516 16027955 14492052 12674820 10482394 7983592
13268 7983592 5359821 2756946 218870 -2226987 -4489764 -6426051 -7860402 -8603675
13260 -8603675 -8535343 -7720464 -6419236 -4911143 -3310943 -1622985 59609 1547453 2775757
13251 2775757 3951331 5451003 7570592 10325872 13451624 16547930 19190971 20980715
13243 20980715 21645483 21176608 19831551 17968378 15857419 13626772 11374114 9301987
13235 9301987 7677642 6678835 6347692 6669947 7657346 9355051 11772947 14769178 17949062
13226 17949062 20724437 22583497 23371245 23326187 22857615 22297088 21805905 21420108 21155900
13217 21155900 21111598 21469025 22351259 23681137 25184656 26516111 27405535 27703805 27327030
13208 27327030 26248403 24572836 22571133 20559307 18691144 16857269 14796210 12355133
13200 12355133 9671135 7092691 4944487 3339277 2161452 1269605 710553 640688 1052114
13191 1052114 1673694 2169146 2424506 2648999 3186788 4197637 5479205 6569132 7027900
13182 7027900 6665873 5575342 4057481 2548757 1483421 1083699 1264105 1768089 2408963
13173 2408963 3173319 4098710 5110043 5996390 6471677 6268459 5303485 3783655 2100176
13164 2100176 634611 -328569 -601735 -78261 1305184 3531151 6337208 9150112 11331399
13155 11331399 12567128 13004386 13035208 12999460 13034751 13090461 13049019 12885075 12712243 12659842
13145 12659842 12748338 12906856 13070235 13229562 13431255 13725511 14043510 14139410 13737879 12783956
13135 12783956 11525182 10323534 9422388 8921709 8886370 9326872 10064182 10753632 11122065
13126 11122065 11144763 10958357 10645142 10153385 9393025 8377239 7301433 6489079 6231757
13117 6231757 6625399 7501693 8519653 9387475 10069244 10804642 11918651 13608007 15876795
13108 15876795 18582631 21471560 24173509 26220671 27150667 26697738 24978052 22506040
13100 22506040 19974038 17924968 16536611 15659505 15046221 14543447 14109604 13715342 13232143
13091 13232143 12448296 11269767 9877109 8640656 7928634 7952547 8647607 9671247 10587111
13082 10587111 11091785 11104286 10693257 9953463 8949752 7742791 6437499 5209617 4268329
13073 4268329 3773601 3794540 4290229 5058664 5750547 6015887 5650103 4654783 3240765
13064 3240765 1739894 449409 -453473 -909964 -996135 -911922 -855408 -918237 -1139317 -1586017
13054 -1586017 -2299150 -3195991 -4121997 -5025544 -6036839 -7348225 -9040266 -11018081 -13060460
13045 -13060460 -14911613 -16352372 -17209136 -17339527 -16668474 -15253898 -13284382 -10993144
13037 -10993144 -8594007 -6305727 -4350219 -2818402 -1554521 -238668 1394160 3369805
13029 3369805 5438566 7211512 8377657 8848584 8768235 8445399 8261440 8542780 9451603
13020 9451603 10965171 12886965 14888146 16650439 18014200 18983781 19609475 19873572 19683844
13011 19683844 18966081 17756079 16212150 14556814 13008096 11730825 10804306 10216177
13003 10216177 9867280 9573276 9117489 8357988 7313593 6182278 5270695 4857335 5094136
12994 5094136 5997879 7461603 9233428 10924563 12151220 12745714 12822665 12664548 12566824
12985 12566824 12703122 13045749 13431800 13741448 13990021 14249149 14546712 14866093 15189746
12976 15189746 15528561 15942103 16532238 17401432 18606368 20133029 21892933 23714114 25360883
12967 25360883 26642165 27496663 27921468 27858770 27184428 25757467 23493448 20491713 17123022
12958 17123022 13922802 11331448 9501176 8317063 7556863 7006353 6466957 5743443 4711935
12949 4711935 3429098 2127172 1048750 259180 -382264 -1082982 -1994590 -3206301 -4743642
12940 -4743642 -6506228 -8260722 -9728583 -10656750 -10862081 -10312711 -9178500 -7733636 -6162465
12931 -6162465 -4451091 -2474621 -203906 2173232 4349697 6119464 7488462 8600977
12923 8600977 9621183 10653402 11674136 12503910 12866417 12528498 11457382 9877766 8158800
12914 8158800 6625433 5466840 4775391 4609050 5004818 5965471 7459844 9444312 11876263
12905 11876263 14659633 17542665 20133922 22115054 23428663 24218763 24635681 24753193
12897 24753193 24625264 24334098 23972542 23597631 23178485 22596481 21728817 20522878 18986313
12888 18986313 17142301 15023026 12690831 10244085 7808967 5519851 3474216 1687990
12880 1687990 124603 -1213369 -2257732 -2956122 -3339536 -3493372 -3495541 -3400293 -3261211
12871 -3261211 -3140399 -3086849 -3098406 -3085865 -2886805 -2352879 -1442661 -245384 1084722 2432119
12861 2432119 3747694 4976556 6001199 6707580 7123582 7452898 7944920 8746567 9857531
12852 9857531 11162534 12495527 13710973 14733882 15570658 16275930 16898777 17432713 17795112
12843 17795112 17871025 17607226 17077867 16449376 15871261 15381593 14884463 14232865 13383385
12834 13383385 12463874 11668569 11122940 10833110 10678028 10440598 9916811 9035854 7874362
12825 7874362 6561609 5187841 3815021 2552885 1554135 912002 602328 499890 414078
12816 414078 181042 -227946 -747190 -1367684 -2180979 -3269707 -4583818 -5936908 -7138450
12807 -7138450 -8147837 -9113624 -10266295 -11756218 -13561345 -15520065 -17417942 -19017429
12799 -19017429 -20054209 -20295225 -19622741 -18069375 -15816105 -13161506 -10446804 -7950302
12791 -7950302 -5792546 -3921942 -2217369 -623372 810463 2013168 2984170 3770065
12783 3770065 4373048 4723806 4730581 4309472 3377005 1879141 -131990 -2441981 -4696349
12774 -4696349 -6499724 -7534813 -7650812 -6909865 -5568967 -3997719 -2591854 -1703090 -1561668
12765 -1561668 -2207209 -3470978 -5038788 -6570813 -7811319 -8641750 -9058445 -9096918 -8775447
12756 -8775447 -8103276 -7115665 -5880550 -4491887 -3082852 -1822606 -863563 -274722 1331
12747 1331 133469 319350 710327 1409756 2500048 4021191 5911856 8001789 10084254
12738 10084254 11980136 13538438 14648970 15310218 15643757 15778814 15720301 15346193 14531857
12729 14531857 13277734 11709699 9965974 8138934 6336102 4714011 3395959 2396354
12721 2396354 1654255 1096453 643039 195105 -336699 -972824 -1653783 -2309989 -2913089
12712 -2913089 -3453621 -3896656 -4169301 -4213744 -4066533 -3851281 -3659569 -3464137 -3177223 -2745723
12702 -2745723 -2169000 -1492916 -821972 -320897 -186572 -587064 -1591786 -3130268 -5017610
12693 -5017610 -7050166 -9069719 -10920381 -12398405 -13306919 -13559907 -13206771 -12357739 -11112449
12684 -11112449 -9568540 -7867129 -6195669 -4746783 -3685981 -3137583 -3140610 -3578248 -4175678
12675 -4175678 -4619722 -4721485 -4479387 -3994755 -3333849 -2473600 -1383564 -149664 999579
12666 999579 1810672 2167549 2144112 1905724 1573077 1186796 784949 475688 396993 612514
12656 612514 1086979 1752252 2548368 3401622 4210220 4887031 5424679 5920982 6546558 7460868
12646 7460868 8698923 10113630 11428170 12347104 12664613 12328529 11429286 10136176 8646520
12637 8646520 7191089 6042796 5427069 5378152 5697575 6061984 6207929 6076269 5794640
12628 5794640 5511979 5263364 4994535 4674984 4335112 3998794 3653139 3302387 2994467
12619 2994467 2785449 2691421 2644641 2493635 2089341 1377415 407924 -692187 -1736570
12610 -1736570 -2515626 -2855960 -2664164 -1934521 -738418 786040 2461108 4118172 5622298
12601 5622298 6859899 7759616 8350794 8749249 9049984 9244228 9237267 8916011 8185987 6979218
12591 6979218 5298258 3287035 1228302 -562481 -1854012 -2542941 -2626363 -2165583 -1287753
12582 -1287753 -176644 987935 2085038 3056767 3878715 4524331 4937927 5055476 4895395
12573 4895395 4610138 4407866 4411623 4563884 4650941 4441684 3837787 2948205 2049129 1435858
12563 1435858 1272581 1532492 2015993 2445397 2625579 2547366 2331932 2101266 1916111 1785268
12553 1785268 1688518 1611782 1582637 1661138 1889774 2258337 2711536 3199609 3734392 4356484
12543 4356484 5029461 5608026 5925578 5913365 5654086 5328586 5102967 5042136 5084954 5061848
12533 5061848 4762997 4064223 3008313 1754834 491107 -599660 -1365343 -1744279 -1803433
12524 -1803433 -1712735 -1663622 -1771578 -2032484 -2373080 -2723188 -3028638 -3262042 -3501674 -3982352
12514 -3982352 -4985275 -6642631 -8860318 -11406818 -14021578 -16444517 -18432737 -19793536
12506 -19793536 -20396798 -20199453 -19279728 -17814351 -16000066 -14012194 -12031354 -10222646
12498 -10222646 -8641981 -7217363 -5855764 -4554356 -3411444 -2571185 -2173394 -2298592
12490 -2298592 -2906028 -3822252 -4815530 -5697917 -6373878 -6836613 -7154027 -7434472 -7750500
12481 -7750500 -8091101 -8400731 -8635931 -8769002 -8755520 -8509192 -7923691 -6937299 -5588270
12472 -5588270 -4041967 -2577033 -1502017 -1043024 -1280489 -2148537 -3469626 -5003123 -6498372
12463 -6498372 -7750295 -8648327 -9212303 -9582757 -9934930 -10370407 -10875632 -11370189 -11792256
12454 -11792256 -12153210 -12516286 -12923205 -13353824 -13749766 -14056113 -14246614 -14330902 -14350903 -14350264
12444 -14350264 -14305349 -14098389 -13611641 -12852346 -11947187 -11013830 -10074778 -9084498 -8008876
12435 -8008876 -6895006 -5880916 -5125995 -4724775 -4665566 -4847073 -5160782 -5582889 -6175992
12426 -6175992 -6994860 -8006302 -9094245 -10098295 -10862190 -11316899 -11511107 -11516104 -11336928
12417 -11336928 -10955277 -10413631 -9797130 -9143390 -8421989 -7597985 -6680920 -5724454 -4800155
12408 -4800155 -3972260 -3292412 -2792324 -2464675 -2275515 -2220035 -2374022 -2882983 -3864384 -5294770
12398 -5294770 -7002435 -8755902 -10329398 -11528686 -12235319 -12431757 -12173563 -11548930 -10638452
12389 -10638452 -9506714 -8249891 -7029560 -6025962 -5341017 -4942293 -4695996 -4448733 -4102084
12380 -4102084 -3651071 -3178256 -2818231 -2703000 -2898263 -3369025 -4004416 -4682585 -5321643
12371 -5321643 -5860809 -6208319 -6271638 -6051981 -5668861 -5294291 -5088259 -5182962 -5655922 -6460540
12361 -6460540 -7428549 -8375406 -9164094 -9668736 -9739975 -9262474 -8259527 -6918645 -5512325
12352 -5512325 -4299276 -3458396 -3048651 -2981740 -3051181 -3062736 -2966760 -2854043 -2844479 -2990740
12342 -2990740 -3249170 -3493380 -3547411 -3253182 -2558825 -1561569 -473102 476049 1164903
12333 1164903 1674416 2241413 3070647 4170128 5363514 6424911 7189026 7600510 7717250
12324 7717250 7639668 7402267 6969372 6358843 5721863 5272357 5148140 5330606 5678471 6045482
12314 6045482 6366827 6633395 6836011 6991464 7197170 7581362 8171365 8837115 9366094
12305 9366094 9566979 9326021 8642143 7645149 6553569 5568601 4760223 4026115 3178280
12296 3178280 2106926 887032 -240189 -976547 -1094311 -506812 737232 2502766 4637091
12287 4637091 7018815 9531866 11987135 14110211 15667607 16610299 17055549 17155437 17027572
12278 17027572 16762547 16433389 16099754 15810872 15588236 15408980 15225946 14996956 14680809
12269 14680809 14224325 13599284 12882933 12259315 11881860 11743493 11702090 11620380 11470136 11318263
12259 11318263 11239310 11248530 11277248 11155448 10642211 9559410 7938542 6035090 4200176
12250 4200176 2729957 1799124 1480760 1780392 2630155 3883032 5366277 6930604 8437165
12241 8437165 9751313 10771889 11442341 11729532 11604763 11041486 10042958 8694513 7149095
12232 7149095 5530279 3903851 2363172 1059395 90112 -603738 -1187838 -1781760 -2359293
12223 -2359293 -2790247 -2952768 -2805920 -2428250 -2027185 -1867369 -2149188 -2916429 -4021813
12214 -4021813 -5179489 -6108429 -6662132 -6844803 -6739176 -6438518 -6028403 -5589880 -5192146
12205 -5192146 -4863853 -4556474 -4150609 -3543968 -2767581 -2012039 -1519990 -1422263 -1657874 -2033046
12195 -2033046 -2343692 -2483781 -2486836 -2466105 -2515063 -2650071 -2778504 -2711588 -2282551 -1487292
12185 -1487292 -516381 330776 797809 814794 509348 58178 -440444 -926877 -1290268 -1386654
12175 -1386654 -1105412 -376635 814611 2354512 4002657 5533125 6853444 7964413
12167 7964413 8846716 9441726 9719446 9688078 9320743 8517130 7164584 5240816 2871535
12158 2871535 323885 -2032275 -3807703 -4728688 -4729599 -3941400 -2637795 -1182195 72207
12149 72207 914419 1338447 1494245 1556991 1595207 1552469 1356123 1012269 589636 167744
12139 167744 -176728 -375820 -385922 -200923 144698 587867 1057564 1493488 1865614 2193660
12129 2193660 2540713 2985542 3630523 4622880 6079849 7939771 9924477 11687822 13003337
12120 13003337 13823485 14224191 14352963 14401156 14541791 14850998 15297910 15804100 16304764
12111 16304764 16769816 17179864 17500723 17696599 17745368 17608958 17189538 16355032 15045060
12102 15045060 13345694 11444678 9533374 7782099 6383774 5554521 5463616 6159685 7543626
12093 7543626 9391799 11424566 13391397 15111812 16470741 17420565 17984737 18239187 18283451
12084 18283451 18203650 18043578 17836531 17674001 17689164 17939646 18340229 18728683 18961201 18930256
12074 18930256 18536925 17703725 16431076 14825045 13047352 11198835 9237278 7029637
12066 7029637 4488959 1674317 -1198433 -3822974 -5914011 -7321439 -8102352 -8490199
12058 -8490199 -8756107 -9062904 -9415541 -9728982 -9935009 -10016745 -9961413 -9748584 -9422429 -9129029
12048 -9129029 -9030199 -9189570 -9554490 -10006065 -10401335 -10614970 -10585457 -10314590 -9812285 -9052631
12038 -9052631 -7998634 -6671802 -5195871 -3763424 -2526264 -1508453 -643691 107581
12030 107581 689875 984489 901552 493931 19498 -152818 240900 1202700 2503682 3841335
12020 3841335 4959975 5706922 6077171 6191437 6194981 6169011 6114031 5996978 5791990 5474887
12010 5474887 5019014 4402953 3591641 2532972 1218999 -265777 -1796035 -3286658 -4682285
12001 -4682285 -5886179 -6750277 -7142920 -7017842 -6439822 -5561351 -4557826 -3538667 -2486935
11992 -2486935 -1294065 132574 1772415 3450655 4854931 5626318 5519109 4516103
11984 4516103 2807406 701971 -1448347 -3325116 -4720807 -5579405 -5960184 -5942739 -5590280
11975 -5590280 -5025025 -4464396 -4094858 -3924977 -3799148 -3539928 -3082278 -2512657 -1985439
11966 -1985439 -1566992 -1143753 -476693 654509 2298218 4241773 6088749 7489792 8328795
11957 8328795 8707097 8800705 8751002 8625464 8411161 8047291 7498893 6811678 6093292 5440882
11947 5440882 4901141 4503804 4296581 4323325 4581661 5017813 5568886 6199071 6866865 7464300
11937 7464300 7841311 7918542 7764827 7552288 7438746 7488739 7682191 7975654 8329863 8677132
11927 8677132 8929337 9058444 9122547 9180907 9226877 9257038 9378484 9780147 10585286 11758338
11917 11758338 13147869 14565358 15812167 16702055 17129184 17124470 16821793 16368677 15873505
11908 15873505 15417098 15093782 15027389 15319440 15963038 16803414 17571842 17979555 17836162
11899 17836162 17144143 16118879 15087290 14301013 13810293 13526459 13382532 13362687 13397102
11890 13397102 13336028 13082766 12747522 12633035 13006162 13846612 14823792 15519755 15678823
11881 15678823 15274610 14396967 13133163 11547285 9724604 7818907 6043526 4576737
11873 4576737 3438961 2455658 1359680 -31399 -1690289 -3395058 -4865527 -5920456
11865 -5920456 -6560049 -6948674 -7332400 -7927276 -8829650 -10021968 -11447641 -13032880 -14639261
11856 -14639261 -16050492 -17062527 -17613863 -17816902 -17862669 -17898148 -17966569 -18029667 -18048011 -18056716
11846 -18056716 -18152077 -18413929 -18870086 -19507527 -20272199 -21053046 -21685705 -21986323 -21788591
11837 -21788591 -20968641 -19461066 -17301812 -14690280 -11952241 -9381390 -7126325 -5222148
11829 -5222148 -3671145 -2451075 -1487010 -696485 -57575 417346 750749 1000445 1197657
11820 1197657 1314947 1332404 1314099 1358968 1496708 1696680 1959027 2328194 2822274 3386672
11810 3386672 3924934 4374299 4738418 5033822 5214250 5174808 4835002 4188504 3275711 2171985
11800 2171985 1043014 167659 -168691 154033 1007025 2086123 3092731 3890168 4497888
11791 4497888 4974284 5350406 5633361 5822770 5914045 5884184 5699864 5349988 4850697 4236698
11781 4236698 3577714 2971662 2479125 2092455 1804612 1682128 1850902 2416684 3375162
11772 3375162 4566009 5717018 6590199 7144076 7534126 7933444 8396156 8905783 9481090
11763 9481090 10154974 10860580 11392809 11491918 10981891 9870802 8331867 6598783 4882183
11754 4882183 3320301 1922355 553300 -967997 -2710050 -4544220 -6214424 -7505148
11746 -7505148 -8338590 -8719497 -8675551 -8317186 -7869261 -7530565 -7315407 -7079479 -6689186 -6149849
11736 -6149849 -5572587 -5024483 -4430716 -3627883 -2486505 -993235 740181 2542132 4266958
11727 4266958 5832971 7218214 8429229 9446376 10208383 10661791 10785852 10563606 9978305
11718 9978305 9061635 7935687 6789586 5804189 5094015 4684711 4510882 4450443 4379280
11709 4379280 4207979 3908616 3535619 3214759 3080598 3165515 3322968 3309348 2987938 2458328
11699 2458328 1997817 1895477 2320831 3263649 4537466 5880899 7109338 8182906 9137626
11690 9137626 9975708 10636999 11035388 11069116 10628408 9673109 8329117 6898582 5773085
11681 5773085 5311914 5719876 6952160 8713269 10574574 12142647 13194437 13729395 13923505
11672 13923505 14014374 14171214 14410129 14615081 14663331 14538369 14317018 14067012 13777809 13384536
11662 13384536 12841923 12174853 11478427 10890398 10538378 10455357 10537761 10597474 10451094 9991524
11652 9991524 9215768 8202966 7079010 6018074 5254595 5021959 5443651 6474368 7918736
11643 7918736 9505142 10964796 12062736 12615997 12544784 11887922 10752091 9290577 7718469
11634 7718469 6260976 5040318 4030273 3130615 2275407 1476989 773779 152276 -447576
11625 -447576 -1044769 -1563721 -1889144 -1971154 -1877881 -1746221 -1666008 -1603730 -1444795 -1105138
11615 -1105138 -594062 10881 624398 1194261 1712951 2201778 2675276 3130470 3570167
11606 3570167 4000068 4386336 4662973 4821757 4964874 5245189 5762030 6498828 7347850
11597 7347850 8200479 8997820 9672340 10082095 10077537 9638088 8893917 8017662 7153721 6451006
11587 6451006 6066103 6064092 6350502 6745259 7109159 7395554 7610623 7740027 7722042 7489623
11577 7489623 7028305 6398883 5718223 5114158 4684468 4484750 4537188 4839003 5360999 6035874
11567 6035874 6754446 7404267 7924237 8310170 8598578 8880610 9292880 9935046 10798977
11558 10798977 11787850 12760183 13553643 14058102 14309431 14443433 14526389 14480358 14184631 13610617
11548 13610617 12853365 12049600 11272918 10505434 9684796 8761884 7731473 6646125 5624795
11539 5624795 4829023 4394176 4363052 4676541 5191995 5692172 5935598 5767979 5205573 4412420
11529 4412420 3588934 2837537 2098967 1232040 191801 -870166 -1720385 -2262055 -2612835
11520 -2612835 -2970585 -3416086 -3836327 -4000705 -3696495 -2859406 -1638451 -309495 899319
11511 899319 1893060 2660890 3183980 3402861 3288185 2926753 2500573 2186356 2077389 2158135
11501 2158135 2325175 2463919 2549874 2680746 2970509 3397216 3788677 3966763 3886307 3651890
11491 3651890 3437489 3401727 3659887 4262654 5143357 6113289 6952288 7515848 7744826 7583615
11481 7583615 6948120 5811842 4319552 2787462 1532299 661208 24433 -629571 -1436743
11472 -1436743 -2323797 -3098470 -3618049 -3893639 -4070334 -4326420 -4764338 -5364564 -6033444
11463 -6033444 -6678908 -7246966 -7748481 -8261121 -8840751 -9418805 -9831469 -9976906 -9924767 -9845871
11453 -9845871 -9857127 -9942754 -9975104 -9790102 -9289158 -8506573 -7563414 -6532846 -5363541 -3966108
11443 -3966108 -2371549 -786945 487023 1189220 1197276 557376 -542835 -1845224 -3135001
11434 -3135001 -4340810 -5521290 -6742615 -7991109 -9201530 -10309883 -11235319 -11820143
11426 -11820143 -11804240 -10895822 -8947977 -6111590 -2813280 430656 3223013 5374910
11418 5374910 6867679 7796825 8336602 8659082 8820613 8745049 8343300 7636366 6766086
11409 6766086 5936188 5350983 5137466 5273829 5592783 5860509 5889205 5624276 5153038 4649781
11399 4649781 4298574 4218779 4405775 4702162 4834133 4528378 3655003 2291995 672584
11390 672584 -933340 -2336758 -3470905 -4337737 -4918987 -5115671 -4800623 -3993215 -2961125
11381 -2961125 -2107761 -1765220 -2044045 -2785021 -3639119 -4258082 -4467476 -4288950 -3837692
11372 -3837692 -3222837 -2528381 -1856463 -1352790 -1181757 -1472815 -2244135 -3373108 -4687689
11363 -4687689 -6067353 -7391167 -8398396 -8703057 -8022539 -6381889 -4094080 -1584343
11355 -1584343 775091 2738167 4188887 5123003 5621489 5816713 5839982 5754144 5537661
11346 5537661 5157148 4636016 4037200 3412654 2792632 2213257 1733670 1404425 1224767
11337 1224767 1152009 1140592 1142421 1074418 825769 317449 -466684 -1492217 -2648540 -3720289
11327 -3720289 -4470486 -4761907 -4560144 -3871591 -2763309 -1437573 -225176 552368 759581
11318 759581 504488 20638 -490382 -892771 -1070995 -963861 -640299 -248690 111584 409165
11308 409165 595278 577950 301585 -179549 -704262 -1046243 -997023 -514078 197150 810687
11298 810687 1137079 1278721 1532389 2129930 3055958 4069711 4855109 5177587 4978750
11289 4978750 4368908 3540873 2678576 1873391 1065111 110047 -1047777 -2277711 -3315861
11280 -3315861 -3900841 -3877755 -3230172 -2079497 -661318 742945 1894560 2663771 3062924
11271 3062924 3216170 3259003 3241844 3098088 2688545 1919865 860938 -272600 -1272238
11262 -1272238 -2061902 -2663428 -3077786 -3240945 -3086017 -2621153 -1961731 -1296977 -801645
11253 -801645 -560620 -548883 -670391 -840989 -1042627 -1305786 -1658312 -2089616 -2564506 -3058097
11243 -3058097 -3527517 -3840225 -3793788 -3244092 -2204587 -847155 563836 1767622 2590577
11234 2590577 2980077 2992010 2764320 2471250 2244726 2121096 2061061 2009904 1930096 1790665
11224 1790665 1576166 1308355 994746 561624 -84407 -933297 -1873509 -2793593 -3631261
11215 -3631261 -4337978 -4843209 -5099535 -5171453 -5248124 -5551056 -6229926 -7323098 -8756064
11206 -8756064 -10337824 -11785073 -12805551 -13218637 -13055793 -12567280 -12104872 -11940590 -12133242
11197 -12133242 -12526570 -12863664 -12943899 -12725385 -12269053 -11580103 -10536130 -8963988 -6760509
11188 -6760509 -3938720 -600411 3067225 6757076 10068074 12623520 14205882 14833356
11180 14833356 14704225 14018065 12851611 11223001 9255512 7263685 5677048 4843839
11172 4843839 4852898 5486892 6326227 6962155 7174499 6949157 6403279 5719614 5088412 4645936
11162 4645936 4448424 4509261 4844974 5434012 6121749 6638045 6754954 6409668 5701331 4844232
11152 4844232 4124554 3806696 3975961 4435743 4807211 4784507 4311472 3548883 2717626 1962047
11142 1962047 1328166 839650 536501 418753 387720 259950 -151269 -919182 -1910033 -2789792
11132 -2789792 -3169662 -2830848 -1845148 -454519 1148792 2880396 4643874 6222292 7300417
11123 7300417 7573000 6854038 5178902 2853896 356117 -1861554 -3505257 -4460746 -4742052
11114 -4742052 -4434304 -3663889 -2588018 -1389209 -247722 710768 1440929 1945882 2243332
11105 2243332 2375917 2401323 2337227 2161004 1886019 1612214 1493891 1655123 2114122 2775169
11095 2775169 3483397 4079380 4427067 4438043 4099749 3471227 2621210 1542785 133310
11086 133310 -1688108 -3812486 -5922131 -7666972 -8856409 -9503523 -9743851 -9750426 -9698955
11077 -9698955 -9735168 -9927053 -10269513 -10738627 -11287203 -11766117 -11919150 -11554768 -10734005 -9745509
11067 -9745509 -8907189 -8399427 -8212286 -8175327 -8056623 -7710320 -7155430 -6470948 -5626332 -4485483
11057 -4485483 -2980239 -1222529 561038 2168208 3500697 4538188 5265817 5657736
11049 5657736 5724883 5546707 5236128 4861281 4405819 3823209 3123081 2386545 1698053 1082421
11039 1082421 526806 39397 -354921 -663763 -940845 -1256291 -1651514 -2109414 -2574593
11030 -2574593 -3011649 -3422417 -3801572 -4135273 -4486384 -5027195 -5905876 -7075413 -8301553
11021 -8301553 -9339220 -10053964 -10383568 -10249626 -9552294 -8267417 -6529856 -4587039 -2663546
11012 -2663546 -874201 736450 2091303 3043635 3449505 3262248 2548499 1425745 15352
11003 15352 -1542060 -3087373 -4491223 -5677138 -6605102 -7262268 -7674139 -7911560 -8061508
10994 -8061508 -8174846 -8245300 -8235009 -8112131 -7884762 -7620292 -7416366 -7347839 -7464912 -7824089
10984 -7824089 -8451409 -9250197 -10011306 -10550731 -10798093 -10758285 -10446595 -9882219 -9126821 -8326442
10974 -8326442 -7731342 -7637130 -8206464 -9305874 -10570374 -11655151 -12399172 -12798731 -12931949
10965 -12931949 -12911813 -12850246 -12827698 -12856504 -12863558 -12733832 -12386918 -11827536 -11138492 -10419113
10955 -10419113 -9715159 -9003654 -8245185 -7449349 -6691557 -6077304 -5695661 -5595342 -5782738
10946 -5782738 -6220933 -6827995 -7496187 -8129238 -8647137 -8948417 -8892270 -8329538 -7150388
10937 -7150388 -5319025 -2897212 -61523 2914258 5731686 8147777 10019426 11324305
10929 11324305 12143253 12584432 12705032 12492157 11899276 10904698 9565153 8044864 6604187
10920 6604187 5524810 4969624 4874626 4995812 5085126 5027968 4821493 4464866 3928223 3226225
10910 3226225 2473076 1860403 1606921 1895726 2780576 4117759 5600572 6878557 7707167
10901 7707167 8042240 7979513 7628623 7100497 6567046 6239672 6269848 6679781 7361729 8122302
10891 8122302 8779586 9282623 9735933 10276384 10914022 11494890 11816801 11792031 11517153 11196495
10881 11196495 10989321 10906993 10832969 10617734 10147791 9360263 8235699 6797326 5128142
10872 5128142 3368024 1670991 166008 -1065240 -2010771 -2732491 -3322743 -3839390 -4290734
10863 -4290734 -4671195 -4988380 -5255461 -5462287 -5586004 -5644227 -5702686 -5811457 -5940571 -5995976
10853 -5995976 -5914899 -5733841 -5565519 -5534843 -5713083 -6070616 -6492361 -6848685 -7046413 -7029788
10843 -7029788 -6776871 -6326341 -5792701 -5311085 -4967585 -4799871 -4837333 -5121348 -5684014 -6504269
10833 -6504269 -7490855 -8506407 -9401591 -10032217 -10269812 -10007634 -9175044 -7802705 -6089856
10824 -6089856 -4362035 -2937513 -2020403 -1668850 -1804572 -2241223 -2749446 -3155514 -3414802
10815 -3414802 -3586378 -3723972 -3793716 -3676000 -3227362 -2377846 -1207305 74993 1233693
10806 1233693 2101209 2618192 2833705 2849434 2712685 2346533 1595164 357925 -1304185
10797 -1304185 -3195844 -5102360 -6855596 -8319888 -9371740 -9913339 -9902890 -9393632 -8553163
10788 -8553163 -7599117 -6671107 -5774063 -4846977 -3864422 -2880467 -1982124 -1203044 -505508
10779 -505508 157943 802931 1405643 1860843 1981396 1631975 868123 -75291 -910799 -1416954
10769 -1416954 -1497614 -1195842 -662926 -99080 291569 328603 -98006 -965606 -2106255 -3260715
$$ [...]
##END NTUPLES=NMR SPECTRUM
##END=
