##TITLE=31P ikalashn
DE-75_k
13.11.2024
##JCAMPDX= 6.0         $$ Bruker NMR JCAMP-DX V2.0
##DATA TYPE= NMR SPECTRUM
##DATA CLASS= NTUPLES
##ORIGIN= UXNMR, Bruker Analytische Messtechnik GmbH
##OWNER= root
$$ TOPSPIN		Version 1.3
$$ 2024-11-13 13:53:50.421 +0400  Irina@DPX200
$$ Compression mode = diff/dup
##.OBSERVE FREQUENCY= 81.01967998063
##.OBSERVE NUCLEUS= ^31P
##.ACQUISITION MODE= SIMULTANEOUS
##.ACQUISITION SCHEME= undefined
##.AVERAGES= 64
##.DIGITISER RES= 17
##SPECTROMETER/DATA SYSTEM= spect
##.PULSE SEQUENCE= zgpg
##.SOLVENT NAME= D2O
##.SHIFT REFERENCE= INTERNAL, D2O, 1, 298.5841
##AUDIT TRAIL= $$ (NUMBER, WHEN, WHO, WHERE, WHAT)
$$ ##TITLE= Audit trail, TOPSPIN		Version 1.3
$$ ##JCAMPDX= 5.01
$$ ##ORIGIN= Bruker BioSpin GmbH
$$ ##OWNER= Irina
$$ $$ F:/spectra/data/iren/nmr/P31dec/1/pdata/1/auditp.txt
$$ ##AUDIT TRAIL=  $$ (NUMBER, WHEN, WHO, WHERE, VERSION, WHAT)
(   1,<2024-11-13 13:53:02.921 +0400>,<Irina>,<DPX200>,<TOPSPIN 1.3>,
      <created by zg
	started at 2024-11-13 13:51:19.546 +0400,
	POWCHK disabled, PULCHK disabled
       configuration hash MD5:
       BE 6D 3F 07 2A EA 11 49 91 17 2B D3 AF B3 58 0D
       data hash MD5: 32K
       BE A8 DA B1 82 5F E2 9D AD BD F5 14 E6 2A 3F 1E>)
(   2,<2024-11-13 13:53:30.437 +0400>,<Irina>,<DPX200>,<TOPSPIN 1.3>,
      <Start of raw data processing
       efp BC_mod = 2 LB = 15 FT_mod = 6 PKNL = 1 PHC0 = 29.70907 PHC1 = 392.8707 SI = 32K 
       data hash MD5: 32K
       9B 0A C0 F0 CA 2F DA B4 9C 73 7C 8E C9 09 6B D2>)
(   3,<2024-11-13 13:53:33.671 +0400>,<Irina>,<DPX200>,<TOPSPIN 1.3>,
      <apk 
       data hash MD5: 32K
       AE 7F 28 8D B2 E9 B4 B7 41 5A 04 2D 68 A8 F0 4E>)
(   4,<2024-11-13 13:53:35.671 +0400>,<Irina>,<DPX200>,<TOPSPIN 1.3>,
      <abs n ABSG = 5 
       data hash MD5: 32K
       FA 20 E5 B4 B2 7F 11 BB E4 59 71 FE BC 68 B0 EE>)
$$ ##END=
$$ 
$$ $$ hash MD5
$$ $$ 03 E6 66 BC 2F 59 41 F0 00 2E 28 8D C2 26 5C 33
##$RELAX= 
##$RELAX= 
##$RELAX= 
##$RELAX= 
##$RELAX= 
##$RELAX= 
##$RELAX= 
##$RELAX= 
##$RELAX= 
##$RELAX= 
##$RELAX= 
$$ Bruker specific parameters
$$ --------------------------
##$DU= <F:/spectra>
##$EXPNO= 1
##$NAME= <P31dec>
##$PROCNO= 1
##$TYPE= <nmr>
##$USER= <iren>
##$AMP= (0..31)
100 100 100 100 100 100 100 100 100 100 100 100 100 100 100 100 100 100 
100 100 100 100 100 100 100 100 100 100 100 100 100 100 
##$ANAVPT= -1
##$AQSEQ= 0
##$AQ_mod= 1
##$AUNM= <au_zg>
##$AUTOPOS= <>
##$BF1= 81.014009
##$BF2= 200.13
##$BF3= 200.13
##$BF4= 200.13
##$BF5= 200.13
##$BF6= 200.13
##$BF7= 200.13
##$BF8= 200.13
##$BYTORDA= 1
##$CFDGTYP= 0
##$CFRGTYP= 5
##$CHEMSTR= <none>
##$CNST= (0..63)
1 1 145 1 1 1 1 1 1 1 1 1 1 1 1 1 1 1 1 1 1 1 1 1 1 1 1 1 1 1 1 1 1 1 
1 1 1 1 1 1 1 1 1 1 1 1 1 1 1 1 1 1 1 1 1 1 1 1 1 1 1 1 1 1 
##$CPDPRG= <waltz16>
##$CPDPRG1= <>
##$CPDPRG2= <waltz16>
##$CPDPRG3= <>
##$CPDPRG4= <mlev>
##$CPDPRG5= <mlev>
##$CPDPRG6= <mlev>
##$CPDPRG7= <mlev>
##$CPDPRG8= <mlev>
##$CPDPRGB= <>
##$CPDPRGT= <>
##$D= (0..63)
$$ [...]
##$SW_h= 37037.037037037
##$TD= 32768
##$TD0= 1
##$TE= 300
##$TE2= 300
##$TE3= 300
##$TEG= 300
##$TL= (0..7)
0 120 53 12 22 120 120 120 
##$TP= (0..7)
150 150 150 150 150 150 150 150 
##$TP07= 0
##$TPNAME0= <>
##$TPNAME1= <>
##$TPNAME2= <>
##$TPNAME3= <>
##$TPNAME4= <>
##$TPNAME5= <>
##$TPNAME6= <>
##$TPNAME7= <>
##$TPOAL= (0..7)
0.5 0.5 0.5 0.5 0.5 0.5 0.5 0.5 
##$TPOFFS= (0..7)
0 0 0 0 0 0 0 0 
##$TUNHIN= 0
##$TUNHOUT= 0
##$TUNXOUT= 0
##$USERA1= <user>
##$USERA2= <user>
##$USERA3= <user>
##$USERA4= <user>
##$USERA5= <user>
##$V9= 5
##$VALIST= <valist>
##$VCLIST= <CCCCCCCCCCCCCCC>
##$VD= 0
##$VDLIST= <DDDDDDDDDDDDDDD>
##$VPLIST= <PPPPPPPPPPPPPPP>
##$VTLIST= <TTTTTTTTTTTTTTT>
##$WBST= 1024
##$WBSW= 4
##$XGAIN= (0..3)
0 0 0 0 
##$XL= 0
##$YL= 0
##$YMAX_a= 1800
##$YMIN_a= -1408
##$ZGOPTNS= <>
##$ZL1= 120
##$ZL2= 120
##$ZL3= 120
##$ZL4= 120
##$ABSF1= 298.5841
##$ABSF2= -158.5842
##$ABSG= 5
##$ABSL= 5
##$ALPHA= 0
##$AQORDER= 0
##$ASSFAC= 0
##$ASSFACI= 0
##$ASSFACX= 0
##$ASSWID= 0
##$AUNMP= <proc_1d>
##$AXLEFT= 0
##$AXRIGHT= 0
##$AXTYPE= 0
##$AXUNIT= <>
##$AZFE= 0.1
##$AZFW= 0.5
##$BCFW= 0
##$BC_mod= 2
##$BYTORDP= 0
##$COROFFS= 0
##$CY= 12.5935478210449
##$DATMOD= 1
##$DC= 0
##$DFILT= <>
##$DTYPP= 0
##$F1P= 47.1127640792319
##$F2P= -24.0371245302204
##$FCOR= 0.5
##$FTSIZE= 32768
##$FT_mod= 6
##$GAMMA= 0
##$GB= 0
##$INTBC= 1
##$INTSCL= 7.269226e-011
##$ISEN= 30
##$LB= 15
##$LEV0= 0
##$LPBIN= 0
##$MAXI= 12.09355
##$MC2= 0
##$MEAN= 0
##$ME_mod= 0
##$MI= 0.7550151
##$NCOEF= 0
##$NC_proc= -14
##$NLEV= 6
##$NOISF1= 298.5841
##$NOISF2= 270.0111
##$NSP= 0
##$NTH_PI= 0
##$NZP= 0
##$OFFSET= 298.5841
##$PC= 1.4
##$PHC0= 79.19907
##$PHC1= 320.0125
##$PH_mod= 1
##$PKNL= yes
##$PPARMOD= 0
##$PPDIAG= 0
##$PPIPTYP= 0
##$PPMPNUM= 100
##$PPRESOL= 1
##$PSCAL= 0
##$PSIGN= 0
##$REVERSE= no
##$SF= 81.014009
##$SI= 32768
##$SIGF1= 270.0111
##$SIGF2= -158.5842
##$SINO= 77.54984
##$SIOLD= 32768
##$SREGLST= <31P.CDCl3>
##$SSB= 0
##$STSI= 32768
##$STSR= 0
##$SW_p= 37037.037037037
##$SYMM= 0
##$S_DEV= 0
##$TDeff= 32768
##$TDoff= 0
##$TI= <>
##$TILT= no
##$TM1= 0
##$TM2= 0
##$TOPLEV= 0
##$USERP1= <user>
##$USERP2= <user>
##$USERP3= <user>
##$USERP4= <user>
##$USERP5= <user>
##$WDW= 1
##$XDIM= 32768
##$YMAX_p= 392492214
##$YMIN_p= -69828037
$$ End of Bruker specific parameters
$$ ---------------------------------
##NTUPLES= NMR SPECTRUM
##VAR_NAME=  FREQUENCY,     SPECTRUM/REAL,   SPECTRUM/IMAG
##SYMBOL=    X,             R,               I
##VAR_TYPE=  INDEPENDENT,   DEPENDENT,       DEPENDENT
##VAR_FORM=  AFFN,          ASDF,            ASDF
##VAR_DIM=   32768,         32768,           32768
##UNITS=     HZ,            ARBITRARY UNITS, ARBITRARY UNITS
##FACTOR=    1.13031516577767, 1,            1
##FIRST=     37037.037037037, -30658452,     24211053
##LAST=      0,             -23481386,       -22329472
##MIN=       0,             -69828037,       0
##MAX=       37037.037037037, 392492214,     0
$$ Real data points
##PAGE= N=1
##DATA TABLE= (X++(R..R)), XYDATA
$$ [...]
17669i17085M95702J04273l34052p50918j099546j352337j482194j451901j220864
17660h008922p64684r7202P09956J514702K116290K315993K017092J297573L87333
17651A488131m45365j015641j267153j232623r75172n69440j09424L04092N96032
17642c226563P33450P19098N84212L89833K22749J69388K73187N08868P99697
17633A173919J059930J230687J301580J317119J356068J483426J697761J908351
17625A2528841J966372J739309J185802L84346n01118j287126j828389k058681
17617A2129356k008213j777338j475177j177154r32050p80415p39284p67885p72103
17608A699737o65450m29885j25739J42122K79218K56869J28636j9277j42784k67975
$$ y = [-917085, -421383, -317110, -651162, -1402080, -2501626, -3853963, -5336157, -6788058, -8008922, -8773606, -8870808, -8160852, -6646150, -4529860, -2213867, -196775, 1100798, 1488131, 1042766, 27125, -1240028, -2472651, -3447823, -4017263, -4126687, -3822595, -3226563, -2493113, -1774015, -1189803, -799970, -577221, -407833, -134646, 374222, 1173919, 2233849, 3464536, 4766116, 6083235, 7439303, 8922729, 10620490, 12528841, 14495213, 16234522, 17420324, 17804670, 17303552, 16016426, 14188037, 12129356, 10121143, 8343805, 6868628, 5691474, 4759424, 3979009, 3239725, 2471840, 1699737, 1034287, 604402, 478663, 620785, 900003, 1156872, 1285508, 1266231, 1123447, 855472]
17598H55472m50955p06154r64890j107772j042976p56679l07956J98465O38663
17589c644782R09591R71717Q43583N52869J19397m08247r29422j322514j492975
17580d400783j395280j039112n02530P5071N52527Q51739R53595Q49983N35298
17571c519492L7685n74421j220864j827670k318011k610086k649359k454538k126636
17562a9263392j799498j571510j471784j469499j500517j494416j398342j186457
17554c1155415q55730m32240J7079M07275O88703Q77997J040510J243708J517497
17545b6650616J841044K148855K348176K350647K120515J717660J283684R59275
17537a1880760Q07389Q15980R52931J187647J464166J693272J795651J747975
$$ y = [855472, 404517, -301637, -1266527, -2374299, -3417275, -4173954, -4481910, -4283445, -3644782, -2735191, -1763474, -919891, -367022, -247625, -655872, -1585294, -2907808, -4400783, -5796063, -6835175, -7337705, -7262634, -6710107, -5858368, -4904773, -4054790, -3519492, -3481807, -4056228, -5277092, -7104762, -9422773, -12032859, -14682218, -17136756, -19263392, -21062890, -22634400, -24106184, -25575683, -27076200, -28570616, -29968958, -31155415, -32011145, -32443385, -32426306, -32019031, -31330328, -30452331, -29411821, -28168113, -26650616, -24809572, -22660717, -20312541, -17961894, -15841379, -14123719, -12840035, -11880760, -11073371, -10257391, -9304460, -8116813, -6652647, -4959375, -3163724, -1415749]
17529a415749J583525J356184J102578Q23040M88649P5650l90991q27644j135526
17520A659716j260113j215678j061184q51771o07252l21166Q047L58791O90134
17511b600476R57388J135533J238268J308704J384142J465869J517492J495414
17503G902334J390438J240883J102987J008809R51613R08703Q72322Q52329Q49868
17494A7080286Q32316P34934M94033R5516m00938q97251j329593j707419k079934
17485A2821950k465258k809983l012211k984733k716776k298212j878235j580299
17477f923757j444907j432941j454453j395820j161368p31019j82966L61102Q24510
17468a3541619J207549J538542J810785J974946J983580J834084J566838J220470
$$ y = [-1415749, 167776, 1523960, 2626538, 3449578, 3938227, 4013877, 3622886, 2795242, 1659716, 399603, -816075, -1877259, -2729030, -3336282, -3657448, -3649401, -3290610, -2600476, -1643088, -507555, 730713, 2039417, 3423559, 4889428, 6406920, 7902334, 9292772, 10533655, 11636642, 12645451, 13597064, 14505767, 15378089, 16230418, 17080286, 17912602, 18647536, 19141569, 19237085, 18836147, 17938896, 16609303, 14901884, 12821950, 10356692, 7546709, 4534498, 1549765, -1167011, -3465223, -5343458, -6923757, -8368664, -9801605, -11256058, -12651878, -13813246, -14544265, -14727231, -14366129, -13541619, -12334070, -10795528, -8984743, -7009797, -5026217, -3192133, -1625295, -404825]
17460d04825P94166K65866l44678r28577j311139j344490j004444m15824K12900
17451d481045O94752R41004R73155Q76653P39841O21096N50886N49519O36624
17442B102485Q23027J100606J441911J797933K089511K219530K127895J847754
17434A5550652J495026J195510J022315R87685J064099J195210J299259J288611
17426B5098367J102814P36593K50421k52810o93476j083906j527863k133086k913384
17417A8583670l762722m504370m967946n050039m738651m111309l312276k501957
17409a4365600j800338j257982q58263n44693k62603J7462L06798O06825R03515
17400a7254879J167936J373154J511111J593170J633832J636675J598470J513990
$$ y = [-404825, 389341, 655207, 310529, -618048, -1929187, -3273677, -4278121, -4693945, -4481045, -3786293, -2845289, -1872134, -995481, -255640, 365456, 916342, 1465861, 2102485, 2925512, 4026118, 5468029, 7265962, 9355473, 11575003, 13702898, 15550652, 17045678, 18241188, 19263503, 20251188, 21315287, 22510497, 23809756, 25098367, 26201181, 26937774, 27188195, 26935385, 26241909, 25158003, 23630140, 21497054, 18583670, 14820948, 10316578, 5348632, 298593, -4440058, -8551367, -11863643, -14365600, -16165938, -17423920, -18282183, -18826876, -19089479, -19072017, -18765219, -18158394, -17254879, -16086943, -14713789, -13202678, -11609508, -9975676, -8339001, -6740531, -5226541]
17392e226541J365765J123322P69055L27070j34313n30439p95596r00661q53008
17383d855346o88981m65655k59496j62010k48251n26010r15978j297552j579601
17374a0998880j721332j698236j480891j063900n09750M0474M08879M56923J42644
17365a6424069m72549j243955j972086k452104k536073k176771j439639m88836
17357b9206082M43768J110769J337397J117457O34729J70568m1775P9505M57458
17348b3896206R36369J384000J734815J956495K006243J841180J468235R67356
17340a1601513M55487K3764l01263n48514p54970r17116r86916r17132p07218
17331a6255391m09147r6934J75164L92989N72680P52573R89740J323213J718317
$$ y = [-5226541, -3860776, -2737454, -1968399, -1641329, -1775642, -2306081, -3101677, -4002338, -4855346, -5544327, -6009982, -6269478, -6431488, -6679739, -7205749, -8121727, -9419279, -10998880, -12720212, -14418448, -15899339, -16963239, -17472989, -17432515, -17023636, -16566713, -16424069, -16896618, -18140573, -20112659, -22564763, -25100836, -27277607, -28717246, -29206082, -28762314, -27651545, -26314148, -25196691, -24561962, -24391394, -24433169, -24353664, -23896206, -22959837, -21575837, -19841022, -17884527, -15878284, -14037104, -12568869, -11601513, -11146026, -11122262, -11423525, -11972039, -12727009, -13644125, -14631041, -15548173, -16255391, -16664538, -16761472, -16586308, -16193319, -15620639, -14868066, -13878326, -12555113, -10836796]
17322a0836796K064041K246360K235087K101939J944232J783485J538646J093442
17314D170436L94645m85695j355636j975764k167759j901469j303048n78724Q5602
17305e117412N79830Q63477R33049Q02486M99879O0692m77631j057705j577967
17296d491302j911155j965386j729657j277233p50951l39872k27496n07786j117624
17287a4318462j849436k448094k729338k644472k260362j689601j030765l44197
17279b9314727L45232J030206J694669K289520K727601K906171K749832K256570
17271a3314926J513904O61508j73011r12155j518524j965933k235244k335940
17263b0280321k311088k203382k021333j750498j387639r52088m76548L256M56987
$$ y = [-10836796, -8772755, -6526395, -4291308, -2189369, -245137, 1538348, 3076994, 4170436, 4565081, 4079386, 2723750, 747986, -1419773, -3321242, -4624290, -5203014, -5117412, -4537582, -3674105, -2741056, -1938570, -1438691, -1377999, -1855630, -2913335, -4491302, -6402457, -8367843, -10097500, -11374733, -12125684, -12465556, -12693052, -13200838, -14318462, -16167898, -18615992, -21345330, -23989802, -26250164, -27939765, -28970530, -29314727, -28969495, -27939289, -26244620, -23955100, -21227499, -18321328, -15571496, -13314926, -11801022, -11139514, -11312525, -12224680, -13743204, -15709137, -17944381, -20280321, -22591409, -24794791, -26816124, -28566622, -29954261, -30906349, -31382897, -31379641, -30922654]
17254c0922654Q63701J209955J479586J637834J635141J446278J113007P45257
17246b0791895M70647L67120M29690N88228P55226Q79107R73124J088948J253924
17237a3985881J441491J602671J708781J759192J765103J739557J696767J645540
17229f26779J582734J504804J420591J332267J209009J009570P31016M07800O2683
17220H633695l19219p63078j262046j765259k195522k468224k505902k267527
17212d913082j785204j158186m85307J97483R01030J609256K233998K640835K711180
17203A952003K390401J710686P98456j44496r01455j323492j388801j201564r34291
17194I57447p55108p72319j003101j372915j751460k008746k061223j890024j535670
$$ y = [-30922654, -30058953, -28848998, -27369412, -25731578, -24096437, -22650159, -21537152, -20791895, -20321248, -19954128, -19524438, -18936210, -18180984, -17301877, -16328753, -15239805, -13985881, -12544390, -10941719, -9232938, -7473746, -5708643, -3969086, -2272319, -626779, 955955, 2460759, 3881350, 5213617, 6422626, 7432196, 8163212, 8571012, 8633695, 8314476, 7551398, 6289352, 4524093, 2328571, -139653, -2645555, -4913082, -6698286, -7856472, -8341779, -8144296, -7243266, -5634010, -3400012, -759177, 1952003, 4342404, 6053090, 6851546, 6707050, 5805595, 4482103, 3093302, 1891738, 957447, 202339, -569980, -1573081, -2945996, -4697456, -6706202, -8767425, -10657449, -12193119]
17185a2193119j080499o25169k62817n3412m567o5883j44136j43068n151K79040
17175a4298781O87960J175396J665329K073610K351304K494396K511341K394761
17167A055316K118243J650505R87742J91317o11919j283390j737390j969414k041775
17158a640765k038802k016144j984211j934489j867112j787236j688069j551362
17150a6508190j364796j132054q66090n85032l18390r9307O5653K13771M02790
17141b0191645O69446J008715J382501J738483K019556K165313K123918J876681
17133g207032J451900R17786L65337j17476m80995p32899r14772j057306j161055
17124h936512j216236j228212j211826j159069j022936p50233l39366J35573N61799
$$ y = [-12193119, -13273618, -13898787, -14161604, -14215016, -14219583, -14285466, -14429602, -14572670, -14577821, -14298781, -13610821, -12435425, -10770096, -8696486, -6345182, -3850786, -1339445, 1055316, 3173559, 4824064, 5811806, 6003123, 5391204, 4107814, 2370424, 401010, -1640765, -3679567, -5695711, -7679922, -9614411, -11481523, -13268759, -14956828, -16508190, -17872986, -19005040, -19871130, -20456162, -20774552, -20873859, -20808206, -20594435, -20191645, -19522199, -18513484, -17130983, -15392500, -13372944, -11207631, -9083713, -7207032, -5755132, -4837346, -4472009, -4589485, -5070480, -5803379, -6718151, -7775457, -8936512, -10152748, -11380960, -12592786, -13751855, -14774791, -15525024, -15864390, -15728817, -15167018]
17115a5167018Q55267J005682J074301J158380J351609J709583K209988K730862
17107c071346L096437L175258K943117K462310J823257J112687M11217k15324
17099A1737613p32910j134277j414089j554459j527321j307806r00829l65790
17091B800132J88944O43220R04918R29402P25587L61753l7871l25314l89188k02206
17081E599377J88022P02479J249128J719540K011576K069544J893243J513109
17073A6946018R67680L06013l92295j014852j456869j674502j699771j606267
17065A0375155j457875j280122j072364q42024o21288m53654l72091l87254m88268
17056C400215o47487q16605r25355r09577p59992n49052m06063m46637o98193
$$ y = [-15167018, -14311751, -13306069, -12231768, -11073388, -9721779, -8012196, -5802208, -3071346, 25091, 3200349, 6143466, 8605776, 10429033, 11541720, 11952937, 11737613, 11004703, 9870426, 8456337, 6901878, 5374557, 4066751, 3165922, 2800132, 2989076, 3632296, 4537214, 5466616, 6192203, 6553956, 6516085, 6190771, 5801583, 5599377, 5787399, 6489878, 7739006, 9458546, 11470122, 13539666, 15432909, 16946018, 17913698, 18219711, 17827416, 16812564, 15355695, 13681193, 11981422, 10375155, 8917280, 7637158, 6564794, 5722770, 5101482, 4647828, 4275737, 3888483, 3400215, 2752728, 1936123, 1010768, 101191, -658801, -1207853, -1613916, -2060553, -2758746]
17047b758746j078618j442870j651893j623572j363387r63502n46745j86646J20830
17038a1495149M13034O97086R19638R82393P90904L12306l90622j172007j853705
17029a0796122k280958k359731k083842j553281r44007m12070m928L30364O55121
17020a9449454R60246J164020J169715R32336M92185m4034n59463r77150j266212
17011a7577811j414230j409195j241742r07207m08978K21635R02608J506560J897594
17002a8430766J979025J735975J252298O80550J72874j85978m02739n48876p03441
16993a4451078q94813j075223j152306j059454q07729m78191j72552K9956Q9159
16984a9972231L696j92738m33861o37430p45057p52582o96437o14532n25380m35148
$$ y = [-2758746, -3837364, -5280234, -6932127, -8555699, -9919086, -10882588, -11429333, -11615979, -11495149, -11082115, -10385029, -9465391, -8482998, -7692094, -7379788, -7770410, -8942417, -10796122, -13077080, -15436811, -17520653, -19073934, -20017941, -20430011, -20434939, -20104575, -19449454, -18489208, -17325188, -16155473, -15223137, -14730952, -14774986, -15334449, -16311599, -17577811, -18992041, -20401236, -21642978, -22550185, -22959163, -22737528, -21834920, -20328360, -18430766, -16451741, -14715766, -13463468, -12782918, -12610044, -12796022, -13198761, -13747637, -14451078, -15345891, -16421114, -17573420, -18632874, -19440603, -19918794, -20091346, -20061390, -19972231, -19968535, -20161273, -20595134, -21232564, -21977621, -22730203, -23426640, -24041172, -24566552, -25001700]
16974b5001700l47477k59560j54807o906K09480N14502R16743J388458J843916
16965b0897351K164521K267884K154975J886609J529035J135018P58459M53808
16957h547042K47586J19786K2934p9478j88974k71158k65986j08772K29956P02164
16947h138984J178607J503390J575316J400198J079542P43576M78901L03144J88272
16938C11962R2350l0777k35719n70688j040282j592255k149632k643542l014787
16929a0873370l206110l167849k873655k332077j587213p18875J53524Q83434
16921b3722191J341781J473214J318890R86601N98659K60192N5349L6539J89982
16912a7460984M22844O14349O98067P03370P23735Q42459J070332J331328J502290
$$ y = [-25001700, -25349177, -25608737, -25763544, -25770450, -25560970, -25046468, -24129725, -22741267, -20897351, -18732830, -16464946, -14309971, -12423362, -10894327, -9759309, -9000850, -8547042, -8299456, -8179670, -8156736, -8236214, -8425188, -8696346, -8962332, -9071104, -8841148, -8138984, -6960377, -5456987, -3881671, -2481473, -1401931, -658355, -179454, 123690, 311962, 404312, 373535, 137816, -432872, -1473154, -3065409, -5215041, -7858583, -10873370, -14079480, -17247329, -20120984, -22453061, -24040274, -24759149, -24605625, -23722191, -22380410, -20907196, -19588306, -18601705, -18003046, -17742854, -17687505, -17650966, -17460984, -17038140, -16423791, -15725724, -15022354, -14298619, -13456160, -12385828, -11054500, -9552210]
16903i552210J481083J237886Q19905L19128j62864n35291p35929p51707o19206
16894h499205l93042j11758K04982N34376Q31470J030300J070024R30769O46790
16885c755294K90330m6017k60644k68981m2698L66139Q33530J203940J350675
16876c29020J231852R09826N20099K12139R2791J86517M24099O78277Q38125Q64014
16866E628719P79347O28464M49801K68017R0320q8216k71178m57009o41530q09575
16856E577160r29718r73511r39484q51009p37217o18697m97433l54243j66664
16847d90816O7253L26865N83593Q08596R68889J026650R52268P43181M28537N3302
16837E468318l38301p03698j000307j198026j295224j319274j304688j259775
$$ y = [-9552210, -8071127, -6833241, -6013336, -5694208, -5857072, -6392363, -7128292, -7879999, -8499205, -8892247, -9004005, -8799023, -8264647, -7433177, -6402877, -5332853, -4402084, -3755294, -3464964, -3510981, -3771625, -4040606, -4083304, -3717165, -2883635, -1679695, -329020, 902832, 1812658, 2332757, 2544896, 2637687, 2824204, 3248303, 3926580, 4764705, 5628719, 6408066, 7036530, 7486331, 7754348, 7844668, 7756452, 7485274, 7028265, 6386735, 5577160, 4647442, 3673931, 2734447, 1883438, 1146221, 527524, 30091, -324152, -490816, -423563, -96698, 486895, 1295491, 2264380, 3291030, 4243298, 4986479, 5415016, 5468318, 5130017, 4426319, 3426012, 2227986, 932762, -386512, -1691200, -2950975]
16829b950975j156719r61992o70883l10965P3366M33306P24269R10520R66205
16820b943868Q86934P03610M66796K13239l8925k65925m30216n06132n14378n35607
16810b964472o82308j033160j576207k204571k756199l065337l009185k541376
16802a9832815j704318o20944N28930J544193K246480K526798K383895J935001
16794a0992780J382413R44032P75499R11633J258666J653666J948815K056492
16786f1564J943970J610277J076442L98920l12659r07747j253476j305172j120876
16777F8115q01348m23374l5580L03513N16580N46712M01112J58968o6672j95361
16767D72665k22748k01695j89465k09861k43100k39041j44023P3366L98494P52631
$$ y = [-2950975, -4107694, -5069686, -5740569, -6051534, -5978168, -5544862, -4820593, -3910073, -2943868, -2056934, -1353324, -886528, -673289, -712214, -978139, -1408355, -1914487, -2428865, -2964472, -3646780, -4679940, -6256147, -8460718, -11216917, -14282254, -17291439, -19832815, -21537133, -22158077, -21629147, -20084954, -17838474, -15311676, -12927781, -10992780, -9610367, -8666335, -7890836, -6979203, -5720537, -4066871, -2118056, -61564, 1882406, 3492683, 4569125, 4968045, 4655386, 3747639, 2494163, 1188991, 68115, -733233, -1156607, -1192187, -888674, -372094, 174618, 575730, 734698, 668026, 472665, 249917, 48222, -141243, -351104, -594204, -833245, -977268, -903902, -505408, 247223]
16757B47223J012407J080441R51849P09469M55657K47446Q1536p7515k56185m40542
16747D011786n69529n63930l79513m9958L11515N60771N93935L90285Q709m41098
16737C872973q42499j127483j308070j442185j551444j568569j376299r08009
16729f251585k20530N19198J123544J481718J591153J513687J316636J049604
16721B123425P47001M26163Q4677k84873o74572j058790j404336j677961j855277
16712c574543j927855j894732j753660j510016j181771p83334l10976K45953Q72362
16703a1818572J498116K000297K249251K177661J823073J307799P79138L68290
16695C85053J85002L07057P34257J348997J954037K376886K546485K480515K220705
$$ y = [247223, 1259630, 2340071, 3291920, 4001389, 4457046, 4704492, 4786028, 4708513, 4452328, 4011786, 3442257, 2878327, 2498814, 2448856, 2760371, 3321142, 3915077, 4305362, 4314071, 3872973, 3030474, 1902991, 594921, -847264, -2398708, -3967277, -5343576, -6251585, -6472115, -5952917, -4829373, -3347655, -1756502, -242815, 1073821, 2123425, 2870426, 3296589, 3381266, 3096393, 2421821, 1363031, -41305, -1719266, -3574543, -5502398, -7397130, -9150790, -10660806, -11842577, -12625911, -12936887, -12690934, -11818572, -10320456, -8320159, -6070908, -3893247, -2070174, -762375, 16763, 385053, 570055, 877112, 1611369, 2960366, 4914403, 7291289, 9837774, 12318289, 14538994]
16686A4538994J800359J276424P60382L70654J40421p849j85175m47308p83577
16677A7463325j158586j535508j865828k080131k109842j929235j578286j145996
16669D059913p33361m23962k60061k22341k42353k47830j92749n0323K00456N63555
16659B450944J003239J446430J813720K045459K107229J993269J731374J367286
16651A5958950R32204M30278j36942p35631j291892j722086j973065k038412j952573
16642G470831j777382j578887j398802j236721j051011p79464l75014J62456P77358
16633B13364J367214J794921J916376J638516R78508P0303q92943j736282k352211
16624B997766k707641k823520k749834k549440k286932k007438j709029j340364
$$ y = [14538994, 16339353, 17615777, 18376159, 18746813, 18887234, 18879385, 18694210, 18246902, 17463325, 16304739, 14769231, 12903403, 10823272, 8713430, 6784195, 5205909, 4059913, 3326552, 2902590, 2642529, 2420188, 2177835, 1930005, 1737256, 1686933, 1887389, 2450944, 3454183, 4900613, 6714333, 8759792, 10867021, 12860290, 14591664, 15958950, 16891154, 17321432, 17184490, 16448859, 15156967, 13434881, 11461816, 9423404, 7470831, 5693449, 4114562, 2715760, 1479039, 428028, -351436, -726450, -563994, 213364, 1580578, 3375499, 5291875, 6930391, 7908899, 7979202, 7086259, 5349977, 2997766, 290125, -2533395, -5283229, -7832669, -10119601, -12127039, -13836068, -15176432]
16616a5176432q42806k11429M75733J088792J517679J727328J752655J653271
16608h015209J472816J221775Q94573N12441J39776j59024l74088n45971p09038
16599e561949q54805r58794j028405j097351j164040j156733r80945n98472n9835
16590a3461329N21592J025240J380697J595422J731830J840429J894354J794542
16582a677223J458016R06365K73059k62696n63606o06844n02994m29073n14496
16573a919492p79135j165457j599848k010021k305493k378591k154793j655124
16565a5967954j005671l71637J37213N12458Q10038J077869J323533J540299J741412
16556a0202440J951127K161979K311392K305915K071982J598076R43389K06915
$$ y = [-15176432, -16019238, -16230667, -15754934, -14666142, -13148463, -11421135, -9668480, -8015209, -6542393, -5320618, -4426045, -3913604, -3773828, -3932852, -4306940, -4852911, -5561949, -6416754, -7375548, -8403953, -9501304, -10665344, -11822077, -12803022, -13401494, -13461329, -12939737, -11914497, -10533800, -8938378, -7206548, -5366119, -3471765, -1677223, -219207, 687158, 960217, 697521, 133915, -472929, -975923, -1404996, -1919492, -2698627, -3864084, -5463932, -7473953, -9779446, -12158037, -14312830, -15967954, -16973625, -17345262, -17208049, -16695591, -15885553, -14807684, -13484151, -11943852, -10202440, -8251313, -6089334, -3777942, -1472027, 599955, 2198031, 3141420, 3348335]
16548C348335n12411j124116j537408j683510j562396j254904q81160n46856l09674
16539f064100j67365p6604P63O9118J14708J30317J13932N7713m5803j89650l50736
16528f407707m96154n89992o10007n71759n29947n41428o25701p64929r30047
16519a2067671j091812j212745j243304j131816q40409l55064L10692J109747
16511a6522382J953444K712273L236599L397574L129955K457324J497832M46790
16503B309409m76097j105865j400410j452591j427613j462620j599865j793256
16495h408908j961215k036202j986144j801791j467647r56565k64756N45106J339411
16486a6998711J958370K280044K269964J996115J595848J203941Q90978O62666
$$ y = [3348335, 2835924, 1711808, 174400, -1509110, -3071506, -4326410, -5207570, -5754426, -6064100, -6231465, -6308069, -6307306, -6238188, -6123480, -5993163, -5879231, -5821518, -5867321, -6056971, -6407707, -6903861, -7493853, -8103860, -8675619, -9205566, -9746994, -10372695, -11137624, -12067671, -13159483, -14372228, -15615532, -16747348, -17587757, -17942821, -17632129, -16522382, -14568938, -11856665, -8620066, -5222492, -2092537, 364787, 1862619, 2309409, 1833312, 727447, -672963, -2125554, -3553167, -5015787, -6615652, -8408908, -10370123, -12406325, -14392469, -16194260, -17661907, -18618472, -18883228, -18338122, -16998711, -15040341, -12760297, -10490333, -8494218, -6898370, -5694429, -4803451, -4140785]
16478d140785N09414M42085M76028N85935O74315N92305K29368l85137j070731
16469b087203j594050j783431j582325j053646l65756K54830O16315O50126M28604
16460f516536J06971j63845l09213l62422m39762o60915j060693j552623j964291
16451a2923329k124904j959198j524310r66300m41956n8479J52355K27698K49013
16442a9369410L19285N42641R95818J693646K561662L440833M146564M553333
16434a115628M634275M430366L993616L356499K547508J628843P06257j07509
16426B0074227p40478j176263j431753j526387j466567j249995q87497m32469
16418A1162818O565K91254L13213O2803l43309p19619r23644r31258q21805p04483
$$ y = [-4140785, -3631371, -3189286, -2713258, -2127323, -1453008, -860703, -631335, -1016472, -2087203, -3681253, -5464684, -7047009, -8100655, -8466411, -8211581, -7595266, -6945140, -6516536, -6409565, -6573410, -6882623, -7245045, -7684807, -8345722, -9406415, -10959038, -12923329, -15048233, -17007431, -18531741, -19498041, -19939997, -19998476, -19846121, -19618423, -19369410, -19050125, -18507484, -17511666, -15818020, -13256358, -9815525, -5668961, -1115628, 3518647, 7949013, 11942629, 15299128, 17846636, 19475479, 20181736, 20074227, 19333749, 18157486, 16725733, 15199346, 13732779, 12482784, 11595287, 11162818, 11169383, 11460637, 11773850, 11836653, 11493344, 10773725, 9850081, 8918823, 8097018, 7392535]
16408G392535o50433o59207o61827n67524l38179l5717K01240K37259J5190m24056
16398D509281r71726j492107j858590j995380j911296j690633j438778j225183
16390h074412j052881q47381m75070J82284J123605K172681L030194L423962L263148
16381B746130K673669J892050J131645N28804J52107R500N1226J93663L48148
16372I726942M34590L91395J88527j69279o56006j240303j878482k484452k926613
16363A386319l095161k989438k723512k437461k207232k026243j846631j631518
16355a7570877j378915j106901q25011n21884j68800K74394Q39021J505354K181485
16346a6772134K739930L076988L142493K940435K522638J973307J377027P84662
$$ y = [7392535, 6742102, 6082895, 5421068, 4853544, 4515365, 4479648, 4680888, 4918147, 4933337, 4509281, 3537555, 2045448, 186858, -1808522, -3719818, -5410451, -6849229, -8074412, -9127293, -9974674, -10449744, -10267460, -9143855, -6971174, -3940980, -517018, 2746130, 5419799, 7311849, 8443494, 8972298, 9124405, 9133905, 9185131, 9378794, 9726942, 10161532, 10552927, 10741454, 10572175, 9916169, 8675866, 6797384, 4312932, 1386319, -1708842, -4698280, -7421792, -9859253, -12066485, -14092728, -15939359, -17570877, -18949792, -20056693, -20881704, -21403588, -21572388, -21297994, -20458973, -18953619, -16772134, -14032204, -10955216, -7812723, -4872288, -2349650, -376343, 1000684, 1785346]
16338A785346K04028l74326r40013j450791j851931k100923k178825k089737j854529
16329a0851701j501232j056496n52526n3958L31061M95608M09792J49134j61171
16320a2791489m25385o01883o76757o38275m76512j94378J98203P13640J407956
16311a3484880K358291L591431M989338O241850O947954O849496N990317M655278
16303B8139075L190597J866584Q27259J00359l56882o05273p03943p22999p44234
16294C0990543q33579j014278j259665j503024j664322j688809j580037j405452
16286B0041377j255966j176295j130456j037220q33219n16969j63551J05332J96971
16277A4230004J07801q5612k75540l64694k96485p3534K50609O00089R00349J094273
$$ y = [1785346, 1989374, 1615048, 675035, -775756, -2627687, -4728610, -6907435, -8997172, -10851701, -12352933, -13409429, -13961955, -14015913, -13684852, -13189244, -12779452, -12630318, -12791489, -13216874, -13818757, -14495514, -15133789, -15610301, -15804679, -15606476, -14892836, -13484880, -11126589, -7535158, -2545820, 3696030, 10643984, 17493480, 23483797, 28139075, 31329672, 33196256, 34023515, 34123874, 33766992, 33161719, 32457776, 31734777, 30990543, 30156964, 29142686, 27883021, 26379997, 24715675, 23026866, 21446829, 20041377, 18785411, 17609116, 16478660, 15441440, 14608221, 14091252, 13927701, 14033033, 14230004, 14337805, 14252193, 13976653, 13611959, 13315474, 13241940, 13492549, 14092638, 14992987, 16087260]
16267A6087260J159119J111925R95583Q57252P25602N88007L87480O5693l71809
16258B1606112q37086j212103j425379j493347j498418j522593j585497j634797
16250A0396892j602052j472484j298695j154623j085082j093483j156661j229961
16242C03851j244078j133961q97905o18237m07594l35900m09998o07096q95334
16233f246252j206298j423910j448684j276857r97103p05997m32148j38582K13795
16224a3662036O09436R73560J217071J296008J245963J172602J201394J402767
16216d543235J730177K024451K100522J853951J300565N31945l50841j258976
16208C388559k093972k732285l050532k978407k530726j789600q63006J40936
$$ y = [16087260, 17246379, 18358304, 19353887, 20211139, 20936741, 21524748, 21912228, 21977921, 21606112, 20769026, 19556923, 18131544, 16638197, 15139779, 13617186, 12031689, 10396892, 8794840, 7322356, 6023661, 4869038, 3783956, 2690473, 1533812, 303851, -940227, -2074188, -2972093, -3590330, -3997924, -4333824, -4743822, -5350918, -6246252, -7452550, -8876460, -10325144, -11602001, -12599104, -13305101, -13737249, -13875831, -13662036, -13052600, -12079040, -10861969, -9565961, -8319998, -7147396, -5946002, -4543235, -2813058, -788607, 1311915, 3165866, 4466431, 4998376, 4647535, 3388559, 1294587, -1437698, -4488230, -7466637, -9997363, -11786963, -12649969, -12509033]
16200a2509033J110496J912743K398003K445573K020642J198203J45563r18914
16192b196724j777946k268550k322447j980248j366614o35571P1956O44419J020260
16183a0811465J206918J261017J244395J197017J127054J007905P98091M80218
16175b488850Q0065l49276p59138j132499j480780j800219k037451k125828k064145
16166a4158121j934968j827979j752440j629502j370460r62178m71963J8507M68957
16157b3620147Q89477J314561J756095K163931K437021K490701K323550K024343
16149h220468J720681J509868J404809J324643J152849Q26781L78936r9117n20427
16140e21445q30836r89449r46259o62588j60918M47373R87332J286887J242553
$$ y = [-12509033, -11398537, -9485794, -7087791, -4642218, -2621576, -1423373, -1277810, -2196724, -3974670, -6243220, -8565667, -10545915, -11912529, -12548100, -12476144, -11831725, -10811465, -9604547, -8343530, -7099135, -5902118, -4775064, -3767159, -2969068, -2488850, -2408785, -2758061, -3517199, -4649698, -6130478, -7930697, -9968148, -12093976, -14158121, -16093089, -17921068, -19673508, -21303010, -22673470, -23635648, -24107611, -24089104, -23620147, -22730670, -21416109, -19660014, -17496083, -15059062, -12568361, -10244811, -8220468, -6499787, -4989919, -3585110, -2260467, -1107618, -280837, 98099, -1018, -521445, -1352281, -2341730, -3287989, -3950577, -4111495, -3664122, -2676790, -1389903, -147350]
16131a47350Q55112K32825m38299r54511j169150j053626p04995k86414O0599
16122c605809K80919M13721N33718O69176P78182Q09054P71890P36103P53628
16113B140582P90216P45175N45352K15262j45534m47934o76152q76166j093610
16104A197191j324264j515215j601642j539423j318081r64062n37011j15571K24246
16095g493832M28794M74973L71443J65484n3238j77072j33570O6414L23466N03215
16085e523923N24885M16370K85213K39690L25902N08061O96149Q01596P73681
16076i52376N99798K99365o8774m02074n77287n01739j67811L30664Q48088J270608
16066F78462J560683J731339J789310J710045J466708J073551N93376J07065l20906
$$ y = [-147350, 707762, 940587, 502288, -452223, -1621373, -2674999, -3379994, -3666408, -3605809, -3324890, -2911169, -2377451, -1708275, -930093, -121039, 650851, 1386954, 2140582, 2930798, 3675973, 4221325, 4436587, 4291053, 3843119, 3166967, 2290801, 1197191, -127073, -1642288, -3243930, -4783353, -6101434, -7065496, -7602507, -7718078, -7493832, -7065038, -6590065, -6218622, -6053138, -6106376, -6283448, -6417018, -6350604, -6027138, -5523923, -4999038, -4582668, -4297455, -4057765, -3731863, -3223802, -2527653, -1726057, -952376, -352578, -53213, -121987, -524061, -1101348, -1603087, -1770898, -1440234, -592146, 678462, 2239145, 3970484, 5759794, 7469839, 8936547, 10010098, 10603474, 10710539, 10389633]
16057A0389633o55688q82234r88390r65651q34063o59660n31035n05551n72510
16048C794851o71839p51973q07837q62405r19215r50229r37930r14222r44369
16039c965168j071249j263574j406698j357162j031077m58576K32208Q76713J333327
16030h111256J519477J436322J182016R18822P79254P73519P85184O62482L22964
16021B68784k07695q26426j407859j846180k073934k068486j853704j491226j056969
16012a2563695o12153j88162K04071N52398Q33563J023426J107323J074307R13669
16003g655253O31306K67074j10050m23604o14120o58321n70852l86259j42339
15994i662418J16449L26445M14822L38462J06740k38455o36871r82735j115112
$$ y = [10389633, 9733945, 8851711, 7863321, 6897670, 6063607, 5403947, 4872912, 4367361, 3794851, 3123012, 2371039, 1563202, 700797, -218418, -1168647, -2106577, -3020799, -3965168, -5036417, -6299991, -7706689, -9063851, -10094928, -10553504, -10321296, -9444583, -8111256, -6591779, -5155457, -3973441, -3054619, -2275365, -1501846, -716662, -54180, 268784, 61089, -765337, -2173196, -4019376, -6093310, -8161796, -10015500, -11506726, -12563695, -13175848, -13364010, -13159939, -12607541, -11773978, -10750552, -9643229, -8568922, -7655253, -7023947, -6756873, -6866923, -7290527, -7904647, -8562968, -9133820, -9520079, -9662418, -9545969, -9219524, -8804702, -8466240, -8359500, -8597955, -9234826, -10217561, -11332673]
15985a1332673q93005l13332M45464J114275J488406J517319J284097R30111N82491
15976e176847L11486J31199L3100K1050J16730L27881O09768Q61164R69353Q78417
15966i16699O23429L00169P810j83401k32278j21223J37116M90969Q57405J151508
15956B114805J323042J375133J345600J260601J102448Q30614M40773n854m24880
15947I362282p72810j047917j234761j283272j157490q88932n73005l13998j62462
15938A927635r1424k7493R4114K89943N15294O77694O78570M67684P8302l79402
15928D230917p63246r59685r32192p32555m68721k59973k12785m05039q58522
15919a361801j513511k228006k817001l128876l114577k832851k391193j882322
$$ y = [-11332673, -12225678, -12539010, -12093546, -10979271, -9490865, -7973546, -6689449, -5759338, -5176847, -4865361, -4734162, -4701062, -4680012, -4563282, -4235401, -3625633, -2764469, -1795116, -916699, -293270, 6899, 14709, -168692, -400970, -522193, -385077, 105892, 963297, 2114805, 3437847, 4812980, 6158580, 7419181, 8521629, 9352243, 9793016, 9787162, 9362282, 8589472, 7541555, 6306794, 5023522, 3866032, 2977100, 2404095, 2090097, 1927635, 1836211, 1808718, 1902832, 2192775, 2708069, 3385763, 4064333, 4532017, 4610319, 4230917, 3467671, 2507986, 1575794, 843239, 374518, 114545, -98240, -503279, -1361801, -2875312, -5103318, -7920319, -11049195, -14163772, -16996623, -19387816, -21270138]
15911b1270138j360934q43721l13094K52411Q23753J301039J561630J545574J319888
15902a6983592J072663J026801J324375J952534K742071L430943L769549L630540
15894A965884L068622K286622J523949R42066N76144L63876K15528P5046o8537
15885A0949200k14370l78134n81156q17517j042635j200057j262690j254531j234893
15876B963217j256279j330743j428658j498232j483084j336716j045656o51733
15868g067884k42553Q8718K71744K58776K6927l91026q70072j213154j258004
15859a0396528r94731n73107j85695N8555J68875K20508K84297L97489N82337
15850a0438000Q64483J250729J688732K063133K241155K126006J684747R60577
$$ y = [-21270138, -22631072, -23474793, -23787887, -23535476, -22711723, -21410684, -19849054, -18303480, -16983592, -15910929, -14884128, -13559753, -11607219, -8865148, -5434205, -1664656, 1965884, 5034506, 7321128, 8845077, 9787143, 10363287, 10727163, 10942691, 11017737, 10949200, 10734830, 10356696, 9775540, 8958023, 7915388, 6715331, 5452641, 4198110, 2963217, 1706938, 376195, -1052463, -2550695, -4033779, -5370495, -6416151, -7067884, -7310437, -7221719, -6949975, -6691199, -6664272, -7055298, -7925370, -9138524, -10396528, -11391259, -11964366, -12150061, -12091506, -11922631, -11702123, -11417826, -11020337, -10438000, -9573517, -8322788, -6634056, -4570923, -2329768, -203762, 1480985, 2441562]
15842B441562P5117q01106j503765j914963j978972j711300j195005n51330R5627
15833g044135O35869R79032J066170Q89197N02068Q014m74645q46511j039689
15824e324630j009373p30674k24231M15511J040671J519897J804087J937518K001124
15815A429900K021603J925418J590328R49766O2201q92550j678466k103833k105984
15806A198383j763694j239367o99640k51347Q2760L34942N37017O84789P40136
15797c76021O63431M55723J75927q5171k49988k82806j91439j5178J87833L60735
15787F43046M80563N71605O71802P84689Q69394Q73045P63493N26543J44027l97346
15777E930861j061437j742402k307146k660750k773361k662662k373150j967951
$$ y = [2441562, 2516679, 1715573, 211808, -1703155, -3682127, -5393427, -6588432, -7139762, -7044135, -6408266, -5429234, -4363064, -3473867, -2971799, -2963785, -3438430, -4284941, -5324630, -6334003, -7064677, -7288908, -6873397, -5832726, -4312829, -2508742, -571224, 1429900, 3451503, 5376921, 6967249, 7917015, 7979216, 7086666, 5408200, 3304367, 1198383, -565311, -1804678, -2504318, -2755665, -2672905, -2337963, -1800946, -1116157, -376021, 287410, 743133, 919060, 833889, 583901, 301095, 109656, 94478, 282311, 643046, 1123609, 1695214, 2367016, 3151705, 4021099, 4894144, 5657637, 6184180, 6328207, 5930861, 4869424, 3127022, 819876, -1840874, -4614235, -7276897, -9650047, -11617998]
15769a1617998j507342j015273m77105J20321P51217J353421J856065K201555
15761h335139K356586K317383K113650J814650J522441J342652J357758J612577
15753F102558K086471K661885L142466L335385L141743K592840J821760R96611
15745B5881719K50802l54944q20158j157346j353684j373666j189860q05568k58336
15736A8818959L80104J008506J523775J859743K002864J976891J812937J524501
15728C0908280J104573N47653j24059q53780j562071k170025k631133k946353
15720B2273085l137475l207668l137495k920027k600168k282275k085085k054538
15712H48354k101336k042096j730031j160075m58668K14374P55108J132951J355109
$$ y = [-11617998, -13125340, -14140613, -14617718, -14497397, -13746180, -12392759, -10536694, -8335139, -5978553, -3661170, -1547520, 267130, 1789571, 3132223, 4489981, 6102558, 8189029, 10850914, 13993380, 17328765, 20470508, 23063348, 24885108, 25881719, 26132521, 25777577, 24957419, 23800073, 22446389, 21072723, 19882863, 19077295, 18818959, 19199063, 20207569, 21731344, 23591087, 25593951, 27570842, 29383779, 30908280, 32012853, 32560506, 32436447, 31582667, 30020596, 27850571, 25219438, 22273085, 19135610, 15927942, 12790447, 9870420, 7270252, 4987977, 2902892, 848354, -1252982, -3295078, -5025109, -6185184, -6643852, -6429478, -5674370, -4541419, -3186310]
15703c186310J433913J385568J248908J095685J007867J027907J122814J195741
15695F332093J144861R34325O17973K95840N8507l5274L3195K32052M85167P03729
15685A0802468Q28804Q64306Q72735R24398J035490J145758J153478R78146O08720
15676A9214303J19708l54958o90127q34936q23903p32320o11882m53341k06410
15667A4626134J68537O70203J255860J839872K293025K474972K295125J758408
15659B7382136R71575J14827o19341j106516j335900j378340j312373j182859
15651B1533209j010429q11618o06798m24798l07619l03525m38374o79144r28766
15642A6022138j071382j040483q69988o94805o78837r01183j286734j644047j783293
$$ y = [-3186310, -1752397, -366829, 882079, 1977764, 2985631, 4013538, 5136352, 6332093, 7476954, 8411279, 9029252, 9325092, 9383599, 9348325, 9381520, 9613572, 10098739, 10802468, 11631272, 12495578, 13368313, 14292711, 15328201, 16473959, 17627437, 18605583, 19214303, 19334011, 18979053, 18288926, 17453990, 16630087, 15897767, 15285885, 14832544, 14626134, 14794671, 15464874, 16720734, 18560606, 20853631, 23328603, 25623728, 27382136, 28353711, 28468538, 27849197, 26742681, 25406781, 24028441, 22716068, 21533209, 20522780, 19711162, 19104364, 18679566, 18371947, 18068422, 17630048, 16950904, 16022138, 14950756, 13910273, 13040285, 12345480, 11666643, 10765460, 9478726, 7834679, 6051386]
15633F051386j623284j220124p19968k80298n978P3475q580j79256l48249m32369
15623A306755l87552k37586o7664K8395N618j13246k52155l12352k24617n428
15613b59832K41299L98123M17891L37970K25801J26022O0478N5290J35979K87252
15603B026273M37475N07941M86882M49458M96528O64877Q93447J082345J182043
15594H227269J218460J245886J301221J402214J560926J780161K035885K266618
15586B1038640K394330K375024K234618K048787J882617J745279J588424J331552
15578C6639271Q92018K18912o68294j661120k590948l295318l677330l716808
15570B2140383l440804k902314k180832j370415n50780K18164Q67107J301448
$$ y = [6051386, 4428102, 3207978, 2488010, 2207712, 2201734, 2275209, 2266629, 2087373, 1739124, 1306755, 919203, 681617, 613953, 642348, 647966, 534720, 282565, -29787, -254404, -259832, -18533, 379590, 797481, 1135451, 1361252, 1487274, 1547752, 1603042, 1739021, 2026273, 2463748, 2971689, 3458571, 3908029, 4404557, 5069434, 5962881, 7045226, 8227269, 9445729, 10691615, 11992836, 13395050, 14955976, 16736137, 18772022, 21038640, 23432970, 25807994, 28042612, 30091399, 31974016, 33719295, 35307719, 36639271, 37531289, 37750201, 37081907, 35420787, 32829839, 29534521, 25857191, 22140383, 18699579, 15797265, 13616433, 12246018, 11695238, 11913402, 12780509, 14081957]
15562A4081957J441193J289121R53546N90097L14141J65249J34986K06776L79159
15553A9556225O66989J073287J560075K056197K483555K761845K796788K502598
15545C5457559J875757J038165J78103n48014j055492j312967j323086j127308
15537C3182717q12306m91283k71614k34300m19603q11300j338669j897068k367412
15528B4539162k645533k691054k555250k348558k168899k044832j927141j734089
15520F423806j419590j006144n64708j80671O6370J29874M3546o5601n0450J54020
15510C530452N04116R04423J265667J520513J645226J711969J893932K360494
15502A5336792L136270M059134M877135N393825N542359N349238M851527M059758
$$ y = [14081957, 15523150, 16812271, 17765817, 18355914, 18670055, 18835304, 18970290, 19177066, 19556225, 20223214, 21296501, 22856576, 24912773, 27396328, 30158173, 32954961, 35457559, 37333316, 38371481, 38549584, 38001570, 36946078, 35633111, 34310025, 33182717, 32370411, 31879128, 31607514, 31373214, 30953611, 30142311, 28803642, 26906574, 24539162, 21893629, 19202575, 16647325, 14298767, 12129868, 10085036, 8157895, 6423806, 5004216, 3998072, 3433364, 3252693, 3319063, 3448937, 3492483, 3426882, 3376432, 3530452, 4034568, 4938991, 6204658, 7725171, 9370397, 11082366, 12976298, 15336792, 18473062, 22532196, 27409331, 32803156, 38345515, 43694753, 48546280, 52606038]
15494E2606038K990867J714744L55606r50719k098886l021590l674828m036688
15486D3884544m123992l993617l710357l309382k795774k181619j517130q86478
15478B1366195l77516n2592N6278o0753l80482q25839j278206j631339j847415
15469A4968331j966518k051921k117766k114840j982668j700143j292224q12019
15461I30232l22942J13490M49860O68865P90325Q58101R22559J036989J250491
15452F697970J570735J920256K148445K121999J834661J437915J149878J112687
15444A9994546J317360J642584J949984K155463K245126K245783K181990K061110
15436C5793946J895135J717112J558386J414018J241385R91274O39397K00269
$$ y = [52606038, 55596905, 57311649, 57667255, 56716536, 54617650, 51596060, 47921232, 43884544, 39760552, 35766935, 32056578, 28747196, 25951422, 23769803, 22252673, 21366195, 20988679, 20936087, 20992365, 20931612, 20551130, 19725291, 18447085, 16815746, 14968331, 13001813, 10949892, 8832126, 6717286, 4734618, 3034475, 1742251, 930232, 607290, 720780, 1170640, 1839505, 2629830, 3487931, 4410490, 5447479, 6697970, 8268705, 10188961, 12337406, 14459405, 16294066, 17731981, 18881859, 19994546, 21311906, 22954490, 24904474, 27059937, 29305063, 31550846, 33732836, 35793946, 37689081, 39406193, 40964579, 42378597, 43619982, 44611256, 45250653, 45450922]
15428D5450922k76466p24855j089085j344082j500609j590160j636596j636607
15420C5652462j561255j374616j062865o60896k55491M9318J90780J84075J00687
15411C1262199P716p5177j68020k87728m15442n03111n06133m08706k22812K7422
15401B8710208L13184O07237Q99761J192937J454688J582558J443913R81600K89873
15392C7475959m20997r42767j166963j100789q22289m34351n2747J97208K17618
15383C2949882m706l80105p64510j034250j132431j073339r22671p67063o79961
15374B6190846p00152q30861j041710j265232j409517j397600j206286q72299
15366A7467189m71054r3026J77961K91006K54803J52893J30376L35325Q30899
$$ y = [45450922, 45174456, 44449601, 43360516, 42016434, 40515825, 38925665, 37289069, 35652462, 34091207, 32716591, 31653726, 30992830, 30737339, 30786657, 30977437, 31161512, 31262199, 31269915, 31194738, 31026718, 30738990, 30323548, 29820437, 29314304, 28905598, 28682786, 28710208, 29023392, 29630629, 30530390, 31723327, 33178015, 34760573, 36204486, 37186086, 37475959, 37054962, 36112195, 34945232, 33844443, 33022154, 32587803, 32535056, 32732264, 32949882, 32945176, 32565071, 31800561, 30766311, 29633880, 28560541, 27637870, 26870807, 26190846, 25490694, 24659833, 23618123, 22352891, 20943374, 19545774, 18339488, 17467189, 16996135, 16903109, 17081070, 17372076, 17626879, 17779772, 17910148, 18245473, 19076372]
15357A9076372J541287K286259K881955L224851L306976L182334K925706K602917
15349D1028657K256190J902959J541077J154165P16707J99381m17591j114566
15341D7266979j807819k365251k663331k650379k377775j975494j573550j219916
15333C0633464q68442m49145M8546N50467R32708J078390R32674N38688K5549
15324C3422899m57120q14850j040985j186959j296935j364514j344983j191665
15316B4724888q68100l44077L89570J287385K222462K999186L430775L446666
15308C7288755L134667K672727K220814J868028J646907J561120J584086J636088
15300E3613192J585513J303007P37767m3951q85217j601774k034081k073388j686736
$$ y = [19076372, 20617659, 22903918, 25785873, 29010724, 32317700, 35500034, 38425740, 41028657, 43284847, 45187806, 46728883, 47883048, 48599755, 48799136, 48381545, 47266979, 45459160, 43093909, 40430578, 37780199, 35402424, 33426930, 31853380, 30633464, 29765022, 29315877, 29364423, 29914890, 30847598, 31925988, 32858662, 33397350, 33422899, 32965779, 32150929, 31109944, 29922985, 28626050, 27261536, 25916553, 24724888, 23856788, 23512711, 23902281, 25189666, 27412128, 30411314, 33842089, 37288755, 40423422, 43096149, 45316963, 47184991, 48831898, 50393018, 51977104, 53613192, 55198705, 56501712, 57239479, 57195528, 56310311, 54708537, 52674456, 50601068, 48914332]
15291D8914332r44940j0716R26459J716881K278606K594065K685976K584428K315154
15282F3060245J916085J449309R91648O17467L77524K74207K59375K70978K77115
15273F9493953K88873L39530M49130N96874P29423Q10080Q62838R65719J204691
15264G5741111J625534K208105K877196L541871M129470M593137M907708N077915
15256A04702047N157770N254010N494637N977960O729754P690315Q742907R761814
15248A59511214J0640693J1293632J1644148J1608179J1077108R920469Q024591
15241B33720034N360889K060141j547692m984153p773137r605948j0415811j0331803
15233A96482520r559820q280927o633468m751975k790733r11640P48023K118429
$$ y = [48914332, 47969392, 47958676, 48885135, 50602016, 52880622, 55474687, 58160663, 60745091, 63060245, 64976330, 66425639, 67417287, 68034754, 68412278, 68686485, 68945860, 69216838, 69493953, 69782826, 70122356, 70571486, 71168360, 71897783, 72707863, 73570701, 74536420, 75741111, 77366645, 79574750, 82451946, 85993817, 90123287, 94716424, 99624132, 104702047, 109859817, 115113827, 120608464, 126586424, 133316178, 141006493, 149749400, 159511214, 170151907, 181445539, 193089687, 204697866, 215774974, 225695443, 233720034, 239080923, 241141064, 239593372, 234609219, 226836082, 217230134, 206814323, 196482520, 186922700, 178641773, 172008305, 167256330, 164465597, 163553957, 164301980, 166420409]
15225A66420409L218785M119808M870842N452710N771806N669339M947358L443633
15217B03914690J150957j696824m666508p292945r250544j0412378j0800713j0513978
15209A50431757r684204q462259p017541n535346m183478l054073k142753j397713
15201A08954390p80363k76815J17786M03849N92858P47391R83740J396157J976270
15192A14115263K617986L188728L588349L764778L706833L440346L033830K593462
15184A40049575K224453J980488J860586J863613K030629K418812L045946L881844
15176A59355946M891340O070156P445490R060706J0953753J3116741J5449827
15169B26343959J7756451J9790373K1299052K2021431K1674301K0003978J6945403
$$ y = [166420409, 169639194, 173759002, 178629844, 184082554, 189854360, 195523699, 200471057, 203914690, 205065647, 203368823, 198702315, 191409370, 182158826, 171746448, 160945735, 150431757, 140747553, 132285294, 125267753, 119732407, 115548929, 112494856, 110352103, 108954390, 108174027, 107897212, 108014998, 108418847, 109011705, 109759096, 110742836, 112138993, 114115263, 116733249, 119921977, 123510326, 127275104, 130981937, 134422283, 137456113, 140049575, 142274028, 144254516, 146115102, 147978715, 150009344, 152428156, 155474102, 159355946, 164247286, 170317442, 177762932, 186823638, 197777391, 210894132, 226343959, 244100410, 263890783, 285189835, 307211266, 328885567, 348889545, 365834948]
15162C65834948J2809549Q302316M263819J281582n59940j687363k848429m790749
15154C82605733p905455j1996416j6330605j9979945k2249416k2925486k2246174
15147B58972236k0685220j8709985j6637976j4629549j2771875j1165718r932922
15140A54438991r137309q705797q438979q110399p581793o861557o076543n381598
15132I4145016m867099m515001m223613l886972l470761l021056k607925k270324
15124F5282265k011733j827539j713983j651710j602716j526750j390454j175037
15116E2382343q93176n89850l16055j07225J2817K4535o8982k11458l02448k60633
15106D9669868q5509J41102L13807L68666L00661J33623j14183m37399q31778
$$ y = [365834948, 378644497, 386946813, 391210632, 392492214, 391932274, 390244911, 387396482, 382605733, 374700278, 362703862, 346373257, 326393312, 304143896, 281218410, 258972236, 238287016, 219577031, 202939055, 188309506, 175537631, 164371913, 154438991, 145301682, 136595885, 128156906, 120046507, 112464714, 105603157, 99526614, 94145016, 89277917, 84762916, 80539303, 76652331, 73181570, 70160514, 67552589, 65282265, 63270532, 61442993, 59729010, 58077300, 56474584, 54947834, 53557380, 52382343, 51489167, 50899317, 50583262, 50476037, 50488854, 50513389, 50444407, 50232949, 49930501, 49669868, 49584359, 49725461, 50039268, 50407934, 50708595, 50842218, 50728035, 50290636, 49458858]
15097D9458858j280225j737078k120131k334445k320875k081160j654377j080539
15089C4850028l94213L61807J139333J901187K616968L233177L650116L739680
15081E1098083L406916K650241J569900L28573q95883j939888k670916l019403
15073E0527623l028597k861789k718636k715346k827760k926985k860601k526291
15065B8061618j913111j099026k08289O39293J355432J888968K227043K389869
15057C3341797K406826K289113K037221J680492J292862R59234P38211O58231
15049D5403987P16317Q56217R73142R73838Q36723O16810M00675K47936J60547
15040E1186192J01431L7915l1649q0441p2444J6306J85651M06180O17081P41023
$$ y = [49458858, 48178633, 46441555, 44321424, 41986979, 39666104, 37584944, 35930567, 34850028, 34455815, 34817622, 35956955, 37858142, 40475110, 43708287, 47358403, 51098083, 54504999, 57155240, 58725140, 59053713, 58157830, 56217942, 53547026, 50527623, 47499026, 44637237, 41918601, 39203255, 36375495, 33448510, 30587909, 28061618, 26148507, 25049481, 24841192, 25480485, 26835917, 28724885, 30951928, 33341797, 35748623, 38037736, 40074957, 41755449, 43048311, 44007545, 44745756, 45403987, 46120304, 46976521, 47949663, 48923501, 49760224, 50377034, 50777709, 51025645, 51186192, 51287623, 51325538, 51293889, 51213448, 51141004, 51157310, 51342961, 51749141, 52366222, 53107245]
15030E3107245P22291N65412L41135J42973K3134k6715l0422J9704J57540M04574
15020E5426871P46938J146809J564014J951826K232200K299963K077808J575489
15012F9021918Q94603J74434m71808r82474j332982j509484j497001j298632r67077
15003F2031497n98573k84310o8394O1189J56365K73235M30238N91432O91400O85755
14993F3969834N91224M80378M29635M65528N51693O10057N54503L36665j2387
14984F7977130l93021p06141r08039r97274r75229q41540o16112l42681n9126
14975F2137967K33887N61111R18487J229716J362522J203229P33522M7153o93269
14966F7734325j314094j681401j743230j542987j185005p79333m11644j38434
$$ y = [53107245, 53829536, 54394948, 54736083, 54879056, 54902190, 54875475, 54845053, 54864757, 55022297, 55426871, 56173809, 57320618, 58884632, 60836458, 63068658, 65368621, 67446429, 69021918, 69916521, 70090955, 69619147, 68636673, 67303691, 65794207, 64297206, 62998574, 62031497, 61432924, 61148614, 61080220, 61141409, 61297774, 61571009, 62001247, 62592679, 63284079, 63969834, 64561058, 65041436, 65471071, 65936599, 66488292, 67098349, 67652852, 67989517, 67977130, 67584109, 66877968, 65969929, 64972655, 63997426, 63155886, 62539774, 62197093, 62137967, 62371854, 62932965, 63851452, 65081168, 66443690, 67646919, 68380441, 68427594, 67734325, 66420231, 64738830, 62995600, 61452613, 60267608, 59488275, 59076631, 58938197]
14958E8938197J9934Q7365J23680J99537L65035O21846R17002J172353J328687
14949F3773636J364958J288790J126389R15929O89289M54499J96834j07181m64764
14940F9238379q36426j131458j247422j125942p82396k96125K18349O39145Q63525
14931F5539629Q34951N63066J29360l27675o55050p45867n81503k19979K59406
14922F4796338P96115J328998J751707J916244J701117J091004K08008p30569
14914G2858962j507133j992329k171490k105100j874506j560759j249032j021993
14906E9376620r36165j008598j224229j544677j907659k233189k451006k527253
14898D5543844k454846k221292j806866j219514n09086K65871J064726J839982
$$ y = [58938197, 58958131, 59045496, 59169176, 59368713, 59733748, 60355594, 61272596, 62444949, 63773636, 65138594, 66427384, 67553773, 68469702, 69158991, 69613490, 69810324, 69703143, 69238379, 68401953, 67270495, 66023073, 64897131, 64114735, 63818610, 64036959, 64676104, 65539629, 66374580, 66937646, 67067006, 66739331, 66084281, 65338414, 64756911, 64536932, 64796338, 65592453, 66921451, 68673158, 70589402, 72290519, 73381523, 73589531, 72858962, 71351829, 69359500, 67188010, 65082910, 63208404, 61647645, 60398613, 59376620, 58440455, 57431857, 56207628, 54662951, 52755292, 50522103, 48071097, 45543844, 43088998, 40867706, 39060840, 37841326, 37332240, 37598111, 38662837, 40502819]
14890D0502819K498940K916836L012285K821198K487589K167349J937374J790259
14882F0134649J689409J610989J552167J522797J520485J495324J344299R64816
14874G1834935L36378m42484j201569j785907k109486k158833j973137j625466
14866F0874431j213278q48365o29087n98734p27347r46294j205767j489960j769371
14857E1446228j956729j942509j678306j205400o08009K9105O16520J059972J302199
14848D7063071J362124J320387J263447J228969J186207J067759Q35519N27902
14840E5855385K44604Q4612R4605K59069N18802P96724J023724J158950J192338
14831F1228813J127467R61521O79713K68732k59882q49729j395784j769415j867021
$$ y = [40502819, 43001759, 45918595, 48930880, 51752078, 54239667, 56407016, 58344390, 60134649, 61824058, 63435047, 64987214, 66510011, 68030496, 69525820, 70870119, 71834935, 72171313, 71728829, 70527260, 68741353, 66631867, 64473034, 62499897, 60874431, 59661153, 58812788, 58183701, 57584967, 56857620, 55911326, 54705559, 53215599, 51446228, 49489499, 47546990, 45868684, 44663284, 44055275, 44084380, 44700900, 45760872, 47063071, 48425195, 49745582, 51009029, 52237998, 53424205, 54491964, 55327483, 55855385, 56099989, 56184601, 56279206, 56538275, 57057077, 57853801, 58877525, 60036475, 61228813, 62356280, 63317801, 63997514, 64266246, 64006364, 63156635, 61760851, 59991436, 58124415]
14822E8124415j649554j148152m51330L05870R65345J396196J547417J465510
14814F0555717J263335J060417R34022R06548R62068J065517J171232J228850
14806F9147706J192212J028174P26619L15448j29562n03321p20378p56078o43474
14797F9657346m38478j92327N3928K68666M38330N76238P12125Q65878J027858
14788G2969564J162129J231390J219789J130080R65387P23743M16305R0672j72759
14779G9736300l02016k85192j83606q3906l2071j1129K9593J31573L04127N25278
14769G9828951P48442R14588R85707R73279R15738Q32209P21283N97699N02456
14760H7020352M72501N18086O36298Q30415J107084J467314J903447K387029K852669
$$ y = [58124415, 56474861, 55326709, 54875379, 55181249, 56146594, 57542790, 59090207, 60555717, 61819052, 62879469, 63813491, 64720039, 65682107, 66747624, 67918856, 69147706, 70339918, 71368092, 72094711, 72410159, 72280597, 71777276, 71056898, 70300820, 69657346, 69218868, 69026541, 69080469, 69349135, 69787465, 70363703, 71075828, 71941706, 72969564, 74131693, 75363083, 76582872, 77712952, 78678339, 79402082, 79818387, 79909059, 79736300, 79434284, 79149092, 78965486, 78881580, 78849509, 78838380, 78867973, 78999546, 79303673, 79828951, 80577393, 81491981, 82477688, 83450967, 84366705, 85198914, 85920197, 86517896, 87020352, 87492853, 88010939, 88647237, 89477652, 90584736, 92052050, 93955497, 96342526, 99195195]
14751I9195195L207522L362521L251019K830252K090316J077108q8679j218591
14743A13706663k104386k596294k667714k421488k035201j686778j502646j540701
14735I7151455j798833k226480k720778l133333l329006l263722k995049k613380
14727G5070874k176840j707277j219606p35820k73036J73409O30518J127504J671555
14718G2561281K240114K784285L228938L480211L453233L109553K483193J678103
14710I5018911Q33427P5296n12592q82814j006193q77845n38353o7408M52607
14701I2495036R60790J410731J755199J950037J977759J858827J631743J332392
14693A05372514R99245O78405L99944J52581j01345l85571o92297r92118j237663
$$ y = [99195195, 102402717, 105765238, 109016257, 111846509, 113936825, 115013933, 114925254, 113706663, 111602277, 109005983, 106338269, 103916781, 101881580, 100194802, 98692156, 97151455, 95352622, 93126142, 90405364, 87272031, 83943025, 80679303, 77684254, 75070874, 72894034, 71186757, 69967151, 69231331, 68958295, 69131704, 69762222, 70889726, 72561281, 74801395, 77585680, 80814618, 84294829, 87748062, 90857615, 93340808, 95018911, 95852338, 95927634, 95415042, 94532228, 93526035, 92648190, 92109837, 92042429, 92495036, 93455826, 94866557, 96621756, 98571793, 100549552, 102408379, 104040122, 105372514, 106371759, 107050164, 107450108, 107602689, 107501344, 107115773, 106423476, 105431358, 104193695]
14684A04193695j358798j280997r70897m73541R2184N83110R01314J044139J096945
14675A03827154J167505J317285J545282J816532K092939K341812K522722K574373
14667A19205604K430735K068331J538754R43921L76124j23282n64849r78748j366321
14658A23530269j676856j843689j843444j707310j478302j170811p66407k38362
14650A12805088M11191J118736J758363K190130K330825K188658J840089J387107
14642A26030187R31705N60222L23165K23037K22641K67459L16634L71126M67969
14633A29714145O33129Q36171R93859J022889Q91770O20404K35056k65874r00718
14624A33780831j659378k463680l173434l639529l763910l528343k985162k231355
$$ y = [104193695, 102834897, 101553900, 100583003, 100109462, 100201646, 100784756, 101686070, 102730209, 103827154, 104994659, 106311944, 107857226, 109673758, 111766697, 114108509, 116631231, 119205604, 121636339, 123704670, 125243424, 126187345, 126563469, 126440187, 125875338, 124896590, 123530269, 121853413, 120009724, 118166280, 116458970, 114980668, 113809857, 113043450, 112805088, 113216279, 114335015, 116093378, 118283508, 120614333, 122802991, 124643080, 126030187, 126961892, 127522114, 127845279, 128068316, 128290957, 128558416, 128875050, 129246176, 129714145, 130347274, 131183445, 132177304, 133200193, 134091963, 134712367, 134947423, 134681549, 133780831, 132121453, 129657773, 126484339, 122844810, 119080900, 115552557, 112567395, 110336040]
14616A10336040j382960n46008K08395Q43771J336432J656214J765579J643569
14608A15861032J320467Q81137M15045m8540n52138j146343j808098k416325k799262
14599A09706975k813802k415865j692301q35991p2730M23242N80306M24573L9109
14590A03343516m72242j001712j451978j758520j904863j913454j816188j628960
14582I1395599j355292j011107o29024k30913J83392N99262R46726J120498J053524
14573I2072665P73928L99722Q6870l6662O5884L06168N06589M98095K06078l31223
14563I4548114r94300j623445k061958k210021k067485j723769j293025q48480
14555H1725631m05450N2350N39677J049483J540825J935968K147737K134140J926165
$$ y = [110336040, 108953080, 108407072, 108615467, 109459238, 110795670, 112451884, 114217463, 115861032, 117181499, 118062636, 118477681, 118429141, 117877003, 116730660, 114922562, 112506237, 109706975, 106893173, 104477308, 102785007, 101949016, 101876286, 102299528, 102879834, 103304407, 103343516, 102871274, 101869562, 100417584, 98659064, 96754201, 94840747, 93024559, 91395599, 90040307, 89029200, 88400176, 88169263, 88352655, 88951917, 89898643, 91019141, 92072665, 92846593, 93246315, 93333185, 93296523, 93362407, 93668575, 94175164, 94673259, 94879337, 94548114, 93553814, 91930369, 89868411, 87658390, 85590905, 83867136, 82574111, 81725631, 81320181, 81372531, 81912208, 82961691, 84502516, 86438484, 88586221, 90720361, 92646526]
14546I2646526J591827J173515O67577O9172n64399j094402j349785j223969p60107
14537I1155955j50344L68156O33654O03787L33329n8265m22256o41478o95847
14528I1126691o66746o62226p37059q81622j062131j250083j422813j556001j619088
14519H1268922j574548j390004j067597o71848l27652j77549l15288p34824j336121
14510G3673491j985871k576486l036806l306839l327571l078885k628741k117083
14502E1615209j668956j328337j077742q95091p72282o97190o39568n53957l97713
14493D3584373j59301J26481M02833O45175Q94395J227145J681644K206893K687673
14484E3297311L024388L185976L186655L031066K700119K189826J556519R17038
$$ y = [92646526, 94238353, 95411868, 96079445, 96148617, 95584218, 94489816, 93140031, 91916062, 91155955, 91005611, 91373767, 92007421, 92611208, 92944537, 92886272, 92464016, 91822538, 91126691, 90459945, 89797719, 89060660, 88179038, 87116907, 85866824, 84444011, 82888010, 81268922, 79694374, 78304370, 77236773, 76564925, 76237273, 76059724, 75744436, 75009612, 73673491, 71687620, 69111134, 66074328, 62767489, 59439918, 56361033, 53732292, 51615209, 49946253, 48617916, 47540174, 46645083, 45872801, 45175611, 44536043, 43982086, 43584373, 43425072, 43551553, 43954386, 44599561, 45493956, 46721101, 48402745, 50609638, 53297311, 56321699, 59507675, 62694330, 65725396, 68425515, 70615341, 72171860, 73088898]
14476G3088898L96936O5922r1818j47402j61794j48562r7467k4334J3009m7732
14466G2845656k23185m70876p19994r22670j089770j275165j510774j747094j856529
14457F3029599j706507j248958n51650K47336J000918J573446J840029J715956
14449F5900169J211090M51529l63500j043679j474080j623749j506653j152338
14441F0398789o15947Q349O09129J099813J445409J659996J776967J808635J730586
14432F9921726J508526J133953O27356K5125o09871j170444j532865j626404j476464
14423F6800638j176818q21216m59989j10277K14324M97278P26064Q87870R68044
14414F7525918R63311Q83581P30605M89148J52544k49867o55930r98724j236371
$$ y = [73088898, 73485834, 73551756, 73459938, 73312536, 73150742, 73002180, 72904713, 72880379, 72893388, 72845656, 72622471, 72151595, 71431601, 70508931, 69419161, 68143996, 66633222, 64886128, 63029599, 61323092, 60074134, 59522484, 59769820, 60770738, 62344184, 64184213, 65900169, 67111259, 67562788, 67199288, 66155609, 64681529, 63057780, 61551127, 60398789, 59782842, 59791191, 60400320, 61500133, 62945542, 64605538, 66382505, 68191140, 69921726, 71430252, 72564205, 73191561, 73216686, 72606815, 71436371, 69903506, 68277102, 66800638, 65623820, 64802604, 64342615, 64232338, 64446662, 64943940, 65670004, 66557874, 67525918, 68489229, 69372810, 70103415, 70592563, 70745107, 70495240, 69839310, 68840586, 67604215]
14405F7604215j365223j415538j441097j499975j620314j776727j903182j922100
14397E4660059j760914j366108p33068O5337Q86253J569870K006712K168530K079297
14388E9575968J763765J239503N61494j50907p61629j197298j468994j618978
14380E7942924j664244j598753j432838j206961r60548p01196m20109j35810R4705
14371D9917170K17996K29884J77795J31336J49549K53476M16014N86925P37781
14362E2817926Q75902J008144J105513J119057J028957Q70981P13089O06899N61148
14353F0707616N59592N97225O87748Q32640R90745J080308J010480P30684K75765
14344F7472803k33594o47174q55389q21340n69009j62510L07836P48449J090379
$$ y = [67604215, 66238992, 64823454, 63382357, 61882382, 60262068, 58485341, 56582159, 54660059, 52899145, 51533037, 50799969, 50865306, 51751559, 53321429, 55328141, 57496671, 59575968, 61339733, 62579236, 63140730, 62989823, 62228194, 61030896, 59561902, 57942924, 56278680, 54679927, 53247089, 52040128, 51079580, 50378384, 49958275, 49822465, 49917170, 50135166, 50365050, 50542845, 50674181, 50823730, 51077206, 51493220, 52080145, 52817926, 53693828, 54701972, 55807485, 56926542, 57955499, 58826480, 59539569, 60146468, 60707616, 61267208, 61864433, 62552181, 63384821, 64375566, 65455874, 66466354, 67197038, 67472803, 67239209, 66592035, 65736646, 64915306, 64346297, 64183787, 64491623, 65240072, 66330451]
14335F6330451J297260J349740J230275R29009M64592j01391o68909j121493j358971
14326F8350563j330308j049409n85954m4676M56361Q16871R89641R84897Q35770
14317F9423756N69751K15246j77332n28034p43984p51360n24536j04665L95676
14308F7774518Q15026R98480Q61852M24896k01024q47950j330427j500491j319256
14299F5675624r00407m70742k48289l16716n84545q47098r05095o68642j85380
14290F0548710M14903J010479J547802K031808K460864K770710K845030K585362
14282G6215668J977368J097594O4080j013785k045050k944103l630243m047150
14274F5674379m186161m083365l780660l293286k620065j773832q01164K10749
$$ y = [66330451, 67627711, 68977451, 70207726, 71136735, 71601327, 71499936, 70831027, 69709534, 68350563, 67020255, 65970846, 65384892, 65340216, 65796577, 66613448, 67603089, 68587986, 69423756, 69993507, 70208753, 70031421, 69503387, 68759403, 68008043, 67483507, 67378842, 67774518, 68589544, 69588024, 70449876, 70874772, 70673748, 69825798, 68495371, 66994880, 65675624, 64775217, 64304475, 64056186, 63739470, 63154925, 62307827, 61402732, 60734090, 60548710, 60963613, 61974092, 63521894, 65553702, 68014566, 70785276, 73630306, 76215668, 78193036, 79290630, 79354710, 78340925, 76295875, 73351772, 69721529, 65674379, 61488218, 57404853, 53624193, 50330907, 47710842, 45937010, 45135846, 45346595]
14266D5346595J145477J891779K374355K561022K468326K174963J805528J467763
14258F1235808J194015R39230O28567K15266k86772q08216j254370j545984j655418
14249E8662126j610518j459821j233983r39467n82265j93047J68858M33953N44653
14240E3790489M63689J78189k90379q86675j531733k117738k502861k548728k188059
14231D2366194j464925n19314M64134J309961J891344K150868K098797J791248
14223E0088307J302423P14878J30402l36335n99469o40144n03347k63702N496
14214D9898509K47597M29803N37795N54587M48198J92856j98036o70324j153838
14205E0287147j573134j843496j888688j687951j313737r19015o71663o75513
$$ y = [45346595, 46492072, 48383851, 50758206, 53319228, 55787554, 57962517, 59768045, 61235808, 62429823, 63369053, 63997620, 64212886, 63926114, 63117898, 61863528, 60317544, 58662126, 57051608, 55591787, 54357804, 53418337, 52836072, 52643025, 52811883, 53245836, 53790489, 54254178, 54432367, 54141988, 53255313, 51723580, 49605842, 47102981, 44554253, 42366194, 40901269, 40381955, 40846089, 42156050, 44047394, 46198262, 48297059, 50088307, 51390730, 52105608, 52236010, 51899675, 51300206, 50660062, 50156715, 49893013, 49898509, 50146106, 50575909, 51113704, 51668291, 52116489, 52309345, 52111309, 51440985, 50287147, 48714013, 46870517, 44981829, 43293878, 41980141, 41061126, 40389463, 39713950]
14197C9713950r26897j328609j744403k061152k232911k286847k280207k227608
14189B4625316k056786j646066r25333M1891J062507J900662K383802K459638
14181B7845631K182582J660956J016820L82593r8672l11826k31066N5817L96903
14172C2899738O67598Q29738R18130R85434J060744J139859J191869J171561J040044
14163D1904715P85957M24916k1003n25813j034074j450045j670030j633925j356488
14154C5424210r20538m44389m9010J67448J57467n1145l60689o49074q23345q47104
14144C1603831p40362n60807l72362k14986r4887j309O7544R2692M6836p2670
14134B9753520k18660l15868l18063k40214j38854p4239q8028j93461l68949n65252
$$ y = [39713950, 38787053, 37458444, 35714041, 33652889, 31419978, 29133131, 26852924, 24625316, 22568530, 20922464, 19997131, 20039022, 21101529, 23002191, 25385993, 27845631, 30028213, 31689169, 32705989, 33088582, 32989910, 32678084, 32447018, 32502835, 32899738, 33567336, 34397074, 35315204, 36300638, 37361382, 38501241, 39693110, 40864671, 41904715, 42690672, 43115588, 43094585, 42568772, 41534698, 40084653, 38414623, 36780698, 35424210, 34503672, 34059283, 34010273, 34177721, 34335188, 34284043, 33923354, 33274280, 32450935, 31603831, 30863469, 30302662, 29930300, 29715314, 29620427, 29619118, 29686662, 29779354, 29826190, 29753520, 29534860, 29218992, 28900929, 28660715, 28521861, 28447622, 28359594, 28166133, 27797184, 27231932]
14124B7231932p36775q80575j044496j285898j614862j973531k260971k374380
14116A5060444k243837j855905j263637n77427O5332N41582P75829P57169N43004
14107A1802554K40296m0173k23976k78358k04187m1075J34355K41730K40547J45815
14097A2017528J685j65934l73818o59572j039218j484590j925662k260841k380775
14088A728803k211972j748575j047457k05247O63869J455634K113703K653320
14080C402078L131951L576601L932006M077958L904786L391465K626129J755357
14072B9798331R08520J59764m50304q71662j043242r52923p00570m83725n00252
14063B5863937q38092j423513k055859k511197k656259k499633k153017j746153
$$ y = [27231932, 26495157, 25614582, 24570086, 23284188, 21669326, 19695795, 17434824, 15060444, 12816607, 10960702, 9697065, 9119638, 9184970, 9726552, 10502381, 11259550, 11802554, 12042850, 12002677, 11778701, 11500343, 11296156, 11255081, 11389436, 11631166, 11871713, 12017528, 12019213, 11853279, 11479461, 10819889, 9780671, 8296081, 6370419, 4109578, 1728803, -483169, -2231744, -3279201, -3484448, -2820579, -1364945, 748758, 3402078, 6534029, 10110630, 14042636, 18120594, 22025380, 25416845, 28042974, 29798331, 30706851, 30866615, 30416311, 29544649, 28501407, 27548484, 26847914, 26364189, 25863937, 25025845, 23602332, 21546473, 19035276, 16379017, 13879384, 11726367, 9980214]
14055I980214j363176j030540p38735m68085k06511L6838K21253K79692J56258
14046F867208j31908m64774o76354o65192m56728j63585J09175L28299N21967
14037E268108P23913R40223J163057J389603J614345J817874J978649K086887
14029A6982659K128002K052144J780423J261453N27282l08174j102530j737790
14021B1583469k138072k260459k086029j630634r73628k65464L22904O74081P52130
14012A3978298N77198J96864l22126r00885j465266j959560k343237k570437k572780
14003B618069k276652j654502p66616K46848J225305K054804K685133L090476
13995G222865L228227L045807K530146J754194Q79335J02707m29503o93843p90590
$$ y = [9980214, 8617038, 7586498, 6847763, 6379678, 6173167, 6210005, 6431258, 6710950, 6867208, 6735300, 6270526, 5594172, 4928980, 4472252, 4308667, 4417842, 4746141, 5268108, 5992021, 6932244, 8095301, 9484904, 11099249, 12917123, 14895772, 16982659, 19110661, 21162805, 22943228, 24204681, 24731963, 24423789, 23321259, 21583469, 19445397, 17184938, 15098909, 13468275, 12494647, 12229183, 12552087, 13226168, 13978298, 14555496, 14752360, 14430234, 13529349, 12064083, 10104523, 7761286, 5190849, 2618069, 341417, -1313085, -2079701, -1832853, -607548, 1447256, 4132389, 7222865, 10451092, 13496899, 16027045, 17781239, 18660574, 18763281, 18333778, 17639935, 16849345]
13986A6849345q61948r90404j162793j314377j386225j346792j195910r69945
13978G620951p26890n08269l16661j28134Q5373L42849O44043R64950J271156
13969I249368J539272J764856J960179K159672K420957K789545L239707L654056
13961B8777612L872212L767329L297779K517309J548801N36148m01373j192628
13953D2723189j812309k262108k552236k696847k719678k658773k566073k498535
13945B2956630k500097k583557k726491k885763l015086l068610k994697k737340
13937D44989k254831j543619o44919L62109J364525K234013K873690L257276L419209
13928I512442L404326L227719K888265K418054J904195J459691J177003J085785
$$ y = [16849345, 15987397, 14996993, 13834200, 12519823, 11133598, 9786806, 8590896, 7620951, 6894061, 6385792, 6069131, 5940997, 6026370, 6369219, 7013262, 7978212, 9249368, 10788640, 12553496, 14513675, 16673347, 19094304, 21883849, 25123556, 28777612, 32649824, 36417153, 39714932, 42232241, 43781042, 44317190, 43915817, 42723189, 40910880, 38648772, 36096536, 33399689, 30680011, 28021238, 25455165, 22956630, 20456533, 17872976, 15146485, 12260722, 9245636, 6177026, 3182329, 444989, -1809842, -3353461, -3998380, -3636271, -2271746, -37733, 2835957, 6093233, 9512442, 12916768, 16144487, 19032752, 21450806, 23355001, 24814692, 25991695, 27077480]
13920B7077480J121394J138846R91406O20121Q3323m83268r41076j222099j364543
13911B7021584j483282j690816k022746k417543k758588k937107k892351k623732
13903H195419k182183j642697j074566n23085k264M90433R39347J296571J508207
13894G005182J547794J431714J220778J003899Q58882Q08587Q00284P33940N32759
13885A5943819J97034j99190n43893p30909p12374n30086k86493p8532L8133L3827
13875A3131336j12698l96957p63072j111327j340388j396020j299166j132833
13867E578875r84391q87616q28020p99369q19667q72513q63776o79042k91757
13858a447276J96088O18361Q47809Q52221O75704L90729P9597j57883k18864m4811
$$ y = [27077480, 28198874, 29337720, 30329126, 30949247, 31032570, 30549302, 29608226, 28386127, 27021584, 25538302, 23847486, 21824740, 19407197, 16648609, 13711502, 10819151, 8195419, 6013236, 4370539, 3295973, 2772888, 2770624, 3261057, 4200404, 5496975, 7005182, 8552976, 9984690, 11205468, 12209367, 13068249, 13876836, 14677120, 15411060, 15943819, 16140853, 15941663, 15397770, 14666861, 13954487, 13424401, 13137908, 13059376, 13097509, 13131336, 13018638, 12621681, 11858609, 10747282, 9406894, 8010874, 6711708, 5578875, 4594484, 3706868, 2878848, 2079479, 1259812, 387299, -476477, -1155519, -1447276, -1251188, -632827, 214982, 1067203, 1742907, 2133636, 2213233, 2055350, 1836486, 1791675]
13848A791675L40306Q32743J288287J580971J654854J531072J265229R01251M61126
13839A1647514l3724n38694r86236j313421j493169j538268j475332j322747j096743
13830A849180q31705n89365m37653m05472m56816n12487m96189l68018j31248
13821b379773J79237N10966Q04899J009661J101835J101540J063871J043935J062721
13812E498892J105673J150187J179579J167894J074853Q69961N59303J98829j10687
13803A2694484k60513j94035N2643L68555O36380P95066Q44806Q04936O80789
13794A6423111M70271J92316r4161l01046l51105k19190N8178M07741P55258J048929
13784A8390302J264528J399349J458517J440008J340109J181583J023482R26767
$$ y = [1791675, 2131981, 2964724, 4253011, 5833982, 7488836, 9019908, 10285137, 11186388, 11647514, 11613790, 11075096, 10088860, 8775439, 7282270, 5744002, 4268670, 2945923, 1849180, 1017475, 428110, -9543, -415015, -871831, -1384318, -1880507, -2248525, -2379773, -2200536, -1689570, -884671, 124990, 1226825, 2328365, 3392236, 4436171, 5498892, 6604565, 7754752, 8934331, 10102225, 11177078, 12047039, 12606342, 12805171, 12694484, 12433971, 12239936, 12292579, 12661134, 13297514, 14092580, 14937386, 15742322, 16423111, 16893382, 17085698, 16991537, 16690491, 16339386, 16120196, 16178374, 16586115, 17341373, 18390302, 19654830, 21054179, 22512696, 23952704, 25292813, 26474396, 27497878, 28424645]
13776B8424645R13305R64133J045274J125608J187706J241557J315769J406442
13768C7624439J430231J260279Q39751K54599l24734p70397j058165j223557j296891
13759C6735555j299352j280854j322159j481521j750005k069885k387923k673184
13751B2470672k882728k936341k755763k342960j815323j347577j060423r51562
13743F377995r25353q85357q01963p01905o07588m99976l48979j71849l7934p162
13733A389929p3625j65948j87895o3946K28251O51618J134176J604829K010647
13724F528036K301884K407545K249203J797535J111492L18140m41234j055076
13716A5217525j458472j629623j576604j321244q94323l51617K11977O83540R84285
$$ y = [28424645, 29337950, 30302083, 31347357, 32472965, 33660671, 34902228, 36217997, 37624439, 39054670, 40314949, 41154700, 41409299, 41084565, 40314168, 39256003, 38032446, 36735555, 35436203, 34155349, 32833190, 31351669, 29601664, 27531779, 25143856, 22470672, 19587944, 16651603, 13895840, 11552880, 9737557, 8389980, 7329557, 6377995, 5452642, 4567285, 3765322, 3063417, 2455829, 1955853, 1606874, 1435025, 1397091, 1389929, 1316304, 1150356, 962461, 898515, 1126766, 1778384, 2912560, 4517389, 6528036, 8829920, 11237465, 13486668, 15284203, 16395695, 16713835, 16272601, 15217525, 13759053, 12129430, 10552826, 9231582, 8337259, 7985642, 8197619, 8881159, 9865444]
13707I865444J108573J116076J086912J071110J062979J016313Q82041O30779
13699A7840227K49589k58442q52465j438944j896436k122371k067542j755909
13691G697707j292999q42110n59875n28268p26507j048573j350517j511110j477698
13682a639950j272419r66506o39165l35312n5072K12478M59174O66447Q19984
13673b750341R03914Q96332P83792N82826L50610J72454J18465J86113K80110
13664A524275K66593O9506k67235n99698p68168o81255l41740J83778Q00084J398600
13654A584740J873037K144035K176291J979536J597519J094965N49343L5053m10477
13645A2624042q03592j174051j499876j689575j634550j284478o80366P5605Q75139
$$ y = [9865444, 10974017, 12090093, 13177005, 14248115, 15311094, 16327407, 17209448, 17840227, 18089816, 17831374, 16978909, 15539965, 13643529, 11521158, 9453616, 7697707, 6404708, 5562598, 5002723, 4474455, 3747948, 2699375, 1348858, -162252, -1639950, -2912369, -3878875, -4518040, -4853352, -4908424, -4695946, -4236772, -3570325, -2750341, -1846427, -950095, -166303, 416523, 767133, 939587, 1058052, 1244165, 1524275, 1790868, 1860374, 1593139, 993441, 225273, -455982, -797722, -613944, 186140, 1584740, 3457777, 5601812, 7778103, 9757639, 11355158, 12450123, 12999466, 13034519, 12624042, 11820450, 10646399, 9146523, 7456948, 5822398, 4537920, 3857554, 3933159, 4808298]
13636D808298J626275K230736K573398K567924K213594J596169Q36849M6334o88051
13627A7811526j305615j776671k089052k232205k210754k068570j886798j752792
13619B489069j716930j763119j816667j784916j603436j264694q15799l27667
13611h604159J34718N16656P70898Q72416Q33485O91416M84621K48887K6105j44142
13601d169099k46142k89281k79464j93428R839L47436P80402J223402J593419
13592a222916J861538K065974K270741K501647K718013K836601K765175K422276
13584A8219049J768681Q51291j91725j187218j995049k533727k768829k699854
13576I462619k358909j811466j148747m70161J37333O13539R29360J086475J114759
$$ y = [4808298, 6434573, 8665309, 11238707, 13806631, 16020225, 17616394, 18453243, 18499577, 17811526, 16505911, 14729240, 12640188, 10407983, 8197229, 6128659, 4241861, 2489069, 772139, -990980, -2807647, -4592563, -6195999, -7460693, -8276492, -8604159, -8469441, -7952785, -7181887, -6309471, -5475986, -4784570, -4299949, -4051062, -4024957, -4169099, -4415241, -4704522, -4983986, -5177414, -5167575, -4820139, -4039737, -2816335, -1222916, 638622, 2704596, 4975337, 7476984, 10194997, 13031598, 15796773, 18219049, 19987730, 20839021, 20647296, 19460078, 17465029, 14931302, 12162473, 9462619, 7103710, 5292244, 4143497, 3673336, 3810669, 4424208, 5353568, 6440043, 7554802]
13567G554802J061215R74713R01181Q85065R57671J116758J328162J553247J763950
13558A8096764J925556J973515J816001J369115O12593l63457j367773k191712
13550B1870602k710285k921023k908963k782422k619082k438964k210501j890897
13542A388465j476180j015553n82268k39619k5573N2552J9882p0910j54172j73443
13532b276819j01582M4942K03583K97924L00651K67767K96879M40608O48889P84280
13522I07122O99903L32710k47875q71680j351861j556716j444135j073589n86977
13513e193098j41779J64838L20427L62352L29395K51192J78287J99973M06185
13504c122228Q16981J349802J857951K198872K280510K080451J650068J097928
$$ y = [7554802, 8616017, 9590730, 10491911, 11376976, 12334647, 13451405, 14779567, 16332814, 18096764, 20022320, 21995835, 23811836, 25180951, 25793544, 25430087, 24062314, 21870602, 19160317, 16239294, 13330331, 10547909, 7928827, 5489863, 3279362, 1388465, -87715, -1103268, -1685536, -1925155, -1950728, -1898176, -1878294, -1949204, -2103376, -2276819, -2378401, -2333459, -2129876, -1831952, -1531301, -1263534, -966655, -526047, 122842, 907122, 1607025, 1939735, 1691860, 820180, -531681, -2088397, -3532532, -4606121, -5193098, -5334877, -5170039, -4849612, -4487260, -4157865, -3906673, -3728386, -3528413, -3122228, -2305247, -955445, 902506, 3101378, 5381888, 7462339, 9112407, 10210335]
13496A0210335N50115J08872j75645l18684l86260m49872n42616o48064p19903
13487G628278p09313n87582l68951j26598L1220L4939q0592j95638k06063j05520
13477E314180K9245J14605J07782O19j95614m45892o87206q50568r00755q52801
13467A633595p43360n88573l75402r1046K51319O20981R87472J311497J526503
13458D532986J554703J356899R69222M88143O461m49226r13202j402961j849495
13449D293530k119674k122070j891557j567233j289772j111067r80888q04252
13441g592983n10707q5998M33709R80013J469221J819355J971306J912280J691019
13432B087215J407492J170833J048532J038281J074182J060994R22550O43944
$$ y = [10210335, 10760450, 10869322, 10693677, 10374993, 9988733, 9538861, 8996245, 8348181, 7628278, 6918965, 6331383, 5962432, 5835834, 5867054, 5901993, 5821401, 5625763, 5419700, 5314180, 5343425, 5458030, 5565812, 5566431, 5370817, 4924925, 4237719, 3387151, 2486396, 1633595, 890235, 301662, -73740, -164786, 86533, 707514, 1694986, 3006483, 4532986, 6087689, 7444588, 8413810, 8901953, 8908414, 8459188, 7545986, 6143025, 4293530, 2173856, 51786, -1839771, -3407004, -4696776, -5807843, -6788731, -7592983, -8103690, -8189688, -7755979, -6775966, -5306745, -3487390, -1516084, 396196, 2087215, 3494707, 4665540, 5714072, 6752353, 7826535, 8887529, 9810079, 10454023]
13424A0454023K83866n2719k65642l12379k40366j64451j88898l40023n63003
13415H610408p63261q56180q07524o40781m03275j25319J90622N51001R40900
13406F696591J300408J535913J576943J426318J149675Q27936N21633K55118J5779
13397A5306314k22131m54804o31914p00665o69848o16149o17713o79979p28152
13388I984959o69275m56795j09301L02305O75450R12454R69344Q74740O96946
13379A3180827M93562K93014J12063l6838j66864l18794n12201o96231p68406
13370A1580132o53441l66327n548L09188M99947N54364N15449M55900M40136M89796
13360A3819596N82055O76800P42047P64852P53565P33622P32977P59527P83975
$$ y = [10454023, 10737889, 10685170, 10419528, 10107149, 9866783, 9702332, 9513434, 9173411, 8610408, 7847147, 6990967, 6183443, 5542662, 5139387, 5014068, 5204690, 5755691, 6696591, 7996999, 9532912, 11109855, 12536173, 13685848, 14513784, 15035417, 15290535, 15306314, 15084183, 14629379, 13997465, 13296800, 12626952, 12010803, 11393090, 10713111, 9984959, 9315684, 8858889, 8749588, 9051893, 9727343, 10639797, 11609141, 12483881, 13180827, 13674389, 13967403, 14079466, 14042628, 13875764, 13556970, 13044769, 12348538, 11580132, 10926691, 10560364, 10554816, 10864004, 11363951, 11918315, 12433764, 12889664, 13329800, 13819596, 14401651, 15078451, 15820498, 16585350, 17338915, 18072537, 18805514, 19565041, 20349016]
13351B0349016P45784N84383K73064j63347o46285j060773j299176j310090j113845
13342A6358731p75905l69087M2169L98964O51534P67104P27357N29326K05171
13333A8535364j58664m37760n23459l74964l7029L78219P30129Q89062P70409
13324A9771307L68797k27763q77511j459531j920254k266738k529588k719965
13316H138754k807089k737024k477063k048584j522485r83550n04859j48423M4412
13307e045911Q2964L3289k0469k4876L0050J49283L85474Q34838J553373K468337
13297D46352L379626M056311M347510M226084L754692L035077K190811J363634
13289B6800097O86723K48206P8268J53063L91937O60507Q08115P30159M05995
$$ y = [20349016, 21094800, 21679183, 21952247, 21788900, 21142615, 20081842, 18782666, 17472576, 16358731, 15582826, 15213739, 15255908, 15654872, 16306406, 17073510, 17800867, 18330193, 18535364, 18376700, 17938940, 17415481, 17040517, 17003488, 17381707, 18111836, 19000898, 19771307, 20140104, 19912341, 19034830, 17575299, 15655045, 13388307, 10858719, 8138754, 5331665, 2594641, 117578, -1931006, -3453491, -4437041, -4941900, -5090323, -5045911, -4962947, -4929658, -4950127, -4975003, -4944953, -4795670, -4410196, -3575358, -2021985, 446352, 3825978, 7882289, 12229799, 16455883, 20210575, 23245652, 25436463, 26800097, 27486820, 27735026, 27813294, 27966357, 28358294, 29018801, 29826916, 30557075, 30963070]
13280C0963070j16756p58333j423315k009589k433005k655688k692477k588716
13272A6285191k388251k116537j784520j403434r99613o19571l13958j07206R814
13263F561915N1335J5887r4941k47989l80358m32211l81904k51977q6043P0172
13253D823886J67513J54822L185k60656n39836o95470o15300k74846K53905Q35027
13243C852230J315794J580438J593898J409322J134321Q81856P32930P10429P62229
13234A3973447P78690O56286L69924l836l33829n12722n04288l29499k0868L96690
13224A4469995Q85376J381390J815803K141082K337357K400910K326770K102889
13216B9861572J724963J217095O39819P7479l96940p63471j064885j361282j665913
$$ y = [30963070, 30846314, 30087981, 28664666, 26655077, 24222072, 21566384, 18873907, 16285191, 13896940, 11780403, 9995883, 8592449, 7592836, 6973265, 6659307, 6552101, 6561915, 6613250, 6629137, 6534196, 6286207, 5905849, 5473638, 5091734, 4839757, 4753714, 4823886, 4991399, 5146221, 5149406, 4888750, 4348914, 3653444, 3038144, 2763298, 3017203, 3852230, 5168024, 6748462, 8342360, 9751682, 10886003, 11767859, 12500789, 13211218, 13973447, 14752137, 15408423, 15778347, 15774511, 15440682, 14927960, 14423672, 14094173, 14073305, 14469995, 15355371, 16736761, 18552564, 20693646, 23031003, 25431913, 27758683, 29861572, 31586535, 32803630, 33443449, 33520928, 33123988, 32360517, 31295632, 29934350, 28268437]
13207B8268437j928756k079545k079648j941542j711945j436945j140256q28936
13199A5120864n11516k11856L2355J96842L07648M40559O66660R92941J353665
13190A8388162J654193J824724J841373J709439J444388J078337O72261L01522
13182B8914399K3641j41143k04179j82880p6239J33626M57422Q73437J310935
13173C1109019J657125J803636J704673J394043R54171M80623P3377j69249j92901
13164C8814517l9240J61166K60061J63859j33850n55212r67968j237495j278319
13155C5187519j081162p16269l13942j1597J17229R8301K0163m2946q2520j51228
13145C3023548l24569o60634j165739j775407k376125k861156l171435l294228
$$ y = [28268437, 26339681, 24260136, 22180488, 20238946, 18527001, 17090056, 15949800, 15120864, 14609348, 14397492, 14429847, 14626689, 14934337, 15374896, 16041556, 17034497, 18388162, 20042355, 21867079, 23708452, 25417891, 26862279, 27940616, 28612877, 28914399, 28938040, 28796897, 28592718, 28409838, 28333599, 28467225, 28924647, 29798084, 31109019, 32766144, 34569780, 36274453, 37668496, 38622667, 39103290, 39176667, 39007418, 38814517, 38775277, 38936443, 39196504, 39360363, 39226513, 38671301, 37703333, 36465838, 35187519, 34106357, 33390088, 33076146, 33064549, 33181778, 33280079, 33300242, 33257296, 33174776, 33023548, 32698979, 32038345, 30872606, 29097199, 26721074, 23859918, 20688483, 17394255]
13137A7394255l238767l014355k624079k080453j425745p30897p6072M71046Q73546
13128E548479J130491J261579J286185J220033J090343R41293Q08807O90284N48439
13119A4525933L49614J07454j08329k25231k42248k39031l03407m54609o31956
13110A2778190p38390o82592l99807J21901Q08704J506055K038622K282579K206751
13101A9922013J873823J410092R54058N96893L45578J46019m6784k17692k98392
13092B4685608k10112R4564O07469J260122J936562K504275K853302K919718K687081
13083C9338589K179782J456884O10962k31509r27760j360007j473839j287683
13075C8305419q76781l44955K15936P65405J307079J821677K215701K365681K221555
$$ y = [17394255, 14155488, 11141133, 8517054, 6436601, 5010856, 4279959, 4203887, 4674933, 5548479, 6678970, 7940549, 9226734, 10446767, 11537110, 12478403, 13287210, 13977494, 14525933, 14875547, 14983001, 14874672, 14649441, 14407193, 14168162, 13864755, 13410146, 12778190, 12039800, 11357208, 10957401, 11079302, 11888006, 13394061, 15432683, 17715262, 19922013, 21795836, 23205928, 24159986, 24756879, 25102457, 25248476, 25201692, 24984000, 24685608, 24475496, 24570060, 25177529, 26437651, 28374213, 30878488, 33731790, 36651508, 39338589, 41518371, 42975255, 43586217, 43354708, 42426948, 41066941, 39593102, 38305419, 37428638, 37083683, 37299619, 38065024, 39372103, 41193780, 43409481, 45775162, 47996717]
13066D7996717J856953J422465J052894P89145N47840J62719n07224j471134k583444
13057D9266931l615539m362033m717057m687557m353227l822222l215067k646516
13049A7847713k175422j773447j372070r41452n09278j15475K24991N13689P43060
13040A2442309Q88610R21601Q26342O13679L32017O2450j19716j93445j96793
13031A5577054j72282j03575Q5115M60604J020551J700429K416660L088259L627160
13022B7699975L930536L902254L490009K711800J671401N59015l94307j014617
13014D2556066j276408j308967j302125j383366j559575j749562j854590j809358
13006C0312115j603046j280121r19378n92524l24190p9176K20849O54511J232743
$$ y = [47996717, 49853670, 51276135, 52329029, 53118174, 53666014, 53828733, 53321509, 51850375, 49266931, 45651392, 41289359, 36572302, 31884745, 27531518, 23709296, 20494229, 17847713, 15672291, 13898844, 12526774, 11585322, 11076044, 10960569, 11185560, 11699249, 12442309, 13330919, 14252520, 15078862, 15692541, 16024558, 16087008, 15967292, 15773847, 15577054, 15404772, 15301197, 15386312, 15846916, 16867467, 18567896, 20984556, 24072815, 27699975, 31630511, 35532765, 39022774, 41734574, 43405975, 43964990, 43570683, 42556066, 41279658, 39970691, 38668566, 37285200, 35725625, 33976063, 32121473, 30312115, 28709069, 27428948, 26509570, 25917046, 25592856, 25513680, 25734529, 26389040, 27621783]
12997B7621783J850222K316883K447757K132390J356028J99770j164292k499428
12989C4261113l570190m227301m453838m334475l979909l474421k873430k224481
12981E123068j579971r97674n35392k29307n5715Q6332L37074P98059J462548
12972D409022K191334K754288K938671K665277K021570J194467L67794l54415
12964A8188008r67866j521023k040026k496994k847022l083731l236718l296725
12956a302097l163112k705082j888306q38320K12540J036123J494952J572545
12948e580757J354623R75499N57417J81514j03381k65177k88118j86013r813J71481
12938c192725L01791L50328L11948K11423R5576J006p6433j73922l18603m97510
$$ y = [27621783, 29472005, 31788888, 34236645, 36369035, 37725063, 37924833, 36760541, 34261113, 30690923, 26463622, 22009784, 17675309, 13695400, 10220979, 7347549, 5123068, 3543097, 2545423, 2010031, 1780724, 1725009, 1811341, 2148415, 2946474, 4409022, 6600356, 9354644, 12293315, 14958592, 16980162, 18174629, 18542423, 18188008, 17220142, 15699119, 13659093, 11162099, 8315077, 5231346, 1994628, -1302097, -4465209, -7170291, -9058597, -9896917, -9684377, -8648254, -7153302, -5580757, -4226134, -3250635, -2693218, -2511704, -2615085, -2880262, -3168380, -3354393, -3364206, -3192725, -2890934, -2540606, -2228658, -2017235, -1921659, -1920653, -1997086, -2171008, -2489611, -2987121]
12928b987121o73723q25131r64558j126492j329213j533550j636640j530297j187945
12919a3794670o96154j99827J78261L76618L89769K46841o359l14162o18889q86201
12909a5324773j126531j372213j623482j824165j895815j796136j543155j185173
12901b7691443p60173k94896J67714N65471Q51617J023559J115797J171571J209001
12892b2641782J193001J042187O85258J28791n20858j101760j471529j559994
12884b4246686j378238r92897m80297J09818P48048J388263J947135K326739K466626
12875a8111489K387520K189742J999197J896807J884565J902811J864887J688361
12867b297599J329950Q12939K27392k96673o35623p22608n74464k80859L1246
$$ y = [-2987121, -3660844, -4485975, -5450533, -6577025, -7906238, -9439788, -11076428, -12606725, -13794670, -14490824, -14690651, -14512390, -14135772, -13746003, -13499162, -13505521, -13819683, -14438572, -15324773, -16451304, -17823517, -19446999, -21271164, -23166979, -24963115, -26506270, -27691443, -28451616, -28746512, -28578798, -28013327, -27161710, -26138151, -25022354, -23850783, -22641782, -21448781, -20406594, -19721336, -19592545, -20113403, -21215163, -22686692, -24246686, -25624924, -26617821, -27098118, -26988300, -26240252, -24851989, -22904854, -20578115, -18111489, -15723969, -13534227, -11535030, -9638223, -7753658, -5850847, -3985960, -2297599, -967649, -154710, 72682, -223991, -859614, -1582222, -2156686, -2437545, -2406299]
12858b406299K36944K46030K6009l88495r00794j370578j654494j667085j420580
12849i299342j006958n47991j56279R3384J91122J91548J69320J69161J96579
12840i999456K43995L14021M14432N31634O21249O45688O22563O15385O73911
12831e316578Q08526J022225J325173J696607K053928K273959K241677J892569
12823G998086J240912L90495m84634j198169j624994j738676j592149j275821
12815A715050q85822n01750j69471J06688L61728O55588J041959J527345K043743
12806E895058K463007K653864K544151K148612J552861Q70620K03371l73372q02561
12797A7155611j039195j055186q54213m87362n0170L50338O39951P97950Q41364
$$ y = [-2406299, -2169355, -1923325, -1897316, -2285811, -3186605, -4557183, -6211677, -7878762, -9299342, -10306300, -10854291, -11010570, -10917186, -10726064, -10534516, -10365196, -10196035, -9999456, -9755461, -9441440, -9027008, -8495374, -7874125, -7228437, -6605874, -5990489, -5316578, -4508052, -3485827, -2160654, -464047, 1589881, 3863840, 6105517, 7998086, 9238998, 9629493, 9144859, 7946690, 6321696, 4583020, 2990871, 1715050, 829228, 327478, 158007, 264695, 626423, 1282011, 2323970, 3851315, 5895058, 8358065, 11011929, 13556080, 15704692, 17257553, 18128173, 18331544, 17958172, 17155611, 16116416, 15061230, 14207017, 13719655, 13669485, 14019823, 14659774, 15457724, 16299088]
12788A6299088P93318O62236M34620P5710m45639j104869j794818k373247k744774
12779I801625k890738k834464k605081k234946j768463j258635p56262l10167
12771d857131J7961J52954M7257k61626o36613q98656r24582p10944l51008M1906
12761h380482L85102O27824P43150P37470O57427N68343N16926N16405N66883
12752c060952O75184Q38500J013850J120512J076303Q31332L83473k12999q45492
12743A819711j367963j657449j668293j441605j068769o46418k47685R6469M05437
12734e776565P31585J116006J540436J913990K120430K097376J877892J562061
12726G183211J249939R90586P83573O15657M78577L51429J89683m7597l58597
$$ y = [16299088, 17092406, 17754642, 18189262, 18264972, 17819333, 16714464, 14919646, 12546399, 9801625, 6910887, 4076423, 1471342, -763604, -2532067, -3790702, -4546964, -4857131, -4839170, -4686216, -4638959, -4900585, -5537198, -6435854, -7360436, -8071380, -8422388, -8380482, -7995380, -7367556, -6624406, -5886936, -5229509, -4661166, -4144240, -3627835, -3060952, -2385768, -1547268, -533418, 587094, 1663397, 2494729, 2878202, 2665203, 1819711, 451748, -1205701, -2873994, -4315599, -5384368, -6030786, -6278471, -6182002, -5776565, -5044980, -3928974, -2388538, -474548, 1645882, 3743258, 5621150, 7183211, 8433150, 9423736, 10207309, 10822966, 11301543, 11652972, 11842655, 11795058, 11436461]
12717A1436461o88585r56545j098778j103220j014896r03828q08165o97964m98206
12708C666274j52366L26350Q49242J290088J538155J530863J257446P52054R0831
12699A1148937o12880j232711j674940j919252k019145k051810k054239k004991
12691b421031j869932j655891j406419j155138r02585o34716l49148o4094J89246
12682a0269708L86402N30774O50066P67489Q91090J035982J233179J498620J800704
12673a475402K066195K217047K208278K038580J720547J246075N99463j96757
12665A0424026j064331j894099k582020l052409l265255l219108k954932k549598
12657a0157726k090600j643411j240048q99169o44404m88993m07707l42818k46171
$$ y = [11436461, 10747876, 9791331, 8692553, 7589333, 6574437, 5670609, 4862444, 4164480, 3666274, 3513908, 3840258, 4689500, 5979588, 7517743, 9048606, 10306052, 11058106, 11148937, 10536057, 9303346, 7628406, 5709154, 3690009, 1638199, -416040, -2421031, -4290963, -5946854, -7353273, -8508411, -9410996, -10045712, -10394860, -10458954, -10269708, -9883306, -9352532, -8702466, -7934977, -7043887, -6007905, -4774726, -3276106, -1475402, 590793, 2807840, 5016118, 7054698, 8775245, 10021320, 10620783, 10424026, 9359695, 7465596, 4883576, 1831167, -1434088, -4653196, -7608128, -10157726, -12248326, -13891737, -15131785, -16030954, -16675358, -17164351, -17572058, -17914876, -18161047]
12648a8161047j10320L7899J59784K21643K12223J61129J34582J99730L92573
12639a6751804P18040J154207J630786K019577K190274K105955J869638J670744
12631c392583J667265J888384K223602K495109K553272K338591J890433J313147
12623A2977220P24864K12565j89444m88994p05134q44915r06233r00749q72984
$$ y = [-18161047, -18271367, -18233468, -18073684, -17852041, -17639818, -17478689, -17344107, -17144377, -16751804, -16033764, -14879557, -13248771, -11229194, -9038920, -6932965, -5063327, -3392583, -1725318, 163066, 2386668, 4881777, 7435049, 9773640, 11664073, 12977220, 13702084, 13914649, 13725205, 13236211, 12531077, 11686162, 10779929, 9879180, 9006196]
$$ [...]
##END NTUPLES=NMR SPECTRUM
##END=
