##TITLE=31P ikalashn
DE-63_33-35_2
18.12.2024
##JCAMPDX= 6.0         $$ Bruker NMR JCAMP-DX V2.0
##DATA TYPE= NMR SPECTRUM
##DATA CLASS= NTUPLES
##ORIGIN= UXNMR, Bruker Analytische Messtechnik GmbH
##OWNER= root
$$ TOPSPIN		Version 1.3
$$ 2024-12-18 13:49:09.812 +0400  Irina@DPX200
$$ Compression mode = diff/dup
##.OBSERVE FREQUENCY= 81.01967998063
##.OBSERVE NUCLEUS= ^31P
##.ACQUISITION MODE= SIMULTANEOUS
##.ACQUISITION SCHEME= undefined
##.AVERAGES= 64
##.DIGITISER RES= 17
##SPECTROMETER/DATA SYSTEM= spect
##.PULSE SEQUENCE= zgpg
##.SOLVENT NAME= DMSO
##.SHIFT REFERENCE= INTERNAL, DMSO, 1, 298.5841
##AUDIT TRAIL= $$ (NUMBER, WHEN, WHO, WHERE, WHAT)
$$ ##TITLE= Audit trail, TOPSPIN		Version 1.3
$$ ##JCAMPDX= 5.01
$$ ##ORIGIN= Bruker BioSpin GmbH
$$ ##OWNER= Irina
$$ $$ F:/spectra/data/iren/nmr/P31dec/1/pdata/1/auditp.txt
$$ ##AUDIT TRAIL=  $$ (NUMBER, WHEN, WHO, WHERE, VERSION, WHAT)
(   1,<2024-12-18 13:48:40.984 +0400>,<Irina>,<DPX200>,<TOPSPIN 1.3>,
      <created by zg
	started at 2024-12-18 13:46:57.578 +0400,
	POWCHK disabled, PULCHK disabled
       terminated by command 'halt'
       configuration hash MD5:
       BE 6D 3F 07 2A EA 11 49 91 17 2B D3 AF B3 58 0D
       data hash MD5: 32K
       F8 24 5C BB F9 03 BD B2 09 DD 13 E8 05 82 D9 CE>)
(   2,<2024-12-18 13:48:41.109 +0400>,<Irina>,<DPX200>,<TOPSPIN 1.3>,
      <Start of raw data processing
       efp BC_mod = 2 LB = 10 FT_mod = 6 PKNL = 1 PHC0 = 16.84241 PHC1 = -16.22269 SI = 32K 
       data hash MD5: 32K
       5D D1 0A A0 84 B5 E5 F3 36 E8 96 3C DA 39 5B 5E>)
(   3,<2024-12-18 13:48:43.453 +0400>,<Irina>,<DPX200>,<TOPSPIN 1.3>,
      <apk 
       data hash MD5: 32K
       13 9B 84 68 BF 7A 91 C9 A5 0A B6 8F FE 84 FA 66>)
(   4,<2024-12-18 13:48:46.531 +0400>,<Irina>,<DPX200>,<TOPSPIN 1.3>,
      <abs n ABSG = 5 
       data hash MD5: 32K
       7A 34 26 26 A8 B9 A2 03 46 47 04 27 6D 7C 7F 0C>)
$$ ##END=
$$ 
$$ $$ hash MD5
$$ $$ 81 7A DE 12 87 BB EA 5E C6 65 00 01 8D D6 9E 38
##$RELAX= 
##$RELAX= 
##$RELAX= 
##$RELAX= 
##$RELAX= 
##$RELAX= 
##$RELAX= 
##$RELAX= 
##$RELAX= 
##$RELAX= 
##$RELAX= 
$$ Bruker specific parameters
$$ --------------------------
##$DU= <F:/spectra>
##$EXPNO= 1
##$NAME= <P31dec>
##$PROCNO= 1
##$TYPE= <nmr>
##$USER= <iren>
##$AMP= (0..31)
100 100 100 100 100 100 100 100 100 100 100 100 100 100 100 100 100 100 
100 100 100 100 100 100 100 100 100 100 100 100 100 100 
##$ANAVPT= -1
##$AQSEQ= 0
##$AQ_mod= 1
##$AUNM= <au_zg>
##$AUTOPOS= <>
##$BF1= 81.014009
##$BF2= 200.13
##$BF3= 200.13
##$BF4= 200.13
##$BF5= 200.13
##$BF6= 200.13
##$BF7= 200.13
##$BF8= 200.13
##$BYTORDA= 1
##$CFDGTYP= 0
##$CFRGTYP= 5
##$CHEMSTR= <none>
##$CNST= (0..63)
1 1 145 1 1 1 1 1 1 1 1 1 1 1 1 1 1 1 1 1 1 1 1 1 1 1 1 1 1 1 1 1 1 1 
1 1 1 1 1 1 1 1 1 1 1 1 1 1 1 1 1 1 1 1 1 1 1 1 1 1 1 1 1 1 
##$CPDPRG= <waltz16>
##$CPDPRG1= <>
##$CPDPRG2= <waltz16>
##$CPDPRG3= <>
##$CPDPRG4= <mlev>
##$CPDPRG5= <mlev>
##$CPDPRG6= <mlev>
##$CPDPRG7= <mlev>
##$CPDPRG8= <mlev>
##$CPDPRGB= <>
##$CPDPRGT= <>
$$ [...]
##$SW_h= 37037.037037037
##$TD= 32768
##$TD0= 1
##$TE= 300
##$TE2= 300
##$TE3= 300
##$TEG= 300
##$TL= (0..7)
0 120 53 12 22 120 120 120 
##$TP= (0..7)
150 150 150 150 150 150 150 150 
##$TP07= 0
##$TPNAME0= <>
##$TPNAME1= <>
##$TPNAME2= <>
##$TPNAME3= <>
##$TPNAME4= <>
##$TPNAME5= <>
##$TPNAME6= <>
##$TPNAME7= <>
##$TPOAL= (0..7)
0.5 0.5 0.5 0.5 0.5 0.5 0.5 0.5 
##$TPOFFS= (0..7)
0 0 0 0 0 0 0 0 
##$TUNHIN= 0
##$TUNHOUT= 0
##$TUNXOUT= 0
##$USERA1= <user>
##$USERA2= <user>
##$USERA3= <user>
##$USERA4= <user>
##$USERA5= <user>
##$V9= 5
##$VALIST= <valist>
##$VCLIST= <CCCCCCCCCCCCCCC>
##$VD= 0
##$VDLIST= <DDDDDDDDDDDDDDD>
##$VPLIST= <PPPPPPPPPPPPPPP>
##$VTLIST= <TTTTTTTTTTTTTTT>
##$WBST= 1024
##$WBSW= 4
##$XGAIN= (0..3)
0 0 0 0 
##$XL= 0
##$YL= 0
##$YMAX_a= 4660
##$YMIN_a= -3689
##$ZGOPTNS= <>
##$ZL1= 120
##$ZL2= 120
##$ZL3= 120
##$ZL4= 120
##$ABSF1= 298.5841
##$ABSF2= -158.5842
##$ABSG= 5
##$ABSL= 5
##$ALPHA= 0
##$AQORDER= 0
##$ASSFAC= 0
##$ASSFACI= 0
##$ASSFACX= 0
##$ASSWID= 0
##$AUNMP= <proc_1d>
##$AXLEFT= 0
##$AXRIGHT= 0
##$AXTYPE= 0
##$AXUNIT= <>
##$AZFE= 0.1
##$AZFW= 0.5
##$BCFW= 0
##$BC_mod= 2
##$BYTORDP= 0
##$COROFFS= 0
##$CY= 12.5935478210449
##$DATMOD= 1
##$DC= 0
##$DFILT= <>
##$DTYPP= 0
##$F1P= 47.1127640792319
##$F2P= -24.0371245302204
##$FCOR= 0.5
##$FTSIZE= 32768
##$FT_mod= 6
##$GAMMA= 0
##$GB= 0
##$INTBC= 1
##$INTSCL= 7.269226e-011
##$ISEN= 30
##$LB= 10
##$LEV0= 0
##$LPBIN= 0
##$MAXI= 12.09355
##$MC2= 0
##$MEAN= 0
##$ME_mod= 0
##$MI= 0.7550151
##$NCOEF= 0
##$NC_proc= -10
##$NLEV= 6
##$NOISF1= 298.5841
##$NOISF2= 270.0111
##$NSP= 0
##$NTH_PI= 0
##$NZP= 0
##$OFFSET= 298.5841
##$PC= 1.4
##$PHC0= 28.98129
##$PHC1= -52.44113
##$PH_mod= 1
##$PKNL= yes
##$PPARMOD= 0
##$PPDIAG= 0
##$PPIPTYP= 0
##$PPMPNUM= 100
##$PPRESOL= 1
##$PSCAL= 0
##$PSIGN= 0
##$REVERSE= no
##$SF= 81.014009
##$SI= 32768
##$SIGF1= 270.0111
##$SIGF2= -158.5842
##$SINO= 77.54984
##$SIOLD= 32768
##$SREGLST= <31P.CDCl3>
##$SSB= 0
##$STSI= 32768
##$STSR= 0
##$SW_p= 37037.037037037
##$SYMM= 0
##$S_DEV= 0
##$TDeff= 32768
##$TDoff= 0
##$TI= <>
##$TILT= no
##$TM1= 0
##$TM2= 0
##$TOPLEV= 0
##$USERP1= <user>
##$USERP2= <user>
##$USERP3= <user>
##$USERP4= <user>
##$USERP5= <user>
##$WDW= 1
##$XDIM= 32768
##$YMAX_p= 346534112
##$YMIN_p= -3736101
$$ End of Bruker specific parameters
$$ ---------------------------------
##NTUPLES= NMR SPECTRUM
##VAR_NAME=  FREQUENCY,     SPECTRUM/REAL,   SPECTRUM/IMAG
##SYMBOL=    X,             R,               I
##VAR_TYPE=  INDEPENDENT,   DEPENDENT,       DEPENDENT
##VAR_FORM=  AFFN,          ASDF,            ASDF
##VAR_DIM=   32768,         32768,           32768
##UNITS=     HZ,            ARBITRARY UNITS, ARBITRARY UNITS
##FACTOR=    1.13031516577767, 1,            1
##FIRST=     37037.037037037, 1454739,       -1632194
##LAST=      0,             -29270,          1298822
##MIN=       0,             -3736101,        0
##MAX=       37037.037037037, 346534112,     0
$$ Real data points
##PAGE= N=1
##DATA TABLE= (X++(R..R)), XYDATA
$$ [...]
16390B179509L58325L45791K97830K30268J87146J84446J58611M5737j27373k98275
16380C562015m28674m82055m37147l32903k48075k28825k53465k69416k50007
16371F31448k08536j67702j39548j30773j45623j82795k27522k49678k27379j68410
16361a216518r4145j3582P7509J71611K31780K29277J80630J20202P1468M3771
16351a97997K9590K6298N3541J20816K00652K55552K74744K63375K17825J42774
16341A387170O2648p275o4310r3320p1604N769J12702K00940K29213J85460Q9098
16330B036491k2112j10821j47937j24482o8583j8245K5678Q6382J60394K12084
16320B028849K06513J32812K4628m6135l8134K4530R4981J35876J17313K3220
$$ plain form
16390 2179509 2537834 2883625 3181455 3411723 3598869 3783315 3941926 3987663 3860290 3562015
16380 3562015 3133341 2651286 2214139 1881236 1633161 1404336 1150871 881455 631448
16371 631448 422912 255210 115662 -15111 -160734 -343529 -571051 -820729 -1048108 -1216518
16361 -1216518 -1310663 -1324245 -1246736 -1075125 -843345 -614068 -433438 -313236 -241768 -197997
16351 -197997 -168407 -142109 -88568 32248 232900 488452 763196 1026571 1244396 1387170
16341 1387170 1449818 1442543 1378233 1284913 1213309 1219078 1331780 1532720 1761933 1947393 2036491
16330 2036491 2014379 1903558 1755621 1631139 1562556 1544311 1569989 1656371 1816765 2028849
16320 2028849 2235362 2368174 2392802 2346667 2308533 2333063 2428044 2563920 2681233 2704453
16310B704453j29968k91634m07612m42981l87132k57581r7635L9887J20654J41805
16300I92256J21104P7323K3172k8328o1456o7863n4101l3020r749J3985K4451
16289I97774M995l6097o5191n9159l4564l6445q7786j62561k22649k42976k08600
16278a53259j30845m9372o25j862n0297j22053j92538k57792l14359l31441k73073
16267a877516j35965M6566K23298L48278L95182L76869L42233L12858K56652J49349
16257D37804J1737j10561j78225j87431j68950j65864k01782k52224k67395k16973
16247a299864r5661P9308K46761L20951K70548J50164L3189m5046p5566o8895
16237d84111n9931p1260q1183o3891l0585L90K3722K4710q235o1032j01916r3247
$$ plain form
16310 2704453 2574485 2282851 1875239 1432258 1045126 787545 689910 729797 850451 992256
16300 992256 1113360 1190683 1213855 1185527 1124071 1056208 1002107 969087 959338 973323 997774
16289 997774 1002769 966672 901481 842322 807758 771313 683527 520966 298317 55341 -153259
16278 -153259 -284104 -333476 -334101 -335963 -386260 -508313 -700851 -958643 -1273002 -1604443 -1877516
16267 -1877516 -2013481 -1966915 -1743617 -1395339 -1000157 -623288 -281055 31803 288455 437804
16257 437804 449541 338980 160755 -26676 -195626 -361490 -563272 -815496 -1082891 -1299864
16247 -1299864 -1395525 -1316217 -1069456 -748505 -477957 -327793 -294604 -339650 -415216 -484111
16237 -484111 -544042 -615302 -696485 -760376 -790961 -790571 -766849 -742139 -750374 -811406 -913322 -1006569
16225a006569k0442Q1793J57397J72296J23717L3913o1852j33483j65763j57525
16215i76518j22473p4547j0207P6407J77418K79503L62299L91567L48053K54077
16205G05579J51591P0096Q514n8158j42065k15785k37486k04578j55499j11053
16195a88844n7130J4522Q9272J33540J13215L5570n9548j48089k21381k68753
16185e57626k91564k97474k68966j75471j4832J72882L23740L99964M18110M06908
16175A15671L70079L02586K09317J09330L5772K640k5492r2430j87145k61275
16165E79053k93513k96174k77496k29961j58938r0865l6211J7829P0964R6766
16155f18546O1348l7098j39342j71773j19360k5440O3452J32342J88997K37716
$$ plain form
16225 -1006569 -1027011 -945218 -787821 -615525 -491808 -457895 -519747 -653230 -818993 -976518
16215 -976518 -1098991 -1173538 -1183745 -1107338 -929920 -650417 -288118 103449 451502 705579
16205 705579 857170 927266 935780 877622 735557 519772 282286 77708 -77791 -188844
16195 -188844 -245974 -231452 -142180 -8640 104575 140145 80597 -67492 -288873 -557626
16185 -557626 -849190 -1146664 -1415630 -1591101 -1605933 -1433051 -1109311 -709347 -291237 115671
16175 115671 485750 788336 997653 1106983 1142755 1145395 1119903 1027473 840328 579053
16165 579053 285540 -10634 -288130 -518091 -677029 -767894 -804105 -786276 -715312 -618546
16155 -618546 -557198 -594296 -733638 -905411 -1024771 -1050211 -986759 -854417 -665420 -427704
16145d27704K64848K49458J86474J01415M2304L0572K8901j3735j05435k04756
16135A52342k58549k53928k27100k03722j49696k2418J53480L04079L74571L58915
16125B27974K86364J93788J04856K7131l5261q0267j15047j39021j34683r9233
16115B36601n2051n86N4924R0872P7613K0166m7656q7426p8229l7516N205M1605
16103B23522P0028Q4766J00339J36278J77503K01436K08009J89666J31251N0928
16093A573726j7758p1148j15347j34965j11354n2380N166J6951l2881j15679j81935
16082G62396j93984j47943p4157k6025m2249r8512j23958p9586l021L4531O280
16071A3772m8869q3507q4409o1102l8865m4007p7142j20433j56153j68215j46217
$$ plain form
16145 -427704 -162856 86602 273076 374491 416795 447367 476268 462533 357098 152342
16135 152342 -106207 -360135 -587235 -790957 -940653 -963071 -809591 -505512 -130941 227974
16125 227974 514338 708126 812982 840113 804852 724585 609538 470517 335834 236601
16115 236601 184550 183964 238888 329760 407373 427539 379883 292457 214228 176712 181917 223522
16103 223522 293550 378316 478655 614933 792436 993872 1201881 1391547 1522798 1573726
16093 1573726 1555968 1484820 1369473 1234508 1123154 1070774 1075940 1092891 1060010 944331 762396
16082 762396 568412 420469 346312 320287 278038 179526 55568 -24018 -27039 7492 13772
16071 13772 -35097 -118604 -203013 -264115 -302980 -346987 -424129 -544562 -700715 -868930 -1015147
16060a015147j01843p0155p0209p8637o0902J175J04717K13254K69125K45073
16050e63549J74125J09264O4626J7207l8369o6974m1802N876J9288j7570p1680
16039d09558j02939r7620n8953Q547Q8289J52514J78742J61883J18793P3228L3688
16028A46614q446o3813j33138k03323k62488l02955l06084k55533j59838m4909
16018a593913N9900J26047J36018Q7244j2811j32655k18292k34661j87998j03747
16008b074868q824P1306J19259J32466J19711R1759O5275O0655Q1265J10324J25279
15997a106393J17496R8528Q2607P3374P3308R0657J13318J03722M3121m6682j24416
15986d81360j61203j64866j55695j29228p3015K128P3851J39258K12674K92621
$$ plain form
16060 -1015147 -1116990 -1187145 -1257354 -1335991 -1396893 -1395718 -1291001 -1077747 -808622 -563549
16050 -563549 -389424 -280160 -215534 -198327 -236696 -303670 -345472 -339596 -320308 -337878 -409558
16039 -409558 -512497 -610117 -669070 -660523 -572234 -419720 -240978 -79095 39698 112926 146614
16028 146614 138168 74355 -58783 -262106 -524594 -827549 -1133633 -1389166 -1549004 -1593913
16018 -1593913 -1534013 -1407966 -1271948 -1184704 -1197515 -1330170 -1548462 -1783123 -1971121 -2074868
16008 -2074868 -2083692 -2012386 -1893127 -1760661 -1640950 -1549191 -1483916 -1423261 -1341996 -1231672 -1106393
15997 -1106393 -988897 -890369 -807762 -734388 -661080 -570423 -457105 -353383 -310262 -356944 -481360
15986 -481360 -642563 -807429 -963124 -1092352 -1165367 -1163239 -1089388 -950130 -737456 -444835
15976d44835L48457L45840K81059J89912J20523R4035Q4597M0118o1562j86663
15966H11481k88323l51990l91702m16653m10290l52315k56780j67040j09035p1939
15956b004586m1271k4391l2044n3485o4227m4185J1627P6721J05636Q2004L0365
15945a957836j8852m5576m0011j1501J6233K8333L6796P2481J45980K21968K51845
15934a300140K29197K02028K17183K72126L35873L74725L65529K96846J61452
15925A154819k2938k04808l26410l58824l17258k41531j63912r6392l9633J1468
15915f05419P3367J54047K19438K18035J46980N1130k7147o4743n8713j6314M8640
15904A39301J10977J63618K22105K70052K54847J54660L995j42275k45114k92118
$$ plain form
15976 -444835 -96378 249462 530521 720433 840956 934991 1019588 1059706 998144 811481
15966 811481 523158 171168 -220534 -637187 -1047477 -1399792 -1656572 -1823612 -1932647 -2004586
15956 -2004586 -2045857 -2070248 -2102292 -2155777 -2220004 -2264189 -2252562 -2175841 -2070205 -1988201 -1957836
15945 -1957836 -1976688 -2022264 -2062275 -2073776 -2057543 -2029210 -1992414 -1919933 -1773953 -1551985 -1300140
15934 -1300140 -1070943 -868915 -651732 -379606 -43733 330992 696521 993367 1154819
15925 1154819 1131881 927073 600663 241839 -75419 -316950 -480862 -577254 -616887 -605419
15915 -605419 -532052 -378005 -158567 59468 206448 257578 230431 165688 106975 90661 139301
15904 139301 250278 413896 636001 906053 1160900 1315560 1319555 1177280 932166 640048
15894F40048k97597k92091k93852k90845k61475k11746j71161j49668j20014n1674
15884a500075M5471J21281J30695P7876P889l5445l5143j861M1472P3437P6093
15873i98310M2794l372k7602k7564k2770n280M0806Q7760R0215L4643n7309j55053
15861a001042k43958l18166l62441l57633l03355k26236j47475n7400N1744J56520
15851b809442K31340K70144K72188K37852J81095J29842J07276J18758J49638
15842a111309J73729J72147J38046P2912M47m1276m3621l0335k1096r694K6577
15831f73473R2017J62991K04478J81190Q5199l2895r2159n7146L1357J10062J45259
15820A56880J22293L1519j09255k40921k98975k59603j48326j5646J01578J85509
$$ plain form
15894 640048 342451 50360 -243492 -534337 -795812 -1007558 -1178719 -1328387 -1448401 -1500075
15884 -1500075 -1454604 -1333323 -1202628 -1124752 -1116863 -1152308 -1187451 -1189312 -1147840 -1074403 -998310
15873 -998310 -955516 -958888 -986490 -1014054 -1036824 -1042104 -1001298 -913538 -823323 -788680 -845989 -1001042
15861 -1001042 -1245000 -1563166 -1925607 -2283240 -2586595 -2812831 -2960306 -3017706 -2965962 -2809442
15851 -2809442 -2578102 -2307958 -2035770 -1797918 -1616823 -1486981 -1379705 -1260947 -1111309
15842 -1111309 -937580 -765433 -627387 -554475 -554028 -595304 -638925 -669260 -690356 -700050 -673473
15831 -673473 -581456 -418465 -213987 -32797 52402 19507 -72652 -129798 -98441 11621 156880
15820 156880 279173 310692 201437 -39484 -338459 -598062 -746388 -762034 -660456 -474947
15810d74947K11047J57982M8958n8129j12504r5070k7303M8514J06064J40184
15800e5204J55914J60018J44232R5931L6441Q34j3630k8811m6915n9166m8718
15789C40926L809Q3848J44172J47984R6607K1568m8863j08495j61214k10142k59429
15778E0771l09117l39856l05528j63409O8731K89014L77090L05644J59436L6854
15768A69630l0450n7847o0065m7989l2788j5541L206J5753J5270k848m2043r3514
15756a79226j22977r6675k3725N4448R9675R1165L5903l9277j08100j46790j37428
15745e73007q0827L065Q3782J28742J18318O3964J409m5497p4550q4374p4743
15734e33718n0118j1299L6040O9897O7533L2411o359k9300m6050o7483p6722m5551
$$ plain form
15810 -474947 -263900 -105918 -56960 -115089 -227593 -322663 -349966 -301452 -195388 -55204
15800 -55204 100710 260728 404960 500891 537332 538166 524536 495725 448810 389644 340926
15789 340926 344735 428583 572755 720739 817346 838914 790051 681556 520342 310200 50771
15778 50771 -258346 -598202 -903730 -1067139 -998408 -709394 -332304 -26660 132776 169630
15768 169630 139180 81333 21268 -26721 -59509 -75050 -71844 -56091 -40821 -43669 -85712 -179226
15756 -179226 -302203 -398878 -422603 -368155 -268480 -177315 -141412 -180689 -288789 -435579 -573007
15745 -573007 -653834 -650769 -566987 -438245 -319927 -255963 -254554 -300051 -374601 -458975 -533718
15734 -533718 -583836 -595135 -559095 -489198 -421665 -389254 -395613 -424913 -470963 -538446 -615168 -660719
15722f60719J9253P4499Q6711N0424k2485j07230j72861j94888j69450j19284
15712a216030p0375k4261L1658R5900J48439J77188J99218K36679K70091K48625
15702I7132J55794L5242n1117q2647r0201j06964j29977j32828r9014m8524k4222
15691d77326n2300j19747j80667j99015j71962j14691m6273J6412O3492R5477
15681a186600J21242J51448J93363K43879K79052K67992K01350J00264L202o6375
15671C08817j30656k17694k93908l03575k52399j83389j17779n2014K1313R2694
15661a128590J57511K34833L18980L55203L01792J84938O1125m2167j09656j13381
15651B20588m7118N2290J31303J60991J51224J17923P3982N1549Q1766J45623
$$ plain form
15722 -660719 -641466 -566967 -480256 -429832 -452317 -559547 -732408 -927296 -1096746 -1216030
15712 -1216030 -1286405 -1310666 -1279008 -1183108 -1034669 -857481 -658263 -421584 -151493 97132
15702 97132 252926 288168 237051 154404 64203 -42761 -172738 -305566 -404580 -453104 -477326
15691 -477326 -529626 -649373 -830040 -1029055 -1201017 -1315708 -1361981 -1345569 -1282077 -1186600
15681 -1186600 -1065358 -913910 -720547 -476668 -197616 70376 271726 371990 375192 308817
15671 308817 178161 -39533 -333441 -637016 -889415 -1072804 -1190583 -1242597 -1221284 -1128590
15661 -1128590 -971079 -736246 -417266 -62063 239729 424667 485792 443625 333969 220588
15651 220588 173470 225760 357063 518054 669278 787201 861183 912732 994498 1140121
15641A140121J75608J18163j5465j70877l09154m15838m79551m93307m54815l58560
15631a263675k09179l8797J07923K04218K49164K52660K32825K22465K47065K90779
15621B95448L12292K93427K35611J33819o797j53515k53493k65828k03337j21336
15611B66291o1213l8990p3840j69826k82461l49486l48591l09947k69892k32690
15601a870645j91096j43518p5464K6978J46964K57825L41417L73397L38342K58994
15591e36806J82385J37452J15355Q7694M4874M224k1838m1037o9239j03609j16956
15580c17501q6019m1J32574K60977L14484K64715J37997j0758j25386j76720j68896
15569B25426j24213n8413K0136Q7058J10764Q0272N705q0775j25371r5335j6108
$$ plain form
15641 1140121 1315729 1433892 1418427 1247550 938396 522558 43007 -450300 -905115 -1263675
15631 -1263675 -1472854 -1511651 -1403728 -1199510 -950346 -697686 -464861 -242396 4669 295448
15621 295448 607740 901167 1136778 1270597 1263800 1110285 856792 590964 387627 266291
15611 266291 205078 166088 92248 -77578 -360039 -709525 -1058116 -1368063 -1637955 -1870645
15601 -1870645 -2061741 -2205259 -2280723 -2253745 -2106781 -1848956 -1507539 -1134142 -795800 -536806
15591 -536806 -354421 -216969 -101614 -13920 30954 35178 13340 -27697 -96936 -200545 -317501
15580 -317501 -403520 -403561 -270987 -10010 304474 569189 707186 696428 571042 394322 225426
15569 225426 101213 42800 62936 149994 260758 341030 346735 265960 140589 45254 29146
15558B9146N3426O8787J8535p7467j79802k55217k95978l06764k81851k13082
15548a440267j08253M668R2518J49766J93802K27479K33577J93492J01216k3152
15538c75154j27441j55061r2888Q112P5981P8224K8859m4265j15711j59552j61239
15527a040135j38530j16873q9735l4126N5331J59993K48036K90938K78828K24930
15517a61343J50022O3132k6918r5149j24963j28118j19390r7912o7201m5205m0667
15506f93712l8333k0617J1702M5366P0060Q2805P7907M8516j878o0971j15043
15495e94198j50563j53825j15045l3341P7026J86491K65984K91480K47264J52447
15485A73720N6937n435k9306j8962Q610L1605L9954K3998k4566q3102j02183o1802
$$ plain form
15558 29146 82572 151359 169894 92427 -87375 -342592 -638570 -945334 -1227185 -1440267
15548 -1440267 -1548520 -1543852 -1451334 -1301568 -1107766 -880287 -646710 -453218 -352002 -375154
15538 -375154 -502595 -657656 -750544 -742432 -666451 -588227 -559368 -603633 -719344 -878896 -1040135
15527 -1040135 -1178665 -1295538 -1385273 -1419399 -1364068 -1204075 -956039 -665101 -386273 -161343
15517 -161343 -11321 51811 24893 -70256 -195219 -323337 -442727 -540639 -607840 -653045 -693712
15506 -693712 -732045 -752662 -740960 -695594 -625534 -542729 -464822 -416306 -418184 -479155 -594198
15495 -594198 -744761 -898586 -1013631 -1046972 -969946 -783455 -517471 -225991 21273 173720
15485 173720 230657 225222 195916 176954 185564 217169 257123 281121 256555 173453 71270 9468
15473I468O690O2792Q1950M9873k9596j26199k02930k43808k51501k27177j66986
15462a037424q2126p237K8402K5188K229j9336k8117k3599k934L5914Q1735J08766
15450i18539R3025M1607m061j0705K4185R7442J99210K89871L21365K79657J80214
15439E93271N4177n0111r7678r9305r4909j13765j57317k06202k39815k49883
15429f61537k38612k24727k34164k62240k74293k43046j62563m5834P1831J47940
15419b127245J64351J37005R8547P5350P6173R6038J33660K00823K89613L58628
15409d97057L75804L40286K68859J86574J15896O2169J4384k8352m9699m0757
15399G48107j3895J1457L7650Q2495J39856J70712J52088J12227R2426R8830J04963
$$ plain form
15473 9468 16158 78950 160900 210773 181177 54978 -147952 -391760 -643261 -870438 -1037424
15462 -1037424 -1119550 -1126787 -1098385 -1073197 -1070968 -1090304 -1118421 -1142020 -1144954 -1109040 -1027305 -918539
15450 -918539 -825514 -783907 -787968 -798673 -774488 -677046 -477836 -187965 133400 413057 593271
15439 593271 647448 597337 499659 400354 305445 191680 34363 -171839 -411654 -661537
15429 -661537 -900149 -1124876 -1359040 -1621280 -1895573 -2138619 -2301182 -2347016 -2275185 -2127245
15419 -2127245 -1962894 -1825889 -1727342 -1651992 -1575819 -1479781 -1346121 -1145298 -855685 -497057
15409 -497057 -121253 219033 487892 674466 790362 852531 866915 838563 788864 748107
15399 748107 734212 745669 783319 865814 1005670 1176382 1328470 1440697 1533123 1631953 1736916
15388A736916Q6073M1378q613m1423n4586n7922n2879k8293K7502J12521K00675
15377A961349K43128K03447R4966l5204j49240k34932k89438l09258l03628k90706
15367H90484k76199k46795j89339j11595l3544K9037P2579J05525J26838J17273
15357D84264P2014K2510k732j6825l9144o0788o3438m6264l0909l3325n0043p3755
15345A61565r3870q8663m2257K8848Q6609J05163R2146Q5668J17811J78050K22402
15334H53472K13574J48804N7435k6298q2132j03421r8699q0036n4390l3652k9812
15323G64845l8103m6741n5105o4621p5065r3230j22466j56990j85901j90085j52066
15312d15528q3512k8953k3078n7713r7595j02764m8971M5007J31728J85434K04483
$$ plain form
15388 1736916 1822989 1864367 1855754 1814331 1759745 1701823 1648944 1620651 1648153 1760674 1961349
15377 1961349 2204477 2407924 2502890 2467686 2318446 2083514 1794076 1484818 1181190 890484
15367 890484 614285 367490 178151 66556 33012 62049 134628 240153 366991 484264
15357 484264 556278 578788 576056 559231 520087 459299 395861 349597 318688 285363 235320 161565
15345 161565 67695 -20968 -63225 -34377 52232 157395 249541 335209 453020 631070 853472
15334 853472 1067046 1215850 1273285 1246987 1164855 1061434 962735 882699 828309 794657 764845
15323 764845 726742 680001 624896 560275 485210 391980 269514 112524 -73377 -263462 -415528
15312 -415528 -499040 -527993 -551071 -608784 -706379 -809143 -858114 -813107 -681379 -495945 -291462
15301b91462J78786J05896K6523q200R259M5993N5256J837j10800k32598k96918
15290e16428k79335k07526j16197l0138K2701K4622m126k7661l3474k5973p878
15279a201413J4338L0299M3794N9368O3444N2870M9047O2474O7527K1505q6623
15268h23370k09919k85662k83934k11401r9702R144Q7018J27104J29448J04672
15258a456602Q0884Q4537J18716J63857J91549J85136J56544J30980J16938J08046
15248a19415J01531J00083J08035J18823J06778N5826j6757q3456j22756j24686
15238A24006j03682q4591p3260n3299j8297Q625J0435Q060L5695Q7592J02756
15227D4040L8289o5224j24908r9577j2666Q6208J52222J58012J06367K8261l9805
$$ plain form
15301 -291462 -112676 -6780 19743 11543 20802 66795 122051 123888 13088 -219510 -516428
15290 -516428 -795763 -1003289 -1119486 -1149624 -1126923 -1102301 -1106427 -1134088 -1167562 -1193535 -1201413
15279 -1201413 -1187075 -1156776 -1112982 -1053614 -990170 -937300 -888253 -825779 -758252 -736747 -823370
15268 -823370 -1033289 -1318951 -1602885 -1814286 -1913988 -1904844 -1817826 -1690722 -1561274 -1456602
15258 -1456602 -1375718 -1291181 -1172465 -1008608 -817059 -631923 -475379 -344399 -227461 -119415
15248 -119415 -17884 82199 190234 309057 415835 471661 454904 371448 248692 124006
15238 124006 20324 -64267 -137527 -190826 -209123 -200498 -190063 -182003 -146308 -58716 44040
15227 44040 82329 17105 -107803 -207380 -220046 -133838 18384 176396 282763 311024 271219
15216B71219o3948k6193N4069J31027J70687J72467J56546J39427J31706J38346
15206A275353J48437J39748R2741R036q6172j64493k02058j84584j31543r3000
15196H03465j03963j53777j97880j94619j42654q0380m4968m2912n9643p7156
15186b94487p5344m8474j9260m529L757Q617Q170K1494O4152J14302J35147J08692
15174B2237M2481l0588o9387n3247J3983J07721J86470K17267K00572J52448P3492
15163H63449m1402j78244l05569l86963l92154l12444j80273n8610R183K8798
15153i54229L6227P1003J62448L08397M49423N11166M79575L87350K60740J17500
15143A829600j7372j21151j92581k53908l23308l78780l80004l24241k35530j27890
$$ plain form
15216 271219 207271 181078 235147 366174 536861 709328 865874 1005301 1137007 1275353
15206 1275353 1423790 1563538 1656279 1665315 1579143 1414650 1212592 1028008 896465 803465
15196 803465 699502 545725 347845 153226 10572 -69808 -114776 -157688 -217331 -294487
15186 -294487 -369831 -418305 -437565 -442094 -438337 -429720 -421550 -400056 -335904 -221602 -86455 22237
15174 22237 64718 34130 -35257 -88504 -74521 33200 219670 436937 637509 789957 863449
15163 863449 822047 643803 338234 -48729 -440883 -753327 -933600 -992210 -983027 -954229
15153 -954229 -918002 -846999 -684551 -376154 73269 584435 1064010 1451360 1712100 1829600
15143 1829600 1812228 1691077 1498496 1244588 921280 542500 162496 -161745 -397275 -525165
15133e25165p170J13510K02888K23732J65215O0701l5043q6772q8099m5524K6167
15122D440J08510J80994K14263J86983J14258M1388Q747K3531O0476Q5159P0882
15111A099631J3602o1501j29711j91927k55229l13115l52671l57462l19990k51692
15101a120065j64859p6930k3827k9562q2769j53200j96755j65912n2456R8934
15091a967401K30134L05165L13456K59521J62149N7181j7956n1426m7169j560
15081g57906P7220J49805J70594J29629O4154J2246k2090n0623q1756j13340j31634
15070e53701j19642n9146N1313J72209K52075K74019K53156K20607J99578J81143
15060H71611J39273O9537m66m4727o7072q9817j25051j66041j97295k08412j99192
$$ plain form
15133 -525165 -532335 -418825 -215937 7795 173010 233711 198668 111896 23797 -21727 4440
15122 4440 112950 293944 508207 695190 809448 850836 859583 883114 943590 1028749 1099631
15111 1099631 1113233 1051732 922021 730094 474865 161750 -190921 -548383 -868373 -1120065
15101 -1120065 -1284924 -1361854 -1385681 -1415243 -1498012 -1651212 -1847967 -2013879 -2066335 -1967401
15091 -1967401 -1737267 -1432102 -1118646 -859125 -696976 -639795 -657751 -709177 -756346 -757906
15081 -757906 -680686 -530881 -360287 -230658 -166504 -154258 -176348 -226971 -308727 -422067 -553701
15070 -553701 -673343 -732489 -681176 -508967 -256892 17127 270283 490890 690468 871611
15060 871611 1010884 1080421 1079955 1035228 968156 878339 753288 587247 389952 181540 -17652
15049a7652j76988j44942r5941j8928Q5761J90600K56341K65708K27617J64624
15039G36200J06693P4904N9939K8453l6424j17336j81625j97957j53527p6857
15029B42463j8947n334j9440l0550j7110K2461N5366M0108k6932j06563j52891
15018a7369j44425q1684J8696J19282J82096J97469J81089J50380J07405N4473
15008G67412J6514J9357N8448J07493J34344J11662L9543n3737j38433j94987
14998H67616k05572j59601p5643m077J141q0536k12623l29416l84547l54460k37435
14987a175153p0317Q3161J82051K28030K36947K09798J36891K9870o8412j11931
14977c19065r2023m3076m668P624M068L295R785J2923L716j3374k0457K975N1070
$$ plain form
15049 -17652 -194640 -339582 -435523 -454451 -368690 -178090 78251 343959 571576 736200
15039 736200 842893 917797 977736 1006189 969765 852429 670804 472847 319320 242463
15029 242463 223516 218182 198742 168192 151082 173543 228909 269017 242085 135522 -17369
15018 -17369 -161794 -243478 -224782 -105500 76596 274065 455154 605534 712939 767412
15008 767412 783926 803283 861731 969224 1103568 1215230 1254773 1201036 1062603 867616
14998 867616 662044 502443 426800 422723 423864 343328 130705 -198711 -583258 -937718 -1175153
14987 -1175153 -1245470 -1162309 -980258 -752228 -515281 -305483 -168592 -138722 -207134 -319065
14977 -319065 -411088 -454164 -458832 -451208 -447140 -443845 -434060 -421137 -417421 -430795 -451252 -448277 -397207
14964c97207R9666J47619J96178K24610K24356K15710K18618K29092K28901K02404
14954A589947J41111M9808m6558j17017j46817j43300j10595m4908M1170J18458
14944A331299J57247J46368R9983L7778l1042j13082k23203l41603m14366m16563
14934B32816l64733k80783j81258q3902j2043K0837K6329L1301N2282Q1363J05143
14923c72648J18388J21109J16474J05045Q6308P1199P3293Q8287R6591Q4314N4867
14912F43227K3971J8374O4562J54623K25658K07753R0114q2798k49470l57404
14902G38610l82179l44630k90456k33847j58429p9418k8792J2204Q1554J64228
14892e21155K07989J94916J61976J54401J82547K18629K32729K23711J99471J51026
$$ plain form
14964 -397207 -297541 -149922 46256 270866 495222 710932 929550 1158642 1387543 1589947
14954 1589947 1731058 1780866 1734308 1617291 1470474 1327174 1216579 1171671 1212841 1331299
14944 1331299 1488546 1634914 1734897 1772675 1741633 1628551 1405348 1063745 649379 232816
14934 232816 -131917 -412700 -593958 -677860 -689903 -669066 -642737 -611436 -559154 -477791 -372648
14923 -372648 -254260 -133151 -16677 88368 174676 245875 319168 407455 504046 588360 643227
14912 643227 667198 685572 750134 904757 1130415 1338168 1428282 1345484 1096014 738610
14902 738610 356431 11801 -278655 -512502 -670931 -750349 -779141 -766937 -685383 -521155
14892 -521155 -313166 -118250 43726 198127 380674 599303 832032 1055743 1255214 1406240
14882A406240O9455l2011j32083k18889k72121k63340j94845j02083j6877M8783
14872B92229R0929J03537Q9007O9474O6755P4025P3869O0890K7324l3026j10543
14861H04470j85396k25373k00481j25095n3550l1372o2165j06080j18574r9217
14851d02833p8649o4660l7071J6880Q5092J42634J69805J73877J87313K23556
14841D15944K56321K52916K03549J18096K0839n2051p3976o3934p0622j08128
14831H98954j45782j45136q1537L8967J78293K93901L42476K91911J64127J9537
14821A855711j02766j91185k38547k48327k36280k12302j75025j21268n7067O818
14811B79762O5666J11329J31470J32638J36452J42997J23787O5482j0006p8648
$$ plain form
14882 1406240 1475695 1443684 1311601 1092712 820591 557251 362406 260323 243446 292229
14872 292229 383158 486695 575702 645176 711931 785956 859825 920715 948039 915013 804470
14861 804470 619074 393701 193220 68125 14575 -16797 -78962 -185042 -303616 -402833
14851 -402833 -481482 -546142 -583213 -566333 -481241 -338607 -168802 5075 192388 415944
14841 415944 672265 925181 1128730 1246826 1267665 1215614 1141638 1077704 1007082 898954
14831 898954 753172 608036 526499 565466 743759 1037660 1380136 1672047 1836174 1855711
14821 1855711 1752945 1561760 1323213 1074886 838606 626304 451279 330011 272944 279762
14811 279762 345428 456757 588227 720865 857317 1000314 1124101 1189583 1179577 1100929
14801A100929j29660j48482j20574m5160O3456J71662K39899K51665K19700J70172
14791A773607J21185P9831N3320N8959J13733J98971K54042K20143R6794n6360
14781B914225j76628k34761k30727j83682j11980k3488O5222J25510J49050J61731
14771B454472J86214K16859K44629K68173K78370K75407K89616L40492L96472
14762D950704M10119L79572L45262L45160L91348M68522N57507O49561P32770
14753I230525P98408Q68098R78425J124012J245453J273409J194499J066764R48896
14744A8728489Q41980O99261M84521K24922j0697j68295k12698j23655P2358L04105
14734B0840291N12673O93002Q72317J055120J200348J272263J290390J289850
$$ plain form
14801 1100929 971269 822787 702213 657053 720509 892171 1132070 1383735 1603435 1773607
14791 1773607 1894792 1974623 2027943 2086902 2200635 2399606 2653648 2873791 2970585 2914225
14781 2914225 2737597 2502836 2272109 2088427 1976447 1952959 2018181 2143691 2292741 2454472
14771 2454472 2640686 2857545 3102174 3370347 3648717 3924124 4213740 4554232 4950704
14762 4950704 5360823 5740395 6085657 6430817 6822165 7290687 7848194 8497755 9230525
14753 9230525 10028933 10897031 11875456 12999468 14244921 15518330 16712829 17779593 18728489
14744 18728489 19570469 20269730 20754251 20979173 20968476 20800181 20587483 20463828 20536186 20840291
14734 20840291 21352964 22045966 22918283 23973403 25173751 26446014 27736404 29026254
14726B9026254J269885J201593J050571P85753L98622o8218n23389q69060j056351
14717C1215660j097791j034874r11440p68012o43552n58942m98428m36542l79263
14708B4886816l66663m46247o26262q50458j048601j189434j264884j268193j206793
14699A6619281j104259r80542q43368p08404o06706n50289n17617m82133m35806
14690A0390157l78164l04421k28972j90463k06618k53643l02373l45502l87377
14681G792624m23671m42036m36858m17986l98683l80808l69704l75004l86276
14672D161598l76304l32775k71016k21063k13720k58034l20905l34702k47530
14663A585549q8444N2019J11374Q4601j1210j43274k61754l30961l38514k83570
$$ plain form
14726 29026254 30296139 31497732 32548303 33334056 33732678 33664460 33141071 32272011 31215660
14717 31215660 30117869 29082995 28171555 27403543 26759991 26201049 25702621 25266079 24886816
14708 24886816 24520153 24073906 23447644 22597186 21548585 20359151 19094267 17826074 16619281
14699 16619281 15515022 14534480 13691112 12982708 12376002 11825713 11308096 10825963 10390157
14690 10390157 10011993 9707572 9478600 9288137 9081519 8827876 8525503 8180001 7792624
14681 7792624 7368953 6926917 6490059 6072073 5673390 5292582 4922878 4547874 4161598
14672 4161598 3785294 3452519 3181503 2960440 2746720 2488686 2167781 1833079 1585549
14663 1585549 1497105 1549124 1660498 1745099 1733889 1590615 1328861 997900 659386 375816
14653C75816j83323p3809J4873P5948J10934J08229N4971k6740q6215r6521p5455
14642A98708n8215o5608r4650j28948j45236j24122p1719n301P4915J68670K46767
14631d739K72812K43694J87385J31739Q1427K8528j9347m1859l3561r598R972
14620H46453J879n3477j46026k25274k36237j66013m7774O1189J15220J05123
14610B55063N0388j9005q2019j34227j74709k06624k46058l04174l65002m01904
14600a628271m03375l66916k93824j89911o1440P6211J95245K66490K66698J87593
14590a951500N2654p0895j00130l671J60472K96778L53675L40298K85182K03798
14580d33339J08281J8498n4119j11072j40944j29590r0843n2713k9256j8025j5487
$$ plain form
14653 375816 192493 118684 133557 209505 320439 428668 483639 456899 370684 274163 198708
14642 198708 140493 74885 -19765 -148713 -293949 -418071 -489790 -495091 -420176 -251506 -4739
14631 -4739 268073 511767 699152 830891 912318 940846 921499 879640 846079 836481 846453
14620 846453 848332 794855 648829 423555 187318 21305 -26469 34720 149940 255063
14610 255063 305451 286446 204427 70200 -104509 -311133 -557191 -861365 -1226367 -1628271
14600 -1628271 -2031646 -2398562 -2692386 -2882297 -2943737 -2867526 -2672281 -2405791 -2139093 -1951500
14590 -1951500 -1898846 -1969741 -2069871 -2073542 -1913070 -1616292 -1262617 -922319 -637137 -433339
14580 -433339 -325058 -306560 -360679 -471751 -612695 -742285 -833128 -885841 -915097 -933122 -948609
14569i48609j9008r297M2774J32620K17413K58880K51376K18366J86631J72313
14559E03459J84940K23332K59956K41590J45137J9443p1104j15753j41759j63485
14549A085756j69581j41547q9159m9937m1316m2692k3307K9515J03054J59137
14539H19923J56221Q6756k0366j29400k17010k77109l16440l26035k74714j55550
14529f53724q463J08578J55877J34245Q4422N8637P8649J13614J13518O0846j8983
14518B27216q4400j08881r6732o9822m5006l0848k6097j9687l261J6426L0049
14507b11043M7552P9713J00182O2335l9556j50016k06797k06064j95495k18715
14497i37904k71559k96210k41158j27019q670R5517J86862K53174K80423K61870
$$ plain form
14569 -948609 -967617 -976914 -934140 -801520 -584107 -325227 -73851 144515 331146 503459
14559 503459 688399 911731 1171687 1413277 1558414 1577857 1506753 1391000 1249241 1085756
14549 1085756 916175 774628 685469 635532 594216 551524 528217 557732 660786 819923
14539 819923 976144 1062900 1042534 913134 696124 419015 102575 -223460 -498174 -653724
14529 -653724 -662187 -553609 -397732 -263487 -179065 -120428 -41779 71835 185353 246199 227216
14518 227216 142816 33935 -62797 -132619 -177625 -208473 -234570 -254257 -257518 -241092 -211043
14507 -211043 -163491 -83778 16404 78739 39183 -110833 -317630 -523694 -719189 -937904
14497 -937904 -1209463 -1505673 -1746831 -1873850 -1882520 -1787003 -1600141 -1346967 -1066544 -804674
14487h04674K04994J41626J02925R0216Q0880N5500R173n9151j42471k15993k54243
14476g91218k56018k38922k06074j37949k5726J07389K16378K54060K02403J00882
14466g74795K4993K7282R6339J69538J88755J43542O2689r625l0946J6474J10151
14455B4397J96389K27059K02299J68954J61035J59905J25189M5878n3822j48364
14445A108919k25140k78112l06729l07401k77711k24995j61406j02505o3476n0908
14435h89464n7775p0987q5013j00841j10018r7762n6122J0818Q9685J71355K56054
14424i40070L37155L85708L68703K86012J80654J03631O4089L6686J0176n103
14414H27641j478P880j2176p7585j42421j53468j21027r0147p6982o0893k6698
$$ plain form
14487 -804674 -599680 -458054 -355129 -264913 -184033 -128533 -119360 -178511 -320982 -536975 -791218
14476 -791218 -1047236 -1286158 -1492232 -1630181 -1655907 -1548518 -1332140 -1078080 -875677 -774795
14466 -774795 -749802 -722520 -626181 -456643 -267888 -124346 -61657 -71282 -102228 -85754 24397
14455 24397 220786 447845 650144 819098 980133 1140038 1265227 1311105 1257283 1108919
14445 1108919 883779 605667 298938 -8463 -286174 -511169 -672575 -775080 -838556 -889464
14435 -889464 -947239 -1018226 -1103239 -1204080 -1314098 -1411860 -1467982 -1457164 -1367479 -1196124 -940070
14424 -940070 -602915 -217207 151496 437508 618162 721793 785882 822568 832744 827641
14414 827641 826163 834043 821867 744282 601861 448393 327366 237219 160237 99344 72646
14403G2646Q815J5157j5180n0597n6578l2148k523P514o353k3781j8745J3644
14391h8129O1154J12765J55688J73578J56469R8871J0565p9880j55454k19210
14381B26417k67489k80431k47666j83803j16255o4921k5359J6975N5265O8572
14371h18695N1332K1378L778J1673M9565J14202J83048K28040K27114J64746N3535
14360B89716o5307j50188j81696j72071j48779j23572q7357l1484M0153J09044
14350e21541J50505J61629J54138J25570Q3364N9253O6737Q3508Q3817O9482O6300
14339E82762Q3578Q9677N1151k1046q5167j06131p5684j8684K1415J8826k3255
14328E17442q9562j38517j09248J7553J89876L21216L58742L11419K22503J36818
$$ plain form
14403 72646 81461 96618 81438 30841 -25737 -57885 -60408 -52894 -59247 -83028 -101773 -88129
14391 -88129 -26975 85790 241478 415056 571525 670396 680961 601081 445627 226417
14381 226417 -41072 -321503 -569169 -752972 -869227 -934148 -959507 -942532 -887267 -818695
14371 -818695 -767363 -745985 -742207 -730534 -680969 -566767 -383719 -155679 71435 236181 289716
14360 289716 224409 74221 -107475 -279546 -428325 -551897 -639254 -670738 -630585 -521541
14350 -521541 -371036 -209407 -55269 70301 153665 212918 279655 363163 446980 516462 582762
14339 582762 666340 756017 807168 786122 700955 594824 519140 500456 521871 540697 517442
14328 517442 427880 289363 180115 197668 387544 708760 1067502 1378921 1601424 1738242
14318A738242P5379K7746k3987p3473r2899p2874l8214j3903P400M7386J00873
14307A681676J39612J51691J46363J31896J05728O1030K025m8168o6610n8169
14297B247074m0000p932M8548J08390J23823O0936o6311k05910l13471l65531
14287A589616l45488k54189j26731j1477O3686J07472J51305K05192K40555K30134
14277A850075J84517J42076J31678J45111J49905J21293O9934M1676O8940J24989
14267C030194J50574J21038O0303m659p4553j52920k07287j89733q8777O7687
14257B711867K36198L70319M36312M25706L52920K55592J83983J69903K16653
14248E359453L12103M40179N77346O90067P53671P68852P58685P52020P67091
$$ plain form
14318 1738242 1813621 1841367 1817380 1743907 1651008 1578134 1539920 1526017 1533417 1580803 1681676
14307 1681676 1821288 1972979 2119342 2251238 2356966 2417996 2420021 2371853 2305243 2247074
14297 2247074 2207074 2199142 2247690 2356080 2479903 2540839 2474528 2268618 1955147 1589616
14287 1589616 1244128 989939 863208 851731 915417 1022889 1174194 1379386 1619941 1850075
14277 1850075 2034592 2176668 2308346 2453457 2603362 2724655 2794589 2836265 2905205 3030194
14267 3030194 3180768 3301806 3362109 3357450 3282897 3129977 2922690 2732957 2644180 2711867
14257 2711867 2948065 3318384 3754696 4180402 4533322 4788914 4972897 5142800 5359453
14248 5359453 5671556 6111735 6689081 7379148 8132819 8901671 9660356 10412376 11179467
14239A1179467Q06343Q52501Q86619R15325R59711J032191J127961J232285J323558
14230B0315961J358003J286297J105191Q65689O17654L71336J13428j68590m72512
14221B5392457p68936r99696j117406j138599j129491j130156j114948j041368
14213A6951857r16726p92706p09667o63526o12876n24892m15113l20697k40029
14204A1755625j38445o732J25487K22756K72228K85264K80170K69701K51358K14543
14194A3531955J64725J15406O4054p307j14064k47751l77147m80378n57981o11103
14184A1480409o40511o67477p07908p32935p02299o21781n29680m51282l98506
14175F028030l78998l82606l85114l68811l31276k84507k48797k34918k29928
$$ plain form
14239 11179467 11985810 12838311 13724930 14640255 15599966 16632157 17760118 18992403 20315961
14230 20315961 21673964 22960261 24065452 24931141 25548795 25920131 26033559 25864969 25392457
14221 25392457 24623521 23623825 22506419 21367820 20238329 19108173 17993225 16951857
14213 16951857 16035131 15242425 14532758 13869232 13256356 12731464 12316351 11995654 11755625
14204 11755625 11617180 11610448 11735935 11958691 12230919 12516183 12796353 13066054 13317412 13531955
14194 13531955 13696680 13812086 13876140 13868833 13754769 13507018 13129871 12649493 12091512 11480409
14184 11480409 10839898 10172421 9464513 8731578 8029279 7407498 6877818 6426536 6028030
14175 6028030 5649032 5266426 4881312 4512501 4181225 3896718 3647921 3413003 3183075
14166C183075k17408k05551k12157k32700k34005j83597q7852K0691J22513K07817
14156B160826K49883K27186J61365R3209M3822J7467J6816M2664P5454P5959K0154
14145C184805q0662j92424k76917l00922k44813j23755P082Q7914R5220M6542
14135B202070k5045j02412j87997k79817l56955l87550l57903k93648k37709k02984
14125b29950j58269p9974l320J8735q687k5471J2524Q4569J44720J90631K51844
14114A97352L30489L89138L89061L25687K29874J36866N9464l651m9099o7383
14104A937798n7468m0107n1444j08748j88250k47109k61020k32777j73801j06775
14094D70299o9212p0275p1994m4216m420J4640J0391J030m42J3389M6521R3730
$$ plain form
14166 3183075 2965667 2760116 2547959 2315259 2081254 1897657 1809805 1830496 1953009 2160826
14156 2160826 2410709 2637895 2799260 2892469 2936291 2953758 2970574 3013238 3088692 3164651 3184805
14145 3184805 3104143 2911719 2634802 2333880 2089067 1965312 1972394 2060308 2155528 2202070
14135 2202070 2177025 2074613 1886616 1606799 1249844 862294 504391 210743 -26966 -229950
14125 -229950 -388219 -468193 -471513 -452778 -461465 -486936 -474412 -389843 -245123 -54492 197352
14114 197352 527841 916979 1306040 1631727 1861601 1998467 2057931 2054280 2005181 1937798
14104 1937798 1880330 1840223 1788779 1680031 1491781 1244672 983652 750875 577074 470299
14094 470299 401087 330812 258818 214602 210182 224822 235213 236243 235801 249190 295711 389441
14082C89441J41401J86502K38573K90699L03308K43704J35446K9530m5975q2310
14072A830319p8526m7531j0378K1040M7645O9262P9986Q5614J07289J49002J81493
14061B435215J80875J57157J29402R6964N2051J0408J475K5043M4195L3984k868
14050C163901p0296j63158k30538k16996j35886o1082m4216p1762r7677q6628
14040A985662l6250L4628J14429J94007K45030K34718J64724P3818J0445N532
14030C026743M0702O0761L3407j9700n1125m5573l6091n2946q5375j06368j06366
14019B658069r1528o5967k6800K4353P2370R5666P7114J6775n6043r8135r2296
14008B513578o1137m4759o7655j15575j46404j35990j05277r4566j24899j89326
$$ plain form
14082 389441 530842 717344 955917 1246616 1549924 1793628 1929074 1958604 1912629 1830319
14072 1830319 1751793 1704262 1693884 1714924 1762569 1831831 1911817 1997431 2104720 2253722 2435215
14061 2435215 2616090 2773247 2902649 2999613 3051664 3062072 3063547 3088590 3132785 3166769 3163901
14050 3163901 3093605 2930447 2699909 2482913 2347027 2285945 2241729 2169967 2072290 1985662
14040 1985662 1949412 1984040 2098469 2292476 2537506 2772224 2936948 3010766 3021211 3026743
14030 3026743 3067445 3128206 3161613 3141913 3090788 3045215 3009124 2956178 2870803 2764435 2658069
14019 2658069 2566541 2500574 2473774 2498127 2570497 2666163 2743277 2760052 2704009 2605874 2513578
14008 2513578 2452441 2407682 2340027 2224452 2078048 1942058 1836781 1742215 1617316 1427990
13998A427990k58355k90583k66296k04155j30601n1605L0776R6921J28559J30529
13988F13180J21749J10799Q9913O1236N6998J10874K01393K51813K08300R6362
13978A922617j8049r0411j03912n2559N2185J75176K70019L09085L14027L19369
13968C097547L10696K43115J00083q3089k42209l32424l43585k78543j38780O1409
13958B394220K79472M63787N69051N69670M82187L45769J84636J1105j43802k33357
13948D922738k43893k08076j52717p6832L725L6373j2125j07733j83884k10073
13938C767503k02891j73018j01689Q791J06841J39513R2919k3206j88382l63577
13928C062804m92843n28291m59911l14429j37769K0816J32437K02510K49896K81824
$$ plain form
13998 1427990 1169635 879052 612756 408601 278000 226395 257171 354092 482651 613180
13988 613180 734929 845728 935641 996877 1053875 1164749 1366142 1617955 1826255 1922617
13978 1922617 1904568 1814157 1710245 1657686 1709871 1885047 2155066 2464151 2778178 3097547
13968 3097547 3408243 3651358 3751441 3668352 3426143 3093719 2750134 2471591 2332811 2394220
13958 2394220 2673692 3137479 3706530 4276200 4758387 5104156 5288792 5299897 5156095 4922738
13948 4922738 4678845 4470769 4318052 4241220 4244945 4281318 4269193 4161460 3977576 3767503
13938 3767503 3564612 3391594 3289905 3298696 3405537 3545050 3637969 3614763 3426381 3062804
13928 3062804 2569961 2041670 1581759 1267330 1129561 1150377 1282814 1485324 1735220 2017044
13918B017044L03034L20123L21317K83968K01993R5522J0402p167N2511J48937
13908C747684K08790J72986M8185r1930j78106k09892k41072l04202l64427l75595
13898B412421l38130k74547j88501o5616R5185K61350L74474L94854L39262K54778
13888C265530J80631J39693J32515J37003J27063R0761L4098k2539n4106n1477
13878C979172l0990j5167j8000m1288p1162r1813j00885r3688n2710K3794J14014
13867C601277J97822K53822K51812J70647K5661j25990k31945k83327k99222l06632
13857C253925l24398l47212l57099l32005k55240j44037n8923n3568j11608j67720
13847A102115j72695j14954j6167Q2423J49475J68535J35867P2111J0864j6821
$$ plain form
13918 2017044 2320078 2640201 2961518 3245486 3447479 3543001 3553403 3546236 3598747 3747684
13908 3747684 3956474 4129460 4177645 4085715 3907609 3697717 3456645 3152443 2788016 2412421
13898 2412421 2074291 1799744 1611243 1545627 1640812 1902162 2276636 2671490 3010752 3265530
13888 3265530 3446161 3585854 3718369 3855372 3982435 4073196 4107294 4084755 4030649 3979172
13878 3979172 3948182 3933015 3915015 3873727 3802565 3710752 3609867 3516179 3463469 3487263 3601277
13867 3601277 3799099 4052921 4304733 4475380 4501041 4375051 4143106 3859779 3560557 3253925
13857 3253925 2929527 2582315 2225216 1893211 1637971 1493934 1435011 1381443 1269835 1102115
13847 1102115 929420 814466 798299 880722 1030197 1198732 1334599 1406710 1417574 1400753
13837A400753Q176P2458J30472J43952J08590M3545j9886n0861l5714K7527J33903
13826A962915K54141L28103L06198K05630R9862M8793N2672P3375P3828L9036
13816C444553j7981p1538j00299r6434o9657l8598j6712k960J4041L4469L4856
13805C113740j904n7109r4472r1096n0716q178p357n6776j13983j17866m6235
13794B468048O4032J51165J75014J44574R9607P9348J06266J56486J71313J25640
13784C741493M7191k8649r0889j37605j56580j41042r8256k8886O4283J52235
13774C323295K05922K29652K46435K66090K72547K44162J88161J40142J26364
13765E242770J44006J67982J54275O1429r4985k34874k81721k23697j18808m6700
$$ plain form
13837 1400753 1408929 1481387 1611859 1755811 1864401 1907946 1888060 1837199 1801485 1829012 1962915
13826 1962915 2217056 2545159 2851357 3056987 3156849 3205642 3258314 3331689 3405517 3444553
13816 3444553 3426572 3355034 3254735 3158301 3088644 3050046 3033334 3030374 3044415 3078884 3113740
13805 3113740 3111836 3054727 2960255 2869159 2818443 2810265 2802908 2746132 2632149 2514283 2468048
13794 2468048 2532080 2683245 2858259 3002833 3102440 3181788 3288054 3444540 3615853 3741493
13784 3741493 3788684 3760035 3669146 3531541 3374961 3233919 3135663 3106777 3171060 3323295
13774 3323295 3529217 3758869 4005304 4271394 4543941 4788103 4976264 5116406 5242770
13765 5242770 5386776 5554758 5709033 5770462 5675477 5440603 5158882 4935185 4816377 4769677
13755D769677n0164j11779j73655j87404j54189j06372n3115J2387P2214J06080
13745D123680J25529J55727J96856K20697K07809J65140J10951N9243J7948n122
13735E378458j938K6004N6262N3992O087n8334r8667r7623o8594n1507p5812j18043
13723D950285j23149o8952Q150N8426O9216N5995L9191L4738L6686K6538J1947
13712E099071J3388K2922J9728O173m576j5147k7240l7120n0097n9818l9820K6215
13700D953679J18823J83326J72261R9121L6164M7651J18779J69181J43486O2466
13690F104937j6738o5334r5967j29889j66462j81324j52312p5628K5651R5869
13680E342803Q3040p473j11746j66565j61951j27176q7102m8387j15O9272J37645
$$ plain form
13755 4769677 4719513 4607734 4434079 4246675 4092486 3986114 3932999 3945386 4017600 4123680
13745 4123680 4249209 4404936 4601792 4822489 5030298 5195438 5306389 5365632 5383580 5378458
13735 5378458 5376520 5402524 5458786 5512778 5518865 5460531 5361864 5264241 5195647 5144140 5068328 4950285
13723 4950285 4827136 4758184 4766334 4824760 4893976 4949971 4989162 5023900 5060586 5087124 5099071
13712 5099071 5112459 5135381 5155109 5161282 5156706 5141559 5114319 5077199 5027102 4967284 4927464 4953679
13700 4953679 5072502 5255828 5428089 5527210 5563374 5611025 5729804 5898985 6042471 6104937
13690 6104937 6088199 6022865 5926898 5797009 5630547 5449223 5296911 5221283 5246934 5342803
13680 5342803 5425843 5418370 5306624 5140059 4978108 4850932 4763830 4715443 4715328 4784600 4922245
13669D922245J61726J35850J01103R0644R6620Q6745L5209n3599j48054k11213
13659E217276k22354j92439j39437n9821M7244J56118K34311K73256K87686K86681
13649E888521K57399J86671Q9853N125m3600n8942n2001l1469m284K0903L3622
13638F291798L3286K6089K617m7554r5689r1825l5370K2910M3725K4111j4190
13627F159908m6478o6495q6206j13044j25173q8090o954P0607J08573J13313J20411
13616F040372J55656K01071K16630J88373J34893P5105J7103j8237j4106J5580
13606G012440N8427J16148J74685K03623J86586J41813J09282J16585J56859K08770
13596H485218K62437K98987K88118K34650J77739J37561J07479R9260J40769K22851
$$ plain form
13669 4922245 5083971 5219821 5320924 5411568 5508188 5594933 5630142 5576543 5428489 5217276
13659 5217276 4994922 4802483 4663046 4603225 4650469 4806587 5040898 5314154 5601840 5888521
13649 5888521 6145920 6332591 6422444 6427569 6383969 6325027 6273026 6241557 6237273 6258176 6291798
13638 6291798 6325084 6351173 6353790 6306236 6210547 6118722 6083352 6106262 6149987 6174098 6159908
13627 6159908 6113430 6046935 5960729 5847685 5722512 5634422 5627468 5698075 5806648 5919961 6040372
13616 6040372 6196028 6397099 6613729 6802102 6936995 7012100 7029203 7010966 6996860 7012440
13606 7012440 7070867 7187015 7361700 7565323 7751909 7893722 8003004 8119589 8276448 8485218
13596 8485218 8747655 9046642 9334760 9569410 9747149 9884710 9992189 10091449 10232218 10455069
13586A0455069L04236L61826L96280M13458M13045L78466K88655J45472j6702
13577A3139805j39947j79080j45140q7387m0824j5591j1233j2808P213O4358J43616
13566A2722982K07632K32661K33892K34505K31905K13576J83411J58776J55578
13557A4574918J85696K51550L26743L69576L72117L66255L65418L35836K58154
13548A7406263J70126J20683J13787J15624J21541J74955K97437M56356O14769
13539A9591541P57320Q68611R40049R92177J048350J099359J127510J144610J164316
13530B8733843J158865J094180R89859R08343Q92699R28643R77044J024838J081470
13521C7789784J138425J167854J154534J102079J029162R66789R36131R38007
$$ plain form
13586 10455069 10759305 11121131 11517411 11930869 12343914 12722380 13011035 13156507 13139805
13577 13139805 12999858 12820778 12675638 12588251 12547427 12531836 12520603 12507795 12515008 12579366 12722982
13566 12722982 12930614 13163275 13397167 13631672 13863577 14077153 14260564 14419340 14574918
13557 14574918 14760614 15012164 15338907 15708483 16080600 16446855 16812273 17148109 17406263
13548 17406263 17576389 17697072 17810859 17926483 18048024 18222979 18520416 18976772 19591541
13539 19591541 20348861 21217472 22157521 23149698 24198048 25297407 26424917 27569527 28733843
13530 28733843 29892708 30986888 31976747 32885090 33777789 34706432 35683476 36708314 37789784
13521 37789784 38928209 40096063 41250597 42352676 43381838 44348627 45284758 46222765
13513D6222765R83015J089884J241642J385365J488686J572495J674110J808710
13505E7466672J976820K183873K435695K713120K980520L222850L454210L709552
13497H0143312M029377M430413M883443N335422N770446O227661O748299P333800
13489A24902173P962656Q609309R249003R889785J0582752J1361656J2196229
13482A94753563J3012659J3730397J4281494J4618381J4716493J4558385J4101212
13475B93772584J3277200J2032134J0346376Q233772N749721K998806J23519k727558
13467C43806554n414437p787727r700447j1062663j1876198j2217471j2194059
13460B73553552j1907317j1432772j0812694j0069344r232254q337306p401774
$$ plain form
13513 46222765 47205780 48295664 49537306 50922671 52411357 53983852 55657962 57466672
13505 57466672 59443492 61627365 64063060 66776180 69756700 72979550 76433760 80143312
13497 80143312 84172689 88603102 93486545 98821967 104592413 110820074 117568373 124902173
13489 124902173 132864829 141474138 150723141 160612926 171195678 182557334 194753563
13482 194753563 207766222 221496619 235778113 250396494 265112987 279671372 293772584
13475 293772584 307049784 319081918 329428294 337662066 343411787 346410593 346534112 343806554
13467 343806554 338392117 330604390 320903943 309841280 297965082 285747611 273553552
13460 273553552 261646235 250213463 239400769 229331425 220099171 211761865 204360091
13453B04360091o437083n474536m544572l655020k808445k032528j388472r35683
13445A77083752o99114o76352q53921j213886j737959k413498l212183m055206
13437A62221633m829663n452536n906675o217706o407949o478476o437021o319940
13429A14171667o168302n995981n786414n518124n198004m861270m538459m226910
13421G1878203l899959l552551l210312k894681k616770k384457k197288k043333
13413D9078852j905641j774308j657313j562584j469922j357451j240948j152003
13405C6958682j096105j056829j022032r85116r38304q70714p78092o83520o23531
13396B8904439o10999o40624p05525p71838p89150p47001o71015n73479m52945
$$ plain form
13453 204360091 197923008 192448472 187903900 184248880 181440435 179407907 178019435 177083752
13445 177083752 176384638 175708286 174854365 173640479 171902520 169489022 166276839 162221633
13437 162221633 157391970 151939434 146032759 139815053 133407104 126928628 120491607 114171667
13429 114171667 108003365 102007384 96220970 90702846 85504842 80643572 76105113 71878203
13421 71878203 67978244 64425693 61215381 58320700 55703930 53319473 51122185 49078852
13413 49078852 47173211 45398903 43741590 42179006 40709084 39351633 38110685 36958682
13405 36958682 35862577 34805748 33783716 32798600 31860296 30989582 30211490 29527970 28904439
13396 28904439 28293440 27652816 26947291 26175453 25386303 24639302 23968287 23394808 22941863
13387B2941863l35481k64827k51311k67085k83711k92120k85200k62911k54293
13378B0444924k93642l75847m54875m83231m44670l50748k29886j25267p8630
13369A7608128j01388j53212j81376j86356k13474k87363l70131l98291l57691
13360A5358846k89476k39675k28610k44018k56779k53699k37201k08584j72300
13351A3228504j38634j17459j15588j29528j44130j57378j92541k55842l07450
13342A1669954k96684k07183p3886M1814R8462R2460M4522k4741j04422j86147
13332A1054149k53321k82625k73000k52413k48654k74224l20350l56364l55126
13323H438072l13407k42589j55271n8358M3640J27033J51016J00256J2959m9618
$$ plain form
13387 22941863 22606382 22341555 22090244 21823159 21539448 21247328 20962128 20699217 20444924
13378 20444924 20151282 19775435 19320560 18837329 18392659 18041911 17812025 17686758 17608128
13369 17608128 17506740 17353528 17172152 16985796 16772322 16484959 16114828 15716537 15358846
13360 15358846 15069370 14829695 14601085 14357067 14100288 13846589 13609388 13400804 13228504
13351 13228504 13089870 12972411 12856823 12727295 12583165 12425787 12233246 11977404 11669954
13342 11669954 11373270 11166087 11092201 11134015 11232477 11324937 11369459 11344718 11240296 11054149
13332 11054149 10800828 10518203 10245203 9992790 9744136 9469912 9149562 8793198 8438072
13323 8438072 8124665 7882076 7726805 7668447 7712087 7839120 7990136 8090392 8103351 8053733
13313H053733o7788p1023p8722p6608o1117n7383p3076p5364l9725O705J7853
13302G477485j6642o6890j00930j10500j02339p8356l5871J6203N3346O1156O4042
13291G160704J05358J97326K97424L27453K33490L7212j84673l61096m58234m63772
13281F891192l77926k31091p5391L8237O9891J7979o2657j06386r6358n8432m192
13270F004866P3231J55548K00003J78406J08837M1208L84k1927k6291l477M3654
13259F754442R9146J53564K04807K38977K42995K19997J77542J18399M2079l8933
13249H213015q9696r2909p7598p2108o5962m5790k3262k0195n2480j16746j81023
13238G375246k01594j64655r8197k5225N1054J16560J51939J46934R2315j1023
$$ plain form
13313 8053733 7985945 7914922 7836200 7759592 7698475 7641092 7568016 7492652 7452927 7459632 7477485
13302 7477485 7460843 7393953 7293023 7182523 7080184 7001828 6965957 6982160 7035506 7096662 7160704
13291 7160704 7266062 7463388 7760812 8088265 8321755 8358967 8174294 7813198 7354964 6891192
13281 6891192 6513266 6282175 6206784 6245021 6314912 6332891 6270234 6163848 6067490 6009058 6004866
13270 6004866 6078097 6233645 6433648 6612054 6720891 6762099 6762483 6740556 6714265 6710788 6754442
13259 6754442 6853588 7007152 7211959 7450936 7693931 7913928 8091470 8209869 8251948 8213015
13249 8213015 8123319 8030410 7952812 7880704 7814742 7768952 7745690 7725495 7673015 7556269 7375246
13238 7375246 7173652 7008997 6910800 6885575 6936629 7053189 7205128 7352062 7444377 7433354
13228G433354j26463k02943k23093j93894j25066m7781r602l1128q9593j43447
13218F240344j65269j50137j00147k5856M5787R2453J08579R4746O2152K2721
13208F225373k0521n3444n7266l5883j8519k9567n5687o3163m3544j7995j3115
13197E816669m2097r1814j30023j28757q1235M220J16313K31279L03631K99983
13187F298169K37461J59295R2166L8165j3161o8506j19569j45969j20243j5253
13177F342555J58187L31692M31835M28316L31867J85136N2204j8152j8332L8769
13167H264077J27102J99363K19836J98482J72500J72729K11946K83137L54857
13158A0204029L86024L56897K86997K20825J85979J83135K21503L17089M38004
$$ plain form
13228 7433354 7306891 7103948 6880855 6686961 6561895 6514114 6504512 6473384 6383791 6240344
13218 6240344 6075075 5924938 5824791 5798935 5844722 5937175 6045754 6140500 6202652 6225373
13208 6225373 6204852 6151408 6094142 6058259 6039740 6010173 5954486 5891323 5847779 5829784 5816669
13197 5816669 5774572 5682758 5552735 5423978 5342743 5346963 5463276 5694555 5998186 6298169
13187 6298169 6535630 6694925 6787091 6825256 6812095 6743589 6624020 6478051 6357808 6342555
13177 6342555 6500742 6832434 7264269 7692585 8024452 8209588 8261792 8243640 8225308 8264077
13167 8264077 8391179 8590542 8810378 9008860 9181360 9354089 9566035 9849172 10204029
13158 10204029 10590053 10946950 11233947 11454772 11640751 11823886 12045389 12362478 12800482
13149A2800482N12767N03890M33149L41455K62016K26317K45909K96378L49266
13140A5971629L95270M28581M40671M35173M30956M38709M65792N32875O32364
13131B0172020P15271P44481P18478O59097O04439N93863O45235P55746R17460
13122B6526090J125150J352977J537642J623412J613588J566167J549947J612763
13114C8507736J774591K020668K321500K656077L000163L329173L638180L946339
13106F1194427M276199M637552N036613N487981O003587O566455P135452P666178
13098A08004444Q105280Q382303Q425475Q181221P604662O653640N328161L694690
13090A64379876J853928r2828k036473l854832n439425o715942p643797q212858
$$ plain form
13149 12800482 13313249 13817139 14250288 14591743 14853759 15080076 15325985 15622363 15971629
13140 15971629 16366899 16795480 17236151 17671324 18102280 18540989 19006781 19539656 20172020
13131 20172020 20887291 21631772 22350250 23009347 23613786 24207649 24852884 25608630 26526090
13122 26526090 27651240 29004217 30541859 32165271 33778859 35345026 36894973 38507736
13114 38507736 40282327 42302995 44624495 47280572 50280735 53609908 57248088 61194427
13106 61194427 65470626 70108178 75144791 80632772 86636359 93202814 100338266 108004444
13098 108004444 116109724 124492027 132917502 141098723 148703385 155357025 160685186 164379876
13090 164379876 166233804 166140976 164104503 160249671 154810246 148094304 140450507 132237649
13082A32237649q452417q435183q243325p931018p523292p033771o485886n927057
13074G2205700n412015m963049m559661m168601l768863l368097l010296k738919
13066D0216199k548398k387116k200130j977487j772065j639826j563681j466562
13058B4660934j290463j044381p88645n83142m57767m15100m18933m09722l60570
13049A8892211k77044j60016r319J51589K62841K72245J93306Q8681J5897o382
13039A9424009m652k2205p4904j48986k37658l45513m63633n79812o97117q00518
13029A6049011q43301q08637p32467o48188n66033n04614m90946n20642n50306
13020A0383877n38041m79670m03688l42445l19335l49930m22690m89139m96442
$$ plain form
13082 132237649 123785232 115350049 107106724 99175706 91652414 84618643 78132757 72205700
13074 72205700 66793685 61830636 57270975 53102374 49333511 45965414 42955118 40216199
13066 40216199 37667801 35280685 33080555 31103068 29331003 27691177 26127496 24660934
13058 24660934 23370471 22326090 21537445 20954303 20496536 20081436 19662503 19252781 18892211
13049 18892211 18615167 18455151 18445832 18597421 18860262 19132507 19325813 19414494 19430391 19424009
13039 19424009 19419357 19397152 19322248 19173262 18935604 18590091 18126458 17546646 16849529 16049011
13029 16049011 15205710 14397073 13664606 13016418 12450385 11945771 11454825 10934183 10383877
13020 10383877 9845836 9366166 8962478 8620033 8300698 7950768 7528078 7038939 6542497
13011F542497m22692k87250j33872p344O4920Q8053Q5135O8315M1709J4331j8860
13000F034942q6099j96764l16046l98554m14506l51886k32544j07874j8165K8792
12990C941296M0198K5923K499j7546l8542p5092j25177j56893j39928q2673k2761
12979C351304Q813K122l5280p6784r4072q7734p9261p5944o3346l5336p575m809
12967B802098m8689j36541k24673k56839k12701j34738q5950o9405m1556J4515
12957A605521Q5465J63597K42813K96199K97637K52973J78653Q4435j1436q5671
12947C110186j32759j67885k01966k30424k47798k48602k17255j40498l2186Q1786
12937A572599J81697K43382K47227J92352J00602J3632k7752k2265j4533k7295
$$ plain form
13011 6542497 6119805 5832555 5698683 5691339 5756259 5844312 5929447 5997762 6039471 6053802 6034942
13000 6034942 5948843 5752079 5436033 5037479 4622973 4271087 4038543 3930669 3912504 3941296
12990 3941296 3981494 4007417 4009916 3992370 3953828 3878736 3753559 3596666 3456738 3374065 3351304
12979 3351304 3360117 3362239 3326959 3250175 3156103 3068369 2989108 2913164 2849818 2814482 2806907 2802098
12967 2802098 2753409 2616868 2392195 2135356 1922655 1787917 1701967 1632562 1591006 1605521
12957 1605521 1690986 1854583 2097396 2393595 2691232 2944205 3122858 3207293 3195857 3110186
12947 3110186 2977427 2809542 2607576 2377152 2129354 1880752 1663497 1522999 1490813 1572599
12937 1572599 1754296 1997678 2244905 2437257 2537859 2551491 2523739 2501474 2486941 2459646
12927B459646l6485k3536J5589Q0398J44532J70596J49862R7966K8093n0919j18364
12916B917378j42173r8931J5502J73357L10787L62869L09079J92483Q1902J0176
12906D132429l4261p1291j03572j25087j39194j54845j63708j48343j18085j05682
12896B968361j19346j31017j14558o7224j2532J3404j569l9732p9765j13004j44869
12885B158149j80800k14291k34841k35828k14042j71921j13836l8392M3203Q1886
12875H79287K9208j00962k41883l25775l16049k19751q0295N5331J57158K02928
12865C9197J83747J19386M9417M833j0612j3731j7296k4628l2654j8644M3466
12854C22481J39061K16479K36384K02852J53798J18792R4643P3581N7590M0855
$$ plain form
12927 2459646 2423161 2399625 2415214 2495612 2640144 2810740 2960602 3058568 3086661 3035742 2917378
12916 2917378 2775205 2676274 2691776 2865133 3175920 3538789 3847868 4040351 4122253 4132429
12906 4132429 4098168 4026877 3923305 3798218 3659024 3504179 3340471 3192128 3074043 2968361
12896 2968361 2849015 2717998 2603440 2536216 2523684 2537088 2535519 2495787 2416022 2303018 2158149
12885 2158149 1977349 1763058 1528217 1292389 1078347 906426 792590 754198 797401 879287
12875 879287 908495 807533 565650 239875 -76174 -295925 -376220 -320889 -163731 39197
12865 39197 222944 342330 391747 396580 385968 372237 354941 330313 297659 279015 322481
12854 322481 461542 678021 914405 1117257 1271055 1389847 1484490 1558071 1615661 1656516
12844A656516O018n3038j10755j40644j45710j33397j05119p7979o8263n3423
12834G74206j369P0177J07576P8804L848n9811o5536r889P8257J64605K21078
12823A361946K28913J87840J17679M5388m301j4461j00q744p0846j71154k66918
12812A405242l14446k93876k17115j21006m2515J4503P6834J63734K55140L08627
12802A235122L04740K64833K25713J97411J58743R7799L3796l487j6437n1766
12792B446467j39863k41717k85807k40085j34916k7083M8923J03942J65662K24170
12782A919693K25850J34495j4593j50400k37848k80726k90789k79173k43796j74064
12772F08649p9030R754O0349P3355Q5257J19935J66189K13092K55133K64258K15830
$$ plain form
12844 1656516 1662534 1609496 1498741 1358097 1212387 1078990 973871 895892 827629 774206
12834 774206 772837 843014 950590 1029394 1033242 973431 907895 898006 976263 1140868 1361946
12823 1361946 1590859 1778699 1896378 1941766 1937465 1923004 1922904 1914160 1843314 1672160 1405242
12812 1405242 1090796 796920 579805 458799 416284 430787 507621 671355 926495 1235122
12802 1235122 1539862 1804695 2030408 2227819 2386562 2484361 2518157 2514670 2498233 2446467
12792 2446467 2306604 2064887 1779080 1538995 1404079 1376996 1425919 1529861 1695523 1919693
12782 1919693 2145543 2280038 2265445 2115045 1877197 1596471 1305682 1026509 782713 608649
12772 608649 529619 539373 599722 673077 758334 878269 1044458 1257550 1512683 1776941 1992771
12761A992771J34277P6868P2256Q9586P7711K0871n7320j26859j74909k10589
12751A894663k45884k73176k72547k32382j59888p3032J3329Q6791J34133J49817
12741A021824J44333J37665J39122J46248J61172J92858K31638K25423J26482
12732B526765l9582j90331k67559k72325k31789j74153j31032j22718j39075j45138
12722H13063j13488n9352k1165r529Q33M4351J26777K06328K29852J82628Q6956
12711A487254j9567q2650o1576J5520P1349N9608k265o5442r6268j06092j30192
12700A069679j73046j94859j61701q8428j9859J0425M214j2955k3253k3452j9075
12689C67690k4096n2082j06382j83265k57812k78334k08217n8338J21083K73608
$$ plain form
12761 1992771 2127048 2203916 2276172 2365758 2443469 2464340 2407020 2280161 2105252 1894663
12751 1894663 1648779 1375603 1103056 870674 710786 637754 651083 737874 872007 1021824
12741 1021824 1166157 1303822 1442944 1589192 1750364 1943222 2174860 2400283 2526765
12732 2526765 2487183 2296852 2029293 1756968 1525179 1351026 1219994 1097276 958201 813063
12722 813063 699575 640223 619058 609529 610362 654713 781490 987818 1217670 1400298 1487254
12711 1487254 1467687 1385037 1323461 1338981 1410330 1469938 1467673 1402231 1305963 1199871 1069679
12700 1069679 896633 701774 540073 451645 431786 442211 446425 433470 410217 386765 367690
12689 367690 343594 291512 185130 1865 -255947 -534281 -742498 -800836 -679753 -406145
12679d06145L64473L84732L50004K91803K25482J44454N5039j9876p5938j25538
12669A188490j64647j72437j44915j04392q0680r6249j51969k27377k93681l31729
12659e79586l49110l61719l61155l18946k26339j14012j8256M8775J00425J55100
12649b024823K05500K34466K46405K52319K47484K23690J88572J55221J27158
12640a44008J04317Q9592Q3919O7102N646j04118k23056l00684l11848k56120
12630i89258j39615J1300J46455K37278K99049L53984L89544L69279K80868J49910
12620A108794J5337r2246j55660j65482j30762r3033r0764j19056j48091j54545
12610b5508j26084o2049J9477R0692J35080J53912J53530J34182R6857N5793L9475
$$ plain form
12679 -406145 -41672 343060 693064 984867 1210349 1354803 1409842 1389966 1314028 1188490
12669 1188490 1023843 851406 706491 602099 521419 425170 273201 45824 -247857 -579586
12659 -579586 -928696 -1290415 -1651570 -1970516 -2196855 -2310867 -2329123 -2280348 -2179923 -2024823
12649 -2024823 -1819323 -1584857 -1338452 -1086133 -838649 -614959 -426387 -271166 -144008
12640 -144008 -39691 49901 133820 200922 206568 102450 -120606 -421290 -733138 -989258
12630 -989258 -1128873 -1117573 -971118 -733840 -434791 -80807 308737 678016 958884 1108794
12620 1108794 1124131 1031885 876225 710743 579981 486948 396184 277128 129037 -25508
12610 -25508 -151592 -213641 -194164 -103472 31608 185520 339050 473232 570089 625882 665357
12599F65357P1256J29949J51436J04157L0370j7412m1800p7570j35358j82075
12589F98310j78541j27664p0362m9651p6635j20822j41362j24716q6794m2554
12579c20791P902O8384J43393K30987L04562L21535K63600J54616M1483l0720
12569A184951m5790l3137l9353q5033j52675k03567k09377j76438j44000j48579
12559e2998j81348k02212j94142j69752j29890n2583O6612J86906K55211K50070
12549b24126J86756R4338l111p8547j01276o2696J1353Q5714J52264K27865L08692
12538E97226L58122L49786K90634K10762J47918J11956P7460K9941j2116l6246
12528B125443o2239j01288j28778j22908r5035p6340q4578j05226j13130j01187
$$ plain form
12599 665357 736613 866562 1017998 1122155 1152525 1135113 1093313 1015743 880385 698310
12589 698310 519769 392105 321743 272092 195457 74635 -66727 -191443 -278237 -320791
12579 -320791 -312889 -244505 -101112 129875 434437 755972 1019572 1174188 1215671 1184951
12569 1184951 1139161 1106024 1066671 981638 828963 625396 416019 239581 95581 -52998
12559 -52998 -234346 -436558 -630700 -800452 -930342 -982925 -916313 -729407 -474196 -224126
12549 -224126 -37370 56968 53857 -24690 -125966 -188662 -177309 -91595 60669 288534 597226
12538 597226 955348 1305134 1595768 1806530 1954448 2066404 2143864 2173805 2161689 2125443
12528 2125443 2063204 1961916 1833138 1710230 1615195 1538855 1454277 1349051 1235921 1134734
12518A134734p8908n1077k944O9300J29234J40061J05552N1859K326k0279n9N8386
12506A538185J21266J38695Q1776l4264j58084k45303k94649l21879l20400k76490
12496B28853j97906r9622M440Q1523R9038N4529l0754j16516j59402j49317j18833
12485d03967j17071j75340k83012l93371m55271m36954l35622j74710N398J52469
12475b617451K30902K56028K77108L21500L77098M16193M12487L54430K60583
12466B88878J75171J31102J26098J24341P3857l9485j69135k68509l25491l31968
12456b15141k81493j95572j11653l8031M3396J38131K30369K98059L33309L45098
12446E46472L32840K76226J72895O1973k1247q1512j24883j27035q5150m6206
$$ plain form
12518 1134734 1055826 1004749 1001805 1071105 1200339 1340400 1445952 1497811 1500137 1479858 1479799 1538185
12506 1538185 1659451 1798146 1879922 1845658 1687574 1442271 1147622 825743 505343 228853
12496 228853 30947 -68675 -64235 17288 116326 170855 140101 23585 -135817 -285134 -403967
12485 -403967 -521038 -696378 -979390 -1372761 -1828032 -2264986 -2600608 -2775318 -2769920 -2617451
12475 -2617451 -2386549 -2130521 -1853413 -1531913 -1154815 -738622 -326135 28295 288878
12466 288878 464049 595151 721249 845590 919447 879962 710827 442318 116827 -215141
12456 -215141 -496634 -692206 -803859 -841890 -798494 -660363 -429994 -131935 201374 546472
12446 546472 879312 1155538 1328433 1390406 1369159 1287647 1162764 1035729 950579 904373
12436I04373l5541k5935N716M0896M1776l112o6308j09914j22469j19812j16110
12425C93560j13237j06681r6706r4953j04506j00730o1242q161J8045J2594o963
12414b68980k7466l3537j2533K6386M8683J5950p8496j92404k67703k82471k55608
12403a328179k17732j89500j69861j34203n0155Q6697K36540L41251L62942L09153
12393g53047K29328J70905J33246Q5351J1785p0882j28209j34796r6448n2896
12383f05663l2451j2757L4089Q7933J00793M7251n3237j57375k36761k83506k96960
12372a408644k74285k10095j17863l4762J2476L2648M8451O4813P8724R3063J04176
12361a611298J03390R7813J09043J40429J65737J59525J17947M9652k1892o5965
$$ plain form
12436 904373 868832 842897 848613 889509 931285 928173 861865 751951 629482 509670 393560
12425 393560 280323 173642 76936 -18017 -122523 -223253 -284495 -292656 -274611 -262017 -268980
12414 -268980 -296446 -329983 -342516 -316130 -267447 -251497 -329993 -522397 -790100 -1072571 -1328179
12403 -1328179 -1545911 -1735411 -1905272 -2039475 -2089630 -2002933 -1766393 -1425142 -1062200 -753047
12393 -753047 -523719 -352814 -219568 -134217 -122432 -193314 -321523 -456319 -552767 -605663
12383 -605663 -638114 -650871 -616782 -528849 -428056 -380805 -434042 -591417 -828178 -1111684 -1408644
12372 -1408644 -1682929 -1893024 -2010887 -2045649 -2033173 -2000525 -1952074 -1887261 -1808537 -1715474 -1611298
12361 -1611298 -1507908 -1410095 -1301052 -1160623 -994886 -835361 -717414 -667762 -689654 -755619
12351g55619p5161o1227l4349o370J4024K4222K3759K0223L2487Q0138J49960
12340e87913J88785J50256L8613r2312j87336k30639k36538k23478k12093k24051
12330a616706k53740k71025k61629k28220j67715p4983M0756J47262J93102J48997
12320b343901N8291L093J7313P4371J38798J77608J58436P3090m9335j55969k11482
12309b059687k15027j74616r5748n382N0274O0663O1599Q1853J17589J59285K08886
12298a810311K64666L12700L35758L23849K79210K12157J36703O6836J2583j8452
12288A15699l0403m3732o6716p1915l0628M3359J10281J49031J74722K15055K64283
12277H29036K74593K07063Q2688l1265q1385o0337L638O4052Q6706P9284O8060
$$ plain form
12351 -755619 -830780 -892007 -926356 -932726 -918702 -894480 -870721 -850498 -818011 -737873 -587913
12340 -587913 -399128 -248872 -210259 -302571 -489907 -720546 -957084 -1180562 -1392655 -1616706
12330 -1616706 -1870446 -2141471 -2403100 -2631320 -2799035 -2874018 -2833262 -2686000 -2492898 -2343901
12320 -2343901 -2285610 -2282517 -2265204 -2190833 -2052035 -1874427 -1715991 -1642901 -1692236 -1848205 -2059687
12309 -2059687 -2274714 -2449330 -2545078 -2550460 -2500186 -2439523 -2377924 -2296071 -2178482 -2019197 -1810311
12298 -1810311 -1545645 -1232945 -897187 -573338 -294128 -81971 54732 121568 134151 115699
12288 115699 85296 41564 -25152 -97067 -127695 -84336 25945 174976 349698 564753 829036
12277 829036 1103629 1310692 1393380 1362115 1280730 1220393 1224031 1288083 1374789 1454073 1522133
12266A522133M8141n578q2680j36319j29874o5143J7668O7334N2872j5527q9099
12255A183928j33098j47983j31591p5126R648R5423J58775J85121J78877J65309
12245A489283J70252J92403J96144J54739R2226N5550N1549L9946j4806j07769
12235B319517k03652k66540k75397k29702j52997q0323k2003L3438P7363R4645
12225A294349R1880P9058N4551L3513M9822R9956J40037J45290J15585O0972J7374
12214B182387J8628N5928J02799J43477J63712J56666J30662J00612P9620P4036
12204C208527Q2353J00058J14918J01841N4418Q463q186r578n257J2031K8725
12193C688313K5047K193l0772n9286o3308m4513k8407k7077k6833j5731O981M9891
$$ plain form
12266 1522133 1570274 1564696 1482016 1345697 1215823 1150680 1168348 1235682 1288554 1273027 1183928
12255 1183928 1050830 902847 771256 696130 705778 801201 959976 1145097 1323974 1489283
12245 1489283 1659535 1851938 2048082 2202821 2295047 2350597 2402146 2442092 2427286 2319517
12235 2319517 2115865 1849325 1573928 1344226 1191229 1110906 1088903 1122341 1199704 1294349
12225 1294349 1386229 1465287 1519838 1553351 1603173 1703129 1843166 1988456 2104041 2165013 2182387
12214 2182387 2201015 2256943 2359742 2503219 2666931 2823597 2954259 3054871 3134491 3208527
12204 3208527 3290880 3390938 3505856 3607697 3662115 3670578 3662392 3652814 3647557 3659588 3688313
12193 3688313 3713360 3715553 3684781 3625495 3562187 3517674 3489267 3462190 3435357 3419626 3426607 3476498
12181C476498J24584K15539K75814K72416K10996J08419k1574j49636k27386k30800
12171D054870j90062j42889r4150m4832p719Q258o518o6885j58261k21438k12640
12160B917734j53063r7806p8958r0501j05646j13409j27777j43890j33045r2260
12150A781379o4892q9522j42375j73318j69216j48326j35155j51575j97039k33781
12140B76180k21974j67539j06622m9888K1798J14555K13887L09228L79844L86268
12130A155737L19456K27414J69388J49829J31265R9633P0712M2086j9644j23335
12120B222541k10667k09191j13851N099O5929L2570p8566k13197k99611k88708
12110I12348j94690q0011N067N4063Q7364J14721J16311P5433J9480q681j0862
$$ plain form
12181 3476498 3601082 3816621 4092435 4364851 4575847 4684266 4662692 4513056 4285670 4054870
12171 4054870 3864808 3721919 3627769 3582937 3575218 3583476 3576958 3510073 3351812 3130374 2917734
12160 2917734 2764671 2666865 2587907 2497406 2391760 2278351 2150574 2006684 1873639 1781379
12150 1781379 1716487 1626965 1484590 1311272 1142056 993730 858575 707000 509961 276180
12140 276180 54206 -113333 -219955 -269843 -248045 -133490 80397 389625 769469 1155737
12130 1155737 1475193 1702607 1871995 2021824 2153089 2252722 2323434 2365520 2345876 2222541
12120 2222541 2011874 1802683 1688832 1693931 1759860 1792430 1713864 1500667 1201056 912348
12110 912348 717658 637647 642714 696777 784141 898862 1015173 1090606 1110086 1101405 1090543
12099A090543k7050q1561j59509k29085k72643k84512k54189j89726j33819j23968
12089f65519j51826j72891j52259r0642j9385L4109P4688J05870J04718O6793
12079h66344J7708k3689m8072m9219l2535p367K8353P7657J31948J70987J75185
12068d25388J51699J31490J33939J46585J42001J07220N1435p881n2485o6460
12058C12155n2904l2752j8745j0575r169k2185n3499r9018j48951j78243j55660
12047d69546q4534j8467r685n0936q0872m9763L8659J51450K57308L24326L19127
12036C27067K36683J12780k0079j54018k69639l41493l58002l15271k17901p9150
12026a079023P8950K21985L11237L36902L27330L02003K54343J82022Q9309j6488
$$ plain form
12099 1090543 1063493 981932 822423 593338 320695 36183 -218006 -407732 -541551 -665519
12089 -665519 -817345 -990236 -1142495 -1233137 -1252522 -1218413 -1143725 -1037855 -933137 -866344
12079 -866344 -848636 -872325 -920397 -969616 -1002151 -1009518 -981165 -903508 -771560 -600573 -425388
12068 -425388 -273689 -142199 -8260 138325 280326 387546 438981 431100 378615 312155
12058 312155 259251 226499 207754 197179 188010 165825 112326 13308 -135643 -313886 -469546
12047 -469546 -554080 -572547 -582232 -633168 -714040 -763803 -725144 -573694 -316386 7940 327067
12036 327067 563750 676530 656451 502433 232794 -108699 -466701 -781972 -999873 -1079023
12026 -1079023 -1000073 -778088 -466851 -129949 197381 499384 753727 935749 1025058 1008570
12016A008570j11109j73538k12811k46948k76908k97347l18602l56671m02499
12007a387863m18538l72556k80919j94062j37756j06372q2896m8379k707L3600
11997b998448M6235M8022P1729J34148K06874K32544J89338J13719N5249N0727
11987a849863J06391J88925K53534K67163K18608J19193l017j04979j48470j23627
11977a076142m7885M8923J41923K13428K49248K48373K22658J80864J21657M7640
11967C50687k6104q9507j42081j79949k05998k40084k90329l29941l28268k88129
11957a769703k31925j71840j08592m2028K4084Q1871J38137K16299L11260L78810
11947a173627L91372L62982L22762K83292K35424J67211P7370j6485r1438j45456
$$ plain form
12016 1008570 897461 723923 511112 264164 -12744 -310091 -628693 -985364 -1387863
12007 -1387863 -1806401 -2178957 -2459876 -2653938 -2791694 -2898066 -2980962 -3029341 -3032048 -2998448
11997 -2998448 -2952213 -2904191 -2832462 -2698314 -2491440 -2258896 -2069558 -1955839 -1900590 -1849863
11987 -1849863 -1743472 -1554547 -1301013 -1033850 -815242 -696049 -699066 -804045 -952515 -1076142
11977 -1076142 -1124027 -1075104 -933181 -719753 -470505 -222132 526 181390 303047 350687
11967 350687 324583 235076 92995 -86954 -292952 -533036 -823365 -1153306 -1481574 -1769703
11957 -1769703 -2001628 -2173468 -2282060 -2324088 -2300004 -2218133 -2079996 -1863697 -1552437 -1173627
11947 -1173627 -782255 -419273 -96511 186781 422205 589416 666786 650301 558863 413407
11937D13407j87230k22910k57088k79050k72252k39989j97605j51805r7769l4574
11927a526865L2433J02115J63149J94788J97712J96951K12853K34826K36911K08628
11917B53501J58140J00384M6651K203k9473m1318k8045l256L739j9879n1368n3743
11905C37536k7804k6088q3609j66427k21133k31579k05266j52223r0704l8062
11895i05359O979O3716J53511K72493L78878M12372L38176J91756N9612m682j6767
11884I50685j7581k8680m8948o4236o1354m6648l2552j3556J6478M1432M1850
11873G36890K1789j359j9558l8883o0639o5582k9357N3131J59370K46298K67044
11862A269144J96828N4691r7591j89649j89830j34118r1665q4186p4133l1779
$$ plain form
11937 413407 226177 3267 -253821 -532871 -805123 -1045112 -1242717 -1394522 -1492291 -1526865
11927 -1526865 -1494432 -1392317 -1229168 -1034380 -836668 -639717 -426864 -192038 44873 253501
11917 253501 411641 512025 558676 560879 531406 490088 462043 458787 462526 442647 391279 337536
11905 337536 309732 283644 200035 33608 -187525 -419104 -624370 -776593 -867297 -905359
11895 -905359 -898380 -834664 -681153 -408660 -29782 382590 720766 912522 972134 967452 950685
11884 950685 933104 904424 855476 791240 729886 683238 650686 637130 653608 695040 736890
11873 736890 758679 757320 737762 698879 638240 572658 543301 596432 755802 1002100 1269144
11862 1269144 1465972 1520663 1423072 1233423 1043593 909475 817810 733624 659491 627712
11852F27712L8661J24377K13059K79878K93253K48590J72185R3396L2455m581
11842B118985l4698q1974j43350j93287k12316j92985j43628p9312n387O9180
11832A101228J23466J41130J22710P6804J0519o7035j48767k29895k87427k86623
11822E56110k18278j01488K8116J20983J39637Q7718N739o2786r7353q6062j9550
11811C52786P8426J49156J49059R6212N4543N9657Q2909Q5398P4483P7264R6780
11800A356673J28551J78629K36186K60292K22836J47804Q2219L7624p812o3618
11790B579384j23003j84205k35972k52819k22494j48939m2863P0678J64575K28888
11780A833230K59173K56256K39301K26746K19762K19031K34906K69329L06077
$$ plain form
11852 627712 666373 790750 1003809 1283687 1576940 1825530 1997715 2091111 2123566 2118985
11842 2118985 2084287 2002313 1858963 1665676 1453360 1260375 1116747 1037435 1032048 1101228
11832 1101228 1224694 1365824 1488534 1565338 1575857 1508822 1360055 1130160 842733 556110
11822 556110 337832 236344 264460 385443 525080 612798 618537 555751 458398 372336 352786
11811 352786 431212 580368 729427 825639 880182 939839 1022748 1108146 1182629 1259893 1356673
11800 1356673 1485224 1663853 1900039 2160331 2383167 2530971 2613190 2650814 2643002 2579384
11790 2579384 2456381 2272176 2036204 1783385 1560891 1411952 1369089 1439767 1604342 1833230
11780 1833230 2092403 2348659 2587960 2814706 3034468 3253499 3488405 3757734 4063811
11771D063811L28466L38003L42809L34977K99007K37131J68225J01417L2138l5410
11761F210574p9883p4790m221J12294K15223K49826K09248J20312J1397r8324
11751F871656j87816k24052j89217j10619m1655j4466k5688n6448q8015j10883
11741E822797j32832j71798k28139k73749k77965k43057j96701j50704j05021
11732D042831p6855q9155j48248k46167l48454l97278l61536k69591j81070j36005
11722A788472j30766j32950j18973q4528l3686J6835L9783K3347p087j3174P823
11711A355096J5275l4315j35350k35595k96625l15265l01802k76191k54212k18823
11701f97807j40196j9572J12285K24143K93191L02520K48822J54266O7723L6995
$$ plain form
11771 4063811 4392277 4730280 5073089 5408066 5707073 5944204 6112429 6213846 6245984 6210574
11761 6210574 6130691 6055901 6051680 6163974 6379197 6629023 6838271 6958583 6969980 6871656
11751 6871656 6683840 6459788 6270571 6159952 6118297 6103831 6078143 6021695 5933680 5822797
11741 5822797 5689965 5518167 5290028 5016279 4738314 4495257 4298556 4147852 4042831
11732 4042831 3965976 3876821 3728573 3482406 3133952 2736674 2375138 2105547 1924477 1788472
11722 1788472 1657706 1524756 1405783 1321255 1287569 1304404 1344187 1367534 1360447 1347273 1355096
11711 1355096 1370371 1336056 1200706 965111 668486 353221 51419 -224772 -478984 -697807
11701 -697807 -838003 -857575 -745290 -521147 -227956 74564 323386 477652 545375 582370
11691E82370P0066J27096J59432J55079J31638R2679K2797p1631j45915j53107
11681I70504r6077k1164K8983L5470M295l8270n9176m6240k6306k8260m9408p2520
11669F01831p9597n3374J0846R3298J64603K03954J98379J57548J23158J21537
11659A542183J12391K1698j66181l63834m45282l58130j63422L0434J50614J85017
11649E45488J60641J13331O2954P687n1357r4554j09448j11177j24977j55747
11639B42841j75440j49333p6466M575N0367M2726l833n1691o6826m5909j2488
11628b41477P007k634m6095j21286k06262k56471k46849k09437j91820j93904
11618a709228j77728j25044o3191l0790l6303n8373o1721j3808P7560J49114J41350
$$ plain form
11691 582370 652436 779532 938964 1094043 1225681 1318360 1341157 1269526 1123611 970504
11681 970504 874427 853263 882246 917716 922011 883741 824565 778325 752019 723759 674351 601831
11669 601831 522234 468860 479706 573004 737607 941561 1139940 1297488 1420646 1542183
11659 1542183 1654574 1676272 1510091 1146257 700975 342845 179423 209857 360471 545488
11649 545488 706129 819460 882414 890101 838744 744190 634742 523565 398588 242841
11639 242841 67401 -81932 -158398 -153823 -103456 -60730 -64563 -116254 -183080 -228989 -241477
11628 -241477 -234470 -237104 -283199 -404485 -610747 -867218 -1114067 -1323504 -1515324 -1709228
11618 -1709228 -1886956 -2012000 -2075191 -2105981 -2142284 -2200657 -2262378 -2276186 -2198626 -2049512 -1908162
11607a908162O8985K370r971L5230J23936K29230L09820L36502L07743K41040
11597b63277J60403Q8033M3800L8383O5837R5845Q3283J556j28002k49368l18410
11586c81917l14318k31443q7489P4882J99617K49906K35137J84425J07917O015
11576D2732j01170j86786k39028k47972k04470j26600n6211j8809r077j4636l0485
11565a192512n2272p4355r0866q9663o2763k3658R176M3912J04628J87316K44966
11554i96091K27503J24273k8852j62298k16728j82764r5528m774N4076P2201O9601
11543a139381P9734J09066J25634J08136P5082M3362n026q9918j80065k19446
11533a092822k00600j55120r4506j1735Q4583J67792K06612J88690J34945Q2521
$$ plain form
11607 -1908162 -1839177 -1836807 -1846778 -1811548 -1687612 -1458382 -1148562 -812060 -504317 -263277
11597 -263277 -102874 -14841 28959 67342 133179 229024 312307 313863 185861 -63507 -381917
11586 -381917 -696235 -927678 -1015167 -940285 -740668 -490762 -255625 -71200 36717 42732
11576 42732 -58438 -245224 -484252 -732224 -936694 -1063294 -1119505 -1138314 -1147391 -1162027 -1192512
11565 -1192512 -1244784 -1319139 -1410005 -1499668 -1562431 -1586089 -1576913 -1533001 -1428373 -1241057 -996091
11554 -996091 -768588 -644315 -673167 -835465 -1052193 -1234957 -1330485 -1335259 -1281183 -1208982 -1139381
11543 -1139381 -1059647 -950581 -824947 -716811 -641729 -598367 -603393 -693311 -873376 -1092822
11533 -1092822 -1293422 -1448542 -1543048 -1554783 -1470200 -1302408 -1095796 -907106 -772161 -689640
11523f89640N8344N9760O0713M2016J0689j8952m8887r1117j48343k09130k53107
11512a227654k63839k41343j96926j52698j24871j01393o0856M825Q2438J38940
11502b143377J47039J15114P9175N7335L9996K2016J6638L0963M8187N1026M3793
11491a492095M3204O3041J04219J46139J58703J28971P3762L0406L0021P7066
11481f36563J48218J96756J85279J22798M7074j0268l4253k6475n395Q321J2746
11470H238J4885J3338O773k895k3504m5542k6321O2104J97618L17549L60553L11082
11458A193878K00977P4102l9553j20779j52437j24469m6087N9173J65917K36973
11448A447695K30313J36573k653j24125j98270k41814k75450k83000k27990j15763
$$ plain form
11523 -689640 -631296 -571536 -510823 -468807 -458118 -477070 -525957 -617074 -765417 -974547 -1227654
11512 -1227654 -1491493 -1732836 -1929762 -2082460 -2207331 -2308724 -2369580 -2364755 -2282317 -2143377
11502 -2143377 -1996338 -1881224 -1802049 -1744714 -1704718 -1682702 -1666064 -1635101 -1586914 -1535888 -1492095
11491 -1492095 -1448891 -1385850 -1281631 -1135492 -976789 -847818 -774056 -743650 -713629 -636563
11481 -636563 -488345 -291589 -106310 16488 63562 53294 19041 -7434 -12829 -4508 8238
11470 8238 23123 36461 43234 40339 16835 -28707 -55028 7076 204694 522243 882796 1193878
11458 1193878 1394855 1468957 1429404 1308625 1156188 1031719 985632 1044805 1210722 1447695
11448 1447695 1678008 1814581 1811928 1687803 1489533 1247719 972269 689269 461279 345516
11438C45516M785J00213J62490J85052J68553J33678R1912K9110n4560j28776
11428A037973j65308j61690j28894p4372j4297J5405q493o7203j21510j47001
11418A64610j38708j00292n1347j7838k281J8852P5567J72575K68415L06246K59879
11407I55678J48821K5744n3696o9426n2750n5566j03410j76571k39401k76030
11397A03393k76771k25606j27438j7924O3254J03473J13756R6176L6062p4680
11387b06305k12068l26997l80401l54037k50566j11212L655P0042J11968J54708
11377a501213J89377J94160J53877O2810o0724j73766k33117k20433j55892q0256
11367a825177j7730L1269P8113J20017J31046J02271N5142N225m9923j00753j14871
$$ plain form
11438 345516 350301 450514 613004 798056 966609 1100287 1192199 1221309 1166749 1037973
11428 1037973 872665 710975 582081 507709 493412 508817 500324 433121 311611 164610
11418 164610 25902 -74390 -125737 -143575 -145856 -127004 -51437 121138 389553 695799 955678
11407 955678 1104499 1130243 1076547 1007121 954371 898805 795395 618824 379423 103393
11397 103393 -173378 -398984 -526422 -544346 -481092 -377619 -263863 -167687 -131625 -206305
11387 -206305 -418373 -745370 -1125771 -1479808 -1730374 -1841586 -1837931 -1767889 -1655921 -1501213
11377 -1501213 -1311836 -1117676 -963799 -900989 -961713 -1135479 -1368596 -1589029 -1744921 -1825177
11367 -1825177 -1842907 -1811638 -1733525 -1613508 -1482462 -1380191 -1325049 -1319824 -1369747 -1470500 -1585371
11356a585371o7882K9440J38814K19699K52205K45430K03422J07100m0492k01688
11346f99323l41329m29219m35398l50865k04603n7667M0659Q9930J12620J14063
11336b161132R4720P6109P6789P4421M7251K6078M2400P2998P3267L4497j7024
11325a559626o0295q6034q8273p1882m9523k6853R251O4877J16660J44854J49636
11314a457208J36640J13222R2204Q0809O0475J6874j2288J8166R5869J70843K06982
11303d77412J99294J68827J47086J53845J87947K33037K56435K18916J11237l2748
11293A166464j64337k52409k85902k60451j93107j29848r5019o3370r691N7377
11283b30293J11044J24000R2995N0928L2532M5164O9979P6008M1762k4469p9768
$$ plain form
11356 -1585371 -1653253 -1623813 -1484999 -1265300 -1013095 -767665 -564243 -457143 -497635 -699323
11346 -699323 -1040652 -1469871 -1905269 -2256134 -2460737 -2518404 -2477745 -2387815 -2275195 -2161132
11336 -2161132 -2066412 -1990303 -1913514 -1839093 -1791842 -1765764 -1723364 -1650366 -1577099 -1542602 -1559626
11325 -1559626 -1619921 -1705955 -1794228 -1866110 -1915633 -1942486 -1933235 -1868358 -1751698 -1606844 -1457208
11314 -1457208 -1320568 -1207346 -1115142 -1034333 -973858 -956984 -969272 -951106 -855237 -684394 -477412
11303 -477412 -278118 -109291 37795 191640 379587 612624 869059 1087975 1199212 1166464
11293 1166464 1002127 749718 463816 203365 10258 -119590 -214609 -277979 -287670 -230293
11283 -230293 -119249 4751 97746 148674 181206 226370 296349 372357 414119 389650 309882
11272C09882q1997l6665J2512M0746N5512N7862K9565l7702j23562j94487k27813
11261a96147k25744k09947k02630k12874k34674k48585k30553j71926q8552r562
11251b031194M6474Q8534J38416K02948K58125K59038J88910R6749M7209M1250
11241f63541K7314k1983p9070j04508r8506j02436j54637k43611l06247k92879
11231b040104k22720j50987j07977r0350q1979o6306l4709N941L2370L3559L3095
11220b690167N0205P3213Q9408J02106J15207J22899J15169R2164P4495R3319
11210a761982J57865K32675K59107K15519J42688R7943J01424J32473J58678J58824
11200a04786J25885O2501j1719o8590j03404j27596j44372j57357j62053j42774
$$ plain form
11272 309882 227885 191220 203732 244478 299990 357852 387417 349715 226153 31666 -196147
11261 -196147 -421891 -631838 -834468 -1047342 -1282016 -1530601 -1761154 -1933080 -2021632 -2031194
11251 -2031194 -1984720 -1896186 -1757770 -1554822 -1296697 -1037659 -848749 -752000 -704791 -663541
11241 -663541 -636227 -658210 -737280 -841788 -940294 -1042730 -1197367 -1440978 -1747225 -2040104
11231 -2040104 -2262824 -2413811 -2521788 -2612138 -2694117 -2760423 -2795132 -2789191 -2756821 -2723262 -2690167
11220 -2690167 -2639962 -2566749 -2477341 -2375235 -2260028 -2137129 -2021960 -1929796 -1855301 -1761982
11210 -1761982 -1604117 -1371442 -1112335 -896816 -754128 -656185 -554761 -422288 -263610 -104786
11200 -104786 21099 83600 71881 3291 -100113 -227709 -372081 -529438 -691491 -834265
11190h34265j09866r8083j05845q1955k569Q0895J05257P1021K0640j1772m800
11179i71342M5502J21215K00273K58327K68961K34592J90030J52657J06491M9805
11169F56511J2744J2181K1875N05o8148j68013k63151l17247l20352k85188k17086
11158i35369j17867r538P9648J43428J89697K12142J88187J06823o485j00897
11148b50231j41694j35598j13835r9822r2278o8656j2270O0353J18490J51555
11138e83986J67910J70176J41443P9038J7193o268J9195O7914Q9945N3317k0128
11127A95749p4955p3130j3360P4494J44469J63907J35288Q8661M9160K0037j5323
11116F94997q9627k18513l62364m56580m75358m44323l96526l29607k22107p6498
$$ plain form
11190 -834265 -944131 -1042214 -1148059 -1230014 -1232583 -1151688 -1046431 -975410 -954770 -966542 -971342
11179 -971342 -925840 -804625 -604352 -346025 -77064 157528 347558 500215 606706 656511
11169 656511 669255 681436 703311 703816 635668 467655 204504 -112743 -433095 -718283 -935369
11158 -935369 -1053236 -1062774 -983126 -839698 -650001 -437859 -249672 -142849 -149334 -250231
11148 -250231 -391925 -527523 -641358 -741180 -833458 -902114 -914384 -854031 -735541 -583986
11138 -583986 -416076 -245900 -104457 -25419 -8226 -14494 4701 72615 162560 215877 195749
11127 195749 120794 47664 34304 108798 253267 417174 552462 641123 690283 710320 694997
11116 694997 605370 386857 24493 -432087 -907445 -1351768 -1748294 -2077901 -2300008 -2376506
11106b376506P2271J75049K04205J81779J59585J69823J95278J97307J79224J83351
11096f58634K20615K62022K80783K63176K04705J18133L7968n215j7565l1516
11086F74472o1090q7730r2689q2232p5853q0864q5575q5154q5250p0778k2888
11075a55631M4801J04445J35892J26155P6455N829o1073j06436j10947n8851L1129
11064C1768J06532J24327P6162j6413j12685j76420j99249j98800j91500j77347
11054g33625j47556r5749k2896O6359J53041K01813J85261R8278k9243j37701
11044d62018j87978j80906j21140m846J42416K62694L18290L15518K80904K42560
11034F05494K20511K06233J71433J20023Q6654P3723N2793J4941k3225m2076l8353
$$ plain form
11106 -2376506 -2304235 -2129186 -1924981 -1743202 -1583617 -1413794 -1218516 -1021209 -841985 -658634
11096 -658634 -438019 -175997 104786 367962 572667 690800 728768 723553 705988 674472
11086 674472 613382 525652 432963 350731 274878 194014 108439 23285 -61965 -132743 -155631
11075 -155631 -110830 -6385 129507 255662 332117 337946 276873 170437 59490 639 31768
11064 31768 138300 262627 338789 322376 209691 33271 -165978 -364778 -556278 -733625
11054 -733625 -881181 -976930 -999826 -933467 -780426 -578613 -393352 -295074 -324317 -462018
11044 -462018 -649996 -830902 -952042 -956888 -814472 -551778 -233488 82030 362934 605494
11034 605494 826005 1032238 1203671 1323694 1410348 1484071 1536864 1551805 1528580 1486504 1448151
11023A448151k6784k5808m1033n8630o0071m4587k9200j8203m698M662L622k257
11011A145164j8029o2157j40694k34813l07546l25812k83949k01064r6085J1412
11001e13573Q6284J05800Q7491O7855O4016N8451K0006n7602j45506k08036k22324
10990f57138j85764j27715r2955r3153j00049q8135m4514L8753J43070K33421
10980i74179K94817L16124K77404J90300J01484M0393J748l3368p7181j23438
10970A4104j52107j48680j14069m9690M8689J64978K56553K87800K60878K07820
10960G76276J43143N4347n9762j64860k07624j76910j30967j23743j39214j36464
10950a65778j07366p1092m9261m9085o0052p1359q3205r3471q9898p5404q0991
$$ plain form
11023 1448151 1421367 1395559 1354526 1295896 1235825 1191238 1162038 1143835 1139137 1143799 1147421 1145164
11011 1145164 1127135 1064978 924284 689471 381925 56113 -227836 -428900 -524985 -513573
11001 -513573 -427289 -321489 -233998 -166143 -102127 -43676 -23670 -81272 -226778 -434814 -657138
10990 -657138 -842902 -970617 -1063572 -1156725 -1256774 -1344909 -1389423 -1350670 -1207600 -974179
10980 -974179 -679362 -363238 -85834 104466 205950 246343 248091 214723 137542 14104
10970 14104 -138003 -286683 -400752 -450442 -401753 -236775 19778 307578 568456 776276
10960 776276 919419 973766 914004 749144 541520 364610 233643 109900 -29314 -165778
10950 -165778 -273144 -344236 -393497 -442582 -502634 -573993 -657198 -750669 -840567 -915971 -996962
10939i96962j26592j77971j71702r3518M942P4545J04140Q8864L1640k9503n1401
10928a343518k0931N1107J46583K47315L30114L63825L28640K34656J14937O915
10918D59643o3992p9276k7199O6644J45362J72550J60244J44382J48897J66578
10908A293833J57611Q9869k2856j29659j84285j79262j43696j18199j24366j51167
10898D87823j67378j44104q2059k1006J67j5667l7598m8666n6835o5947o9531
10887b20801p4897r8573j42026j81939j79127j10492m054P7391R6495O2040K396
10876g73587n1560p7339p2551n3159m9449q6036j51636k06315k11096j45674k6086
10865a904488R8312J90310K49883K81310K70819K12799J30831N7764J2436j1465
$$ plain form
10939 -996962 -1123554 -1301525 -1473227 -1566745 -1561803 -1487258 -1383118 -1294254 -1262614 -1292117 -1343518
10928 -1343518 -1364449 -1313342 -1166759 -919444 -589330 -225505 103135 337791 452728 459643
10918 459643 395651 316375 289176 355820 501182 673732 833976 978358 1127255 1293833
10908 1293833 1451444 1541313 1518457 1388798 1204513 1025251 881555 763356 638990 487823
10898 487823 320445 176341 94282 73276 73443 57776 20178 -28488 -85323 -151270 -220801
10887 -220801 -295698 -394271 -536297 -718236 -897363 -1007855 -1011909 -934518 -838023 -775983 -773587
10876 -773587 -825147 -902486 -975037 -1028196 -1077645 -1163681 -1315317 -1521632 -1732728 -1878402 -1904488
10865 -1904488 -1806176 -1615866 -1365983 -1084673 -813854 -601055 -470224 -412460 -400024 -411489
10855d11489l7136o8641r5579j18195j26395r7179l2738L2134N6037J0313q7549
10844i76417j77127k20037k21388j92129j32171m7320L6899Q8557J06229J19019
10834a615885J44617J78766K17617K63386L08770L34218L22861K67576J69096
10825E91022L6604j04834k09549k42335k12782j53540q2697l539P5734J30520
10815a75396J33821Q1128j4735j34781k46906l15477l23209k77228j99425j17034
10805a589242n1801q774J6370K0322P552J5907Q3970K02468L25942L97126L65344
10794b14816K38610R2018m412l7309l0276q583K582k7464r9977j67500j90607
10783d47734j80750j70470j72252j75993j70826j53092j27791j15292j38628k06409
$$ plain form
10855 -411489 -448625 -517266 -612845 -731040 -857435 -954614 -987352 -955218 -899181 -888868 -976417
10844 -976417 -1153544 -1373581 -1594969 -1787098 -1919269 -1966589 -1929690 -1841133 -1734904 -1615885
10834 -1615885 -1471268 -1292502 -1074885 -811499 -502729 -168511 154350 421926 591022
10825 591022 627626 522792 313243 70908 -141874 -295414 -378111 -381650 -305916 -175396
10815 -175396 -41575 39553 24818 -109963 -356869 -672346 -995555 -1272783 -1472208 -1589242
10805 -1589242 -1641043 -1649817 -1633447 -1613125 -1605573 -1589666 -1505696 -1303228 -977286 -580160 -214816
10794 -214816 23794 115812 111400 74091 43815 35232 37814 10350 -89627 -257127 -447734
10783 -447734 -628484 -798954 -971206 -1147199 -1318025 -1471117 -1598908 -1714200 -1852828 -2059237
10773b059237k99560l53816k84246n5608K58727N04321N89255N59152N01601M64980
10763a74431M60255M74103M71019M08925K76058J03222o4598j89545k38555j96637
10753A329816q6474M5799J55876K10583K00462J53410J11881Q9541P1948M3833
10743B326675l502p2878j53985k21437k57279k65583k57375k33482j83835j06504
10733E70815l3064m656k2474n8255r5519j28221j38784j20918r7229p9954m6433
10722b54692K7427J22055J91913K18323K15794K09507K15184K25463K27631K25611
10712A624216K23706K18260K08015J86446J30820K4028j08683k00824k00844j31423
10702A973717o5844n3804r1179j47006k01036k47740k84465l04138k95067k55608
$$ plain form
10773 -2059237 -2358797 -2712613 -2996859 -3052467 -2793740 -2289419 -1700164 -1141012 -639411 -174431
10763 -174431 285824 759927 1230946 1639871 1915929 2019151 1954553 1765008 1526453 1329816
10753 1329816 1243342 1289141 1445017 1655600 1856062 2009472 2121353 2210894 2282842 2326675
10743 2326675 2323173 2250295 2096310 1874873 1617594 1352011 1094636 861154 677319 570815
10733 570815 537751 533095 510621 452366 356847 228626 89842 -31076 -128305 -208259 -254692
10722 -254692 -227265 -105210 86703 305026 520820 730327 945511 1170974 1398605 1624216
10712 1624216 1847922 2066182 2274197 2460643 2591463 2615491 2506808 2305984 2105140 1973717
10702 1973717 1907873 1854069 1762890 1615884 1414848 1167108 882643 578505 283438 27830
10692B7830k01821j45381q9015m6832k6352k4331n0011j05019j63728k03608k18515
10681a246783j99577j41101o0959L002J9222p749l6520k3118L4242R2008J23300
10670a444033J51197K01706K59973K91761K76162K10422J14549K8726j0438K112
10660H2137M4633R6167J40031J63875J65553J47230J18876J08978J37606J79570
10650A384656J89312J47304O6222k6302j05985j69869k34622l12569l95740m58297
10640H4110m71802m27519l43513k40863j30388k4223O3476J19773J37720J23074
10630a110155R9077R2803J03153J07410R0749M5544k4803q4148p8685P632J26257
10619f25166K11460K35319K07592J42704N2443l2827p3305o7582n8154q1279j37737
$$ plain form
10692 27830 -173991 -319372 -408387 -455219 -481571 -505902 -555913 -660932 -824660 -1028268 -1246783
10681 -1246783 -1446360 -1587461 -1648420 -1645418 -1626196 -1633945 -1670465 -1693583 -1659341 -1567333 -1444033
10670 -1444033 -1292836 -1091130 -831157 -539396 -263234 -52812 61737 90463 80025 82137
10660 82137 126770 222937 362968 526843 692396 839626 958502 1067480 1205086 1384656
10650 1384656 1573968 1721272 1787494 1761192 1655207 1485338 1250716 938147 542407 84110
10640 84110 -387692 -815211 -1158724 -1399587 -1529975 -1554198 -1490722 -1370949 -1233229 -1110155
10630 -1110155 -1011078 -918275 -815122 -707712 -616963 -571419 -596222 -680370 -759055 -751423 -625166
10619 -625166 -413706 -178387 29205 171909 224352 191525 118220 50638 -7516 -88795 -226532
10608b26532j98101k18791j69235o6657K5207N3338J3059n9255j06387r4302m0014
10597a087670J7547N2251N6980M0181J7080R780N0584J52761K77995L55062L42435
10586B84986K69012J99887J69205J63081J49116J10871O2539K7749N977k5398
10576A417025p3227j18577j41331j33832j03904o6528k2939L3436Q7482J05635
10566I83240P3252Q038o1528j12610j32168j29229j26731j33127j43446j58082
$$ plain form
10608 -226532 -424633 -643424 -812659 -879316 -854109 -800771 -787712 -846967 -953354 -1047656 -1087670
10597 -1087670 -1070123 -1017872 -960892 -920711 -903631 -893851 -843267 -690506 -412511 -57449 284986
10586 284986 553998 753885 923090 1086171 1235287 1346158 1408697 1436446 1442423 1417025
10576 1417025 1343798 1225221 1083890 950058 846154 779626 756687 790123 877605 983240
10566 983240 1056492 1064530 1003002 890392 758224 628995 502264 369137 225691 67609
$$ [...]
##END NTUPLES=NMR SPECTRUM
##END=
