##TITLE=31P ikalashn
DE-63_33-35_1
18.12.2024
##JCAMPDX= 6.0         $$ Bruker NMR JCAMP-DX V2.0
##DATA TYPE= NMR SPECTRUM
##DATA CLASS= NTUPLES
##ORIGIN= UXNMR, Bruker Analytische Messtechnik GmbH
##OWNER= root
$$ TOPSPIN		Version 1.3
$$ 2024-12-18 14:19:16.281 +0400  Irina@DPX200
$$ Compression mode = diff/dup
##.OBSERVE FREQUENCY= 81.01967998063
##.OBSERVE NUCLEUS= ^31P
##.ACQUISITION MODE= SIMULTANEOUS
##.ACQUISITION SCHEME= undefined
##.AVERAGES= 64
##.DIGITISER RES= 17
##SPECTROMETER/DATA SYSTEM= spect
##.PULSE SEQUENCE= zgpg
##.SOLVENT NAME= DMSO
##.SHIFT REFERENCE= INTERNAL, DMSO, 1, 298.5841
##AUDIT TRAIL= $$ (NUMBER, WHEN, WHO, WHERE, WHAT)
$$ ##TITLE= Audit trail, TOPSPIN		Version 1.3
$$ ##JCAMPDX= 5.01
$$ ##ORIGIN= Bruker BioSpin GmbH
$$ ##OWNER= Irina
$$ $$ F:/spectra/data/iren/nmr/P31dec/1/pdata/1/auditp.txt
$$ ##AUDIT TRAIL=  $$ (NUMBER, WHEN, WHO, WHERE, VERSION, WHAT)
(   1,<2024-12-18 14:18:29.609 +0400>,<Irina>,<DPX200>,<TOPSPIN 1.3>,
      <created by zg
	started at 2024-12-18 14:16:46.375 +0400,
	POWCHK disabled, PULCHK disabled
       configuration hash MD5:
       BE 6D 3F 07 2A EA 11 49 91 17 2B D3 AF B3 58 0D
       data hash MD5: 32K
       74 0B D7 68 5E E1 2B F5 30 93 0C 8C 7E 72 34 B1>)
(   2,<2024-12-18 14:18:32.718 +0400>,<Irina>,<DPX200>,<TOPSPIN 1.3>,
      <Start of raw data processing
       efp BC_mod = 2 LB = 12 FT_mod = 6 PKNL = 1 PHC0 = 28.98129 PHC1 = -52.44113 SI = 32K 
       data hash MD5: 32K
       FE EB 66 A9 5E 03 D0 34 36 89 78 15 F3 53 BB F8>)
(   3,<2024-12-18 14:18:48.281 +0400>,<Irina>,<DPX200>,<TOPSPIN 1.3>,
      <apk 
       data hash MD5: 32K
       B6 2B 39 B1 CB DA 5A 70 31 C5 2B C8 CB 70 88 7C>)
(   4,<2024-12-18 14:18:50.406 +0400>,<Irina>,<DPX200>,<TOPSPIN 1.3>,
      <abs n ABSG = 5 
       data hash MD5: 32K
       E7 EB 1E 19 A3 D9 68 09 0A 44 A1 F1 B4 CA 27 5F>)
(   5,<2024-12-18 14:19:00.234 +0400>,<Irina>,<DPX200>,<TOPSPIN 1.3>,
      <pk fgphup PHC0 = -8.8 PHC1 = 0 
       data hash MD5: 32K
       C1 83 E4 EF FE A1 28 DD 39 1F 25 6E EA 17 31 B8>)
(   6,<2024-12-18 14:19:02.437 +0400>,<Irina>,<DPX200>,<TOPSPIN 1.3>,
      <abs n ABSG = 5 
       data hash MD5: 32K
       61 0E B3 44 4B 67 D9 39 50 5B 86 55 9D 4F 8A 4B>)
$$ ##END=
$$ 
$$ $$ hash MD5
$$ $$ C4 7E A6 2F 0A 4E BD 91 2F 48 CE A3 13 4E 81 2F
##$RELAX= 
##$RELAX= 
##$RELAX= 
##$RELAX= 
##$RELAX= 
##$RELAX= 
##$RELAX= 
##$RELAX= 
##$RELAX= 
##$RELAX= 
##$RELAX= 
$$ Bruker specific parameters
$$ --------------------------
##$DU= <F:/spectra>
##$EXPNO= 1
##$NAME= <P31dec>
##$PROCNO= 1
##$TYPE= <nmr>
##$USER= <iren>
##$AMP= (0..31)
100 100 100 100 100 100 100 100 100 100 100 100 100 100 100 100 100 100 
100 100 100 100 100 100 100 100 100 100 100 100 100 100 
##$ANAVPT= -1
##$AQSEQ= 0
##$AQ_mod= 1
##$AUNM= <au_zg>
##$AUTOPOS= <>
##$BF1= 81.014009
##$BF2= 200.13
##$BF3= 200.13
##$BF4= 200.13
##$BF5= 200.13
##$BF6= 200.13
##$BF7= 200.13
##$BF8= 200.13
##$BYTORDA= 1
##$CFDGTYP= 0
##$CFRGTYP= 5
##$CHEMSTR= <none>
$$ [...]
##$SW_h= 37037.037037037
##$TD= 32768
##$TD0= 1
##$TE= 300
##$TE2= 300
##$TE3= 300
##$TEG= 300
##$TL= (0..7)
0 120 53 12 22 120 120 120 
##$TP= (0..7)
150 150 150 150 150 150 150 150 
##$TP07= 0
##$TPNAME0= <>
##$TPNAME1= <>
##$TPNAME2= <>
##$TPNAME3= <>
##$TPNAME4= <>
##$TPNAME5= <>
##$TPNAME6= <>
##$TPNAME7= <>
##$TPOAL= (0..7)
0.5 0.5 0.5 0.5 0.5 0.5 0.5 0.5 
##$TPOFFS= (0..7)
0 0 0 0 0 0 0 0 
##$TUNHIN= 0
##$TUNHOUT= 0
##$TUNXOUT= 0
##$USERA1= <user>
##$USERA2= <user>
##$USERA3= <user>
##$USERA4= <user>
##$USERA5= <user>
##$V9= 5
##$VALIST= <valist>
##$VCLIST= <CCCCCCCCCCCCCCC>
##$VD= 0
##$VDLIST= <DDDDDDDDDDDDDDD>
##$VPLIST= <PPPPPPPPPPPPPPP>
##$VTLIST= <TTTTTTTTTTTTTTT>
##$WBST= 1024
##$WBSW= 4
##$XGAIN= (0..3)
0 0 0 0 
##$XL= 0
##$YL= 0
##$YMAX_a= 1458
##$YMIN_a= -2970
##$ZGOPTNS= <>
##$ZL1= 120
##$ZL2= 120
##$ZL3= 120
##$ZL4= 120
##$ABSF1= 298.5841
##$ABSF2= -158.5842
##$ABSG= 5
##$ABSL= 5
##$ALPHA= 0
##$AQORDER= 0
##$ASSFAC= 0
##$ASSFACI= 0
##$ASSFACX= 0
##$ASSWID= 0
##$AUNMP= <proc_1d>
##$AXLEFT= 0
##$AXRIGHT= 0
##$AXTYPE= 0
##$AXUNIT= <>
##$AZFE= 0.1
##$AZFW= 0.5
##$BCFW= 0
##$BC_mod= 2
##$BYTORDP= 0
##$COROFFS= 0
##$CY= 12.5935478210449
##$DATMOD= 1
##$DC= 0
##$DFILT= <>
##$DTYPP= 0
##$F1P= 47.1127640792319
##$F2P= -24.0371245302204
##$FCOR= 0.5
##$FTSIZE= 32768
##$FT_mod= 6
##$GAMMA= 0
##$GB= 0
##$INTBC= 1
##$INTSCL= 7.269226e-011
##$ISEN= 30
##$LB= 12
##$LEV0= 0
##$LPBIN= 0
##$MAXI= 12.09355
##$MC2= 0
##$MEAN= 0
##$ME_mod= 0
##$MI= 0.7550151
##$NCOEF= 0
##$NC_proc= -12
##$NLEV= 6
##$NOISF1= 298.5841
##$NOISF2= 270.0111
##$NSP= 0
##$NTH_PI= 0
##$NZP= 0
##$OFFSET= 298.5841
##$PC= 1.4
##$PHC0= 33.51816
##$PHC1= -56.6977
##$PH_mod= 1
##$PKNL= yes
##$PPARMOD= 0
##$PPDIAG= 0
##$PPIPTYP= 0
##$PPMPNUM= 100
##$PPRESOL= 1
##$PSCAL= 0
##$PSIGN= 0
##$REVERSE= no
##$SF= 81.014009
##$SI= 32768
##$SIGF1= 270.0111
##$SIGF2= -158.5842
##$SINO= 77.54984
##$SIOLD= 32768
##$SREGLST= <31P.CDCl3>
##$SSB= 0
##$STSI= 32768
##$STSR= 0
##$SW_p= 37037.037037037
##$SYMM= 0
##$S_DEV= 0
##$TDeff= 32768
##$TDoff= 0
##$TI= <>
##$TILT= no
##$TM1= 0
##$TM2= 0
##$TOPLEV= 0
##$USERP1= <user>
##$USERP2= <user>
##$USERP3= <user>
##$USERP4= <user>
##$USERP5= <user>
##$WDW= 1
##$XDIM= 32768
##$YMAX_p= 292790819
##$YMIN_p= -15400050
$$ End of Bruker specific parameters
$$ ---------------------------------
##NTUPLES= NMR SPECTRUM
##VAR_NAME=  FREQUENCY,     SPECTRUM/REAL,   SPECTRUM/IMAG
##SYMBOL=    X,             R,               I
##VAR_TYPE=  INDEPENDENT,   DEPENDENT,       DEPENDENT
##VAR_FORM=  AFFN,          ASDF,            ASDF
##VAR_DIM=   32768,         32768,           32768
##UNITS=     HZ,            ARBITRARY UNITS, ARBITRARY UNITS
##FACTOR=    1.13031516577767, 1,            1
##FIRST=     37037.037037037, 4052406,       -3717767
##LAST=      0,             -3324500,        4818055
##MIN=       0,             -15400050,       0
##MAX=       37037.037037037, 292790819,     0
$$ Real data points
##PAGE= N=1
##DATA TABLE= (X++(R..R)), XYDATA
$$ [...]
15740c132520M03003J64330p4389k40338l08072k99375k53777k05180j71408j50016
15730d267742j19334n3450M6635J42023J91687J96511J95126K14813K41230K44666
15720b967835K18084J81322J61509J69127J91196K12874K33812K64200L24832
15711a010879M21360M97906M68660L13522J03256p5688j96388k88740l72690m04614
15701e44295l08970o3466K61145N41584O81802O65438N42711L80413K26791J08269
15691B491422L6775J6097M7763J24126K17977K91350L14550K69868J41576p9662
15681C871842l73178o73079q90945r68188r03730p34498n07517k74625r2330M401
15671a541847L3720M9713P8786Q0718k788j60449l04912l63023l47744l28511
$$ plain form
15740 -3132520 -2729517 -2565187 -2639576 -2879914 -3187986 -3487361 -3741138 -3946318 -4117726 -4267742
15730 -4267742 -4387076 -4440526 -4393891 -4251868 -4060181 -3863670 -3668544 -3453731 -3212501 -2967835
15720 -2967835 -2749751 -2568429 -2406920 -2237793 -2046597 -1833723 -1599911 -1335711 -1010879
15711 -1010879 -589519 -91613 377047 690569 793825 718137 521749 233009 -139681 -544295
15701 -544295 -853265 -916731 -655586 -114002 567800 1233238 1775949 2156362 2383153 2491422
15691 2491422 2528197 2544294 2592057 2716183 2934160 3225510 3540060 3809928 3951504 3871842
15681 3871842 3498664 2825585 1934640 966452 62722 -671776 -1179293 -1453918 -1546248 -1541847
15671 -1541847 -1508127 -1458414 -1379628 -1298910 -1301698 -1462147 -1767059 -2130082 -2477826 -2806337
15661b806337l47514l82852l78396k87627j06315J09657K69848L15228K50409
15652c363899J10453o4558k22882l18636l40536l06081k32110j22945L431Q9126
15642d768637O4701q6076l02710m95207o03334o05491m96971k90671l1586K11037
15632g404945L76956M51721M72432M95746N67184P03908Q76631J012304J030318
15623a417745Q93703O41111L59812J14258q9019k64200m02403m84691n14924n09486
15613a673584m66155l70489k30390p9790N9437J97675L41377M55409M86823M22183
15603h57504L06160K10112J89439K54043L74375N11934O39198P43656Q17428Q41043
15593D029884P85791O45737M59021K71580R9280m6377j34238j50471j28609j11441
$$ plain form
15661 -2806337 -3153851 -3536703 -3915099 -4202726 -4309041 -4199384 -3929536 -3614308 -3363899
15652 -3363899 -3253446 -3318004 -3540886 -3859522 -4200058 -4506139 -4738249 -4861194 -4857763 -4768637
15642 -4768637 -4703936 -4790012 -5092722 -5587929 -6191263 -6796754 -7293725 -7584396 -7615982 -7404945
15632 -7404945 -7027989 -6576268 -6103836 -5608090 -5040906 -4336998 -3460367 -2448063 -1417745
15623 -1417745 -524042 117069 476881 591139 502120 237920 -164483 -649174 -1164098 -1673584
15613 -1673584 -2139739 -2510228 -2740618 -2820408 -2760971 -2563296 -2221919 -1766510 -1279687 -857504
15603 -857504 -551344 -341232 -151793 102250 476625 988559 1627757 2371413 3188841 4029884
15593 4029884 4815675 5461412 5920433 6192013 6291293 6244916 6110678 5960207 5831598 5720157
15583E720157j03378p5217K674J31638K69835L42170K78766O4425k28728m66123
15573E936219n41092m46540k53627m4790J14419J73596J16214l1094k32153m61357
15563D329795o77337q13519q19138o92831m72244k16627J174J30702J86957K25003
15553A181935K68825K90534K59448J95785J64011K15204L40638M75885N49137
15544C941402N38052M78899M10783L25720J96270K7421j51779l12410m24566m69693
15534D560099m55846m01603l23801k49371k03694j91985k26314l37146n07614
15525A662725o31640n93573l72914o3523J94074L18433L24318K57547J34041n0329
15515A179159k78004m95503o47507p18958p31128p01804o21673m66587k20333
$$ plain form
15583 5720157 5616779 5541562 5544236 5675874 5945709 6287879 6566645 6631070 6402342 5936219
15573 5936219 5395127 4948587 4694960 4650170 4764589 4938185 5054399 5023305 4791152 4329795
15563 4329795 3652458 2838939 2019801 1326970 854726 638099 639273 769975 956932 1181935
15553 1181935 1450760 1741294 2000742 2196527 2360538 2575742 2916380 3392265 3941402
15544 3941402 4479454 4958353 5369136 5694856 5891126 5918547 5766768 5454358 5029792 4560099
15534 4560099 4104253 3702650 3378849 3129478 2925784 2733799 2507485 2170339 1662725
15525 1662725 1031085 437512 64598 1075 195149 513582 837900 1095447 1229488 1179159
15515 1179159 901155 405652 -241855 -960813 -1691941 -2393745 -3015418 -3482005 -3702338
15506c702338J09745M77066P95254R71905R61766Q02881N86771L84589K30920
15497A618559J57201J74227K36679K71589K27654J02677m7955j46640j60037j30700
15487B303254j35479k16627l57570n04674n92992n76022m61263k94377r4225J61317
15477g68658M67507P41865Q71273P95826N36228J67096k26698n68827p77692p88711
15467D49209o13454l41552p7902J08691J91504J74524Q8508j4449p2725m5461
15457a53107N0498J58878K47121L24633M04852M72947M84068L89894J90861l8436
15447B532209k01737k52631k03405q1800J01328L34816N70080P31629P69293O74779
15437D974561M59890J51371k02023n36276p83177q88467q43858o97022n21279
$$ plain form
15506 -3702338 -3592593 -3115527 -2320273 -1348368 -386602 416279 1003050 1387639 1618559
15497 1618559 1775760 1949987 2186666 2458255 2685909 2788586 2740631 2593991 2433954 2303254
15487 2303254 2167775 1951148 1593578 1088904 495912 -80110 -541373 -835750 -929975 -768658
15477 -768658 -301151 440714 1311987 2107813 2644041 2811137 2584439 2015612 1237920 449209
15467 449209 -164245 -505797 -583699 -475008 -283504 -108980 -20472 -34921 -107646 -153107
15457 -153107 -102609 56269 303390 628023 1032875 1505822 1989890 2379784 2570645 2532209
15447 2532209 2330472 2077841 1874436 1792636 1893964 2228780 2798860 3530489 4299782 4974561
15437 4974561 5434451 5585822 5383799 4847523 4064346 3175879 2332021 1634999 1113720
15428A113720l84894l32445l64570m34111m74884m45983l45802j91880j2408J52274
15418a720983K70565L30766L21829K27980M9882j81801m16163n95141o63594n92668
15408b969328l95720j16792J87231M60232O59029P59521P58644O63679M75590
15399D82086K08188q0246l13341m59640n48177o18144o67780o66788o21101n85678
15389c870621n91374o08553n95820n40030m39605k81404o1344J85831L91077M81105
15379e930738M20154K45475O2768q582R8056L54561O50314Q67265R52277R28446
15369a360004Q52715P67477O85432N98467M95065L73814K41660J12165J5087o344
15359B775534P5602K36079L95555M77122M56178L41989J48960q5336k88763l98843
$$ plain form
15428 1113720 728826 396381 31811 -402300 -877184 -1323167 -1668969 -1860849 -1873257 -1720983
15418 -1720983 -1450418 -1119652 -797823 -569843 -519961 -701762 -1117925 -1713066 -2376660 -2969328
15408 -2969328 -3365048 -3481840 -3294609 -2834377 -2175348 -1415827 -657183 6496 482086
15399 482086 690274 610028 296687 -162953 -711130 -1329274 -1997054 -2663842 -3284943 -3870621
15389 -3870621 -4461995 -5070548 -5666368 -6206398 -6646003 -6927407 -6988751 -6802920 -6411843 -5930738
15379 -5930738 -5510584 -5265109 -5202341 -5210923 -5112867 -4758306 -4107992 -3240727 -2288450 -1360004
15369 -1360004 -507289 260188 945620 1544087 2039152 2412966 2654626 2766791 2781878 2775534
15359 2775534 2851136 3087215 3482770 3959892 4416070 4758059 4907019 4821683 4532920 4134077
15349D134077m09479l58294k78053j82813r8195q0447j91463m29452o91481q48360
15339E66040q52786p60193o55397n66395m54871k82402o1830J61708L55417N07614
15329b043095O02343O07282N10592L54920J96030M4847j11547k53094l24829k89597
15319g06148j69309k4745R4189J69585K10954K40562K76581L30372M05969M89207
15309A317217N57761O09565O53777O82872O85789O71091O57678O53188O37061
15300G125999N66858M17388K08110j2679j93977k96882l09444k50240j55065o6146
15290G033922k7261o4855j63901k78630l71940m43889n17180n93575o45605o43595
15280C283491n70033m29894k59020j03206J7532J17440K15122L04558L56541L36722
$$ plain form
15349 4134077 3724598 3366304 3088251 2905438 2807243 2726796 2535333 2105881 1414400 566040
15339 566040 -286746 -1046939 -1702336 -2268731 -2723602 -3006004 -3067834 -2906126 -2550709 -2043095
15329 -2043095 -1440752 -833470 -322878 32042 228072 272919 161372 -91722 -416551 -706148
15319 -706148 -875457 -900202 -806013 -636428 -425474 -184912 91669 422041 828010 1317217
15309 1317217 1874978 2484543 3138320 3821192 4506981 5178072 5835750 6488938 7125999
15300 7125999 7692857 8110245 8318355 8305676 8111699 7814817 7505373 7255133 7100068 7033922
15290 7033922 7006661 6941806 6777905 6499275 6127335 5683446 5166266 4572691 3927086 3283491
15280 3283491 2713458 2283564 2024544 1921338 1938870 2056310 2271432 2575990 2932531 3269253
15270C269253K38121J12252M5022Q5326K03599L15418L44476K84843K04232J66661
15260E269203J68057J67073J39646Q6025J4785o9256j63824k67103l86029n21967
15250D436610o36087o55187n30214k87660j9644J68551K06002Q4371j40537l78390
15240B247815n42407n92065n68051n48938n49531n04437l61228j46054O0451J79725
15230a324720J67751J7380k30648m78295o14808n90332m42781k58655j09904j3702
15220c878714N8239J33679K06763K46774K29855J61903P2554j0913q1062j42246
15210c003168j83650j85636j61621j43903j20292l9345J09795K68750L69202L95998
15200b693870L80738L33219K23414N2813j16296k21329k52670k50077k60165k95986
$$ plain form
15270 3269253 3507374 3619626 3664648 3749974 3953573 4268991 4613467 4898310 5102542 5269203
15260 5269203 5437260 5604333 5743979 5830004 5844789 5775533 5611709 5344606 4958577 4436610
15250 4436610 3800523 3145336 2615122 2327462 2307818 2476369 2682371 2766742 2626205 2247815
15240 2247815 1705408 1113343 545292 -3646 -553177 -1057614 -1418842 -1564896 -1504445 -1324720
15230 -1324720 -1156969 -1139589 -1370237 -1848532 -2463340 -3053672 -3496453 -3755108 -3865012 -3878714
15220 -3878714 -3820475 -3686796 -3480033 -3233259 -3003404 -2841501 -2768947 -2779860 -2860922 -3003168
15210 -3003168 -3186818 -3372454 -3534075 -3677978 -3798270 -3837615 -3727820 -3459070 -3089868 -2693870
15200 -2693870 -2313132 -1979913 -1756499 -1703686 -1819982 -2041311 -2293981 -2544058 -2804223 -3100209
15190c100209l48160m15137m84343n06589m28322k39074J7013K61648M20260M61527
15180d361386M14665L29326K34532J62584J45030J52930J11859l112j30958j80801
15170c125331r4886J30317M55162Q18907J137937J296964J199353Q53300L99582
15161C071305L0733j42990j44895n8331N6811J62125K09754J65066M9906o9680
15151C329804j51314k06766k49503k55164j94135o7288J05219L10796N42841P76645
15141C941135R66708J074723J081862R69485P24662L86316N2107j89884l32462
15132H674652m41297n74597p16930p97252p68102o52428n13096l99447l35629
15123C475874l30273l60367l74130l47011l05212k75856k47548j93755j08166
$$ plain form
15190 -3100209 -3448369 -3863506 -4347849 -4854438 -5282760 -5521834 -5504821 -5243173 -4822913 -4361386
15180 -4361386 -3946721 -3617395 -3382863 -3220279 -3075249 -2922319 -2810460 -2813572 -2944530 -3125331
15170 -3125331 -3220217 -3089900 -2634738 -1815831 -677894 619070 1818423 2671723 3071305
15161 3071305 3102038 2959048 2814153 2755822 2812633 2974758 3184512 3349578 3399484 3329804
15151 3329804 3178490 2971724 2722221 2467057 2272922 2205634 2310853 2621649 3164490 3941135
15141 3941135 4907843 5982566 7064428 8033913 8758575 9144891 9196998 9007114 8674652
15132 8674652 8233355 7658758 6941828 6144576 5376474 4724046 4210950 3811503 3475874
15123 3475874 3145601 2785234 2411104 2064093 1758881 1483025 1235477 1041722 933556
15114I33556Q02J27411K59880L67092M05738L48226K17717Q4857J0323k63J7353
15103B772692K9143K4338K468m8666j51704l06504m67972n73063n93331n59381
15093A28020n41128n97676p22799q36054q39254o86079m14203j22144J02366K37015
15083d291936L06503L34403L24322K80917K44133K76730M08611O02108P67278
15074g46931Q15666P20363N26245K94787O0879j52095l12745l92207l81300k97307
15064A35355j77477o2162K3706P6860J01252R1173L7890n0394j41574j89180j57065
15053c11616n2319P3221J68677K22094K54307K91935L45899M05249M31893L62567
15043B191907J45686k10680o17107r32101j052380r78063p79207n32766k92804
$$ plain form
15114 933556 934358 1061769 1321649 1688741 2094479 2442705 2660422 2745279 2755602 2755339 2772692
15103 2772692 2801835 2826173 2828641 2779975 2628271 2321767 1853795 1280732 687401 128020
15093 128020 -413108 -1010784 -1733583 -2569637 -3408891 -4094970 -4509173 -4631317 -4528951 -4291936
15083 -4291936 -3985433 -3651030 -3326708 -3045791 -2801658 -2524928 -2116317 -1514209 -746931
15074 -746931 68735 789098 1315343 1610130 1671009 1518914 1206169 813962 432662 135355
15064 135355 -42122 -104284 -80578 -3718 97534 188707 226597 176203 34629 -154551 -311616
15053 -311616 -363935 -290714 -122037 100057 354364 646299 992198 1397447 1829340 2191907
15043 2191907 2337593 2126913 1509806 577705 -474675 -1452738 -2231945 -2764711 -3057515
15034c057515q3582R1645K27363L04298L21151L34093M21372N98581P96433R11492
15024H65331Q64074O36703K84510r8396m29953o56865p50527p16335n92784m28676
15014a022918k68654j42693m3022O9957K14792L60056M47883M26705K82094O0185
15004C84385j49424k67250k61091j49230P793J29661J57686R0547k3795j41963
14994b22681k55336l58817m29700m55689m45930l96902k85602j18388M7366J41975
14984b779704J32972M0569r6208k45838l63724l92598l10227j43107P7720L36343
14974c743802O05050Q34689R73395R90286Q98021P55296O41613O13333O60098
14965C227979P04469O56449M82960K45419O0387N771P9544K39225M44535O59738
$$ plain form
15034 -3057515 -3141097 -3049452 -2822089 -2517791 -2196640 -1862547 -1441175 -842594 -46161 865331
15024 865331 1729405 2366108 2650618 2552222 2122269 1465404 714877 -1458 -594242 -1022918
15014 -1022918 -1291572 -1434265 -1477287 -1407330 -1192538 -832482 -384599 42106 324200 384385
15004 384385 234961 -32289 -293380 -442610 -434817 -305156 -147470 -56923 -80718 -222681
14994 -222681 -478017 -836834 -1266534 -1722223 -2168153 -2565055 -2850657 -2969045 -2921679 -2779704
14984 -2779704 -2646732 -2606163 -2702371 -2948209 -3311933 -3704531 -4014758 -4157865 -4080145 -3743802
14974 -3743802 -3138752 -2304063 -1330668 -340382 557639 1312935 1954548 2567881 3227979
14965 3227979 3932448 4588897 5071857 5317276 5377663 5383434 5462978 5702203 6146738 6806476
14955F806476Q38764R25741Q86716P44653N62855L85275K10087J3963k15946m56487
14945A0702097o54686p72677q07683p63868o34690m25121j78535K7065J15191
14936F607093N1575j32852l45872m72955m31888k20545O3172K77696L37277K41266
14926E973967L4809k16182m29153n27959m82938l25482j18570Q2170K45883L62562
14916D599107M31943M61043M54984L93264K41910J0159k32196m04568m68474m31667
14906E055505l14776j40413N0901K12294L21501L84631M09243L73715K40711J6283
14896F609595k30055m21323n29996n67469n47420m89213m33091m18273m47760
14887B524995m88457n01530m72985m23030l79423l48634l27184l26117l59083
$$ plain form
14955 6806476 7645240 8570981 9457697 10202350 10765205 11150480 11360567 11374530 11158584 10702097
14945 10702097 10047411 9274734 8467051 7703183 7068493 6643372 6464837 6491902 6607093
14936 6607093 6658668 6525816 6179944 5706989 5275101 5054556 5117728 5395424 5732701 5973967
14926 5973967 6008776 5792594 5363441 4835482 4352544 4027062 3908492 3990662 4236545 4599107
14916 4599107 5031050 5492093 5947077 6340341 6582251 6592410 6360214 5955646 5487172 5055505
14906 5055505 4740729 4600316 4651217 4863511 5185012 5569643 5978886 6352601 6593312 6609595
14896 6609595 6379540 5958217 5428221 4860752 4313332 3824119 3391028 2972755 2524995
14887 2524995 2036538 1535008 1062023 638993 259570 -89064 -416248 -742365 -1101448
14878a101448m23517n17512o49428q12355r69806j079670j110971j033505q30564
14869h528776n32548k07293R0031L38334N27461O41806O82257O89600P19177P85451
14859d794500Q47527Q58343Q10117P25962O39522N91589O02712O28126N74227
14850A483625L88702J29507o6961r5995K6182J77853K35356J68712M0818p2018
14840B415781j32782j38546j01493l4273N0296J35326K10563K78089L42086L91810
14830C416857L93570L11913J44614p5225l08970n27593o97721p69170o94827m73055
14820G20393j71943R1189K15318J89097R2549J6711q342j1578l4277j02774k16340
14809G80003l40105m28953m64265m65983m68454m78407m60655l72876k06507O510
$$ plain form
14878 -1101448 -1524965 -2042477 -2691905 -3504260 -4474066 -5553736 -6664707 -7698212 -8528776
14869 -8528776 -9061324 -9268617 -9178586 -8840252 -8312791 -7670985 -6988728 -6299128 -5579951 -4794500
14859 -4794500 -3946973 -3088630 -2278513 -1552551 -913029 -321440 281272 909398 1483625
14850 1483625 1872327 2001834 1934873 1838878 1865060 2042913 2278269 2446981 2487799 2415781
14840 2415781 2282999 2144453 2042960 2008687 2058983 2194309 2404872 2682961 3025047 3416857
14830 3416857 3810427 4122340 4266954 4191729 3882759 3355166 2657445 1888275 1193448 720393
14820 720393 548450 639639 854957 1044054 1136603 1153314 1144972 1133394 1099117 996343 780003
14809 780003 439898 10945 -453320 -919303 -1387757 -1866164 -2326819 -2699695 -2906202 -2899692
14799b899692K09468L43079L66916K84117J56566O3828L3801L1828P370o8738
14789a471457j96777l39796m28010m09923k93533j27466K7534J10898R3457J3025
14779c022048m9422l7191M9833J69396K69877L25505L46347L55528L59773L44926
14769h87476K97698K18435J20576L1488j5807K6P5872J85045K93424L68612L67599
14758A055492K49365L6680j69130k68194k20668l6620K27562M81017O58909P60940
14748B775353Q19272Q51614Q56788Q26479P41324N85080L68008J20685j19358
14739G825245l08244l99365l69013k52701j41339j15226j78270k68140l30007
14730E462940l69086m23333m95155n31686m82844l57078k04414o3390N8911J64936
$$ plain form
14799 -2899692 -2690224 -2347145 -1980229 -1696112 -1539546 -1475718 -1441917 -1410089 -1402719 -1471457
14789 -1471457 -1668234 -2008030 -2436040 -2845963 -3139496 -3266962 -3239428 -3128530 -3035073 -3022048
14779 -3022048 -3071470 -3108661 -3058828 -2889432 -2619555 -2294050 -1947703 -1592175 -1232402 -887476
14769 -887476 -589778 -371343 -250767 -219279 -235086 -235060 -159188 25857 319281 687893 1055492
14758 1055492 1304857 1341537 1172407 904213 683545 646925 874487 1355504 2014413 2775353
14748 2775353 3594625 4446239 5303027 6129506 6870830 7455910 7823918 7944603 7825245
14739 7825245 7517001 7117636 6748623 6495922 6354583 6239357 6061087 5792947 5462940
14730 5462940 5093854 4670521 4175366 3643680 3160836 2803758 2599344 2535954 2594865 2759801
14720B759801K40904K50622J55059n2333l20243n55250o81155o85148o07094m99591
14710E572m03054l29965k56090j47589n878J30192K32908L10910L67097L64669
14700B68772K64601P4017j55033l62721n11103n83262n78532n08516l80107j91181
14690b663065N7591L47505O18867P79793P62801N60000K15141j91513n73000q78377
14680i64257j098152j232534j281792j254003j147044r34331n93324j58117K68722
14671h394832N80457P41915P94401P99946P98579Q14903Q65669R39565R84197
14662a075200R25470P13538L59637o1469m39316o80053p52522o89212n49883l87368
14652b636378k34342j03012R025J11693K22341L51494M73032N36580N13965M05980
$$ plain form
14720 2759801 3000705 3251327 3406386 3354053 3033810 2478560 1797405 1112257 505163 5572
14710 5572 -397482 -727447 -983537 -1131126 -1137004 -1006812 -773904 -462994 -95897 268772
14700 268772 533373 607390 452357 89636 -421467 -1004729 -1583261 -2091777 -2471884 -2663065
14690 -2663065 -2605474 -2257969 -1639102 -859309 -96508 463492 678633 487120 -85880 -964257
14680 -964257 -2062409 -3294943 -4576735 -5830738 -6977782 -7912113 -8505437 -8663554 -8394832
14671 -8394832 -7814375 -7072460 -6278059 -5478113 -4679534 -3864631 -2998962 -2059397 -1075200
14662 -1075200 -149730 563808 923445 861976 422660 -257393 -1009915 -1699127 -2249010 -2636378
14652 -2636378 -2870720 -2973732 -2964707 -2853014 -2630673 -2279179 -1806147 -1269567 -755602 -349622
14642c49622K20224k2205k67431m52579n62338o31359o81711o90334o23134m83312
14632d543801l19367j95696j63414k31422l45991m17020l74418k02447O4555L68805
14622f360216O43745Q14855Q30056P04720N19281L62421K73601K37350K24547
14613a749640K32688K79832L57893M09322L69411K26545K6799j68951l21224m18290
14603g55615m57262m39289l87696l40285l10232k71424j94793r0696m658L2474
14593c219476M2534P1797J22786J41039Q8079P455j811J15501L03390M37065M27271
14582a464370K85375R9507m7100j28238j55113j37307p5308L4380K04849M47316
14572i36009P33759R84920J117810J109226J003095Q68614P64456P11363O71712
$$ plain form
14642 -349622 -129398 -151603 -419034 -871613 -1433951 -2065310 -2747021 -3437355 -4060489 -4543801
14632 -4543801 -4863168 -5058864 -5222278 -5453700 -5799691 -6216711 -6591129 -6793576 -6729021 -6360216
14622 -6360216 -5716471 -4901616 -4071560 -3366840 -2847559 -2485138 -2211537 -1974187 -1749640
14613 -1749640 -1516952 -1237120 -879227 -469905 -100494 126051 152850 -16101 -337325 -755615
14603 -755615 -1212877 -1652166 -2039862 -2380147 -2690379 -2961803 -3156596 -3247292 -3251950 -3219476
14593 -3219476 -3176942 -3105145 -2982359 -2841320 -2753241 -2745786 -2747597 -2632096 -2328706 -1891641 -1464370
14582 -1464370 -1178995 -1079488 -1126588 -1254826 -1409939 -1547246 -1622554 -1588174 -1383325 -936009
14572 -936009 -202250 782670 1900480 3009706 4012801 4881415 5645871 6357234 7028946
14563G028946N65358L32351j118l40069o13822q16805r60028j029399r97881q58584
14553B308949o43766m12846k14126n8329O8105J80052K83395L70466M26174M42857
14543B750931M14858L21679J44817r4668l23863m51173m34623l18306j80285m7200
14533A782167J17043L32955N49662O86026P03384O28692N11682L71902K16148
14524E899661Q9546N3865J20902K40187L38761L55734K68751J11442m6771j35249
14514G296829j04874N5097L04320N61055P45455Q11467P40050N39164K60483k793
14504A1206253j53660j54200m5073J02689K28876L01318L21249K94432K01868
14495A2303752K6035j99502l96194n05309n25249m80284l85414k55895j31439
$$ plain form
14563 7028946 7594304 7926655 7925537 7585468 6971646 6154841 5194813 4165414 3167533 2308949
14553 2308949 1665183 1252337 1038211 979882 1047987 1228039 1511434 1881900 2308074 2750931
14543 2750931 3165789 3487468 3632285 3537617 3213754 2762581 2327958 2009652 1829367 1782167
14533 1782167 1899210 2232165 2781827 3467853 4171237 4799929 5311611 5683513 5899661
14524 5899661 5989207 6043072 6163974 6404161 6742922 7098656 7367407 7478849 7432078 7296829
14514 7296829 7191955 7247052 7551372 8112427 8857882 9669349 10409399 10948563 11209046 11206253
14504 11206253 11052593 10898393 10853320 10956009 11184885 11486203 11807452 12101884 12303752
14495 12303752 12329787 12130285 11734091 11228782 10703533 10223249 9837835 9581940 9450501
14486I450501n9664n2769q8637j51456k35207l11403l32402k66738j25781L3735
14476G860179J47019J93690K11562K60046L63081M82027N51384N28522M10839
14467A1008349K31377K6450j98151m40779o55958p80305p91941p07616n50976
14458G140450l48097j22908J18638L69213N81181O79920O24380M47218K32381
14449I722376M9668q7375k06803l34888m66256n69245o16625o13904n92529n73868
14439E710551n51287n03964m20195l07325j84889p9425j9899k8228j18162k88255
14429C208922n06317p18544q70151r11683q08360n61859k14558J67309N01462
14420g13779P04677P38984O37185M69474L03870J89407J43129J52976K01367K79468
$$ plain form
14486 9450501 9390837 9338068 9249431 9097975 8862768 8551365 8218963 7952225 7826444 7860179
14476 7860179 8007198 8200888 8412450 8672496 9035577 9517604 10068988 10597510 11008349
14467 11008349 11239726 11266176 11068025 10627246 9971288 9190983 8399042 7691426 7140450
14458 7140450 6792353 6669445 6788083 7157296 7738477 8418397 9042777 9489995 9722376
14449 9722376 9772044 9684669 9477866 9142978 8676722 8107477 7490852 6876948 6284419 5710551
14439 5710551 5159264 4655300 4235105 3927780 3742891 3663466 3643567 3615339 3497177 3208922
14429 3208922 2702605 1984061 1113910 202227 -606133 -1167992 -1382550 -1215241 -713779
14420 -713779 -9102 729882 1367067 1836541 2140411 2329818 2472947 2625923 2827290 3106758
14410C106758L78834M70356M96612M07743K14816j2505k13781l83951n35375o44256
14400C285251o70286o06856m86631l53822k38713j52927j03771r5806j07770q9241
14390C79428K791J65777L43429M54411M42941L13755J24590m7870j43496j40528
14380A895228n3288Q1420K13352K90597K89511K38989J99252K00365K05756J54614
14370C715796L5641r3092j55732j31436o6192j4994r526o5990j75982l08509m36531
14359B293453n46986o39417p18963p74783p73888o87738n16505k76970K0428L55001
14349b266368O70435Q90285R52115Q45982O42025M52669L50600L29689L22618
14340C190050K50368R4046p6939j78013j94032j68470j44654j45840j97249l30980
$$ plain form
14410 3106758 3485592 3955948 4452560 4860303 5075119 5062614 4848833 4464882 3929507 3285251
14400 3285251 2614965 2008109 1521478 1167656 928943 776016 672245 576439 468669 379428
14390 379428 382219 547996 891425 1345836 1788777 2102532 2227122 2179252 2035756 1895228
14380 1895228 1841940 1923360 2136712 2427309 2716820 2955809 3155061 3355426 3561182 3715796
14370 3715796 3751437 3658345 3502613 3371177 3304985 3289991 3280465 3214475 3038493 2729984 2293453
14359 2293453 1746467 1107050 388087 -386696 -1160584 -1848322 -2364827 -2641797 -2621369 -2266368
14349 -2266368 -1595933 -705648 246467 1092449 1734474 2187143 2537743 2867432 3190050
14340 3190050 3440418 3534464 3457525 3279512 3085480 2917010 2772356 2626516 2429267 2098287
14330B098287n42137p59859q94979r19999q75225p85610o15126l27383M1845L91186
14320c189000O19752O86000O15498M72177L29829K51331K60428L17554L49788
14311G13357L25430K84546K81642L06614K85591J61544m9428k81671m86535o60442
14301H80648q04378q88019q74058p60782n86931m03751k54400j68920j54682j97948
14291d213221k80079l72140m24690l92807k66921p5862J28035K96250M14872N09347
14281d677216O11493P17768P87124P75981O64011M62376K22322K5039o4843k9379
14271e05324J15135L29190N56144P47692Q79978R41147R30676Q64721P47736N57604
14261F164699K85530k6221l08462n28379p11201q87328j033285j085214j018869
$$ plain form
14330 2098287 1556150 796291 -98688 -1018687 -1893912 -2679522 -3294648 -3622031 -3580186 -3189000
14320 -3189000 -2569248 -1883248 -1267750 -795573 -465744 -214413 46015 363569 713357
14311 713357 1038787 1323333 1604975 1911589 2197180 2358724 2309296 2027625 1541090 880648
14301 880648 76270 -811749 -1685807 -2446589 -3033520 -3437271 -3691671 -3860591 -4015273 -4213221
14291 -4213221 -4493300 -4865440 -5290130 -5682937 -5949858 -6025720 -5897685 -5601435 -5186563 -4677216
14281 -4677216 -4065723 -3347955 -2560831 -1784850 -1120839 -658463 -436141 -411102 -475945 -505324
14271 -505324 -390189 -60999 495145 1242837 2122815 3063962 3994638 4859359 5607095 6164699
14261 6164699 6450229 6424008 6115546 5587167 4875966 3988638 2955353 1870139 851270
14252H51270q98945q19579q07818q09709p48264n70344k65384J26557N31754Q74235
14242b536227J090515J144911J046759Q35796N53450K46918j4271j64635j88043
14233B015173j23234k8697O0872J49057K42141L17033L49482L37148K69648J18763
14223C707386j18321l86518n94865o71198o10474m84921l89615l60297l54260
14214b63083l09802k06889p8207K3118O2603L7283l5506j34189k44409l57519
14204a506600m56073n10621m95923m13776k95420j67864l2188J09268K19366K45699
14194c304132J71536K0787j71669l55284m57429m28656k80736o3635J71042L73180
14184d324996M90352M83206L50860J50316j1801l0614J17926L49517N47352O37538
$$ plain form
14252 851270 -47675 -867254 -1675072 -2484781 -3233045 -3803389 -4068773 -3942216 -3410462 -2536227
14242 -2536227 -1445712 -300801 745958 1581754 2135204 2382122 2367851 2203216 2015173
14233 2015173 1891939 1863242 1924114 2073171 2315312 2632345 2981827 3318975 3588623 3707386
14223 3707386 3589065 3202547 2607682 1936484 1326010 841089 451474 91177 -263083
14214 -263083 -572885 -779774 -857981 -834863 -772260 -734977 -770483 -904672 -1149081 -1506600
14204 -1506600 -1962673 -2473294 -2969217 -3382993 -3678413 -3846277 -3878465 -3769197 -3549831 -3304132
14194 -3304132 -3132596 -3111809 -3283478 -3638762 -4096191 -4524847 -4805583 -4869218 -4698176 -4324996
14184 -4324996 -3834644 -3351438 -3000578 -2850262 -2862063 -2892677 -2774751 -2425234 -1877882 -1240344
14174a240344N81487L68316M6229k78799n05252n98874n82749m80236k98470n8825
14164c047517J91437M08929N80043P07127P84601P98226P50353O84543O63082
14155B520824P06380P54714O94256M46628N4511l31368n58304n70160m16267j79387
14145C121827Q1777L29518N26335O27642N98869M47549K35880N1074m6621m8840
14135E925010J7332J25636K75980M76372P02704Q94171R95427R93826R04827P37730
14125A2049015M95100J92820j37952m50591o75558p48585o63936m83393k86027
14116I290893j18416J3657J18540J80371J62457O7516l3538o6085k7719K1467
14106I609143K6252k2080r9688j83632k59750l02252k79578j98299j02056r181
$$ plain form
14174 -1240344 -658857 -290541 -244312 -523111 -1028363 -1627237 -2209986 -2690222 -2988692 -3047517
14164 -3047517 -2856080 -2447151 -1867108 -1159981 -375380 422846 1173199 1857742 2520824
14155 2520824 3227204 3981918 4676174 5122802 5177313 4845945 4287641 3717481 3301214 3121827
14145 3121827 3203604 3533122 4059457 4687099 5285968 5733517 5969397 6020471 5973850 5925010
14135 5925010 5942342 6067978 6343958 6820330 7523034 8417205 9412632 10406458 11311285 12049015
14125 12049015 12544115 12736935 12598983 12148392 11472834 10724249 10060313 9576920 9290893
14116 9290893 9172477 9186134 9304674 9485045 9647502 9715018 9681480 9615395 9587676 9609143
14106 9609143 9635395 9613315 9513627 9329995 9070245 8767993 8488415 8290116 8188060 8178879
14096H178879J14010L07673N68145Q44219J072885J214338J258827J221422J141848
14087A5922246J078654J081496J158534J273168J371707J415595J396277J336122
14079B6033799J275813J237178J198856J136482J072504J061193J139427J288559
14071C5443811J421699J421425J228044Q91245N13973J69562j20047l60035n39070
14062D0070607o14336n52971l64818r5370J83375L86781M50690L54773J23641
14053C9942372j71369m32319n95567o63173o56925n63763l65335j09689R6673
14044C6480905J75000J15331p1798l86299p99218j229493j582851j792098j821297
14035B9088182j672378j403928j122941r30801q59997q65213q72936q38739p62937
$$ plain form
14096 8178879 8292889 8600562 9168707 10012926 11085811 12300149 13558976 14780398 15922246
14087 15922246 17000900 18082396 19240930 20514098 21885805 23301400 24697677 26033799
14079 26033799 27309612 28546790 29745646 30882128 31954632 33015825 34155252 35443811
14071 35443811 36865510 38286935 39514979 40406224 40920197 41089759 40969712 40609677 40070607
14062 40070607 39456271 38903300 38538482 38443112 38626487 39013268 39463958 39818731 39942372
14053 39942372 39771003 39338684 38743117 38079944 37423019 36859256 36493921 36384232 36480905
14044 36480905 36655905 36771236 36699438 36313139 35513921 34284428 32701577 30909479 29088182
14035 29088182 27415804 26011876 24888935 23958134 23098137 22232924 21359988 20521249 19758312
14026A9758312o59311n39119m27371l60225l59450m10745m60937m42397l17952
14017A5780805j11896J12130L01162M34062N05633N07967M43462L47651K75195
14008A8596171K64478L07075L42494L13231K28157J43409R6965R2718J26795J99623
13998B0711116L03237M04269M48208M02546L00818K17000J98394K40404K92011
13989B3518003K67516J01339j86870m98774p21565p79117o49983l70357k0140
13980B0660052L16301N85893P72249Q82936R31384R23313Q63012P69038O75348
13971B7379526O20357O29684O90793P47324P44064O80758O12760O05626O85565
13962C3396457Q21738R51473J016469R87738Q89741P97186P75385Q16860Q55263
$$ plain form
14026 19758312 19099001 18559882 18132511 17772286 17412836 17002091 16541154 16098757 15780805
14017 15780805 15668909 15781039 16082201 16516263 17021896 17529863 17973325 18320976 18596171
14008 18596171 18860649 19167724 19510218 19823449 20051606 20195015 20291980 20384698 20511493 20711116
13998 20711116 21014353 21418622 21866830 22269376 22570194 22787194 22985588 23225992 23518003
13989 23518003 23785519 23886858 23699988 23201214 22479649 21700532 21050549 20680192 20660052
13980 20660052 20976353 21562246 22334495 23217431 24148815 25072128 25935140 26704178 27379526
13971 27379526 27999883 28629567 29320360 30067684 30811748 31492506 32105266 32710892 33396457
13962 33396457 34218195 35169668 36186137 37173875 38063616 38860802 39636187 40453047 41308310
13953D1308310Q38172P66260O66801N47401L83129J47757j41014m14319n97308
13944D3505189o60576o34634n91694o15144p50597r63759j161880j269234j282189
13935C5575482j248118j206405j166225j122342j073877j032711j024439j077006
13927B6624359j196209j334454j392654j305888j126005r70861r06977r17069
13919A7474242r54321r91426j023110j037237r94701q54870o32250m06371k59229
13910A0320727k27595l11072m77333o54988p63075p59765o61486n26340m12223
13901E526850l35978k73606j95900r8512o258M5024L2144m2061j47162k38706
13891D265835k83695k73325k14885j16575K2449K07031M20268O02708O72785N78398
$$ plain form
13953 41308310 42146482 42912742 43579543 44126944 44510073 44657830 44516816 44102497 43505189
13944 43505189 42844613 42209979 41618285 41003141 40252544 39288785 38126905 36857671 35575482
13935 35575482 34327364 33120959 31954734 30832392 29758515 28725804 27701365 26624359
13927 26624359 25428150 24093696 22701042 21395154 20269149 19298288 18391311 17474242
13919 17474242 16519921 15528495 14505385 13468148 12473447 11618577 10986327 10579956 10320727
13910 10320727 10093132 9782060 9304727 8649739 7886664 7126899 6465413 5939073 5526850
13901 5526850 5190872 4917266 4721366 4622854 4616596 4661620 4693764 4651703 4504541 4265835
13891 4265835 3982140 3708815 3493930 3377355 3399804 3606835 4027103 4629811 5302596 5880994
13881E880994L27931k0067l73062o20054o90046o19837n20885m65217m29304l44332
13871B126121j75879M7954K63112M09650M58718M22032L49898L03647K95695K62290
13861D763238J31835r2167l44278n57255o80207o75837n43309l36327j25273O2066
13851A602486K33866L82155M78623N10544M81864L94677K77886K14299K90538
13842D866938N13309P91652J015571J140205J176056J121136R51746O78311L64703
13833A2619627Q5249j18500k35033k62796k18062j42925q7431q2033j06265p6617
13823A1375214R7497M15121P52073R42295Q95587O57643L71082J68848Q6624N8011
13813A5819995o591j33916k85722m15673m86794m60819l29849j48053l794L3264
$$ plain form
13881 5880994 6208925 6188858 5815796 5195742 4505696 3885859 3364974 2899757 2470453 2126121
13871 2126121 1950242 1998196 2261308 2670958 3129676 3551708 3901606 4205253 4500948 4763238
13861 4763238 4895073 4802906 4458628 3901373 3221166 2545329 2002020 1665693 1540420 1602486
13851 1602486 1836352 2218507 2697130 3207674 3689538 4084215 4362101 4576400 4866938
13842 4866938 5380247 6171899 7187470 8327675 9503731 10624867 11576613 12254924 12619627
13833 12619627 12704876 12586376 12351343 12088547 11870485 11727560 11640129 11558096 11451831 11375214
13823 11375214 11472711 11887832 12639905 13582200 14477787 15135430 15506512 15675360 15761984 15819995
13813 15819995 15813404 15679488 15393766 14978093 14491299 14030480 13700631 13552578 13548784 13582048
13803A3582048n6323k40494m56417o38238p42580p57623o95214n85272m68309
13794H941578l74383l09469k65840k34429k08301j90420k02837k75095m10962
13785F469842n73067p05614p64211p36842o53298n61034m88315m39232m04483
13776A143746l59926k73540j34392L1091J84767L11511M13865M87877N26986N38142
13766B870127N42511N63450N98976O07615N47887M20952K63265J28307P0513J15485
13756F729088K49348M31035N95827O66254N83249L32820l6655m21385p16241q67654
13746G545686q77813p90149o66918n60167n07977n26759n79180n93932n40121
13737A902670m47669l56853k83527k29508j98861j98893k25501k53254k49892
$$ plain form
13803 13582048 13525725 13285231 12828814 12190576 11447996 10690373 9995159 9409887 8941578
13794 8941578 8567195 8257726 7991886 7757457 7549156 7358736 7155899 6880804 6469842
13785 6469842 5896775 5191161 4426950 3690108 3036810 2475776 1987461 1548229 1143746
13776 1143746 783820 510280 375888 406979 591746 903257 1317122 1804999 2331985 2870127
13766 2870127 3412638 3976088 4575064 5182679 5730566 6151518 6414783 6543090 6613603 6729088
13756 6729088 6978436 7409471 8005298 8671552 9254801 9587621 9550966 9129581 8413340 7545686
13746 7545686 6667873 5877724 5210806 4650639 4142662 3615903 3036723 2442791 1902670
13737 1902670 1455001 1098148 814621 585113 386252 187359 -38142 -291396 -541288
13728e41288k03247j39745j04325j09545j16125p2443L6069J79893L14317M08936
13718c47503M50221M25374L27340J77216K0077q7906r3566Q43J16956J67583J13171
13707A269806m9145k98559n79875q11590r23696r03237q07334p10546o39087n62205
13697e015468m36540k53771m6079J45480L04699M43222N63599O39471O48485N97585
13687b409317N10458M19604L59497L43245L42685L02218J88518K0495j52974k91790
13677c67361l84319m41352m76215m99092n13246m95580m04781k20525M4292L67213
13667c390966P19262J035245J215462J188504R71100O56025L61695K02756K50827
13658C209910M70612P22875Q65525Q48726P26281N98816N31618M98717M12793
$$ plain form
13728 -541288 -744535 -884280 -988605 -1098150 -1214275 -1286718 -1250649 -1070756 -756439 -347503
13718 -347503 102718 528092 855432 1032648 1052725 964819 871253 872096 989052 1156635 1269806
13707 1269806 1220661 922102 342227 -469363 -1393059 -2296296 -3103630 -3814176 -4453263 -5015468
13697 -5015468 -5452008 -5705779 -5751858 -5606378 -5301679 -4858457 -4294858 -3655387 -3006902 -2409317
13687 -2409317 -1898859 -1479255 -1119758 -776513 -433828 -131610 56908 77403 -75571 -367361
13677 -367361 -751680 -1193032 -1669247 -2168339 -2681585 -3177165 -3581946 -3802471 -3758179 -3390966
13667 -3390966 -2671704 -1636459 -420997 767507 1738607 2394632 2756327 2959083 3209910
13658 3209910 3680522 4403397 5268922 6117648 6843929 7442745 7974363 8473080 8885873
13649H885873K18936n5340l35661n57761o82129o77165n12404j82775K43553O33283
13639F978410Q77866R46004Q69940P42400O83296P40091Q40400Q56221P03454
13630A4238082L96034K1428l22826n74009p11514p36776o65659n43739m35256
13621A0665765l81937l84093m10940m10509l23842j25211J40331L74873M89786
13612I634223M52507K90690O0701j90267m27963o22538p73541r20765j099837
13603F403210j297075j455091j517217j455627j257836r27160n21955j49118J09506
13594b068363K48031L26977M23105N66179P05501P48660O47511M41965K28747
13585B268313R7616Q1551J48235K42111L40119M58636O10995P66162Q52596Q11315
$$ plain form
13649 8885873 9104809 9049469 8713808 8156047 7473918 6796753 6284349 6101574 6345127 6978410
13639 6978410 7856276 8802280 9672220 10414620 11097916 11838007 12678407 13534628 14238082
13630 14238082 14634116 14655544 14332718 13758709 13047195 12310419 11644760 11101021 10665765
13621 10665765 10283828 9899735 9488795 9078286 8754444 8629233 8769564 9144437 9634223
13612 9634223 10086730 10377420 10438121 10247854 9819891 9197353 8423812 7503047 6403210
13603 6403210 5106135 3651044 2133827 678200 -579636 -1506796 -2028751 -2177869 -2068363
13594 -2068363 -1820332 -1493355 -1070250 -504071 201430 950090 1597601 2039566 2268313
13585 2268313 2365929 2447480 2595715 2837826 3177945 3636581 4247576 5013738 5866334 6677649
13575F677649O44155M01809J29792j51605m18170o25940p28123o97749n40496
13566D691322k93775k6143J66956K14741J37344L0129k5879k2598L712K4255K3067
13555D923131n194m1476n6127m2297j3820K7531R4028J79957K60148L26122L95984
13544F047987M77854N35374N16377M33452L84184M48151N89340P01646P23845
13535A0858210O74838N91331M70034K80775L745l48651p19370j025476j196074
13526I589362j190870j004372o75336k89003N5993K85953L66255L09434J75037
13517G622453M5380j4326K6714J73773M01391O39690P96158Q08899O72761M18982
13507A1591875R1476k54175n52582p46266q02123p19281n28125k84621n2246J33335
$$ plain form
13575 6677649 7321804 7723613 7853405 7701800 7283630 6657690 5929567 5231818 4691322
13566 4691322 4397547 4371404 4538360 4753101 4890445 4920574 4894695 4872097 4875809 4900064 4923131
13555 4923131 4917937 4876461 4820334 4778037 4764217 4791748 4885776 5065733 5325881 5652003 6047987
13544 6047987 6525841 7061215 7577592 8011044 8395228 8843379 9432719 10134365 10858210
13535 10858210 11533048 12124379 12594413 12875188 12878933 12530282 11810912 10785436 9589362
13526 9589362 8398492 7394120 6718784 6429781 6485774 6771727 7137982 7447416 7622453
13517 7622453 7667833 7653507 7680221 7853994 8255385 8895075 9691233 10500132 11172893 11591875
13507 11591875 11683351 11429176 10876594 10130328 9328205 8608924 8080799 7796178 7743932 7877267
13497G877267K72683L70261M09311L60089K14135J9687j23262j32678k5027R9789
13487I342255J59417J52406J33332J48736J93481K14034J57499L7742n7805n4995
13477A0426102K7524J06773J23617Q3199K4997k4970p2575j41957k46762l70377
13467I935571m85677n86814o72314p09255o63420n59476m60301l92932l27891
13458E077491k25808p8316J04968L18063N47575P55518Q82439Q78210P48903N77080
13448I586123M74010M94793O00977O97036O98498N82124L80670J38141j16210
13439A3536162l63347n81913p44695q29302q35669p89716p13731n91811l85658
13430G700320r7203K00058M12706M98934M79598L97118K76506J22517n2754k06203
$$ plain form
13497 7877267 8149950 8520211 8929522 9289611 9503746 9523433 9400171 9267493 9242466 9342255
13487 9342255 9501672 9654078 9787410 9936146 10129627 10343661 10501160 10538902 10481097 10426102
13477 10426102 10453626 10560399 10684016 10767215 10792212 10767242 10694667 10552710 10305948 9935571
13467 9935571 9449894 8863080 8190766 7481511 6818091 6258615 5798314 5405382 5077491
13458 5077491 4851683 4773367 4878335 5196398 5743973 6499491 7381930 8260140 9009043 9586123
13448 9586123 10060133 10554926 11155903 11852939 12551437 13133561 13514231 13652372 13536162
13439 13536162 13172815 12590902 11846207 11016905 10181236 9391520 8677789 8085978 7700320
13430 7700320 7603117 7803175 8215881 8714815 9194413 9591531 9868037 9990554 9937800 9731597
13420I731597k69902j85892M1383L24110N42329O13971N20228L00764L9066j75152
13410A1482502k81866k44557m7737K54458N21234O14978N06220K80643P0242j6475
13400A3139642O9429L07680O12381Q60154R50543Q63611O58308M25827K47211
13391A8134786J48844Q4194n073j14300j86179j79814j16546p0128j12210k55014
13381A7328560m42274n99123o94675p50510p92299q13887p95702p36446o47904
13372A1055740n32858l74005j42568J64345M89837P42227Q61677Q59395P99896
13363A3923686P48566P24261O93819O21316N07073L62888J90281K652j62629k58168
13353A7353745k41434r7755J31575L62631N29115O25741O87792P30193P23268
$$ plain form
13420 9731597 9461695 9275803 9317186 9641296 10183625 10797596 11317824 11618588 11657654 11482502
13410 11482502 11200636 10956079 10908342 11162800 11684034 12299012 12805232 13085875 13156117 13139642
13400 13139642 13209071 13516751 14129132 14989286 15939829 16803440 17461748 17887575 18134786
13391 18134786 18283630 18367824 18362751 18248451 18062272 17882458 17765912 17695784 17583574 17328560
13381 17328560 16886286 16287163 15592488 14841978 14049679 13235792 12440090 11703644 11055740
13372 11055740 10522882 10148877 10006309 10170654 10660491 11402718 12264395 13123790 13923686
13363 13923686 14672252 15396513 16090332 16711648 17218721 17581609 17771890 17774542 17611913 17353745
13353 17353745 17112311 17014556 17146131 17508762 18037877 18663618 19351410 20081603 20804871
13344B0804871O32497M57158K25329j8767k02692k31515n1788K78405O05216P75799
13334B3274513P36928N68447M11411L54462L89980M56464M96915M67418L31967
13325B7488505R6763j70162l73574m41198l46673j00971K54955O54028J019410
13316B8081083J288025J432854J463479J398448J253279J058752Q62812P09988
13308C7548720O31674O39676P08550P81695Q16203Q14054Q04050Q02138P91043
13299D4337803P38332O41401N49081N15043N35803N66372N85070O08053O50834
13290D9727792P15982Q21115R97956J236105J445867J514139J413137J236322
13282E9108415J106109J066507J088014J142043J223719J314988J365284J319596
$$ plain form
13344 20804871 21437368 21894526 22119855 22101088 21898396 21666881 21615093 21893498 22498714 23274513
13334 23274513 24011441 24579888 24991299 25345761 25735741 26192205 26689120 27156538 27488505
13325 27488505 27585268 27415106 27041532 26600334 26253661 26152690 26407645 27061673 28081083
13316 28081083 29369108 30801962 32265441 33663889 34917168 35975920 36838732 37548720
13308 37548720 38180394 38820070 39528620 40310315 41126518 41940572 42744622 43546760 44337803
13299 44337803 45076135 45717536 46266617 46781660 47317463 47883835 48468905 49076958 49727792
13290 49727792 50443774 51264889 52262845 53498950 54944817 56458956 57872093 59108415
13282 59108415 60214524 61281031 62369045 63511088 64734807 66049795 67415079 68734675
13274F8734675J169020R61414P47985N52058L86699K46661R7855q1028k59392
13265G2555947l81449m30312m39496m32267l83163k59795p4370J20832K58481
13256G0534408K79120J72534K575j29091j51740o8671N5157J38953J26537R896
13246G0969678j69564l41164m28053l88048k57914j27858o5936r1685k00902l73631
13236F8524923n72087p57111r03783j015410j130460j283272j443079j519627
13228E9900094j454068j292016j141763j073945j089479j162504j274725j404745
13220E0006849j511119j560340j556741j511420j408573j224794r61398o55193
13212C9617271l67009j60325p9485j34807k99606n10729o90899p99353q55353
$$ plain form
13274 68734675 69903695 70865109 71613094 72165152 72551851 72798512 72896367 72815339 72555947
13265 72555947 72174498 71744186 71304690 70872423 70489260 70229465 70155095 70275927 70534408
13256 70534408 70813528 70986062 70988637 70859546 70707806 70639135 70694292 70833245 70959782 70969678
13246 70969678 70800114 70458950 70030897 69642849 69384935 69257077 69191141 69099456 68898554 68524923
13236 68524923 67952836 67195725 66291942 65276532 64146072 62862800 61419721 59900094
13228 59900094 58446026 57154010 56012247 54938302 53848823 52686319 51411594 50006849
13220 50006849 48495730 46935390 45378649 43867229 42458656 41233862 40272464 39617271
13212 39617271 39250262 39089937 39010452 38875645 38576039 38065310 37374411 36575058 35719705
13203C5719705q99601r43220r69675r80872j006584j057655j104171j112372j078948
13194B6566607j020417r52896q85588q10969p09435n71987l96243j67776J21173
13185B1172469M35310O98693Q46877Q68129P89620O58665N45284N11533N49400
13176B7075980N74974N01670L15233Q8970o1464o4719N0434J99325L12336L45825
13166B9338564K75558J14332p9974k39764l41501m14211m83070n17036m69090
13157B7183808l58251k54329j93641j54672r5291O251J24295J91693J46712j4015
13147B6582560k25271m01498m93458m88553l78137j67553Q8000K91527L63489
13138B5171106K97240J54033J8524l0550N7231K66713N08703O78016P27484O86680
$$ plain form
13203 35719705 34820104 33876884 32907209 31926337 30919753 29862098 28757927 27645555 26566607
13194 26566607 25546190 24593294 23707706 22896737 22187302 21615315 21219072 21051296 21172469
13185 21172469 21607779 22306472 23153349 24021478 24811098 25469763 26015047 26526580 27075980
13176 27075980 27650954 28152624 28467857 28556827 28495363 28430644 28481078 28680403 28992739 29338564
13166 29338564 29614122 29728454 29648480 29408716 29067215 28653004 28169934 27652898 27183808
13157 27183808 26825557 26571228 26377587 26222915 26127624 26133875 26258170 26449863 26596575 26582560
13147 26582560 26357289 25955791 25462333 24973780 24595643 24428090 24516090 24807617 25171106
13138 25171106 25468346 25622379 25640903 25610353 25667584 25934297 26443000 27121016 27848500 28535180
13128B8535180O25336O00585O19627O40977O18584N53228N05652N52208P13269
13119C3964646R37592J159370J336211J435785J436246J343922J177734R52676
13111D3744182O99016M74765L42546L31718M18308N34768O15226O49795O78554
13102D8488878P36146Q15433Q66579Q36923P33422O29235O00366O68523P84538
13093E5160043Q49308P82278N99180M16228L61632M71227O63860Q11063Q23958
13084F0938777P01858N31903M34339M80220O42174Q23923R41978R82253R92941
13075F7470366J038140J150574J314381J483360J611259J682545J734445J839861
13067G9324931K051498K361715K714091L045450L313113L485261L526853L424305
$$ plain form
13128 28535180 29160516 29761101 30380728 31021705 31640289 32193517 32699169 33251377 33964646
13119 33964646 34902238 36061608 37397819 38833604 40269850 41613772 42791506 43744182
13111 43744182 44443198 44917963 45260509 45592227 46010535 46545303 47160529 47810324 48488878
13102 48488878 49225024 50040457 50907036 51743959 52477381 53106616 53706982 54375505 55160043
13093 55160043 56009351 56791629 57390809 57807037 58168669 58639896 59303756 60114819 60938777
13084 60938777 61640635 62172538 62606877 63087097 63729271 64553194 65495172 66477425 67470366
13075 67470366 68508506 69659080 70973461 72456821 74068080 75750625 77485070 79324931
13067 79324931 81376429 83738144 86452235 89497685 92810798 96296059 99822912 103247217
13059A03247217L225138L029339K926420K950994L089099L296247L517985L716814
13051A28999253L883711M024394M152553M289347M438649M576904M685584M780910
13043A63831305M903744N086168N336782N637003N931762O155883O282806O331351
13035B09496804O337180O325399O299179O255259O203709O158695O106386N985639
13027B59168250N721994N290118M730658M117706L519003K969707K470995K000349
13019B89988780J516898R67921L17220m15808j152018j805890k352235k830495
13011B84234373l289820l740679m160606m535513m867121n146391n355867n501553
13003B47636823n628017n791562o013696o265179o488595o622995o621091o480978
$$ plain form
13059 103247217 106472355 109501694 112428114 115379108 118468207 121764454 125282439 128999253
13051 128999253 132882964 136907358 141059911 145349258 149787907 154364811 159050395 163831305
13043 163831305 168735049 173821217 179157999 184795002 190726764 196882647 203165453 209496804
13035 209496804 215833984 222159383 228458562 234713821 240917530 247076225 253182611 259168250
13027 259168250 264890244 270180362 274911020 279028726 282547729 285517436 287988431 289988780
13019 289988780 291505678 292473599 292790819 292375011 291222993 289417103 287064868 284234373
13011 284234373 280944553 277203874 273043268 268507755 263640634 258494243 253138376 247636823
13003 247636823 242008806 236217244 230203548 223938369 217449774 210826779 204205688 197724710
12995A97724710o266044o072981n971705n969808o027549o091351o119019o098524
12987A49107729o034068n912963n711708n438645n148567m893189m667935m422382
12979A06878272m118422l775763l458768l231215l120547l097122l084294l009375
12971G9982766k854986k643123k374999k027277j611726j203641q93948p22315
12963F5650751o64676o77869p32630q03747q68307r23931r80137j029237j050255
12954E7919962j040610j023564j027133j068033j143309j221714j258188j230962
12946D8906449j163364j105980j105621j188248j334872j474835j532904j476843
12938C8523782j317610j086205q13877n28088k63858o6217K8717J3708q8943k41879
$$ plain form
12995 197724710 191458666 185385685 179413980 173444172 167416623 161325272 155206253 149107729
12987 149107729 143073661 137160698 131448990 126010345 120861778 115968589 111300654 106878272
12979 106878272 102759850 98984087 95525319 92294104 89173557 86076435 82992141 79982766
12971 79982766 77127780 74484657 72109658 70082381 68470655 67267014 66373066 65650751
12963 65650751 64986075 64308206 63575576 62771829 61903522 60979591 59999454 58970217 57919962
12954 57919962 56879352 55855788 54828655 53760622 52617313 51395599 50137411 48906449
12946 48906449 47743085 46637105 45531484 44343236 43008364 41533529 40000625 38523782
12938 38523782 37206172 36119967 35306090 34778002 34514144 34447927 34476644 34490352 34401409 34159530
12928C4159530m13876n89541p50492q62957q99389q54126p39253n80772m08479
12919B8060645k45746j19179o9738j32187k89108m52934n32082n26971n25623
12910B5167077n98874p31097q53752r10570q75245p31778m74644j32733K23878
12901B0082262N08827O60172O65452N57576L97333K52157J66051J37999J41334
12892B3569163J63743K16399L09497M30862N51099O41468O86122O74210N88245
12883B7830808M28429K29799K3527j93942m38533p03686r40339j070731j039566
12874B4125766q56179n92816l53536k30966k60787m03558n69017o58947o05849
12865A9594111m05244j24842J35834L13006M01794M26054M04478L32723J99166
$$ plain form
12928 34159530 33745654 33156113 32405621 31542664 30643275 29789149 29049896 28469124 28060645
12919 28060645 27814899 27695720 27625982 27493795 27204687 26751753 26219671 25692700 25167077
12910 25167077 24568203 23837106 22983354 22072784 21197539 20465761 19991117 19858384 20082262
12901 20082262 20591089 21251261 21916713 22474289 22871622 23123779 23289830 23427829 23569163
12892 23569163 23732906 23949305 24258802 24689664 25240763 25882231 26568353 27242563 27830808
12883 27830808 28259237 28489036 28512563 28318621 27880088 27176402 26236063 25165332 24125766
12874 24125766 23269587 22676771 22323235 22092269 21831482 21427924 20858907 20199960 19594111
12865 19594111 19188867 19064025 19199859 19512865 19914659 20340713 20745191 21077914 21277080
12856B1277080K2108j47519k66140l34593m00498n23322p15326r13083j024412
12847A6974295j002252q68689o78214m62236k17030M8587K80607M14727M22257
12838A4912052L12664J26145o9872k09764k57744k04772o3912J23741K89875L60204
12828A5318617K93557J02887j64176m62658p61351j026754j219030j297465j225462
12819I558165r89033o16426j74215K55164O01089Q26195R26831R18788Q36820
12810A2143378P43786P10480P63795Q54108Q83821P73767N07984J36367k42568
12801A7274918n11645n88141m72882k42447R808K20706L59229M19445M23861M04203
12791A7297055L67441K87534J28138j13734l80205n83733o66573o22356m82077
$$ plain form
12856 21277080 21299188 21151669 20885529 20550936 20150438 19627116 18911790 17998707 16974295
12847 16974295 15972043 15103354 14425140 13962904 13745874 13794461 14075068 14489795 14912052
12838 14912052 15224716 15350861 15280989 15071225 14813481 14608709 14544797 14668538 14958413 15318617
12828 15318617 15612174 15715061 15550885 15088227 14326876 13300122 12081092 10783627 9558165
12819 9558165 8569132 7952706 7778491 8033655 8634744 9460939 10387770 11306558 12143378
12810 12143378 12887164 13597644 14361439 15215547 16099368 16873135 17381119 17517486 17274918
12801 17274918 16763273 16175132 15702250 15459803 15469611 15690317 16049546 16468991 16892852 17297055
12791 17297055 17664496 17952030 18080168 17966434 17586229 17002496 16335923 15713567 15231490
12782A5231490k97420j21169Q800P2207O0135k4226j49912k63389l35060l90678
12772A3790778m75757o01604p33959q10693p81838o44201m28081j77231N5765
12763I193179K31693L46480M24112M92148N55598N88431N62272M85401M00966
12754A3280280L41664K95978K28633J30352L3978j9296k1337l826m011k8080n0794
12743A4183541n2173n1107r0291j94675l45385m73232m89337l53656j16377J21658
12733A2138966K88500L64055L34386J73005j08276m21610o55553p55030p30406
12724A0628037o19158m64121l06369j70592m8438Q7820K39893L69340M26026L73515
12714A0515953K13371r052k44983m74254o89324q75360j007518j051785r78127
$$ plain form
12782 15231490 14934070 14812901 14821701 14893908 14954043 14929817 14779905 14516516 14181456 13790778
12772 13790778 13315021 12713417 11979458 11168765 10386927 9742726 9314645 9137414 9193179
12763 9193179 9424872 9771352 10195464 10687612 11243210 11831641 12393913 12879314 13280280
12754 13280280 13621944 13917922 14146555 14276907 14310885 14291589 14270252 14266426 14262415 14234335 14183541
12743 14183541 14131368 14080261 13989970 13795295 13449910 12976678 12487341 12133685 12017308 12138966
12733 12138966 12427466 12791521 13125907 13298912 13190636 12769026 12113473 11358443 10628037
12724 10628037 10008879 9544758 9238389 9067797 9019359 9107179 9347072 9716412 10142438 10515953
12714 10515953 10729324 10720272 10475289 10001035 9311711 8436351 7428833 6377048 5398921
12705E398921p86292n19060k40637M722K10438L81804N01549N35628M70124L33508
12695F290705J81226O2497K777j713J3755o364j11502l09176n49288p54508q63870
12684C954539q50725p22997n14948k69708l0527J50122K12757J35298k6034j74115
12674A863662k57392k98111l27081l24420k52819j20157J8565J09535J28761P0964
12664F11507n3205j98203k84529k48777j01087Q1523K20464K86436K94355K75046
12654H83530K57261K56790K74625L03647L30305L36710L17455K98373L30564M49541
12644D038801O27170P67866P70440O12740L80242K02595J44077J43113P0355j50506
12634G606893m78899p84981r40138r05149p38985n46748m33933m63024o06085
$$ plain form
12705 5398921 4612629 4093569 3852932 3857654 4068092 4449896 4951445 5487073 5957197 6290705
12695 6290705 6471931 6534428 6537205 6535492 6549247 6542883 6431381 6122205 5572917 4818409 3954539
12684 3954539 3103814 2380817 1865869 1596161 1565634 1715756 1928513 2063811 2037777 1863662
12674 1863662 1606270 1308159 981078 656658 403839 283682 302247 411782 540543 611507
12664 611507 558302 360099 75570 -173207 -274294 -192771 27693 314129 608484 883530
12654 883530 1140791 1397581 1672206 1975853 2306158 2642868 2960323 3258696 3589260 4038801
12644 4038801 4665971 5433837 6204277 6817017 7197259 7399854 7543931 7687044 7757399 7606893
12634 7606893 7127994 6343013 5402875 4497726 3758741 3211993 2778060 2315036 1708951
12625A708951p56472q10288p40387o13200n36081n67032o78115p95445q48228
12616d636297p94883o36930m14001j76856L2960J85333K65761K86644K88897L16261
12606e283111L79293M55144N26076O04950P06574Q06324Q58084Q49323Q13299
12597G15956P98581Q48366R81217J151829J248521J179460R61298O97253M75387
12588I057868L14655K06867J60188J80328K45148L15878L52013L07189J40492
12579A1280626j40920m65363p37530q92125r11424q04499n85041k85711J0020
12570F468033J93165K04678N0573k49575o64549j112514j485673j717232j803038
12561a16132j770684j640993j411046j066229o13420r8855M06373Q16421J050179
$$ plain form
12625 1708951 952479 142191 -598196 -1211396 -1747477 -2314509 -2992624 -3788069 -4636297
12616 -4636297 -5431180 -6068110 -6482111 -6658967 -6626007 -6440674 -6174913 -5888269 -5599372 -5283111
12606 -5283111 -4903818 -4448674 -3922598 -3317648 -2611074 -1804750 -946666 -97343 715956
12597 715956 1514537 2362903 3344120 4495949 5744470 6923930 7885228 8582481 9057868
12588 9057868 9372523 9579390 9739578 9919906 10165054 10480932 10832945 11140134 11280626
12579 11280626 11139706 10674343 9936813 9044688 8133264 7328765 6743724 6458013 6468033
12570 6468033 6661198 6865876 6916449 6666874 6002325 4889811 3404138 1686906 -116132
12561 -116132 -1886816 -3527809 -4938855 -6005084 -6618504 -6717359 -6310986 -5494565 -4444386
12552d444386J084294R69846P87783O02747M44145L05299J43977j00017m51996
12543f58308q61986j227819j449403j457910j224206p78094k26972K70908N80242
12534g033548O53384N41895L52772J80782O1239k1154o6352j9487J61668M04965
12524d783836N45370M73415K34841k9199k07016k64705k16315r6281L6344R9567
12514d207815L8255j16038k55621k80027j69621K9099K79845N80335R01610J152582
12504b047396J238269J138623R27946P20144N82081M94892L96800K55146Q4874
12495C791379r2144k72291m44435n71615o18951n77919m53925k57778k4512J91553
12485F69362L50100M29796M24037L61334K94135K39201J57849R316j99634m23398
$$ plain form
12552 -4444386 -3360092 -2390246 -1602463 -999716 -555571 -250272 -106295 -206312 -658308
12543 -658308 -1520294 -2748113 -4197516 -5655426 -6879632 -7657726 -7884698 -7613790 -7033548
12534 -7033548 -6380164 -5838269 -5485497 -5304715 -5243476 -5264630 -5330982 -5350469 -5188801 -4783836
12524 -4783836 -4238466 -3765051 -3530210 -3559409 -3766425 -4031130 -4247445 -4343726 -4307382 -4207815
12514 -4207815 -4169560 -4285598 -4541219 -4821246 -4990867 -4961768 -4681923 -4101588 -3199978 -2047396
12504 -2047396 -809127 329496 1257442 1977586 2559667 3054559 3451359 3706505 3791379
12495 3791379 3699235 3426944 2982509 2410894 1791943 1214024 760099 502321 477809 669362
12485 669362 1019462 1449258 1873295 2234629 2528764 2767965 2925814 2935130 2735496 2312098
12475B312098o20737p82130r06926r58360q68846o08342k28209J77141N20473
12466a963838P31574P71546O58228M56160K31437K7149j17784j51994l7473J99235
12456H04240M54132O13848O46132O04526N44447M72734L85961L04872K47078J95094
12446E273064J00381p9337l31271n88733p97916r52883j048737j050497r36558
12437d12487p36120n00131k56456j0200K22506M07191N22008N66284N31849L89547
12427G23991J24117k22813n62670q13335r44208r75269r36835q36027o64824m22683
12417e530556j23704J96340M78645O63612P21451O63290N24457L51394J99407
12408a855664J04074M4402l9047j92989m23477o84709q89652r62302q79932o61186
$$ plain form
12475 2312098 1691361 909231 2305 -956055 -1824901 -2433243 -2661452 -2484311 -1963838
12466 -1963838 -1232264 -460718 197510 653670 885107 912256 794472 642478 605005 804240
12456 804240 1258372 1872220 2518352 3122878 3667325 4140059 4526020 4830892 5077970 5273064
12446 5273064 5373445 5294108 4962837 4374104 3576188 2623305 1574568 524071 -412487
12437 -412487 -1148607 -1648738 -1905194 -1915394 -1692888 -1285697 -763689 -197405 334444 723991
12427 723991 848108 625295 62625 -750710 -1694918 -2670187 -3607022 -4443049 -5107873 -5530556
12417 -5530556 -5654260 -5457920 -4979275 -4315663 -3594212 -2930922 -2406465 -2055071 -1855664
12408 -1855664 -1751590 -1707188 -1746235 -1939224 -2362701 -3047410 -3937062 -4899364 -5779296 -6440482
12398f440482l48016r461K77215M68012N57101N47813M39658K45803K1251j45130
12388d386236j87051j04068N1204K13375L30883L73401L35155K37880J22863L5815
12378b976779M860K5152O7718R1913N9973l9276j79352l14326m18307n05438o02200
12367d786062p14564q19108q59933p70350n25196j78823J55111L77214M53575
12358g668136M07188K91978J67638P3933L0043N0034J33213K43009L17703L13289
12348e640108K30151J04464n455m2272j560L9576j9593j94010l70301m00599k35994
12337f535701M4435L15624M97474N75848N66487M90374L68799J99357n1481l93562
12327c922346p56052j019654j116709j070967r27072o82994l18485J34739N80020
$$ plain form
12398 -6440482 -6788498 -6797959 -6520744 -6052732 -5495631 -4947818 -4508160 -4262357 -4241106 -4386236
12388 -4386236 -4573287 -4677355 -4626151 -4412776 -4081893 -3708492 -3373337 -3135457 -3012594 -2976779
12378 -2976779 -2971919 -2946767 -2879049 -2787136 -2727163 -2766439 -2945791 -3260117 -3678424 -4183862 -4786062
12367 -4786062 -5500626 -6319734 -7179667 -7950017 -8475213 -8654036 -8498925 -8121711 -7668136
12358 -7668136 -7260948 -6968970 -6801332 -6727399 -6697356 -6647322 -6514109 -6271100 -5953397 -5640108
12348 -5640108 -5409957 -5305493 -5310948 -5353220 -5354780 -5315204 -5334797 -5528807 -5899108 -6299707 -6535701
12337 -6535701 -6491266 -6175642 -5678168 -5102320 -4535833 -4045459 -3676660 -3477303 -3528784 -3922346
12327 -3922346 -4678398 -5698052 -6814761 -7885728 -8812800 -9495794 -9814279 -9679540 -9099520
12318i099520R13180J083481J109769J053126R71234Q73122P18296M87211K38913
12309a651188O7630J8393O8154J62281K42878K57462J79288L6691r1666j27627
12299h37704n3091P3904J62356J51003M0419j26499k99112m29098m78461m41404
12289b237687l53248k67855k19956k09703k25585k67222l25375l59190l33435
12280d799256k67130k16343k17079k49732k59959k21128j64655j47160k03896
12271f746338l33227n03754o57357p26753o80684n38248l35153j03930J19676
12262a0505768L02154M30685N18656N97865O98607Q06114Q40619P20159M51854
12253e139055J39230j10048k67373l69434m49192m98985m95514m36523l32800
$$ plain form
12318 -9099520 -8186340 -7102859 -5993090 -4939964 -3968730 -3095608 -2377312 -1890101 -1651188
12309 -1651188 -1583558 -1565165 -1497011 -1334730 -1091852 -834390 -655102 -618411 -710077 -837704
12299 -837704 -890795 -816891 -654535 -503532 -463113 -589612 -888724 -1317822 -1796283 -2237687
12289 -2237687 -2590935 -2858790 -3078746 -3288449 -3514034 -3781256 -4106631 -4465821 -4799256
12280 -4799256 -5066386 -5282729 -5499808 -5749540 -6009499 -6230627 -6395282 -6542442 -6746338
12271 -6746338 -7079565 -7583319 -8240676 -8967429 -9648113 -10186361 -10521514 -10625444 -10505768
12262 -10505768 -10203614 -9772929 -9254273 -8656408 -7957801 -7151687 -6311068 -5590909 -5139055
12253 -5139055 -4999825 -5109873 -5377246 -5746680 -6195872 -6694857 -7190371 -7626894 -7959694
12244g959694j77489N2507L48788O45626Q73360J011128J059859J007928Q52855
12235b285132O20348L58151J30421r222n9588o4565n8636m7248l3174l6043r0685
12224a575373k17509l89579n46339o30784o02104m33383j31301K29876N14073
12215c782423N92453M40996J75131m8633j62926j93491j78990j44001j16438j17717
12205c536039j39240j41522p2871R5100L30328N49316O68361O44526M97106L02276
12195h02659J36436Q777j36702l42571n78808p75464q85500q92548p87109n67671
12185e623819k53410J10114M54372P12463Q39918Q20145O73403M50374J93797
12176a622643q4970l72375o11528p25585o80334n08906k82937p3857P0023J36968
$$ plain form
12244 -7959694 -8137183 -8084676 -7735888 -7090262 -6216902 -5205774 -4145915 -3137987 -2285132
12235 -2285132 -1664784 -1306633 -1176212 -1185434 -1245022 -1309587 -1368223 -1415471 -1448645 -1484688 -1575373
12224 -1575373 -1792882 -2182461 -2728800 -3359584 -3961688 -4395071 -4526372 -4296496 -3782423
12215 -3782423 -3189970 -2748974 -2573843 -2622476 -2785402 -2978893 -3157883 -3301884 -3418322 -3536039
12205 -3536039 -3675279 -3816801 -3889672 -3794572 -3464244 -2914928 -2246567 -1602041 -1104935 -802659
12195 -802659 -666223 -657446 -794148 -1136719 -1715527 -2490991 -3376491 -4269039 -5056148 -5623819
12185 -5623819 -5877229 -5767115 -5312743 -4600280 -3760362 -2940217 -2266814 -1816440 -1622643
12176 -1622643 -1707613 -2079988 -2691516 -3417101 -4097435 -4606341 -4889278 -4963135 -4893112 -4756144
12166d756144J55421J76192K35380L29444M22244M74141M75005M46804M09390
12157a632123L63669L12846K69601K33836J88172J17124J5744j18982k91425m85236
12147a026774o43404o90256n80842l37313m3793K06770L64314M18844L74119K60478
12137a697857J53403J27260J99756L44777N17740O54534O94736O25719M97066
12128B117134L84979L27047K88092K05812O8676p0459j58632j97133k21113k49430
12118B494973k76098k95882l09822l20009l36120l64914l97379m20197m18243
12109f43691l68668k55051q3523J14843K90799L99704M32225M13340L69994L16286
12099I86258K57499J89834J07165J3936p5170j47404k04397k64938l53876m83438
$$ plain form
12166 -4756144 -4600723 -4424531 -4189151 -3859707 -3437463 -2963322 -2488317 -2041513 -1632123
12157 -1632123 -1268454 -955608 -686007 -452171 -263999 -146875 -131131 -250113 -541538 -1026774
12147 -1026774 -1670178 -2360434 -2941276 -3278589 -3322382 -3115612 -2751298 -2332454 -1958335 -1697857
12137 -1697857 -1544454 -1417194 -1217438 -872661 -354921 299613 994349 1620068 2117134
12128 2117134 2502113 2829160 3117252 3323064 3391740 3321281 3162649 2965516 2744403 2494973
12118 2494973 2218875 1922993 1613171 1293162 957042 592128 194749 -225448 -643691
12109 -643691 -1012359 -1267410 -1350933 -1236090 -945291 -545587 -113362 299978 669972 986258
12099 986258 1243757 1433591 1540756 1554692 1479522 1332118 1127721 862783 508907 25469
12089B5469o32159p41017p48135o38350m56544k65286q4746J22510L94070O95358
12079b328830R24840R90383Q67895O06633L02910N3837r1773j48254j56940j32789
12069H87912n3963R3694K80536M54208N84642O66664O84532O06297M25543J99299
12059D829364K6605k9282J1143P3312P7217l1041k44694m88836o66368p06731
12049B850689n94814l96404k29395j69004k01215k69312l33323l80390m04318
12040a27486m02158l88325l90459m26846m93814n66386o10053o11350n94512n84608
12030e195997n55226m47305k56988n8575Q7095J94240K96597L83939M12965L47979
12020d791276J93531J0083j18215j51812j23121r4356j15181k14003l77518n38478
$$ plain form
12089 25469 -606690 -1347707 -2095842 -2734192 -3190736 -3456022 -3540768 -3418258 -3024188 -2328830
12079 -2328830 -1403990 -413607 454288 1060921 1363831 1417668 1325895 1177641 1020701 887912
12069 887912 833949 927643 1208179 1662387 2247029 2913693 3598225 4204522 4630065 4829364
12059 4829364 4855969 4826687 4837830 4911142 4988359 4957318 4712624 4223788 3557420 2850689
12049 2850689 2255875 1859471 1630076 1461072 1259857 990545 657222 276832 -127486
12040 -127486 -529644 -917969 -1308428 -1735274 -2229088 -2795474 -3405527 -4016877 -4611389 -5195997
12030 -5195997 -5751223 -6198528 -6455516 -6514091 -6426996 -6232756 -5936159 -5552220 -5139255 -4791276
12020 -4791276 -4597745 -4587662 -4705877 -4857689 -4980810 -5075166 -5190347 -5404350 -5781868 -6320346
12010f320346o24049o05397m84549k71936R9K71397M89999O37930P05916O81069
12000e519867N75339M33897L06122K13661J47146R0926L9513L775J4075J02533
11990c592880K76419N03498P16465Q50244Q86902Q60851Q22073P83688P08810
11981B816070N60136L46373J20213o0187j68501k05290j72871p9235M0797J40013
11971C337518J90117J79195J03199k8397j94633l69005n16069n92308n72578m76888
11961A060151l51132k27453j22772n3644l0326n0143j11301k25977l95637n84453
11951a092687p41455q30270q29762p31489n51709l35521j34221K5180J44454K33672
11941d843808K97456L43259L85870M32574M74819M94928M77897M12511K87200
$$ plain form
12010 -6320346 -6944395 -7549792 -8034341 -8306277 -8306178 -8034781 -7544782 -6906852 -6200936 -5519867
12000 -5519867 -4944528 -4510631 -4204509 -3990848 -3843702 -3752776 -3713263 -3709488 -3695413 -3592880
11990 -3592880 -3316461 -2812963 -2096498 -1246254 -359352 501499 1323572 2107260 2816070
11981 2816070 3376206 3722579 3842792 3782605 3614104 3408814 3235943 3156708 3197505 3337518
11971 3337518 3527635 3706830 3810029 3781632 3586999 3217994 2701925 2109617 1537039 1060151
11961 1060151 709019 481566 358794 305150 274824 224681 113380 -112597 -508234 -1092687
11951 -1092687 -1834142 -2664412 -3494174 -4225663 -4777372 -5112893 -5247114 -5221934 -5077480 -4843808
11941 -4843808 -4546352 -4203093 -3817223 -3384649 -2909830 -2414902 -1937005 -1524494 -1237294
11932a237294J18871j4389j9713J24787L52055N55060O54672O36377N22273L39902
11922B032601J28306o3228j92086k34827j99376j17568j6886P9708J43677J63006
11912A723327J66077K07932L20669M75784O10532O87583P24589P77162Q80474
11903F574129J000225J055831R90704Q05438N22858J54982k76464p12592j072362
11894I042749j298223j386535j363908j239505j001784o66079l04506j2000J50714
11885A920923J79156J16384K9908l1544o4927r3973j43180k23135l17767l96910
11875I74935m48305m80402m90234m44384l09141r1372J64443M03695N82282O76947
11865E38464O92626O71184O75528P37042Q16709Q39771P77712O68430N56161M50395
$$ plain form
11932 -1237294 -1118423 -1132812 -1152525 -1027738 -675683 -120623 534049 1170426 1692699 2032601
11922 2032601 2160907 2097679 1905593 1670766 1471390 1353822 1336936 1416644 1560321 1723327
11912 1723327 1889404 2097336 2418005 2893789 3504321 4191904 4916493 5693655 6574129
11903 6574129 7574354 8630185 9620889 10426327 10949185 11104167 10827703 10115111 9042749
11894 9042749 7744526 6357991 4994083 3754578 2752794 2086715 1782209 1770209 1920923
11885 1920923 2100079 2216463 2246371 2214827 2149900 2055927 1912747 1689612 1371845 974935
11875 974935 526630 46228 -444006 -888390 -1197531 -1288903 -1124460 -720765 -138483 538464
11865 538464 1231090 1902274 2577802 3314844 4131553 4971324 5749036 6417466 6973627 7424022
11855G424022L35020J88730J6779j26638j80107j46443r4614q8634j31812j76546
11845G019757j69823q7494O0335K51375M66863O81332Q61633R72826R67330P99742
11835A1823876M81449R1800k90627o50701j012524j370723j666277j808350j715640
11826C882283j369974q46549k88639J53634L85466M04600K93824J71953J21825
11817B908423J40752J58878J05565l6201k17423l53705l92139l64140l58913m40838
11807A150259n97610p49742p99847o98209m73235k03960K2942J50243J86141K04560
11797a808458K80008M23507N89637P22170P79517P46024O41477N00519L45668
11788C220069J94562O0562o2581j78427k57343k47233j06191J59280M71384P15046
$$ plain form
11855 7424022 7759042 7947772 7964551 7837913 7657806 7511363 7416749 7328115 7196303 7019757
11845 7019757 6849934 6762440 6822775 7074150 7541013 8222345 9083978 10056804 11024134 11823876
11835 11823876 12305325 12397125 12106498 11455797 10443273 9072550 7406273 5597923 3882283
11826 3882283 2512309 1665760 1377121 1530755 1916221 2320821 2614645 2786598 2908423
11817 2908423 3049175 3208053 3313618 3277417 3059994 2706289 2314150 1950010 1591097 1150259
11807 1150259 552649 -197093 -996940 -1695149 -2168384 -2372344 -2349402 -2199159 -2013018 -1808458
11797 -1808458 -1528450 -1104943 -515306 206864 986381 1732405 2373882 2874401 3220069
11788 3220069 3414631 3475193 3412612 3234185 2976842 2729609 2623418 2782698 3254082 3969128
11778C969128Q08384P34569N21220K25085p8366l35481n37177o86099p73149q02995
11768C045119q04463p95339p61375o79289n40560l65371k15010j58030k01784
11759a476102k74246k82577j83002L78J98217L42796M08620M04103L45628K58316
11749b57869J82895J56531J76994K01951K01723J93788K06060K27316K20116J74902
11739A684407J24188J03082J18126J56069K04575K47810K55617K03025R7327k7812
11729C166414j35755j88447j50215j4830J89859M24267O45291Q04210Q55895P82840
11719F379529O12511L99412J88550N144j26491j84228j78046j52692j55489k09542
11709F578658l05459m13519n08205n77283o04785n58641m21416k31250n8934N8316
$$ plain form
11778 3969128 4777512 5512081 6033301 6258386 6180020 5844539 5307362 4621263 3848114 3045119
11768 3045119 2240656 1445317 683942 4653 -535907 -901278 -1116288 -1274318 -1476102
11759 -1476102 -1750348 -2032925 -2215927 -2215549 -2017332 -1674536 -1265916 -861813 -516185 -257869
11749 -257869 -74974 81557 258551 460502 662225 856013 1062073 1289389 1509505 1684407
11739 1684407 1808595 1911677 2029803 2185872 2390447 2638257 2893874 3096899 3194226 3166414
11729 3166414 3030659 2842212 2691997 2677167 2867026 3291293 3936584 4740794 5596689 6379529
11719 6379529 6992040 7391452 7580002 7585146 7458655 7274427 7096381 6943689 6788200 6578658
11709 6578658 6273199 5859680 5351475 4774192 4169407 3610766 3189350 2958100 2899166 2957482
11699B957482J32432J74370J60902N5474j56823m46255p33440r17715r32084p87914
11689d93571n69270l69040k25799j24620l5812O8956K07419L65795N10122O18365
11679d7455O85580P14009P02854O33668M73455K06910j39342n05780q26293j060643
11669H36963j216118j319432j366064j323311j181475r70391p20994m43166j42992
11660g846980J63412M55505P15825R23324J040176J025559Q78592O55639M28268
11651a560680K30514N0525j26336k67916l12911k41386r4947N9381J57223J66385
11641a940148J04011N815r4127j53071j46046r6760m5570j1302K832j086k2070
11630b397522o9833j53757k59731l50452l93205l75768k98289j73953l4321R0542
$$ plain form
11699 2957482 3089914 3264284 3425186 3480660 3323837 2877582 2144142 1226427 294343 -493571
11689 -493571 -1062841 -1431881 -1657680 -1782300 -1818112 -1749156 -1541737 -1175942 -665820 -47455
11679 -47455 638125 1352134 2054988 2688656 3162111 3369021 3229679 2723899 1897606 836963
11669 836963 -379155 -1698587 -3064651 -4387962 -5569437 -6539828 -7260822 -7703988 -7846980
11660 -7846980 -7683568 -7228063 -6512238 -5588914 -4548738 -3523179 -2644587 -1988948 -1560680
11651 -1560680 -1330166 -1279641 -1405977 -1673893 -1986804 -2228190 -2323137 -2263756 -2106533 -1940148
11641 -1940148 -1836137 -1830322 -1924449 -2077520 -2223566 -2320326 -2365896 -2377198 -2374366 -2375452 -2397522
11630 -2397522 -2467355 -2621112 -2880843 -3231295 -3624500 -4000268 -4298557 -4472510 -4506831 -4416289
11620d416289K00646L21806M70126O25919P38181P46129O08788L38693J4889k51194
11610f02306l80799l60576k18999M153K55749M54912N12982L98427J80868j6751
11600B27660j17638j31230r8679l7956L8903J00543J22967J19558J20521J33801
11590D78450J47959J57424J56942J20058R395j71439l54720m65867m86870m50507
11580h59175l84684k78762j16333Q1150K60813L60784L16405Q2207l21388p86640
11570a645623j145529j248862j065592p03555l26003m7251J10766J86920K29567
11561e655162K78802L54248M31234M54858L92035K65458J41813Q0143Q6481J32528
11551c037562K00780K77386L21993K81907J30218j10978l73950n79187o75850
$$ plain form
11620 -4416289 -4215643 -3893837 -3423711 -2797792 -2059611 -1313482 -704694 -366001 -351112 -602306
11610 -602306 -983105 -1343681 -1562680 -1558527 -1302778 -847866 -334884 63543 244411 227660
11600 227660 110022 -21208 -119887 -157843 -118940 -18397 104570 224128 344649 478450
11590 478450 626409 783833 940775 1060833 1070228 898789 544069 78202 -408668 -859175
11580 -859175 -1243859 -1522621 -1638954 -1557804 -1296991 -936207 -619802 -537595 -858983 -1645623
11570 -1645623 -2791152 -4040014 -5105606 -5809161 -6135164 -6182415 -6071649 -5884729 -5655162
11561 -5655162 -5376360 -5022112 -4590878 -4136020 -3743985 -3478527 -3336714 -3256571 -3170090 -3037562
11551 -3037562 -2836782 -2559396 -2237403 -1955496 -1825278 -1936256 -2310206 -2889393 -3565243
11542c565243o59491n62322m24615k68551j00593N6586J58399J75428J12529K8
11532e077845j12755j73572j65786j25303j01336j05884j09197o4704P3548L30496
11522e632338O74134J002381J192684J180427R91973P11486M29574K13184Q4165
11513H47670M719r0344k23661l47001l99829l86634l62369l50494l24077k59614
11503a891634j60387m1197P8921J83097K61763L06578L02283K38301J31663J8945
11493e71667o7838r8640l7662J32114L72064O00774P47546P75780O77389M75999
11483C005859K22193l5398k65670m47577n59046n62048m14584j23682K24691M96350
11473A541088N66676L84338J8696l65043o02857o28776m97249l18702j79988j15447
$$ plain form
11542 -3565243 -4224734 -4787056 -5211671 -5480222 -5580815 -5524229 -5365830 -5190402 -5077873 -5077845
11532 -5077845 -5190600 -5364172 -5529958 -5655261 -5756597 -5862481 -5971678 -6036382 -5962834 -5632338
11522 -5632338 -4958204 -3955823 -2763139 -1582712 -590739 120747 550321 763505 847670
11513 847670 852389 762045 538384 191383 -208446 -595080 -957449 -1307943 -1632020 -1891634
11503 -1891634 -2052021 -2093218 -2014297 -1831200 -1569437 -1262859 -960576 -722275 -590612 -571667
11493 -571667 -639505 -738145 -775807 -643693 -271629 329145 1076691 1852471 2529860 3005859
11483 3005859 3228052 3192654 2926984 2479407 1920361 1358313 943729 820047 1044738 1541088
11473 1541088 2107764 2492102 2510798 2145755 1542898 914122 416873 98171 -81817 -197264
11463a97264j08662j03094l7765J17767L61804O67324R87258J273096J473148
11454D433612J516123J349427R98306N47853P4234l86362q11135j157720j373776
11445E190562j431502j351389j195534j031120q92744p68229o27587m59226k60343
11436b827112k8363K13991M18941N47949N91290N64020M95440M19154L62736L42540
11426A100586L68040M39342N36785O22885O61182O35435N50030M22852K90480
11417E627617K06292K08224K85085L76076M03184L19384J39071p0237k25097k83642
11407F985957k87930l34154m88351p34212r93894j178311j222332j105069q62571
11398b20867n80807l44657j83354p8285O555J16566K82863M82366O33869O37856
$$ plain form
11463 -197264 -305926 -409020 -446785 -329018 32786 700110 1687368 2960464 4433612
11454 4433612 5949735 7299162 8297468 8845321 8919555 8533193 7722058 6564338 5190562
11445 5190562 3759060 2407671 1212137 181017 -711727 -1479956 -2107543 -2566769 -2827112
11436 -2827112 -2855475 -2641484 -2222543 -1674594 -1083304 -519284 -23844 395310 758046 1100586
11426 1100586 1468626 1907968 2444753 3067638 3728820 4364255 4914285 5337137 5627617
11417 5627617 5833909 6042133 6327218 6703294 7106478 7425862 7564933 7494696 7269599 6985957
11407 6985957 6698027 6363873 5875522 5141310 4147416 2969105 1746773 641704 -220867
11398 -220867 -801674 -1146331 -1329685 -1407970 -1401415 -1284849 -1001986 -519620 114249 752105
11388G52105M41833R6683k65139n16479n96173n14663l24376q1405J66665L82341
11378d58608N49692O57316O66696N33910K63266p1650l56887n02971m99962m10822
11368C69980l03799k04236j10292j4267R9809K39206L69774M25174L60528J90465
11358A422342k3591k13853l42857m12723m38554m13687l18693j61545J9978J83085
11348g00098K90329L28528L31538L55853M27476N19566N77882N70200N11273M36911
11338C649458L61990K80352J95065J30187J10812J25300J18392L3189j48785l90067
11328D465893o04952p07809o67372n22045l63214k92201l48373m73717n61795
11319g5585n29155l55769q4699K21297N10697P36392Q52622Q28637O79424M83414
$$ plain form
11388 752105 1193938 1290621 1025482 509003 -87170 -601833 -926209 -1007614 -840949 -458608
11378 -458608 91084 748400 1415096 1949006 2212272 2140622 1783735 1280764 780802 369980
11368 369980 66181 -138055 -248347 -262614 -162805 76401 446175 871349 1231877 1422342
11358 1422342 1398751 1184898 842041 429318 -9236 -422923 -741616 -903161 -883183 -700098
11348 -700098 -409769 -81241 250297 606150 1033626 1553192 2131074 2701274 3212547 3649458
11338 3649458 4011448 4291800 4486865 4617052 4727864 4853164 4971556 5004745 4855960 4465893
11328 4465893 3860941 3153132 2485760 1963715 1600501 1308300 959927 486210 -75585
11319 -75585 -604740 -960509 -1045208 -823911 -313214 423178 1275800 2104437 2783861 3267275
11309C267275L35726K75486K70933K57098J78358J8061j96668m14933n93330p13078
11299B684928p61944p22715o03073m46740k95262j63025o0769j6191m5497j21582
11289e51870j98554k55349k99092l46055m02215m38379l94538k36100m233K05235
11279b921150L21424L51714L45927L28483K98170K72018K86059L62234M91357
11270A36236O36414P51548Q10236Q14969P72508O73104N10592L09841J14706m6443
11260E483711j64194k23816k10495j39172n5177k619M497k2646q7176k20593m40872
11249C921448p11390r46990j059256j009851q26594n73075l08659o1698J73346
11240a402719M06559O17181P52692P61612O36320M38126K67488J87907J81880
$$ plain form
11309 3267275 3603001 3878487 4149420 4406518 4584876 4602937 4406269 3991336 3398006 2684928
11299 2684928 1922984 1200269 597196 150456 -144806 -307831 -368600 -384791 -430288 -551870
11289 -551870 -750424 -1005773 -1304865 -1650920 -2053135 -2491514 -2886052 -3122152 -3126385 -2921150
11279 -2921150 -2599726 -2248012 -1902085 -1573602 -1275432 -1003414 -717355 -355121 136236
11270 136236 772650 1524198 2334434 3149403 3921911 4595015 5105607 5415448 5530154 5483711
11260 5483711 5319517 5095701 4885206 4746034 4690857 4688238 4692735 4670089 4582913 4362320 3921448
11249 3921448 3210058 2263068 1203812 193961 -632633 -1205708 -1514367 -1576065 -1402719
11240 -1402719 -996160 -378979 373713 1135325 1771645 2209771 2477259 2665166 2847046
11231B847046J89440J67443R5591l6399k01340l14531k96701j54652L8870K19528
11221B554295L53934M25314M26027L49891J81208q5604m01033o53203p30733o15485
11211A804611m12174k64379k31039k63508k93846k89116k37559j48634n7095N934
11201c86805L5382M1969M7722Q3042J51838K19801K62182K90052L26444L93874
11191A465501N10538O71915Q51261J021163J152425J195101J091856Q14970L83023
11182I157753j35813o31762r96712j178523j198671j127136j038855r73672r19322
11173I57287q38729p13948n57183l89880k20592n0681R8114J82134J76753J11254
11163a245471M7818L3101P4930J42203J82855J67745J19224Q3445Q7549J40002
$$ plain form
11231 2847046 3036486 3203929 3299520 3263121 3061781 2747250 2450549 2295897 2334767 2554295
11221 2554295 2908229 3333543 3759570 4109461 4290669 4205065 3804032 3150829 2420096 1804611
11211 1804611 1392437 1128058 897019 633511 339665 50549 -187010 -335644 -392739 -386805
11201 -386805 -351423 -309454 -261732 -178690 -26852 192949 455131 745183 1071627 1465501
11191 1465501 1976039 2647954 3499215 4520378 5672803 6867904 7959760 8774730 9157753
11182 9157753 9021940 8390178 7393466 6214943 5016272 3889136 2850281 1876609 957287
11173 957287 118558 -595390 -1152573 -1542453 -1763045 -1813726 -1715612 -1533478 -1356725 -1245471
11163 -1245471 -1197653 -1164552 -1089622 -947419 -764564 -596819 -477595 -394150 -306601 -166599
11153a66599K46301L88172N04766N29958M45846K90532J11588q0326l01705n55626
11143A412907q11535j014166j115862j103313r84930p65377m54007r2930K46070
11134d683143N02394O58215P30270P52797P69637Q16364R00497R97503J055601
11125B500135J017887Q70432O67460M80231L23695J56372n4006k81283m68212
11116E212711n91980o79106p50984p79778p24132n88950m20776k49555o4475J40890
11106E03865L25682M17167L55686J34466j87798n14303p56637q67707q51612p56959
11096b198150o44956n44238m35978k85762q6259J29022L02132L80138L32116J63413
11086b888522o2478k40143k81244j67631M3218K66238M41781N48911N87398N58861
$$ plain form
11153 -166599 79702 467874 972640 1502598 1948444 2238976 2350564 2270238 1968533 1412907
11143 1412907 601372 -412794 -1528656 -2631969 -3616899 -4382276 -4836283 -4929213 -4683143
11134 -4683143 -4180749 -3522534 -2792264 -2039467 -1269830 -453466 447031 1444534 2500135
11125 2500135 3518022 4388454 5055914 5536145 5859840 6016212 5962206 5680923 5212711
11116 5212711 4620731 3941625 3190641 2410863 1686731 1097781 677005 427450 362975 503865
11106 503865 829547 1246714 1602400 1736866 1549068 1034765 278128 -589579 -1441191 -2198150
11096 -2198150 -2843106 -3387344 -3823322 -4109084 -4195343 -4066321 -3764189 -3384051 -3051935 -2888522
11086 -2888522 -2951000 -3191143 -3472387 -3640018 -3596800 -3330562 -2888781 -2339870 -1752472 -1193611
11076a193611M68426L52322K86055L23694M39371N52613N87684N10805L39438
11067B666797J21810r1427k59453l60444m07558m45091n03729n64265n83722n41523
11057i68605m44005l00824j15614R5068K83889L87565L64082K27832N1687q5755
11047e04680j62885k18209k92249l71649l94164l13837j63963m3528k3716q0698
11037b569578j31192j12739j9930J08630K20785K91311L36632L71492L73472L12510
11027h18607J87066L4707o4859l3767J32244L67112N93974P53142P98178O97576
11017B646766M55972J33223j76391l93295m83985m72262m25914m00538m01013
11008D82563m14335m40792m73665m94304n05175n29985n67622n76923n18184l89345
$$ plain form
11076 -1193611 -725185 -372863 -86808 236886 676257 1228870 1816554 2327359 2666797
11067 2666797 2788607 2697180 2437727 2077283 1669725 1224634 720905 156640 -427082 -968605
11057 -968605 -1412610 -1713434 -1829048 -1733980 -1450091 -1062526 -698444 -470612 -418925 -504680
11047 -504680 -667565 -885774 -1178023 -1549672 -1943836 -2257673 -2421636 -2465164 -2488880 -2569578
11037 -2569578 -2700770 -2813509 -2833439 -2724809 -2504024 -2212713 -1876081 -1504589 -1131117 -818607
11027 -818607 -631541 -596834 -661693 -695460 -563216 -196104 397870 1151012 1949190 2646766
11017 2646766 3102738 3235961 3059570 2666275 2182290 1710028 1284114 883576 482563
11008 482563 68228 -372564 -846229 -1340533 -1845708 -2375693 -2943315 -3520238 -4038422 -4427767
10998d427767k16889l5311J19338K16579K42968K08536J38382O7504M7219J18067
10988c521374K71022M54737N94553O06178M41781J37632k05973m89660o52266
10979b363370o77269n80845l83079j10062J85251M44184O24538O92142O37736
10970a530774N06267L75907L02764K93043L15755L27795K92270J82184j4639k81103
10960G69469n62176p79005q74781q48711p35246n61938l27275r078L92244Q05572
10950b730925J096463J142216R19246N26648J22957j61839k71473k21453p5702
10941C46138R1911K24858K79083K32080J09774l2090j51208k28632k66266k91141
10931C14507l37663m14760m96835n40110n15876m39037l46745k60306j80702q2886
$$ plain form
10998 -4427767 -4644656 -4679967 -4560629 -4344050 -4101082 -3892546 -3754164 -3686660 -3639441 -3521374
10988 -3521374 -3250352 -2795615 -2201062 -1594884 -1153103 -1015471 -1221444 -1711104 -2363370
10979 -2363370 -3040639 -3621484 -4004563 -4114625 -3929374 -3485190 -2860652 -2168510 -1530774
10970 -1530774 -1024507 -648600 -345836 -52793 262962 590757 883027 1065211 1050572 769469
10960 769469 207293 -571712 -1446493 -2295204 -3030450 -3592388 -3919663 -3928741 -3536497 -2730925
10950 -2730925 -1634462 -492246 427000 953648 1076605 914766 643293 421840 346138
10941 346138 438049 662907 941990 1174070 1283844 1251754 1100546 871914 605648 314507
10931 314507 -23156 -437916 -934751 -1474861 -1990737 -2429774 -2776519 -3036825 -3217527 -3300413
10921c300413Q3784L47687O56506Q83740R13705P30465M35491J78163N9737Q7473
10911A076338J94578K91703L03072J91589j2711k24565l66582m27523m67311n60702
10901b114p20915q79672r49939q96390p40410n37945l66416k79496k67585k87717
10891e928599l03384k83687k07210q7887K3848P0729K2021j02314k37364l11442
10881g345289k92872k02427o8210J16028L65484O63197R59359J182521J265073
10872c357136J190285R97460P41389M66140K12448L1751m2031l0651J8469Q1427
10862C09551J43840J60824P4422j13540l11444m08109l57234j79827P4341L47628
10852b59548N92921P87961R25933R89315R48487P89263N17015J46687k78189o74114
$$ plain form
10921 -3300413 -3216629 -2868942 -2212436 -1328696 -414991 315474 750965 929128 988865 1076338
10911 1076338 1270916 1562619 1865691 2057280 2044569 1820004 1453422 1025899 558588 -2114
10901 -2114 -723029 -1602701 -2552640 -3449030 -4189440 -4727385 -5093801 -5373297 -5640882 -5928599
10891 -5928599 -6231983 -6515670 -6722880 -6810767 -6786919 -6716190 -6694169 -6796483 -7033847 -7345289
10881 -7345289 -7638161 -7840588 -7908798 -7792770 -7427286 -6764089 -5804730 -4622209 -3357136
10872 -3357136 -2166851 -1169391 -428002 38138 250586 282337 240306 209655 228124 309551
10862 309551 453391 614215 688637 575097 263653 -144456 -501690 -681517 -607176 -259548
10852 -259548 333373 1121334 2047267 3036582 3985069 4774332 5291347 5438034 5159845 4485731
10842D485731r61767j114524j146566j078640r39934p78812o40275n31902m17410
10833c124099k46608k670K71438M92354N90052N59220M61478L71657L32370L54037
10823E9229M21511M88753M89791L79019J64174j06056l66145n41379n75856m81087
10813f8046l29569j79809m5299N7601R9255Q7627P2647R5962J62579K43100K79466
10802D75514K10564K7923j96078l54993l92899l45597k96145k96188l36947l74503
10792a879349l68191l02649j81266j9557J49640K94275M18521N55421P12136Q41489
10782B20470Q75546P81838N93406L96754K82037K89631M08025O11254Q65940J109327
10772F434228J254688J219937R51089M57657j44867o76345j004332j071238q65844
$$ plain form
10842 4485731 3523964 2409440 1262874 184234 -755700 -1534512 -2174787 -2706689 -3124099
10833 -3124099 -3370707 -3373377 -3101939 -2609585 -2019533 -1460313 -998835 -627178 -294808 59229
10823 59229 480740 969493 1459284 1838303 2002477 1896421 1530276 988897 413041 -68046
10813 -68046 -397615 -577424 -622723 -565122 -465867 -378240 -305593 -209631 -47052 196048 475514
10802 475514 686078 714001 517923 162930 -229969 -575566 -871711 -1167899 -1504846 -1879349
10792 -1879349 -2247540 -2550189 -2731455 -2751012 -2601372 -2307097 -1888576 -1333155 -621019 220470
10782 220470 1096016 1877854 2471260 2868014 3150051 3439682 3847707 4458961 5324901 6434228
10772 6434228 7688916 8908853 9859942 10317599 10172732 9496387 8492055 7420817 6554973
10763F554973m57676j8104K69602L25350J86240n2432k88828m49268n01136m37296
10753E131425k73627o6148J07653J99148K06768J43735J0212j90228m20364o08682
10743D239892o91607o61233n62141m39214k98692j34018K9684J42791J72214J30008
10733A927684O6348K2991o574n6440j36729k29648l29228m41714n41991n69801
10723b95102m85734l01357m5595K55342N41378P08694O71679M23592N1596k94437
10713A230056m76093m39461k42617k7504N5968o3721l34697o13794p59482p12157
10703b383502n08246k32474M2325K78807M67524O05640O79639O73052N75471L76914
10693E75150Q5709k46459n46622p48443p96088o68315m14273j38786O7967J91133
$$ plain form
10763 6554973 6097297 6079193 6348795 6674145 6860385 6807953 6519125 6069857 5568721 5131425
10753 5131425 4857798 4791650 4899303 5098451 5305219 5448954 5459166 5268938 4848574 4239892
10743 4239892 3548285 2887052 2324911 1885697 1587005 1452987 1482671 1625462 1797676 1927684
10733 1927684 1994032 2017023 2010449 1954009 1817280 1587632 1258404 816690 274699 -295102
10723 -295102 -780836 -1082193 -1127788 -872446 -331068 377626 1049305 1472897 1524493 1230056
10713 1230056 753963 314502 71885 44381 100349 36628 -298069 -911863 -1671345 -2383502
10703 -2383502 -2891748 -3124222 -3081897 -2803090 -2335566 -1729926 -1050287 -377235 198236 575150
10693 575150 660859 414400 -132222 -880665 -1676753 -2345068 -2759341 -2898127 -2830160 -2639027
10683b639027K89163M29077O05193P25783P02856N39558L20404J38146L0506k3266
10673A118393p3135j71435l21696m42587m34960k91549j03128L5433J01392J42204
10663d41068K17901L42965M66913M97623L63465P9363k50530m98839n90657n32387
10653c45251l79072j88316n542J35295K14286K28707J92708J33281R2796J25347
10643B04239K53223M17036N11435M76281L29073J27679p8610k68509m29509n40368
10633A001970n87047n84021n72023n91483o44012o80344o42368n22985l77152
10624d199465k60951j73868p7574N2092K01204L24806L67695K91620J13915p5173
10614c435699j64928j09499M7262K28176L87295N20824O37002P26950P61889P19252
$$ plain form
10683 -2639027 -2349864 -1920787 -1315594 -589811 113045 652603 973007 1111153 1141659 1118393
10673 1118393 1045258 873823 552127 109540 -325420 -616969 -720097 -684664 -583272 -441068
10663 -441068 -223167 119798 586711 1084334 1447799 1527162 1276632 777793 187136 -345251
10653 -345251 -724323 -912639 -918181 -782886 -568600 -339893 -147185 -13904 78892 204239
10643 204239 457462 874498 1385933 1862214 2191287 2318966 2240356 1971847 1542338 1001970
10633 1001970 414923 -169098 -741121 -1332604 -1976616 -2656960 -3299328 -3822313 -4199465
10624 -4199465 -4460416 -4634284 -4711858 -4659766 -4458562 -4133756 -3766061 -3474441 -3360526 -3435699
10614 -3435699 -3600627 -3710126 -3662864 -3434688 -3047393 -2526569 -1889567 -1162617 -400728 318524
10604C18524O08225M64109L27117K24711J57632J01822L8784j5152k1418L3963
10594B238317J16146J68543J54621P8399k2461r5938j03154m9282J9428N8045
10584B562664N3016R864o7650j64111k47318l09892l81786m84576o05809p14074
10574c49672p75390p62584o65342n04970l48883k91875l85915n83439p65704q27936
10564f261710p41682n48568l02112l2180K34262M56921N98119O37569N87803N07459
10554d864119M55525M26285L76510L00663K39671K31675K81795L72960M81645
10545a697390N85316O70357P23857P15334O05082L78655O8372k60559n45019p45361
10535D98644q41495q28587p24993n66729l84444k04366o0477K9968R1420J68875
$$ plain form
10604 318524 926749 1390858 1717975 1942686 2100318 2202140 2240924 2225772 2204354 2238317
10594 2238317 2354463 2523006 2677627 2756026 2733565 2637627 2534473 2485191 2504619 2562664
10584 2562664 2615680 2625544 2557894 2393783 2146465 1836573 1454787 970211 364402 -349672
10574 -349672 -1125062 -1887646 -2552988 -3057958 -3406841 -3698716 -4084631 -4668070 -5433774 -6261710
10564 -6261710 -7003392 -7551960 -7854072 -7886252 -7651990 -7195069 -6596950 -5959381 -5371578 -4864119
10554 -4864119 -4408594 -3982309 -3605799 -3305136 -3065465 -2833790 -2551995 -2179035 -1697390
10545 -1697390 -1112074 -441717 282140 997474 1602556 1981211 2049583 1789024 1244005 498644
10535 498644 -342851 -1171438 -1896431 -2463160 -2847604 -3051970 -3112447 -3082479 -2991059 -2822184
10525b822184K97690M80652O71002P95130Q04348P10408N80336M85935M36691
10516B440008L71651K30111M615k67852n19907o63890o37737m61635k30978m8822
10506B15564K4185k5224j72812l61018n09062n51164m83004l57674k30216j22343
10496b572768l7460J6052K6023j8442j23362k64792l74521l81238k70184r4122
10486d094814P8057K22232L59357N05715O36903O95267O31723M51567K22854L1361
10476b59778p5431j08613j25168j86980l01956m14138m67729m67292m65994n06556
10466c379635n83894o50430o45745n37366l34042p0655J84761L34046L06457J13228
10456e263275j65961m29998n86288n72852l77159m1164L54106P22536J006765
$$ plain form
10525 -2822184 -2524494 -2043842 -1372840 -577710 226638 937046 1517382 2003317 2440008
10516 2440008 2811659 3041770 3046385 2778533 2258626 1594736 956999 495364 264386 215564
10506 215564 239749 214525 41713 -319305 -828367 -1379531 -1862535 -2220209 -2450425 -2572768
10496 -2572768 -2610228 -2594176 -2568153 -2586595 -2709957 -2974749 -3349270 -3730508 -4000692 -4094814
10486 -4094814 -4016757 -3794525 -3435168 -2929453 -2292550 -1597283 -965560 -513993 -291139 -259778
10476 -259778 -335209 -443822 -568990 -755970 -1057926 -1472064 -1939793 -2407085 -2873079 -3379635
10466 -3379635 -3963529 -4613959 -5259704 -5797070 -6131112 -6201767 -6017006 -5682960 -5376503 -5263275
10456 -5263275 -5429236 -5859234 -6445522 -7018374 -7395533 -7436697 -7082591 -6360055 -5353290
10447e353290J194215J303994J358198J363777J298787J117224P95200L69964
10439C448069p0021m24587o28162o72440n92628m41326k71036j32383o7780q4501
10429F3205j45251k04016k43584k71724k91650k91033k55122j77395o4491O7550
10419a813511K02851L22264L95706L92917L17952K25473J79169K03440K90193
10410G16454M17192N31535N56264M55498K67194N2282j49630l06166l75158l36129
10400A829336k35038j57602j44349j70635k16272l01635m41288n93389o69320
10391a100192n93562l62952o8430J50781K06404J15145l8205j57442j66587m2302
10381b057342J71239M01133N97472P37316P98275P59175O23669M22138J96710
$$ plain form
10447 -5353290 -4159075 -2855081 -1496883 -133106 1165681 2282905 3078105 3448069
10439 3448069 3378048 2953461 2325299 1652859 1060231 618905 347869 215486 147706 63205
10429 63205 -82046 -286062 -529646 -801370 -1093020 -1384053 -1639175 -1816570 -1881061 -1813511
10419 -1813511 -1610660 -1288396 -892690 -499773 -181821 43652 222821 426261 716454
10410 716454 1133646 1665181 2221445 2676943 2944137 2996419 2846789 2540623 2165465 1829336
10400 1829336 1594298 1436696 1292347 1121712 905440 603805 162517 -430872 -1100192
10391 -1100192 -1693754 -2056706 -2125136 -1974355 -1767951 -1652806 -1691011 -1848453 -2015040 -2057342
10381 -2057342 -1886103 -1484970 -887498 -150182 648093 1407268 2030937 2453075 2649785
10372B649785m770j36346j71126j19619l3150K8690M6484M7007N3823M1304m9462
10361B352620k56022n53960q52313j038099j041992q65616n65625k29574N8911
10352b991670K57960L66858M00242L73572L03136K12396J34663R4410R1762J24383
10342f32288J90063K49635K38621J29871l4558j75072k45960k59835k29642j32026
10332i01191N3854L08350N80812Q15920R65810R94163Q87170O69845M11800J96811
10322D983344O7755N020k6064k7430m293j1667j20423l56221o82318j018424j265542
10311A543737j332169j171676q16837l69225N1644L60568N31771N80667N30396
10302i1124M05244K44752R6591r809p6027j33778k25603l63458n09559o14886
$$ plain form
10372 2649785 2645015 2508669 2337543 2217924 2184774 2213464 2259948 2306955 2360778 2402082 2352620
10361 2352620 2096598 1542638 690325 -347774 -1389766 -2255382 -2821007 -3050581 -2991670
10352 -2991670 -2733710 -2366852 -1966610 -1593038 -1289902 -1077506 -942843 -848433 -756671 -632288
10342 -632288 -442225 -192590 46031 175902 141344 -33728 -279688 -539523 -769165 -901191
10332 -901191 -847337 -538987 41825 857745 1823555 2817718 3704888 4374733 4786533 4983344
10322 4983344 5051099 5056119 5030055 5002625 4998332 4986665 4866242 4510021 3827703 2809279 1543737
10311 1543737 211568 -960108 -1776945 -2146170 -2094526 -1733958 -1202187 -621520 -91124
10302 -91124 314120 558872 655463 645654 569627 435849 210246 -153212 -662771 -1277657
10292a277657o74690p16429p29906o50515m30890j05451K32951M99492O49521
10283c203574O72027N85148M40433K98916J90374J06748K1162j00088k76197m78120
10273a743171o36091o88360o10284m13815j46685J20292L34401M86099N88476
10264b709138O58246P17863P76865Q06893P59162O12193L94825J58715m7274j65242
$$ plain form
10292 -1277657 -1952347 -2668776 -3398682 -4049197 -4480087 -4585538 -4352587 -3853095 -3203574
10283 -3203574 -2531547 -1946399 -1505966 -1207050 -1016676 -909928 -888766 -988854 -1265051 -1743171
10273 -1743171 -2379262 -3067622 -3677906 -4091721 -4238406 -4118114 -3783713 -3297614 -2709138
10264 -2709138 -2050892 -1333029 -556164 250729 1009891 1622084 2016909 2175624 2128350 1963108
$$ [...]
##END NTUPLES=NMR SPECTRUM
##END=
