##TITLE=31P ikalashn
DE-63-P3
19.12.2024
##JCAMPDX= 6.0         $$ Bruker NMR JCAMP-DX V2.0
##DATA TYPE= NMR SPECTRUM
##DATA CLASS= NTUPLES
##ORIGIN= UXNMR, Bruker Analytische Messtechnik GmbH
##OWNER= root
$$ TOPSPIN		Version 1.3
$$ 2024-12-19 15:09:43.156 +0400  Irina@DPX200
$$ Compression mode = diff/dup
##.OBSERVE FREQUENCY= 81.01967998063
##.OBSERVE NUCLEUS= ^31P
##.ACQUISITION MODE= SIMULTANEOUS
##.ACQUISITION SCHEME= undefined
##.AVERAGES= 32
##.DIGITISER RES= 17
##SPECTROMETER/DATA SYSTEM= spect
##.PULSE SEQUENCE= zgpg
##.SOLVENT NAME= D2O
##.SHIFT REFERENCE= INTERNAL, D2O, 1, 298.5841
##AUDIT TRAIL= $$ (NUMBER, WHEN, WHO, WHERE, WHAT)
$$ ##TITLE= Audit trail, TOPSPIN		Version 1.3
$$ ##JCAMPDX= 5.01
$$ ##ORIGIN= Bruker BioSpin GmbH
$$ ##OWNER= Irina
$$ $$ F:/spectra/data/iren/nmr/P31dec/1/pdata/1/auditp.txt
$$ ##AUDIT TRAIL=  $$ (NUMBER, WHEN, WHO, WHERE, VERSION, WHAT)
(   1,<2024-12-19 15:09:23.140 +0400>,<Irina>,<DPX200>,<TOPSPIN 1.3>,
      <created by zg
	started at 2024-12-19 15:08:27.890 +0400,
	POWCHK disabled, PULCHK disabled
       terminated by command 'halt'
       configuration hash MD5:
       BE 6D 3F 07 2A EA 11 49 91 17 2B D3 AF B3 58 0D
       data hash MD5: 32K
       10 AB 0A 6A 22 B8 24 A3 ED C1 22 07 51 BE 12 7E>)
(   2,<2024-12-19 15:09:24.359 +0400>,<Irina>,<DPX200>,<TOPSPIN 1.3>,
      <Start of raw data processing
       efp BC_mod = 2 LB = 8 FT_mod = 6 PKNL = 1 PHC0 = 51.69177 PHC1 = 66.77242 SI = 32K 
       data hash MD5: 32K
       29 C2 15 5C 3A 9B 10 37 CA EB 65 E9 CC A5 22 C2>)
(   3,<2024-12-19 15:09:26.515 +0400>,<Irina>,<DPX200>,<TOPSPIN 1.3>,
      <apk 
       data hash MD5: 32K
       89 6D 8D DB 82 21 C6 DE D1 9D 15 29 31 72 ED 25>)
(   4,<2024-12-19 15:09:29.031 +0400>,<Irina>,<DPX200>,<TOPSPIN 1.3>,
      <abs n ABSG = 5 
       data hash MD5: 32K
       ED 2E 97 FB 70 53 0B 59 A7 4B 8A B5 9E 52 5C 5A>)
$$ ##END=
$$ 
$$ $$ hash MD5
$$ $$ AA 63 EB A1 CE 86 E2 02 12 54 97 04 2F A8 5D 20
##$RELAX= 
##$RELAX= 
##$RELAX= 
##$RELAX= 
##$RELAX= 
##$RELAX= 
##$RELAX= 
##$RELAX= 
##$RELAX= 
##$RELAX= 
##$RELAX= 
$$ Bruker specific parameters
$$ --------------------------
##$DU= <F:/spectra>
##$EXPNO= 1
##$NAME= <P31dec>
##$PROCNO= 1
##$TYPE= <nmr>
##$USER= <iren>
##$AMP= (0..31)
100 100 100 100 100 100 100 100 100 100 100 100 100 100 100 100 100 100 
100 100 100 100 100 100 100 100 100 100 100 100 100 100 
##$ANAVPT= -1
##$AQSEQ= 0
##$AQ_mod= 1
##$AUNM= <au_zg>
##$AUTOPOS= <>
##$BF1= 81.014009
##$BF2= 200.13
##$BF3= 200.13
##$BF4= 200.13
##$BF5= 200.13
##$BF6= 200.13
##$BF7= 200.13
##$BF8= 200.13
##$BYTORDA= 1
##$CFDGTYP= 0
##$CFRGTYP= 5
##$CHEMSTR= <none>
##$CNST= (0..63)
1 1 145 1 1 1 1 1 1 1 1 1 1 1 1 1 1 1 1 1 1 1 1 1 1 1 1 1 1 1 1 1 1 1 
1 1 1 1 1 1 1 1 1 1 1 1 1 1 1 1 1 1 1 1 1 1 1 1 1 1 1 1 1 1 
##$CPDPRG= <waltz16>
##$CPDPRG1= <>
##$CPDPRG2= <waltz16>
##$CPDPRG3= <>
##$CPDPRG4= <mlev>
##$CPDPRG5= <mlev>
##$CPDPRG6= <mlev>
##$CPDPRG7= <mlev>
##$CPDPRG8= <mlev>
##$CPDPRGB= <>
##$CPDPRGT= <>
$$ [...]
##$SW_h= 37037.037037037
##$TD= 32768
##$TD0= 1
##$TE= 300
##$TE2= 300
##$TE3= 300
##$TEG= 300
##$TL= (0..7)
0 120 53 12 22 120 120 120 
##$TP= (0..7)
150 150 150 150 150 150 150 150 
##$TP07= 0
##$TPNAME0= <>
##$TPNAME1= <>
##$TPNAME2= <>
##$TPNAME3= <>
##$TPNAME4= <>
##$TPNAME5= <>
##$TPNAME6= <>
##$TPNAME7= <>
##$TPOAL= (0..7)
0.5 0.5 0.5 0.5 0.5 0.5 0.5 0.5 
##$TPOFFS= (0..7)
0 0 0 0 0 0 0 0 
##$TUNHIN= 0
##$TUNHOUT= 0
##$TUNXOUT= 0
##$USERA1= <user>
##$USERA2= <user>
##$USERA3= <user>
##$USERA4= <user>
##$USERA5= <user>
##$V9= 5
##$VALIST= <valist>
##$VCLIST= <CCCCCCCCCCCCCCC>
##$VD= 0
##$VDLIST= <DDDDDDDDDDDDDDD>
##$VPLIST= <PPPPPPPPPPPPPPP>
##$VTLIST= <TTTTTTTTTTTTTTT>
##$WBST= 1024
##$WBSW= 4
##$XGAIN= (0..3)
0 0 0 0 
##$XL= 0
##$YL= 0
##$YMAX_a= 1174
##$YMIN_a= -3412
##$ZGOPTNS= <>
##$ZL1= 120
##$ZL2= 120
##$ZL3= 120
##$ZL4= 120
##$ABSF1= 298.5841
##$ABSF2= -158.5842
##$ABSG= 5
##$ABSL= 5
##$ALPHA= 0
##$AQORDER= 0
##$ASSFAC= 0
##$ASSFACI= 0
##$ASSFACX= 0
##$ASSWID= 0
##$AUNMP= <proc_1d>
##$AXLEFT= 0
##$AXRIGHT= 0
##$AXTYPE= 0
##$AXUNIT= <>
##$AZFE= 0.1
##$AZFW= 0.5
##$BCFW= 0
##$BC_mod= 2
##$BYTORDP= 0
##$COROFFS= 0
##$CY= 12.5935478210449
##$DATMOD= 1
##$DC= 0
##$DFILT= <>
##$DTYPP= 0
##$F1P= 47.1127640792319
##$F2P= -24.0371245302204
##$FCOR= 0.5
##$FTSIZE= 32768
##$FT_mod= 6
##$GAMMA= 0
##$GB= 0
##$INTBC= 1
##$INTSCL= 7.269226e-011
##$ISEN= 30
##$LB= 8
##$LEV0= 0
##$LPBIN= 0
##$MAXI= 12.09355
##$MC2= 0
##$MEAN= 0
##$ME_mod= 0
##$MI= 0.7550151
##$NCOEF= 0
##$NC_proc= -12
##$NLEV= 6
##$NOISF1= 298.5841
##$NOISF2= 270.0111
##$NSP= 0
##$NTH_PI= 0
##$NZP= 0
##$OFFSET= 298.5841
##$PC= 1.4
##$PHC0= 83.64471
##$PHC1= -35.63737
##$PH_mod= 1
##$PKNL= yes
##$PPARMOD= 0
##$PPDIAG= 0
##$PPIPTYP= 0
##$PPMPNUM= 100
##$PPRESOL= 1
##$PSCAL= 0
##$PSIGN= 0
##$REVERSE= no
##$SF= 81.014009
##$SI= 32768
##$SIGF1= 270.0111
##$SIGF2= -158.5842
##$SINO= 77.54984
##$SIOLD= 32768
##$SREGLST= <31P.CDCl3>
##$SSB= 0
##$STSI= 32768
##$STSR= 0
##$SW_p= 37037.037037037
##$SYMM= 0
##$S_DEV= 0
##$TDeff= 32768
##$TDoff= 0
##$TI= <>
##$TILT= no
##$TM1= 0
##$TM2= 0
##$TOPLEV= 0
##$USERP1= <user>
##$USERP2= <user>
##$USERP3= <user>
##$USERP4= <user>
##$USERP5= <user>
##$WDW= 1
##$XDIM= 32768
##$YMAX_p= 519250717
##$YMIN_p= -14558964
$$ End of Bruker specific parameters
$$ ---------------------------------
##NTUPLES= NMR SPECTRUM
##VAR_NAME=  FREQUENCY,     SPECTRUM/REAL,   SPECTRUM/IMAG
##SYMBOL=    X,             R,               I
##VAR_TYPE=  INDEPENDENT,   DEPENDENT,       DEPENDENT
##VAR_FORM=  AFFN,          ASDF,            ASDF
##VAR_DIM=   32768,         32768,           32768
##UNITS=     HZ,            ARBITRARY UNITS, ARBITRARY UNITS
##FACTOR=    1.13031516577767, 1,            1
##FIRST=     37037.037037037, -1995279,      1571036
##LAST=      0,             -387494,         -1991904
##MIN=       0,             -14558964,       0
##MAX=       37037.037037037, 519250717,     0
$$ Real data points
##PAGE= N=1
##DATA TABLE= (X++(R..R)), XYDATA
$$ [...]
16165a63091o76018m27495r7725K45102M28774L49233K29048L35666N91720P35922
16155A551136N50291O0670l25123m24094n02661o55637p17798o23816m43577k17892
16145a748501M4191K29550J91249j0868j35472j1891M28215R56296J177533J013580
16135B133882N73723P454m94826q57977j116248j288899j324319j103827n57022
16126d028059J24901M95308L91862J37901M5091J12358K05511L36356N35230O53236
16116i90305N59609L10268J04054J01502K46965L23249K78572K75569M13606O05336
16106B228425O92416O10357M58834M19560N15060M92950J96191k48918o36057
16097D728818q48381j016040j166963j120602q76614n11877j34159J80271M67070
$$ y = [-163091, -839109, -1266604, -1364329, -1119227, -690453, -341220, -112172, 223494, 815214, 1551136, 2101427, 2162097, 1836974, 1412880, 910219, 254582, -463216, -1087032, -1530609, -1748501, -1704310, -1474760, -1283511, -1294379, -1429851, -1441742, -1013527, -57231, 1120302, 2133882, 2707605, 2715059, 2220233, 1362256, 246008, -1042891, -2367210, -3471037, -4028059, -3903158, -3407850, -3015988, -2878087, -2832996, -2720638, -2515127, -2178771, -1643541, -990305, -430696, -120428, -16374, 85128, 332093, 655342, 933914, 1209483, 1623089, 2228425, 2920841, 3531198, 3990032, 4409592, 4924652, 5417602, 5613793, 5364875, 4728818, 3880437, 2864397, 1697434, 576832, -299782, -811659, -945818, -765547, -298477]
16088b98477O05213K80595m18507q46880o15504m4984L34571L38917J68156K3084
16078d73816k9636J3469N5561l686q0703o5096m1755j60762l95504n83481n93654
16067b359063l13345K43465O93344O87555M54497K87186R5570j58941l21524m01394
16057a092650m96313n63777n28405l41800j8249L16224N36916O29253P02510R29083
16047G2792J305974J483091J232114P29453K07757k64798o15391p01972n47083
16038B901937l11924j70228j90833k02622L062L82508P21232P90678N88139K83553
16028D795502p594j44926j03827K9658J32337J3983l31861o00857n07925j34146
16018C140344J51185J55560J67739M17428O27760N19643J98862q9016k42683k84007
$$ y = [-298477, 306736, 587331, 168824, -678056, -1293560, -1338544, -1003973, -665056, -496900, -473816, -503452, -489983, -434422, -438108, -518811, -583907, -625662, -786424, -1181928, -1765409, -2359063, -2672408, -2428943, -1735599, -1048044, -593547, -306361, -210791, -369732, -691256, -1092650, -1588963, -2152740, -2681145, -3022945, -3041194, -2724970, -2188054, -1558801, -856291, 72792, 1378766, 2861857, 4093971, 4823424, 5031181, 4766383, 4150992, 3449020, 2901937, 2590013, 2419785, 2228952, 2026330, 2029392, 2411900, 3133132, 3923810, 4511949, 4795502, 4787908, 4642982, 4539155, 4568813, 4701150, 4715133, 4383272, 3782415, 3274490, 3140344, 3291529, 3447089, 3614828, 4032256, 4660016, 5179659, 5378521, 5289505, 5046822, 4762815]
16008D762815j76412K9393R2499q9113m09820o57069o87739o28425o97506q37576
15998G01047p70146l64000J83609N05019M66241K40307l2278l81228p66682r75889
15988a194000q05368k36201M68047R23892Q84505L87504j46775k64406k9284J20548
15978A08462p4117n09114q55985r37277r78667j069005r46644n75698k51841j70390
15968f260276k74328l67341l01922j75982j69022k08932j23266J18133N16547
15959g246389R23837J117839J108261R41277N47889j1531m21709m40761q5422
15950c566709M33203P57702O17258O3938n07988p23066m69136J45361Q76704J486174
15940h86559J719686J428613P68003M1450n55561r32679r84322o07110M1120N19116
$$ y = [4762815, 4586403, 4615796, 4708295, 4619182, 4209362, 3552293, 2864554, 2236129, 1538623, 701047, -69099, -433099, -249490, 255529, 721770, 962077, 929799, 548571, -218111, -1194000, -1999368, -2235569, -1767522, -843630, 40875, 428379, 281604, 17198, -12086, 108462, 34345, -474769, -1330754, -2268031, -3246698, -4315703, -5262347, -5838045, -6089886, -6260276, -6534604, -6901945, -7203867, -7379849, -7548871, -7757803, -7881069, -7762936, -7246389, -6322552, -5204713, -4096452, -3155175, -2607286, -2618817, -3040526, -3481287, -3566709, -3133506, -2375804, -1758546, -1694608, -2202596, -2925662, -3394798, -3249437, -2372733, -886559, 833127, 2261740, 3029743, 3071193, 2515632, 1582953, 598631, -8479, 32641, 551757]
15930E51757O02546M94595L51279J73556J95069M37035N19180K47971j30915k70898
15920C171175j11209J38936J66406j42410o51172j163873j441859j309813r00982
15911b244801n36491k36400J10796L92782O06835Q27350R52336Q18988M47602
15902A138997Q8335j53379l25018l68065l36178m16136n84343p53643r00593r48132
15892c558155p35635j94216M53298R59099J264632J401814J432712J319817Q59957
15883C203323N5745o93751r79182p65824l86492j46491l9615J7702k0364j22436
15873A22615j09553K9105Q3023m6812k24440l47188m98254p20018q98375r39748
15863c549645q73113o85526k65452L23699P89606R64881Q81789N63221J24522
$$ y = [551757, 1154303, 1648898, 2000177, 2173733, 2368802, 2805837, 3325017, 3572988, 3442073, 3171175, 3059966, 3198902, 3365308, 3222898, 2571726, 1407853, -34006, -1343819, -2244801, -2781292, -3017692, -2906896, -2514114, -1907279, -1079929, -127593, 691395, 1138997, 1227332, 1073953, 748935, 380870, 44692, -371444, -955787, -1709430, -2610023, -3558155, -4293790, -4488006, -4034708, -3075609, -1810977, -409163, 1023549, 2343366, 3203323, 3259068, 2565317, 1586135, 820311, 433819, 287328, 247713, 265415, 245051, 122615, 13062, 42167, 125190, 78378, -146062, -493250, -991504, -1711522, -2609897, -3549645, -4422758, -5108284, -5373736, -5050037, -4260431, -3295550, -2413761, -1850540, -1726018]
15854a726018j64295j78185j2253K09328K78468J0072m02468n46636l85366j71570
15844c088923o2726n2131q4230m4250J59831M08681M46724K44372n3906l05238
15834b431796l29631j36991P3812J71518J98031K66543L38383L51785K66670l2974
15824a264650m92566q47096q38126m51655Q0791M12267K71810k17391n35656m31058
15814d313330k05222r8382K3108L33325Q03594J184204J162337P95396M90218
15805A75248N03478O95460P29548N31376J55731l82813q63652r53902n79547k4185
15795a3258L85860N33718N18493N34990O81003Q49845P79725L85459o6334k72012
15785D317489k18921j03480o8745j93605l40871k83267p2027K3932j92364o57262
$$ y = [-1726018, -1890313, -2068498, -2080751, -1871423, -1592955, -1582883, -1985351, -2531987, -2917353, -3088923, -3151649, -3203780, -3288010, -3332260, -3172429, -2763748, -2317024, -2072652, -2126558, -2431796, -2761427, -2898418, -2824606, -2653088, -2455057, -2188514, -1850131, -1498346, -1231676, -1264650, -1757216, -2604312, -3442438, -3894093, -3813302, -3401035, -3129225, -3346616, -3882272, -4313330, -4518552, -4616934, -4593826, -4260501, -3456907, -2272703, -1110366, -314970, 175248, 678726, 1374186, 2103734, 2635110, 2790841, 2408028, 1544376, 590474, 10927, -13258, 372602, 906320, 1424813, 1959803, 2640806, 3490651, 4270376, 4655835, 4589501, 4317489, 4098568, 3995088, 3926343, 3732738, 3391867, 3108600, 3036573, 3060505, 2868141, 2210879]
15775B210879j049164j033388o70809k89300j68475l62217p35353j200145j526709
15766d824681j337868o64897Q430L15173L09481J77270j6151j14333P709K05402
15756e934465L16886L09584K39300J95705K16737L43165N99375Q44416Q85940
15747a983357P17463N19007N89667Q96057R49344N36035L2894l02803n83736q14304
15737E56267q99627p96935o33880o05453o31471n53796l67446n7818L22499M62025
15727c205635K08091j94958m49704m82869l68060j91368m4025O2853K70207O87446
15717c708022J124067J309682J220638J015574Q60130P80735O19325L78380K01668
15708C802177J06820K4459m3947k3607Q6539J28731j08371n52728r17692j197966
$$ y = [2210879, 1161715, 128327, -542482, -831782, -1000257, -1362474, -2097827, -3297972, -4824681, -6162549, -6827446, -6819016, -6503843, -6194362, -6017092, -6033243, -6147576, -6139867, -5934465, -5617579, -5307995, -5068695, -4872990, -4656253, -4313088, -3713713, -2869297, -1983357, -1265894, -746887, -157220, 738837, 1688181, 2224216, 2257110, 1954307, 1370571, 556267, -343360, -1140295, -1774175, -2379628, -3011099, -3564895, -3932341, -3990159, -3667660, -3205635, -2997544, -3192502, -3642206, -4125075, -4493135, -4684503, -4728528, -4665675, -4395468, -3708022, -2583955, -1274273, -53635, 961939, 1822069, 2602804, 3222129, 3600509, 3802177, 3908997, 3933456, 3889509, 3865902, 3952441, 4081172, 3972801, 3420073, 2502381, 1304415]
15698A304415j414937j406924j065994m59470J37543N01183N60820L42813P4116
15689a426435P0632K63585K97800J02233j31926k05881l2972J67473J72988K4834
15679f97669j60927k33743o5477K88405O52294R07313R23923O81998M23722L51806
15669C071645L15094K7031n09938q82929q46941o23366l24169J04816M25670L66538
15659A123451Q5611o1859k6178K1440l943r9824k72313n44973r03465j155345
15649a837398j052129p04954m05199k25548j42437j47220j15399R9738M17353
15640d113193O70630Q78443J113606J292355J227992R04078N16625K58576K62679
15631C011791M44759M68706J59811l96555j054218j544871j619424j280985o95774
$$ y = [1304415, -110522, -1517446, -2583440, -3042910, -2905367, -2404184, -1843364, -1500551, -1426435, -1355803, -1092218, -794418, -692185, -824111, -1029992, -1062964, -895491, -722503, -697669, -858596, -1092339, -1157816, -869411, -217117, 690196, 1614119, 2296117, 2719839, 3071645, 3386739, 3413770, 2903832, 2020903, 1173962, 550596, 226427, 331243, 756913, 1123451, 1209062, 1147203, 1121025, 1142465, 1138522, 1038698, 766385, 221412, -682053, -1837398, -2889527, -3594481, -3999680, -4225228, -4367665, -4514885, -4630284, -4530546, -4113193, -3442563, -2564120, -1450514, -158159, 1069833, 1973911, 2490536, 2749112, 3011791, 3456550, 3925256, 4085067, 3688512, 2634294, 1089423, -530001, -1810986, -2506760]
15622b506760r3491L65037N88168M74732R6942j77990r7711K11299N64856R12295
15612C37377J107024R81876O17913K87424J03030o8257l30564o39422q30029p61158
15602H05214m80512r3535K25248K79832K42143K94736K44110n8499l75984l94226
15592F88527j38229J55808M19786O86559Q64847R45255J014097R58259O31869
15583F226778Q1956m72918p18217n79056l90219m36400o50993p87419p68333o47034
15573H58145m51995l27166l55991m29258m23869l75494l96593m18032k89858j20663
15563b730774j18571k30612k59265j72167r6677J411K40775M69725M99944L76530
15553b019681J58809j62741n42031q89402j070014q62276k88064L50922P12325
$$ y = [-2506760, -2600251, -2235214, -1647046, -1172314, -1075372, -1253362, -1351073, -1139774, -574918, 337377, 1444401, 2426277, 3044190, 3331614, 3434644, 3366387, 3035823, 2396401, 1566372, 805214, 324702, 231167, 456415, 736247, 978390, 1273126, 1517236, 1458737, 1082753, 688527, 550298, 706106, 1125892, 1812451, 2677298, 3622553, 4636650, 5594909, 6226778, 6308734, 5835816, 5117599, 4538543, 4148324, 3711924, 3060931, 2273512, 1505179, 858145, 406150, 78984, -277007, -706265, -1130134, -1505628, -1902221, -2320253, -2610111, -2730774, -2849345, -3079957, -3339222, -3511389, -3608066, -3606655, -3365880, -2896155, -2396211, -2019681, -1860872, -2023613, -2565644, -3455046, -4525060, -5387336, -5675400, -5324478, -4612153]
15544d612153N43289k6957n95606q62727q27132o11662l16467n1902J08065K09276
15534g043976M71829R64669J349951J301283Q49511K70021k89719q61223j173492
15525d161146q57600n6201O18612P35261N27713L91887M05237M80721M70433L27116
15515a117967K59552N50557J153059J609220J476507Q19965J59543j02981o4456
15506D742999j17217l83238p25038j049710j224375j067665o08534p6565L61360
15497a47983O04921N63644L34934J17018m0968k24631m66827o14616m93243j82387
15487e50138P0063J56915J19021J3083j58337l33939l67777k78036k44606l70065
15477a943816n98240q27038j012245j003497o28162j01766K10273K51291K32412
$$ y = [-4612153, -4068864, -4095821, -4691427, -5554154, -6381286, -6992948, -7309415, -7361317, -7253252, -7043976, -6572147, -5607478, -4257527, -2956244, -2106733, -1836712, -2126431, -2987654, -4161146, -5018746, -5074947, -4456335, -3721074, -3193361, -2801474, -2396237, -1915516, -1445083, -1117967, -858415, -307858, 845201, 2454421, 3930928, 4750893, 4910436, 4807455, 4742999, 4625782, 4242544, 3517506, 2467796, 1243421, 175756, -432778, -509343, -147983, 456938, 1020582, 1355516, 1472534, 1431566, 1206935, 740108, 125492, -367751, -550138, -480075, -323160, -204139, -191056, -349393, -683332, -1051109, -1329145, -1573751, -1943816, -2542056, -3369094, -4381339, -5384836, -6012998, -6114764, -5904491, -5653200, -5420788]
15468e420788K95483L47808K47788k499j52400n4956n802j97590m11656m29130
15458e783742k41287J27116N67189P97497O70920M69018N61903Q66106R72099
15449i93181P89872N74141L09575r9055l57787k06738J71406M28618M61309L83802
15439A461962K67524J00016p9409j60941j00660O4688K05099K08978J62190J11239
15429B240686j7514j63771l01900n36123p31192o89961n81516o58970p99668p38968
15419b978897m50303l2833M09705Q14983J096947J193304J135527R96750P99229
15410B984412N83250M54902M24406M59370N63111O29250M96083K16332r7871n07641
15400F205604r53008j174840j036364o22588j50632J23536R9348J8251J21180
$$ y = [-5420788, -5125305, -4777497, -4529709, -4532208, -4684608, -4739564, -4745366, -4942956, -5354612, -5783742, -6025029, -5897913, -5330724, -4533227, -3862307, -3393289, -2831386, -1965280, -993181, -203309, 370832, 680407, 581352, 223565, 16827, 188233, 616851, 1078160, 1461962, 1729486, 1829502, 1750093, 1589152, 1488492, 1553180, 1758279, 1967257, 2129447, 2240686, 2223172, 2059401, 1757501, 1221378, 490186, -199775, -781291, -1440261, -2239929, -2978897, -3429200, -3462033, -3052328, -2237345, -1140398, 52906, 1188433, 2185183, 2984412, 3567662, 4022564, 4446970, 4906340, 5469451, 6098701, 6594784, 6811116, 6713245, 6205604, 5252596, 4077756, 3041392, 2418804, 2268172, 2391708, 2491056, 2509307, 2630487]
15391B630487L52422N26684O22855P01510O65367M15727O0953j73130j59515J06452
15381E749812L93080L99610J49599j99027n78139q51359r86733j182771j541884
15372A352188j837870j751627j285261o29137J4645N23474Q96887J110538J066228
15363e39935P45094K71052j52603k48871L4700N56001J048592J198496R74327
15354C886853N55180Q6034l23488o09022p30702p27488o64096m62450l731N78137
15344A585227Q90262Q33384O10250L14210o9450l91625n09126m94980m35811l19116
15334B013225r8510R1371Q8714m084j16424k59026k95851k05895r8966M8892J86508
15323A349954J32733q231J408J38099K44849L15335M50253O62877P52635M98085
$$ y = [2630487, 2982909, 3509593, 4132448, 4833958, 5499325, 5915052, 5976005, 5802875, 5643360, 5749812, 6142892, 6542502, 6692101, 6493074, 5914935, 5063576, 4076843, 2894072, 1352188, -485682, -2237309, -3522570, -4151707, -4137062, -3613588, -2716701, -1606163, -539935, 205159, 476211, 323608, 74737, 109437, 665438, 1714030, 2912526, 3886853, 4442033, 4528067, 4204579, 3595557, 2864855, 2137367, 1473271, 1010821, 1007090, 1585227, 2475489, 3308873, 3919123, 4233333, 4163883, 3772258, 3263132, 2768152, 2332341, 2013225, 1914715, 2006086, 2094800, 2090716, 1974292, 1715266, 1419415, 1213520, 1114554, 1163446, 1349954, 1482687, 1474456, 1475864, 1613963, 1858812, 2174147, 2624400, 3287277, 4039912, 4537997]
15313D537997J1880l24965l12481j60983n1932L5702J56585K82740K69425L4011
15303D477979k40374l34252k29931n3928O5456J03674Q1880P526j59871m74525
15293C243634p90134p87641l46962K53961N77613M35911l2021m99245o51185m62242
15283I41689j26653K26884M25467L05639p7452m28371m67834j80001K48878N23496
15273A391742M50620J31774j48156j58336Q5519L08248K64937J7126k27225m72514
15263A643735q16542j087872r40268l71736K66879P55985J077169J221765J147988
15254B897103Q57684M56166M8255l36251o00312p25044q48066r98581j104594
15245c53640j124153j026222p78518l34551L57110J125938J593722J521598R13256
$$ y = [4537997, 4549877, 4224912, 3912431, 3751448, 3699516, 3735218, 3891803, 4174543, 4443968, 4477979, 4237605, 3903353, 3673422, 3619494, 3684950, 3788624, 3870504, 3878030, 3718159, 3243634, 2453500, 1665859, 1318897, 1572858, 2150471, 2586382, 2554361, 2055116, 1403931, 941689, 815036, 1041920, 1467387, 1773026, 1695574, 1267203, 799369, 619368, 868246, 1391742, 1842362, 1974136, 1825980, 1667644, 1753163, 2061411, 2326348, 2343474, 2116249, 1643735, 827193, -260679, -1200947, -1572683, -1305804, -549819, 527350, 1749115, 2897103, 3754787, 4210953, 4259208, 3922957, 3322645, 2597601, 1749535, 750954, -353640, -1477793, -2504015, -3282533, -3617084, -3259974, -2134036, -540314, 981284, 1894540]
15236A894540R1154m27917n26365m86274m18233j75852K29720N97426Q05479Q49694
15226B433372P45947M59436o5164p70732j342177j432944j106857o51896j41418
15217a872433L85950P86087Q57601N36624P1422k56712l72280l10397j37216j0605
15207c21959r1423k90506l85368l74185l43105k92522k39087j89228q9024J19540
15197b496867M74246Q61475J028917Q49456M56846R6296j37093l96093p69077
15188c1894j048262r60238n13200L6411M68206P01222Q00490R33532J254780J661646
15178C302693J667324R23908j65571q73217j011203q97898q05387p75620p62353
15169F02676p75908q23373p90969n26669j32272L0837r1159j88585j96655l09346
$$ y = [1894540, 1985694, 1557777, 1031412, 545138, 126905, -48947, 180773, 778199, 1583678, 2433372, 3179319, 3638755, 3573591, 2802859, 1460682, 27738, -1079119, -1731015, -1872433, -1486483, -700396, 157205, 693829, 765251, 508539, 136259, -174138, -311354, -321959, -413382, -703888, -1089256, -1463441, -1806546, -2099068, -2338155, -2527383, -2616407, -2496867, -2022621, -1161146, -132229, 717227, 1174073, 1270369, 1133276, 737183, -31894, -1080156, -2040394, -2553594, -2517183, -2048977, -1347755, -547265, 386267, 1641047, 3302693, 4970017, 5893925, 5728354, 4855137, 3843934, 2946036, 2140649, 1365029, 602676, -173232, -996605, -1787574, -2314243, -2446515, -2415678, -2506837, -2695422, -2892077, -3201423]
15159c201423n18197o82948p88812q25858p06177m22224p2953L01269P17140J061525
15149e138658J205790J182720J061737Q30229M26652n447j73379M5999L91275
15140a73082N24518M14574J86101j33435m37587n13233m12469m15472o36937q64159
15130b461181q52289n96808k46600L0818J49385J82896K51054L09260K00323j05647
15120c138789m46001n97588m95570l47578k60120j06286J51659L82224M85736
15111d372313N40555O34287O06755K82823j74136m17816k19490L15456Q19328
15102a984551J098107J198406J011576M48489k02822m98449m38567l71679l14485
15093e3975j78330L103K37310M35982L99457J62871m5736r3737L4314J84447K44793
$$ y = [-3201423, -3719620, -4402568, -5191380, -6017238, -6723415, -7145639, -7218592, -6917323, -6200183, -5138658, -3932868, -2750148, -1688411, -858182, -431530, -436977, -610356, -564357, -173082, 351436, 766010, 952111, 818676, 381089, -132144, -544613, -960085, -1597022, -2461181, -3313470, -3910278, -4156878, -4126060, -3976675, -3793779, -3542725, -3233465, -3033142, -3138789, -3584790, -4182378, -4677948, -5025526, -5285646, -5391932, -5240273, -4858049, -4372313, -3831758, -3197471, -2590716, -2307893, -2482029, -2899845, -3119335, -2803879, -1984551, -886444, 311962, 1323538, 1772027, 1569205, 1070756, 632189, 260510, -53975, -232305, -229202, 8108, 444090, 843547, 1006418, 960682, 866945, 901259, 1085706, 1330499]
15082A330499K78865L93822O53065Q86655Q30967N65700L35967J84968j0880k95295
15072E154333n23626o59579p48033p26502n68198k96882P963K27683L08517K10811
15062B386487j7083k40617l40967k96463k05766j59781l1008L14398O44979O82676
15052B736855M34949Q2372k31010m07711m81690m33268j08313L39262N93204O01701
15042C126351M32482J22135j93740m69536p14147o83734j72288N06244Q74510
15033B828277R13910Q83323Q84304Q29047N37209p7245q51752j430244j486631
15024C030198j080761n86055l15034l64367n13109n31860n05937n00831m68367
15015a836123l89427j82003K14695O96995J121223J343465J407557J553938J685840
$$ y = [1330499, 1609364, 2003186, 2656251, 3542906, 4373873, 4939573, 5275540, 5460508, 5449628, 5154333, 4630707, 3971128, 3223095, 2496593, 1928395, 1631513, 1639476, 1867159, 2175676, 2386487, 2369404, 2128787, 1787820, 1491357, 1285591, 1125810, 1094802, 1409200, 2054179, 2736855, 3171804, 3254176, 3023166, 2615455, 2133765, 1700497, 1592184, 1931446, 2524650, 3126351, 3558833, 3680968, 3487228, 3017692, 2303545, 1619811, 1447523, 1953767, 2828277, 3742187, 4625510, 5509814, 6338861, 6876070, 6798825, 5947073, 4516829, 3030198, 1949437, 1363382, 1048348, 683981, 170872, -360988, -866925, -1367756, -1836123, -2225550, -2407553, -2192858, -1495863, -374640, 968825, 2376382, 3930320, 5616160]
15006E616160J172193m5968j126198j594443j494287q80682O9993Q90280J219637
14997C826685J107032P82781M40337J88328k2873k56836l71891l42047m72866
14988D878650q45268j163910j177679q40124l52121j06559l12299p13074q54365
14979a486749o54577l98546l41031m49805m15456j62458O4117K06792L60260M13020
14969b864433K81305J17378O8109J19787K32323L37529L58471L15554K20382Q6597
14959g26998M050p8927k30041k72598r6312J20164K41642L10727L97657M83810
14949A53174M62406K01872k18083n42218o63788o69594o60270n67156l11928P4060
14939b741525N01301P33044O14239M03537L36092K17438j31862m98562n25018
$$ y = [5616160, 6788353, 6742385, 5616187, 4021744, 2527457, 1646775, 1716768, 2607048, 3826685, 4933717, 5716498, 6156835, 6345163, 6322290, 6065454, 5693563, 5351516, 4878650, 4033382, 2869472, 1691793, 851669, 499548, 392989, 80690, -632384, -1486749, -2141326, -2539872, -2880903, -3330708, -3746164, -3908622, -3844505, -3637713, -3277453, -2864433, -2583128, -2465750, -2397641, -2277854, -2045531, -1708002, -1349531, -1033977, -813595, -726998, -722948, -801875, -1031916, -1304514, -1400826, -1280662, -1039020, -728293, -330636, 153174, 615580, 817452, 599369, 57151, -606637, -1276231, -1936501, -2503657, -2815585, -2741525, -2240224, -1507180, -892941, -489404, -153312, 64126, -67736, -566298, -1091316]
14930a091316r9164M76569Q12553Q11201N60769J94965j53051m28175p26946j071433
14920g14028j259086j067313n00549J11564M61520N34886M12008J82880R015K7165
14910a801938J90328K96159J76526k7388o7144N270M2508p1604m02221p84705
14900b444209r06452o31887k51896k22779n28886p12310m14416L74991J045441
14891d692403J034265O69264M98068O16602Q70882J149867J338016J293780J016568
14882C794909N99931J77967q0968o1636K34288O30843Q08091N49901m7424n79209
14872F026693o77159l87264J5164L34354M48833L34445J01341j12906j98728j50360
14862E734413k7920O8555m5046l85373p46506q96386p24974l30271J23540M54573
$$ y = [-1091316, -1190480, -713911, 98642, 909843, 1470612, 1665577, 1512526, 1084351, 357405, -714028, -1973114, -3040427, -3540976, -3429412, -2967892, -2433006, -2020998, -1838118, -1829103, -1801938, -1611610, -1315451, -1138925, -1166313, -1233457, -1228187, -1185679, -1257283, -1659504, -2444209, -3350661, -3982548, -4234444, -4457223, -4986109, -5698419, -6112835, -5737844, -4692403, -3658138, -2988874, -2490806, -1874204, -1003322, 146545, 1484561, 2778341, 3794909, 4394840, 4572807, 4491839, 4430203, 4664491, 5295334, 6103425, 6653326, 6605902, 6026693, 5349534, 4962270, 4977434, 5311788, 5760621, 6095066, 6196407, 6083501, 5884773, 5734413, 5706493, 5775048, 5730002, 5344629, 4598123, 3701737, 2976763, 2646492, 2770032, 3224605]
14852C224605N04945K97136j0492k52403l31045l28928m08462n25774n47813m58331
14842A163438l03215j85820k22340l45017l67622k44747n9046N5967M265j59314
14832f63451l23708m41162l81558m0661M11697O78980O23079L70162J61772j6077
14822C79073l27578o79318q99106r37351p63294m44071j47818L9492J54389J95953
14812c429629p309m70511q23302p07881j29404O58738J325525J609056J547827
14803d26890J395164J273372J035622N95978J30931k34914n32210q28330j073734
14794A334989j093037p94189m02693k73625l79853m70036m78098l97516k07109
14785c161167k0627O225n3761K7704K79537N70311Q06866Q61283N95029J24785
$$ y = [3224605, 3729550, 4026686, 4016194, 3763791, 3432746, 3103818, 2695356, 2169582, 1621769, 1163438, 860223, 674403, 452063, 107046, -260576, -505323, -564369, -508402, -504137, -663451, -987159, -1428321, -1809879, -1850540, -1438843, -759863, -136784, 233378, 395150, 379073, 51495, -627823, -1526929, -2464280, -3227574, -3671645, -3819463, -3779971, -3625582, -3429629, -3436938, -3907449, -4730751, -5438632, -5568036, -4909298, -3583773, -1974717, -426890, 968274, 2241646, 3277268, 3873246, 4004177, 3769263, 3237053, 2408723, 1334989, 241952, -552237, -954930, -1228555, -1608408, -2078444, -2556542, -2954058, -3161167, -3181794, -3175569, -3229330, -3201626, -2922089, -2351778, -1544912, -683629, -88600, 36185]
14775C6185k44941l97046l93384k32585N2961J92565P842l54588p09770r35566
14765b978327q65817m66283j2570K11598K81734M92013R29601J374206J543232
14756E09387J302643Q56418M92603J24812l80842p91031q85359p10799l05948
14747B11884L59733R84387J084846O76598J77343j63152l86621m92919l95229
14738B056870j06035J90913K71653J31392o749L0889J35116P3065j89207m58439
14728B129468m96399k33405J64351M78617O41272O36517M26298M7947j92733j8464
14718C583469L35007M14932J74335p5444n5189L04013P43643Q23415M71188J72805
14708F892174K66703N70572P62682P50890O29862M63986K87228K68814N92980
$$ y = [36185, -208756, -605802, -999186, -1231771, -1178810, -986245, -978403, -1332991, -2042761, -2978327, -3844144, -4310427, -4322997, -4111399, -3829665, -3337652, -2408051, -1033845, 509387, 1812030, 2668448, 3161051, 3285863, 2905021, 2113990, 1228631, 517832, 211884, 571617, 1556004, 2640850, 3317448, 3494791, 3331639, 2945018, 2452099, 2056870, 1950835, 2141748, 2413401, 2544793, 2538044, 2568933, 2704049, 2777114, 2587907, 2129468, 1633069, 1399664, 1564015, 2042632, 2683904, 3320421, 3746719, 3794666, 3601933, 3583469, 3918476, 4333408, 4507743, 4432299, 4377110, 4681123, 5424766, 6248181, 6719369, 6892174, 7158877, 7729449, 8492131, 9243021, 9872883, 10336869, 10624097, 10892911, 11485891]
14699A1485891J077967J405874J546908J582883J405442J001195N78391K18864
14691B0303415m7457j50754j16805l7696J3435R2189K05674K29179L23615P35620
14681B1550415J334760J841534K207369K503230K676015K713848K609854K122371
14673C9559396J081968j61965j111630j534261j460679j193695j121765j222496
14665C2834873j137160p52953l08262j19205j99318j70913J20665K73728n8610
14656C0482845p59374j520279k153624k601414k754517k559192k079324j412091
14648A4643030p68185m92908p41333j255719j641385j692694j431295r95778o35964
14639D987769n16854n08771n22871n63555n07265k97660o4222P0771Q1499J4244
$$ y = [11485891, 12563858, 13969732, 15516640, 17099523, 18504965, 19506160, 20084551, 20303415, 20255958, 20105204, 19988399, 19950703, 19964138, 20056327, 20262001, 20491180, 20814795, 21550415, 22885175, 24726709, 26934078, 29437308, 32113323, 34827171, 37437025, 39559396, 40641364, 40479399, 39367769, 37833508, 36372829, 35179134, 34057369, 32834873, 31697713, 30944760, 30636498, 30517293, 30317975, 30147062, 30267727, 30541455, 30482845, 29723471, 28203192, 26049568, 23448154, 20693637, 18134445, 16055121, 14643030, 13874845, 13381937, 12640604, 11384885, 9743500, 8050806, 6619511, 5623733, 4987769, 4470915, 3962144, 3439273, 2875718, 2368453, 2070793, 2006571, 2077342, 2158841, 2173085]
14629B173085p7260j53202j92521j95534r9192J13136L08575L65577L22271K78322
14619B843257L13775M87436Q12062J147516J242328J021186N81283L6640l97086
14610H088397n27884m33739l47441m14704l70934J3400K84828J7676o04726j233993
14600D470880j541593j361511q26152j23789M39603N94119M90659L56231K24515
14591B722962J47137L8629k34082n31300p27606q31544p68587n67924l76144l37319
14581a465778l89724l41737j29131J51435L83773N21705O09502N85438K47125
14572A72608k51255m96006l56169J0697L23877L75665K20635j54058q17534j525887
14562b497427j809195j483585q01026r9673M08750P49475J002746J152627J213904
$$ y = [2173085, 2095825, 1942623, 1750102, 1554568, 1455376, 1568512, 1877087, 2242664, 2564935, 2843257, 3157032, 3644468, 4456530, 5604046, 6846374, 7867560, 8448843, 8485483, 8088397, 7560513, 7126774, 6779333, 6364629, 5993695, 6007095, 6291923, 6309599, 5704873, 4470880, 2929287, 1567776, 741624, 617835, 1057438, 1651557, 2142216, 2498447, 2722962, 2870099, 2908728, 2674646, 2143346, 1415740, 584196, -184391, -752315, -1128459, -1465778, -1855502, -2197239, -2326370, -2174935, -1791162, -1269457, -659955, -74517, 172608, -78647, -574653, -930822, -920125, -596248, -220583, 52, -154006, -971540, -2497427, -4306622, -5790207, -6591233, -6690906, -6282156, -5532681, -4529935, -3377308, -2163404]
14553b163404J197453J186284J254230J243510Q65908Q3116p35683j177162j114511
14544F39741o80551j67883J50010J07561k05692m54579m81619l62378k01750r5897
14534a753037r5478j30728j07360j1988R5323J36810P7961n466J05064M33436
14524a255463O96952P20914N55703M60740M83800K84760j92005n29853m98698
14515G26850k88150j08670n4331j39671l03885m12096l11912l6077J92230J99110
14505e36602J9238j27968j24544n3508o0745k40260n24817p14400o49105l98621
14495c411332j57468K0471K64540O04593Q40115Q75142Q22183P59645O45406L35450
14485A598745k74469r29743j054218n09044J55348L74353J59660q4594j28949
$$ y = [-2163404, -965951, 220333, 1474563, 2718073, 3583981, 3667097, 2931414, 1754252, 639741, -40810, -208693, -58683, 48878, -156814, -611393, -1093012, -1455390, -1657140, -1753037, -1848515, -1979243, -2086603, -2098591, -2003268, -1866458, -1788497, -1793963, -1688899, -1255463, -558511, 162403, 718106, 1178846, 1662646, 1947406, 1755401, 1225548, 726850, 438700, 330030, 275699, 136028, -167857, -579953, -891865, -927942, -735712, -536602, -517364, -645332, -769876, -823384, -884129, -1124389, -1649206, -2363606, -3012711, -3411332, -3568800, -3548329, -3283789, -2679196, -1839081, -963939, -141756, 617889, 1263295, 1598745, 1324276, 394533, -659685, -1168729, -1013381, -639028, -479368, -563962, -692911]
14476f92911R8002M54857O16267N52679M12021K54512P0264j65056l99619n96048
14466F04968p37908p00649n03397l76018m29921m73419k97144P210K01902J86890
14456b517486L8740r4294j19108n6314K5551Q6172J19323J39689K25338L91417
14446a760972M70677L93347J92306q0965k22529p7847K04398L77261M55319O03274
14436E54269O97060M96692P7517k44739k17673J65642O01510P74583O43072K95105
14426C843038m7459j51686L270K59709M08879M27314M08036K83955m1769l76051
14416E017236m33638k00661P342o5709l11199m62836m29732k87351j04745o116
14406B722591p9276k40243l82119m38666l56319k07392o3641L8779n5746l97586
$$ y = [-692911, -594909, -140052, 476215, 1028894, 1440915, 1695427, 1765691, 1600635, 1201016, 604968, -132940, -833589, -1336986, -1713004, -2142925, -2616344, -2913488, -2906278, -2704376, -2517486, -2478746, -2573040, -2692148, -2748462, -2722911, -2636739, -2517416, -2377727, -2152389, -1760972, -1290295, -896948, -704642, -785607, -1008136, -1085983, -881585, -504324, -49005, 554269, 1251329, 1748021, 1825538, 1580799, 1363126, 1528768, 2130278, 2904861, 3547933, 3843038, 3795579, 3643893, 3647163, 3906872, 4315751, 4743065, 5151101, 5435056, 5393287, 5017236, 4583598, 4382937, 4390279, 4324570, 4013371, 3550535, 3120803, 2833452, 2728707, 2722591, 2643315, 2403072, 2020953, 1582287, 1225968, 1018576, 954935, 993714, 937968, 540382]
14396E40382p20882q13699o24133j97117K61307N98375Q70199R96939P60995K47412
14386A919778k43484n72363q03190r57879j022160j007446q51851n31724j11537
14377d181856L34186P05599R79620J182724J247247J164311J055029R68123P95076
14368D250059M67443R3633j40484j65962r4848q6933k54354n54915q45851j056498
14358A611290j249949j352088j150090o83675k28930K1234Q5423j0895j96720
14349c154400k73882j45689O9556K32901L13061L51289L69575L01306P2370k27967
14339b091880l78926k94902q9364J91500L47796K08946J903j07798k53618m57560
14329b923903m98106k69338J27812N55338Q59859R95082R73002P61421L91861
$$ y = [540382, -180500, -994199, -1618332, -1815449, -1554142, -955767, -85568, 911371, 1672366, 1919778, 1676294, 1103931, 300741, -657138, -1679298, -2686744, -3538595, -4070319, -4181856, -3847670, -3142071, -2162451, -979727, 267520, 1431831, 2486860, 3454983, 4250059, 4717502, 4811135, 4670651, 4504689, 4409841, 4322908, 4068554, 3513639, 2667788, 1611290, 361341, -990747, -2140837, -2824512, -3053442, -3032208, -2946785, -2957680, -3154400, -3428282, -3573971, -3504415, -3271514, -2958453, -2607164, -2237589, -1936283, -1863913, -2091880, -2470806, -2765708, -2855072, -2663572, -2315776, -2106830, -2104927, -2212725, -2466343, -2923903, -3422009, -3691347, -3563535, -3008197, -2148338, -1153256, -180254, 581167, 973028]
14320I73028n3258m26791n33770m02510l63198n78188q79079r37614n09897K56445
14310c454832Q36540Q52791M46665P006k46292l31302j70858J91195M03445L36394
14300a129248K09755J64640J92304K82820L72134L25881J99320K41360N36942
14291A395908Q87026R99186Q13826M83681J49950j43242l97038o09899q59122
14282B720276j111610j055420n78691p5367O7622N4494K08176M46578N29868L84987
14272A590913J38813o1685q3901P4302J19844k53847p93641q63675m00644J8405
14262e15116L5764k41424n81115r09849j213072j414271j437391j187771n90718
14253h054963J33410N41587N51071M32587L35490L11212L98972N13622O08305
$$ y = [973028, 919770, 492979, -40791, -443301, -806499, -1384687, -2263766, -3201380, -3711277, -3454832, -2618292, -1765501, -1318836, -1311830, -1558122, -1889424, -2060282, -1869087, -1465642, -1129248, -919493, -754853, -562549, -279729, 92405, 418286, 617606, 858966, 1395908, 2282934, 3282120, 4095946, 4579627, 4729577, 4586335, 4189297, 3579398, 2720276, 1608666, 553246, -25445, -100812, -33190, 21304, 229480, 676058, 1205926, 1590913, 1729726, 1668041, 1584140, 1658442, 1778286, 1524439, 730798, -132877, -533521, -515116, -479352, -720776, -1301891, -2211740, -3424812, -4839083, -6276474, -7464245, -8054963, -7921553, -7379966, -6828895, -6396308, -6060818, -5749606, -5350634, -4837012, -4228707]
14244d228707P49550R11505Q80854O20277L85907K39843l8161n41536j029758
14235b050226j275420j257728r32256l50256K26582N89052P44561Q26165Q21927
14226b657599O09254J94720k01711k97840j07928J39086L03591L32878J67219
14217a518330j18547k79631p1806M23919Q41839R39205O49540J50045l28473o74831
14207A2930p63631o10185l94437k33602j26708o1098m7693Q8898M34057O83007
14197a018462O74393O45633O91807O76007O35716P19576Q81785R01946O51793
14188E460194L56952K62040L24891L32900J55398l8280J4164K87080M55030L83824
14178G994193K33561J21844J18836K46051L84734N19383P56018J054519J231381
$$ y = [-4228707, -3479157, -2567652, -1686798, -1066521, -680614, -440771, -478932, -1020468, -2050226, -3325646, -4583374, -5515630, -5865886, -5639304, -5050252, -4305691, -3479526, -2657599, -2048345, -1853625, -2055336, -2353176, -2461104, -2322018, -2018427, -1685549, -1518330, -1636877, -1916508, -1988314, -1564395, -722556, 216649, 866189, 1016234, 687761, 12930, -750701, -1360886, -1755323, -1988925, -2115633, -2176731, -2224424, -2135526, -1701469, -1018462, -344069, 301564, 993371, 1669378, 2305094, 3024670, 3906455, 4808401, 5460194, 5817146, 6079186, 6404077, 6736977, 6892375, 6854095, 6868259, 7155339, 7610369, 7994193, 8227754, 8349598, 8468434, 8714485, 9099219, 9618602, 10374620, 11429139, 12660520]
14169A2660520J274360J457498J917314K418686K694028K585050K045426J234896
14161B8287778M34469j49590n72739j064039j599732j939850k032870j882907
14153A9480520j537171j314729j419817j611825j570397j316297r67410n41473
14145I201401o7930L88924O45078M84764N1929j74278P966L50174O24756Q15653
14135A2328437Q59461O61347L71390K15911K70323N19718Q71001J039786Q32266
14126A7969640M11310L3981k73524o53896j062121j281031j298941j213458j015566
14117A1616394q21803p29330o89621o57899n91260n27488m40277k74603j64757
14108F719356j29533N8105L92313N94846M78936J31418k13451m38481n60953o12752
$$ y = [12660520, 13934880, 15392378, 17309692, 19728378, 22422406, 25007456, 27052882, 28287778, 28722247, 28572657, 27999918, 26935879, 25336147, 23396297, 21363427, 19480520, 17943349, 16628620, 15208803, 13596978, 12026581, 10710284, 9742874, 9201401, 9133471, 9522395, 10167473, 10652237, 10704166, 10529888, 10537854, 10888028, 11512784, 12328437, 13187898, 13849245, 14220635, 14436546, 14706869, 15226587, 16097588, 17137374, 17969640, 18380950, 18414931, 18141407, 17487511, 16425390, 15144359, 13845418, 12631960, 11616394, 10794591, 10065261, 9375640, 8717741, 8126481, 7598993, 7158716, 6884113, 6719356, 6589823, 6647928, 7040241, 7635087, 8114023, 8245441, 8031990, 7593509, 7032556, 6419804]
14098F419804o52707p46835r00167j006042r64663p71422m80382j37395K44728
14089A004919N63479O40972M47148J34102j25862k72837l38721l69573m77785
14080A205842o85359p52515n80846l09457l0828J08186n3471m69856q34404q62678
14070c265386n72229j9826P11481J262740J283697P99702J51926k75690m07093
14061c30678l93183k34254P9563L42210L65483J97935L0137q300O0239J89777
14051B98929L73230M95544L02524j13864k99250k21608j91840k43101k13166j61457
14041B5941l18972n95910p21649n45226p3647M64928P86050Q28637O26624K50553
14031G27329q0087k15871j45517J31113N44624Q42948P37119J88227n68997j123131
$$ y = [6419804, 5767097, 5020262, 4120095, 3114053, 2149390, 1377968, 897586, 760191, 1004919, 1568398, 2209370, 2656518, 2790620, 2664758, 2391921, 2053200, 1683627, 1205842, 520483, -232032, -812878, -1122335, -1153163, -1044977, -1098448, -1568304, -2402708, -3265386, -3837615, -3857441, -3145960, -1883220, -599523, 200179, 352105, 76415, -330678, -723861, -958115, -878552, -536342, -170859, 27076, 57213, 48913, 109152, 298929, 672159, 1167703, 1470227, 1356363, 1057113, 835505, 643665, 400564, 187398, 25941, -293031, -888941, -1610590, -2155816, -2229463, -1764535, -978485, -149848, 476776, 727329, 647242, 431371, 285854, 416967, 961591, 1804539, 2541658, 2729885, 2160888, 1037757]
14021A037757j177815q89864n54744k44582O6975M31975R10471J294835J342791
14012B217799J174133R03727M08284k84566q30342r37705o31218j64109K09849
14003B065852L59465L66953L98546N03396O42376P92076R68824R94126O88204
13994G779818K32457q0809j49996j1794K13513K92573J57686j0056r0917j77693
13984H154782l57172o10328q25395q29070n99745k96270p7434M190Q5308J87040
13974D835906J3624m85604q83395q48974m74825m564L79272N18759M17298K37873
13964C705370J55726J69258J85567J84364J35042K8483q7042j14842r5072k39752
13954D027102o02846r60354j063421q04737k66547K28553M80967N33318M81868
$$ y = [1037757, -140058, -1029922, -1584666, -1829248, -1762273, -1330298, -419827, 875008, 2217799, 3391932, 4295659, 4703943, 4419377, 3589035, 2651330, 2020112, 1856003, 2065852, 2425317, 2792270, 3190816, 3694212, 4336588, 5128664, 6097488, 7091614, 7779818, 8012275, 7931466, 7781470, 7769676, 7983189, 8275762, 8433448, 8423392, 8332475, 8154782, 7797610, 7187282, 6361887, 5532817, 4933072, 4636802, 4559368, 4563558, 4648866, 4835906, 4849530, 4363926, 3480531, 2631557, 2156732, 2152168, 2531440, 3050199, 3467497, 3705370, 3861096, 4030354, 4215921, 4400285, 4535327, 4563810, 4476768, 4361926, 4266854, 4027102, 3424256, 2463902, 1400481, 595744, 329197, 557750, 1038717, 1572035, 2053903]
13945B053903M82490O35561P78388P58297O34801M46499K15412k9557l30897o87282
13935D957615j020575j313125j537503j557946j153308l73078L25890N79394N31498
13926e61138M17302J63742j76045l35538l39592l60636l50379k63573j85130j02049
13916b093036K0164P6708l35j28171k71911l36265j17203K57177L52291L4890
13906b205691n05903r69012r80542n35306o3439M1078k26382n18781n16478k53482
13896f733938N5494K97931M42095M70416M63168M74273M55741M81452N95536O40258
13886b357574N49419M13788K82092J45519L1110o460m0241j74416l94488o00145
13876b151396o39775n15154l02012L6972M62135R24383J387082J600432J354489
$$ y = [2053903, 2536393, 3171954, 3950342, 4708639, 5343440, 5789939, 6005351, 5975794, 5644897, 4957615, 3937040, 2623915, 1086412, -471534, -1624842, -1997920, -1672030, -1092636, -561138, -143836, 19906, -156139, -491677, -831269, -1191905, -1542284, -1805857, -1990987, -2093036, -2072872, -1996164, -1996499, -2124670, -2396581, -2732846, -2850049, -2592872, -2240581, -2205691, -2711594, -3680606, -4661148, -5196454, -5259893, -5218815, -5445197, -5963978, -6480456, -6733938, -6678444, -6380513, -5938418, -5468002, -5004834, -4530561, -4074820, -3593368, -2997832, -2357574, -1808155, -1394367, -1112275, -966756, -935646, -942106, -982347, -1156763, -1551251, -2151396, -2791171, -3306325, -3608337, -3571365, -3109230, -2184847, -797765, 802667, 2157156]
13867B157156Q30562L10752j61473n04846n61484m61876l90635k33023J73612
13858A158745O58078Q61508O46437K53746K4778J1290J37070L77417N11348K89696
13848D930113k53640r37961j496449j610237j137770l54268K88710O25261P32296
13839G86055P26408P11199P04316O21415L74049L9965j50566j49591j48254l03252
13829C211744n57288p42812o61996k00282L85412O19428M38320J34386n9643j08253
13819B459016j66103k11821n9928K24719L93012K85660K0297k51492n63972q70069
13809A259319r20498o34434l26222k06475j82695k05915l82596o30717o83127
13800b913360n12792l83567m54550n14609k83703K80173R75691J508609J690247
$$ y = [2157156, 2987718, 3298470, 3136997, 2632151, 2070667, 1608791, 1218156, 985133, 1158745, 1816823, 2678331, 3324768, 3578514, 3603292, 3614582, 3751652, 4129069, 4640417, 4930113, 4676473, 3738512, 2242063, 631826, -505944, -860212, -571502, 53759, 786055, 1512463, 2223662, 2927978, 3549393, 3923442, 3963407, 3812841, 3663250, 3514996, 3211744, 2654456, 1911644, 1249648, 1049366, 1434778, 2054206, 2492526, 2626912, 2567269, 2459016, 2292913, 2081092, 2021164, 2245883, 2638895, 2924555, 2944852, 2693360, 2129388, 1259319, 338821, -295613, -621835, -828310, -1011005, -1216920, -1599516, -2230233, -2913360, -3426152, -3809719, -4264269, -4778878, -5062581, -4782408, -3806717, -2298108, -607861]
13791f07861J499863J018175M34815r8387n65216q94247r49234q14816p26300
13782a703208o94539n90608m28383k06240R0797K80654K85093L10248N15550P61885
13772a378751P78709L91474k38842n83191l22458K75232P33610R28132R94394
13763A578309R78428Q37302N67342K11405j38520l14225k96533k76529l16523
13754B830456k81268j54829n3886j2444J5951R1520J81650K18000K21448K66107
13744C322705M04008M58832K18903j78752l78913k61498o5162n8617j97556l06109
13734B957841l40774l32768k15371P4870L84348N57957N37765L50323J76445J59194
13724D309830K06574J37071o2670k73560l50072k17991j0004O8690J9694r6590
$$ y = [-607861, 892002, 1910177, 2344992, 2246605, 1681389, 787142, -162092, -976908, -1703208, -2397747, -2988355, -3416738, -3622978, -3532181, -3251527, -2966434, -2656186, -2140636, -1378751, -600042, -208568, -447410, -1030601, -1353059, -1077827, -344217, 583915, 1578309, 2556737, 3394039, 3961381, 4172786, 4034266, 3720041, 3423508, 3146979, 2830456, 2549188, 2394359, 2340473, 2328029, 2343980, 2435500, 2617150, 2835150, 3056598, 3322705, 3726713, 4185545, 4404448, 4225696, 3846783, 3585285, 3520123, 3461506, 3263950, 2957841, 2617067, 2284299, 2068928, 2143798, 2528146, 3086103, 3623868, 3974191, 4150636, 4309830, 4516404, 4653475, 4590805, 4317245, 3967173, 3749182, 3739178, 3807868, 3827562, 3730972]
13714C730972k15706j81910K5456K92202M95971N15861L68894J97495J17816J22588
13704E469639J42210J40351J29373J15132L7736j59479m61207p33504p65336n45242
13694C369673k07726K5697p1933l04745l59444k04025N2340J67702k0759k89916
13684B156864m11075l70257j44810J51209L38520M14108L86434K62102P5182p7487
13674B780790m5215J60506L69605M25964L05031L9741k67855l26035O9355P19146
13664D231033J197631J223994Q37995L49827m3800l86186o31708o63847n06897
13655E608042m16869o27537r81090j154168j059758p64126l78866q4381Q8885
13646B30132J92448N6009l26886n18572k45002J68595K67732J48743J70241K97493
$$ y = [3730972, 3515266, 3333356, 3358812, 3651014, 4146985, 4662846, 5031740, 5229235, 5347051, 5469639, 5611849, 5752200, 5881573, 5996705, 6034441, 5874962, 5413755, 4680251, 3914915, 3369673, 3161947, 3187644, 3115711, 2810966, 2451522, 2247497, 2299837, 2467539, 2446780, 2156864, 1745789, 1375532, 1230722, 1381931, 1720451, 2134559, 2520993, 2783095, 2858277, 2780790, 2735575, 2896081, 3265686, 3691650, 3996681, 4036422, 3768567, 3442532, 3511887, 4231033, 5428664, 6652658, 7490653, 7840480, 7796680, 7410494, 6778786, 6114939, 5608042, 5191173, 4563636, 3582546, 2428378, 1368620, 604494, 225628, 141247, 230132, 422580, 478589, 151703, -366869, -611871, -443276, -175544, -26801, 143440, 440933]
13636D40933K59739p8653n89461r58607r47347n55769o7645J51751R6026O7575
13626b181458J60248J64786l041j14963k465K70653N16324N74569N31388N87842
13616E03883P46514R42185J169201J295831J096353N95822N4043l10919l86604
13607E706309k81765k00685j44342o5040J5625N6263K9077l1781q8112o6928J62120
13596E090741N06237O86976N67677R7862n68298r88044r81974p69151n30552l43656
13586B767818k85925k19890K3500K87971L53999L43200M27299N79758P71757R51067
13576F000554R64144P79238N54397L77929K48412K16759K71868L18742L24400
13567A0056443J54546k48398n56252m65089j25088P2529q9550m47635p64663r98687
$$ y = [440933, 700672, 622019, 32558, -926049, -1873396, -2429165, -2496810, -2345059, -2249033, -2181458, -2021210, -1856424, -1859465, -1974428, -1976893, -1706240, -1189916, -615347, -83959, 503883, 1250397, 2192582, 3361783, 4657614, 5753967, 6349789, 6403832, 6092913, 5706309, 5424544, 5223859, 5079517, 5014477, 5030102, 5086365, 5115442, 5083661, 4995549, 4928621, 5090741, 5596978, 6283954, 6851631, 6949493, 6381195, 5393151, 4411177, 3642026, 3111474, 2767818, 2481893, 2262003, 2285503, 2573474, 2927473, 3270673, 3697972, 4277730, 5049487, 6000554, 6964698, 7743936, 8298333, 8676262, 8924674, 9141433, 9413301, 9732043, 10056443, 10210989, 9962591, 9406339, 8941250, 8816162, 8888691, 8799141, 8351506, 7586843, 6588156]
13557F588156j139637j055844o06108R4653O80832R36659R66206Q48265N73156
13548G886338K42937j27544n42457p86812p81676n98435k47088J34493L95124
13539E574880N27876M66816Q1154n95198j207356j492274j495320j255145p63257
13530a57824j26761M00291O92658P49113N97928L57253J90103K07739L71691N04525
13520C786716M74318L37145K87469M21540O61591Q26401P46713M08124K581j59779
13510G792819J11355O32803R50489Q03099L32800p4397k03866k70527m84099o42133
13500H948343m49471N723L80304N66561P00647Q10082P73187N17051K19112J97937
13490A2669476N43108J033579J311850J165736O44816k8984n25335o05672l42858
$$ y = [6588156, 5448519, 4392675, 3786567, 3881220, 4562052, 5498711, 6464917, 7313182, 7886338, 8129275, 8001731, 7459274, 6672462, 5890786, 5292351, 5045263, 5179756, 5574880, 6102756, 6569572, 6650726, 6055528, 4848172, 3355898, 1860578, 605433, -157824, -284585, 115706, 808364, 1557477, 2155405, 2512658, 2702761, 2910500, 3282191, 3786716, 4261034, 4598179, 4885648, 5307188, 5968779, 6795180, 7541893, 7950017, 7952598, 7792819, 7904174, 8536977, 9487466, 10290565, 10623365, 10548968, 10345102, 10074575, 9590476, 8948343, 8498872, 8504595, 8884899, 9451460, 10152107, 10962189, 11735376, 12252427, 12471539, 12669476, 13212584, 14246163, 15558013, 16723749, 17368565, 17339581, 16814246, 16208574, 15865716]
13481A5865716j7628J23268P2276K2914J45709M60518Q01673Q97613O74676M62848
13471A9509583M79015N42693N26528M61135L62809L38511N42563R93212J511581
13462B5267630J915492K176142K208557J906573J360839Q69493P64382J136363
13454C7605471J649619J802372J512277J065407Q13107J006879J581770K233465
13446D9270367K771090L098757L188746L232769L391244L687183M136051M721552
13438G7497759N331328N887646O515194P256346P954490Q529701R087421R795593
13430A37855478J0753712J1975025J3527959J5534910J7889202K0258157K2405899
13423B50200342K4352947K6231807K8170084L0108729L1546815L1720087L0084269
$$ y = [15865716, 15848088, 15971356, 16043632, 16066546, 16212255, 16672773, 17474446, 18372059, 19046735, 19509583, 19988598, 20531291, 21057819, 21518954, 21881763, 22220274, 22762837, 23756049, 25267630, 27183122, 29359264, 31567821, 33474394, 34835233, 35704726, 36469108, 37605471, 39255090, 41057462, 42569739, 43635146, 44448253, 45455132, 47036902, 49270367, 52041457, 55140214, 58328960, 61561729, 64952973, 68640156, 72776207, 77497759, 82829087, 88716733, 95231927, 102488273, 110442763, 118972464, 128059885, 137855478, 148609190, 160584215, 174112174, 189647084, 207536286, 227794443, 250200342, 274553289, 300785096, 328955180, 359063909, 390610724, 422330811, 452415080]
13416D52415080K6451290K0966571J3878283N539493l140731j1113803j7758050
13409D87238133k2773417k6026948k7570548k7729306k6887182k5189075k2750239
13402C08311418j9943905j7173372j4722102j2677254j0771263q659769o350129
13395B18013624m216374k580781j253602J87328J781862L376290M903059O186721
13387B26398127P035973P279744O591831M738679J849409j577153m876662p635814
13379B39804134r815449j1596912j3097322j4092463j4285006j3763112j2870754
13372A50283116j1786464j0555452r348973q344787p587693o988223o454917n895615
13364H3320992n315657m877048m622089m368393l991977l497329k886917k287962
$$ y = [452415080, 478866370, 499832941, 513711224, 519250717, 516109986, 504996183, 487238133, 464464716, 438437768, 410867220, 383137914, 356250732, 331061657, 308311418, 288367513, 271194141, 256472039, 243794785, 233023522, 224363753, 218013624, 213797250, 211216469, 209962867, 210150195, 211932057, 215308347, 220211406, 226398127, 233434100, 240713844, 247305675, 252044354, 253893763, 252316610, 247439948, 239804134, 229988685, 218391773, 205294451, 191201988, 176916982, 163153870, 150283116, 138496652, 127941200, 118592227, 110247440, 102659747, 95671524, 89216607, 83320992, 78005335, 73128287, 68506198, 64137805, 60145828, 56648499, 53761582, 51473620]
13356E1473620k008134k142978k172705j616376p58636k34080l07241p51785j157018
13347D0324667j206900j002127r05707r57190j038576j203234j395330j517103
13339C1098500j533804j468845j425056j399393j296176j079500q33175o52901
13331B1409650o06646o24620n80878n30262m70432k83908J7656L07258M13991
13322A9051809L19042K68166L79602M94231M47399K82953J22308L4527J25420
13313B1525457L82623O26395O22216K63257k64946p07959j008093j188504j168453
13304A9081993r07711n83083l80037l00082l58715n66228p65893q05847o77964
13295A3736433m68650k91052k16729j51222j8148R4281R7797m5392k32252l34044
$$ y = [51473620, 49465486, 47322508, 45149803, 43533427, 42774791, 42540711, 42233470, 41481685, 40324667, 39117767, 38115640, 37209933, 36252743, 35214167, 34010933, 32615603, 31098500, 29564696, 28095851, 26670795, 25271402, 23975226, 22895726, 22062551, 21409650, 20803004, 20178384, 19597506, 19067244, 18596812, 18312904, 18330560, 18637818, 19051809, 19370851, 19639017, 20018619, 20512850, 20960249, 21243202, 21365510, 21400037, 21525457, 21908080, 22534475, 23156691, 23419948, 23155002, 22447043, 21438950, 20250446, 19081993, 18174282, 17591199, 17211162, 16911080, 16552365, 15986137, 15220244, 14414397, 13736433, 13267783, 12976731, 12760002, 12608780, 12590632, 12684913, 12782710, 12737318, 12505066, 12171022]
13285A2171022l21332j23647J41151J59880n8822k14289r7010K45985N31440M73811
13275A2908189M6079n13737r33833j192301j413416j527296j369006r92795o74886
13266D336998n54276m82059k37102J81001N64921O77080M31250Q2695j05458p4598
13256D820452J76890N48807Q55433J048209J139376R93524N54827Q799m39317
13247I707000n80964l29171r78j6082l34365o34226p46269q20006j025601j131195
13237D088143q31519k32477K79319N01321M88409M25966M61813M98380M51282
13228F130637M23835M68888N42522N05199K65803o5091l45650m67019l91939j99609
13218F867576m7908j22403l82502o32894q13942r07169q45224n77809p1167N31210
$$ y = [12171022, 11849690, 11726043, 11867194, 12027074, 11968252, 11753963, 11656953, 11902938, 12434378, 12908189, 12954268, 12440531, 11506698, 10314397, 8900981, 7373685, 6004679, 5011884, 4336998, 3782722, 3300663, 3063561, 3244562, 3809483, 4486563, 4917813, 5000508, 4895050, 4820452, 4997342, 5546149, 6401582, 7449791, 8589167, 9582691, 10137518, 10146317, 9707000, 9126036, 8796865, 8795887, 8779805, 8445440, 7811214, 7064945, 6244939, 5219338, 4088143, 3256624, 3024147, 3303466, 3804787, 4293196, 4719162, 5180975, 5679355, 6130637, 6554472, 7023360, 7565882, 8071081, 8336884, 8271793, 7926143, 7459124, 7067185, 6867576, 6819668, 6697265, 6314763, 5681869, 4867927, 3960758, 3115534, 2537725, 2466558, 2997768]
13208B997768Q27585N12930q4745m22684n18453n29917l46597O301L34905N72324
13198C349417O93936O77371N56791L44994p56m37354p43187p97331p28701n90502
13188B324678l43777j55444k57722n02670m22536J13166P85843J231933J216449
13179C989920Q64896O00056O10274P57871Q56248Q38055P66810O83430M80852
13170A0448412J26636j87957k91606k58510l13223n68952r49031j280936j332112
13161E392721j063166o62317l54981j71776q0313r0722j27841r6369Q2010L83318
13151C210564O87495Q96955R40163R44008J060770J102195R41594O87025L26044
13142A0796813j21104l89521k96191M864K08740J96874L9568o0459J17424N03111
$$ y = [2997768, 3825353, 4338283, 4253538, 3830854, 3312401, 2782484, 2435887, 2442188, 2777093, 3349417, 4043353, 4720724, 5277515, 5622509, 5621753, 5184399, 4441212, 3643881, 2915180, 2324678, 1980901, 1825457, 1567735, 1065065, 642529, 755695, 1541538, 2773471, 3989920, 4854816, 5454872, 6065146, 6823017, 7679265, 8517320, 9284130, 9967560, 10448412, 10575048, 10387091, 10095485, 9836975, 9523752, 8954800, 8005769, 6724833, 5392721, 4329555, 3667238, 3312257, 3140481, 3060168, 2969446, 2841605, 2745236, 2827246, 3210564, 3898059, 4795014, 5735177, 6679185, 7739955, 8842150, 9783744, 10470769, 10796813, 10675709, 10286188, 9989997, 9994861, 10203601, 10400475, 10440043, 10379584, 10497008, 11000119]
13132A1000119P92718Q31148O02002J65993k56972m23508k91818k8582J58183
13123A2549283J35324j07739k89355l7393M84921O77745K85745l40601p17142
13114A2640788o87347m56803k68296j49719o5497k2244N6963J80332L16685N09336
13104A2054198O78985O55353M17894J30468m9031j76252l65926n56438n48854
13095A2240397l11386R5138O15420J015020J060088Q70776Q27323J017352J173889
13086A8604017J145193R52105Q02241R90193J393084J648633J764314J947260
13078B9247040K059314J933004J886271K303002L105989M007985M924134N898859
13070E5365598O820680P651751Q687253J0112124J1737836J3296087J4741943
$$ y = [11000119, 11792837, 12623985, 13225987, 13391980, 13135008, 12711500, 12419682, 12391100, 12549283, 12684607, 12576868, 12287513, 12250120, 12735041, 13412786, 13698531, 13357930, 12640788, 11953441, 11496638, 11228342, 11078623, 11013126, 10990882, 11047845, 11228177, 11544862, 12054198, 12733183, 13388536, 13806430, 13936898, 13887867, 13711615, 13345689, 12789251, 12240397, 11929011, 12024149, 12639569, 13654589, 14714677, 15585453, 16412776, 17430128, 18604017, 19749210, 20701315, 21503556, 22493749, 23886833, 25535466, 27299780, 29247040, 31306354, 33239358, 35125629, 37428631, 40534620, 44542605, 49466739, 55365598, 62186278, 69838029, 78525282, 88637406, 100375242, 113671329, 128413272]
13063A28413272J6257904J7821886J9029166J9411098J8563059J6129877J1967283
13056B47593545O249637m44409o985593j2386965j6239852j8369552j8828060
13049A80588751j8031724j6663430j5196517j3732275j2243148j0721519r291968
13042H4708170q098424p053535n952319m751508l733587l283717l480864l896318
13034D4457898m010128l626785k803081j734764p90499k31240M9707J90043J74878
13025C1676029m0253m91809j035801j497150j829302k006598j939163j576383
13017B1259570j118382q03978n85413l15237P2344M82957P22451P35502O31869
13008B1081683N48432O06726R39681J561730K255938K709695K735868K372705
$$ y = [128413272, 144671176, 162493062, 181522228, 200933326, 219496385, 235626262, 247593545, 253843182, 253398773, 246413180, 234026215, 217786363, 199416811, 180588751, 162557027, 145893597, 130697080, 116964805, 104721657, 94000138, 84708170, 76609746, 69556211, 63603892, 58852384, 55118797, 51835080, 48354216, 44457898, 40447770, 36820985, 34017904, 32283140, 31492641, 31261401, 31311108, 31501151, 31676029, 31635776, 31143967, 30108166, 28611016, 26781714, 24775116, 22835953, 21259570, 20141188, 19337210, 18751797, 18436560, 18508904, 18991861, 19714312, 20449814, 21081683, 21630115, 22236841, 23176522, 24738252, 26994190, 29703885, 32439753, 34812458]
13000C4812458J657124N82687n62741j395894j794604j859571j831092j851116
12992B7757251j809196j618128j347606j175895j245062j467463j597769j496379
12984A5999753j211149r89190j086118j337704j355772j101627q22498o71737
12976G423958n43576k96377p1020q7266l74454p28824q53088p43643o21461n68004
12966B536245m73818l04332k32492k68847k65685j52141J17972M88249Q03674
12957B248825R69438R48398P63741O05199N32416L38412m1504m76993r25838j278271
12947C683823j255319q16681k09094K66495L89305K26763j9986k69391m66003
12938A529912m58230j25240L61407O82844P63517O38502L25110M0515J03856N59338
$$ y = [34812458, 36469582, 37052269, 36489528, 35093634, 33299030, 31439459, 29608367, 27757251, 25948055, 24329927, 22982321, 21806426, 20561364, 19093901, 17496132, 15999753, 14788604, 13799414, 12713296, 11375592, 10019820, 8918193, 8095695, 7423958, 6880382, 6584005, 6512985, 6425719, 6051265, 5322441, 4469353, 3725710, 3104249, 2536245, 2062427, 1758095, 1525603, 1256756, 991071, 838930, 956902, 1445151, 2248825, 3218263, 4166661, 4930402, 5535601, 6068017, 6406429, 6364925, 5887932, 4962094, 3683823, 2428504, 1611823, 1402729, 1669224, 2058529, 2285292, 2265306, 1995915, 1529912, 1071682, 946442, 1307849, 1990693, 2754210, 3392712, 3717822, 3758337, 3862193, 4421531]
12928D421531J076879J316559J257134J025637O65741K46255j56215m81576p14778
12919H657167r34064j143859j227829j136471j042377j064362j014209p92723
12911C01273n87207n80064o87922n20889R9593P98840J215124J378393J293554
12902B710695R50445N03638m0095o24128j007550j072321p80339j90226L70867
12893H20986N94452O15569P71350Q87243O10773N5750m65950p56541p21036m84763
12883A927833k33787n371K23790M48077N33984L75993J43102J10145K75878N13166
12873D312810O67985O62665O16283N04384J68126l32271o37619n50202k45017
12864E167144m2084j37863j80826K78361R04488J097319Q00898L24763r6072l60675
$$ y = [4421531, 5498410, 6814969, 8072103, 9097740, 9763481, 10009736, 9853521, 9371945, 8657167, 7723103, 6579244, 5351415, 4214944, 3172567, 2108205, 1093996, 301273, -285934, -865998, -1553920, -2074809, -1975216, -1176376, 38748, 1417141, 2710695, 3661140, 4164778, 4124683, 3500555, 2493005, 1420684, 640345, 450119, 820986, 1415438, 2031007, 2802357, 3689600, 4300373, 4356123, 3890173, 3133632, 2412596, 1927833, 1694046, 1688675, 1912465, 2360542, 2894526, 3270519, 3413621, 3523766, 3799644, 4312810, 4980795, 5643460, 6259743, 6764127, 6932253, 6599982, 5962363, 5412161, 5167144, 5125060, 4987197, 4806371, 5084732, 5989220, 7086539, 7887437, 8212200, 8116128, 7755453]
12854G755453n01747o70443q09196p03743m04301j21716O1244J03642J0067j25447
12844D593813k39411m49290q53603j156674j047331o59762k90636r3760K2996
12835a73658J12373N6613j57891l55928m13656l57859k91616l73616o26751q64288
12825c446277r40060q21130n17536r4609K89208M88736N23441N82279Q45701J230956
12815a859291J457484J299259P94800K45103p5498j11952O2540L10928M35600
12806B558973L79857K89421J62400j08618l88281n07583m85556m18043l18954
12797A163616k32042k02812k38299m31832o19196m98752j41562K04815L96224
12788e99840L48139J51466j07553l81554m90719l16927O9561M28404N74859O02697
$$ y = [7755453, 7253706, 6583263, 5774067, 5070324, 4666023, 4544307, 4605551, 4709193, 4719260, 4593813, 4354402, 3905112, 3051509, 1894835, 847504, 187742, -102894, -196654, -173658, -61285, -4672, -162563, -518491, -932147, -1290006, -1581622, -1955238, -2581989, -3446277, -4386337, -5207467, -5725003, -5819612, -5530404, -5041668, -4518227, -3935948, -3090247, -1859291, -401807, 897452, 1692252, 1937355, 1861857, 1749905, 1812445, 2123373, 2558973, 2938830, 3228251, 3390651, 3282033, 2893752, 2386169, 1900613, 1482570, 1163616, 931574, 728762, 490463, 58631, -560565, -1059317, -1200879, -996064, -599840, -251701, -100235, -207788, -589342, -1080061, -1396988, -1327427, -899023, -324164, 278533]
12778B78533O43232O48501N72325M77438M70189N32776O03761O47944N83047L93637
12768E851383J82276J18730L28706O30392O67000L85838l6244m66344q63592j184955
12758E613190j304940j097213o16876k13570j44294k93352m00891l06612M338
12749A239780L18492L23442M9934k23746l22496j87436P261k8547k07915j56504
12739H12265J47669M04918M07270J06129l44673o48159o14927l53588o0147J63039
12729A9796K90640L45102L51413L03090J40660o2946j65792j99893k90452m75562
12719B56056o71314p35623n67868j55459L56735O74176O89848N26705K76514L5567
12709F85337p21J53391K60925K16876L3734k66600o04382p45436o29474m81000
$$ y = [278533, 921765, 1570266, 2142591, 2620029, 3090218, 3622994, 4226755, 4874699, 5457746, 5851383, 6033659, 6152389, 6481095, 7111487, 7778487, 8164325, 8128081, 7661737, 6798145, 5613190, 4308250, 3211037, 2594161, 2380591, 2236297, 1942945, 1542054, 1235442, 1239780, 1558272, 1881714, 1931648, 1707902, 1385406, 1197970, 1205231, 1176684, 968769, 812265, 959934, 1364852, 1772122, 1878251, 1533578, 885419, 270492, -83096, -143243, 19796, 310436, 655538, 1006951, 1310041, 1450701, 1387755, 1221963, 1022070, 731618, 256056, -415258, -1150881, -1718749, -1874208, -1517473, -843297, -153449, 373256, 649770, 685337, 684616, 838007, 1098932, 1315808, 1349542, 1082942, 478560, -266876, -896350, -1377350]
12699a377350m46893n14683o12537o65437n73946l21129o6352L0731j36192n39986
12689e223774q58639p28468k01999L85558Q53939J203857J396856J397388J264385
12680e10897J062530Q85537O95113L49041j18968m99732n51700k69563l4348j87666
12670H19347o20934r96260j083620q77508n18815j99546n5701j2943J485j13190
12660c657685l02663k66320O8270M26464N67383N26010M28275L74406M70660P04967
12650f60233R31880R36724O07640R6296l03364m33072m60066o02243p01840m21958
12640a010236J74152O46806P38652N39642J94691j54377l14454j68826K27096
12631H73146O20032P89226P19369M80833J97269O5851O4396k229j96594m60173
$$ y = [-1377350, -1824243, -2338926, -2951463, -3616900, -4190846, -4511975, -4578327, -4547596, -4683788, -5223774, -6082413, -6810881, -7012880, -6627322, -5773383, -4569526, -3172670, -1775282, -510897, 551633, 1437170, 2132283, 2481324, 2362356, 1862624, 1310924, 1041361, 1007013, 819347, 198413, -797847, -1881467, -2758975, -3277790, -3477336, -3533037, -3545980, -3544495, -3657685, -3960348, -4226668, -4158398, -3731934, -3164551, -2638541, -2210266, -1835860, -1365200, -660233, 271647, 1208371, 1816011, 1912307, 1608943, 1175871, 715805, 113562, -588278, -1010236, -836084, -189278, 549374, 1089016, 1283707, 1129330, 814876, 646050, 873146, 1493178, 2282404, 3001773, 3482606, 3679875, 3745726, 3810122, 3807893, 3611299, 3151126]
12621C151126p58516j029038j090231p75855k44995J30676J41334j56596n62652
12612a194747q52191q74343o77500l56709J8672K96389K99199j8707m68426p28118
12602d556481o39020k35440K62550M61690K81082J46785K86524M72887N28922
12593b990501N56610O36503N49298J40708k68772k88347N8243M76739O70367N27791
12583F8639K29296m1231k46369m34924o59652p66157o11732l33800j03521O1762
12573b837689J74818J30092j62730n56328o95103m46421r1764J39119L10291N01472
12563c534243O03435O15835O41546O37603M65868J08551k97939o18966p13039
12554b091349n05929j36151J52881K35281R3069k09569m64208m62852k78791j10874
$$ y = [3151126, 2392610, 1363572, 273341, -502514, -747509, -616833, -475499, -632095, -1194747, -2046938, -2921281, -3598781, -3955490, -3936818, -3640429, -3341230, -3359937, -3828363, -4556481, -5195501, -5430941, -5168391, -4706701, -4425619, -4278834, -3992310, -3519423, -2990501, -2433891, -1797388, -1248090, -1107382, -1376154, -1664501, -1606258, -1129519, -459152, 68639, 297935, 256704, 10335, -424589, -1084241, -1850398, -2462130, -2795930, -2899451, -2837689, -2662871, -2532779, -2695509, -3251837, -3946940, -4393361, -4485125, -4346006, -4035715, -3534243, -2930808, -2314973, -1673427, -1035824, -569956, -461405, -759344, -1378310, -2091349, -2597278, -2733429, -2580548, -2345267, -2252198, -2461767, -2925975, -3388827, -3667618, -3778492]
12544c778492J3508O6658R266l9003R2399L86147N95720N27153M08967N71566
12534a146111Q60208Q90306O08944K17483m2569o2153l0430r1108j11085L385
12524A096870J77894M27928O70118O91613L85127k2542m5531L03048M42112K25932
12514D352569j7114j37000j30825m571J57177K42695K41594R2768k74179o66945
12504C856169q08209o54056m12182k19803n0063J56087L74787N47146N42406J03031
12494C435313p19719j386606j336873n59531L32378P91104Q27758P32090O42520
12485B758434M79273J39901l42398p66718q64265n35188k5039K94580L68450M09684
12475A916714N19637N15982K57541r0979k17566o3705p721l41130p91438q81240
$$ y = [-3778492, -3764984, -3698326, -3689060, -3728063, -3635664, -3249517, -2653797, -2126644, -1717677, -1146111, -285903, 604403, 1213347, 1430830, 1388261, 1326108, 1295678, 1204570, 1093485, 1096870, 1274764, 1702692, 2372810, 3064423, 3449550, 3427008, 3381477, 3684525, 4126637, 4352569, 4335455, 4198455, 4067630, 4063059, 4220236, 4462931, 4704525, 4797293, 4523114, 3856169, 3047960, 2393904, 1981722, 1761919, 1711856, 1867943, 2242730, 2789876, 3332282, 3435313, 2715594, 1328988, -7885, -567416, -235038, 556066, 1383824, 2115914, 2758434, 3237707, 3377608, 3035210, 2268492, 1404227, 869039, 844000, 1138580, 1507030, 1916714, 2436351, 2952333, 3209874, 3118895, 2901329, 2837624, 2829903, 2488773, 1697335, 816095]
12465H16095n79275j84547J64863M25870M64984K20591k20655n99398n86646k04129
12455b82247K20705M64991N38517N67372N43922M11919K24608Q5942J09207K27496
12445C112432L08568M15082N57464N71317M03774R6229k52184n12711o82764p04762
12435C312445n89469n28989n27128n19580o34829q71181r76224p76670l77952
12426b489577m6320Q5998J05840J50149K19431K13874R0671q1425j97039k14866
12416b163264p9163K61060O12581O70485M55712J07109k86023o09635q15775r04411
12406b751324q91004q59150q20822p02826n14125l52014k50913j76728j82849
12397g501755k55622j99059J171J90366L32671L93830L03280J13705m7251o7260
$$ y = [816095, 236820, 52273, 217136, 643006, 1107990, 1328581, 1107926, 508528, -78118, -282247, -61542, 403449, 941966, 1509338, 2053260, 2465179, 2689787, 2775729, 2884936, 3112432, 3421000, 3836082, 4393546, 4964863, 5368637, 5464866, 5212682, 4699971, 4017207, 3312445, 2722976, 2193987, 1666859, 1147279, 512450, -358731, -1334955, -2111625, -2489577, -2535897, -2449899, -2344059, -2193910, -1974479, -1760605, -1669934, -1751359, -1948398, -2163264, -2242427, -1981367, -1368786, -698301, -242589, -135480, -421503, -1031138, -1846913, -2751324, -3642328, -4501478, -5322300, -6025126, -6539251, -6891265, -7142178, -7318906, -7501755, -7757377, -7956436, -7955265, -7764899, -7432228, -7038398, -6735118, -6621413, -6668664, -6735924]
12387f735924J12255L56657N62562P56947Q75609P86459M27113q4423n05540o92831
12377d141116p24939o72761n25249j87057L82327R59192J365346J625687J721061
12368a97509J572627J108941M63937r284k55118m08689m10748k08966J98820P42752
12358B596763J092528J015856O75599L08356p0273n24837r56948j153115j063113
12349A920816r37402r39033r16728p26128m40846j37305K04630M94322N20924
12340i56750L00802J67501K37074J72796j82215n44880p20769o51710l63555l6761
12330b578467J92162K97482L95964O32241Q90646R22015O02381R2577k15508k03646
12320A027847j88803l60065m56118k33714J73602M74836N59847M87599L50399
$$ y = [-6735924, -6623669, -6267012, -5704450, -4947503, -4071894, -3285435, -2858322, -2942745, -3448285, -4141116, -4866055, -5538816, -6064065, -6251122, -5868795, -4909603, -3544257, -1918570, -197509, 1375118, 2484059, 2947996, 2938712, 2683594, 2274905, 1864157, 1655191, 1854011, 2596763, 3689291, 4705147, 5380746, 5689102, 5618829, 5093992, 4137044, 2983929, 1920816, 983414, 44381, -872347, -1598475, -2039321, -2176626, -1971996, -1477674, -956750, -655948, -488447, -251373, -78577, -260792, -805672, -1526441, -2178151, -2541706, -2578467, -2386305, -2088823, -1692859, -1060618, -169972, 752043, 1354424, 1447001, 1231493, 1027847, 839044, 478979, 22861, -210853, -37251, 437585, 997432, 1485031, 1835430]
12311A835430K15516J31373J30513J53917O8296m5648j15762l15555p10404j090416
12301B57260j266713j205294q69980l84872m2922k9259k18602l67258k84759M0775
12291d371624L32758M35957M87997N35483M36586J46925j33387j92261r216K91880
12281b038902N02761M94302L60884L31064M37331M85150L26392m104k42310k18112
12271D34456j49715j80489j27808P8336K29564K03634J28036N7385r0291k40090
12261C43018k50369j71835j39309j71415k07298k15373j39179L6537J60269J11311
12251f43643l3795j59828k34534k60237l06345l53438k68043j8672L12655N85925
12241a379955P17239O60206L68382k5486k77304l95416n24219o33172o35320n43857
$$ y = [1835430, 2050946, 2182319, 2312832, 2466749, 2535045, 2489397, 2373635, 2058080, 1347676, 257260, -1009453, -2214747, -3084727, -3469599, -3512521, -3541780, -3760382, -4127640, -4412399, -4371624, -4038866, -3602909, -3114912, -2579429, -2142843, -1995918, -2129305, -2321566, -2330782, -2038902, -1536141, -1041839, -680955, -349891, 87440, 572590, 898982, 894878, 652568, 434456, 284741, 104252, -23556, 54780, 284344, 487978, 616014, 673399, 583108, 343018, 92649, -79186, -218495, -389910, -597208, -812581, -951760, -915223, -754954, -643643, -677438, -837266, -1071800, -1332037, -1638382, -1991820, -2259863, -2278535, -1965880, -1379955, -662716, -2510, 365872, 340386, 63082, -332334, -856553, -1489725, -2125045, -2668902]
12231b668902l40135K2641M06594O28051O65759O08187N63718O23932Q31807J003652
12221B345304R21141O62222L64055N0926k23873k90182j32798L3214R0434K2179
12211C842622j58207m44599p88933j053344j141679r19813l65573J69306M37919
12202d22301N67536P13686R16765J081813R68018N43206L3034l35643m99208n42387
12192C024519o10029p73577r00194p50359l14936N4187J12021J2071J7930J76489
12182D8122L53459M34467M36707L36688Q0261j66228j33338J66647M37360N56582
12172B550727O60206Q58761J029570R82950P23906M09206R9624j80867l53875
12163F780208l47735j15213J70022K46364J09498j65115n46476q75804r87777
$$ y = [-2668902, -3009037, -2986396, -2579802, -1951751, -1285992, -677805, -114087, 509845, 1341652, 2345304, 3266445, 3928667, 4292722, 4343648, 4119775, 3829593, 3696795, 3730009, 3820443, 3842622, 3684415, 3239816, 2450883, 1397539, 255860, -663953, -1029526, -860220, -422301, 145235, 858921, 1775686, 2857499, 3825517, 4368723, 4401757, 4066114, 3566906, 3024519, 2414490, 1640913, 740719, -9640, -324576, -270389, -158368, -146297, -128367, 48122, 401581, 836048, 1272755, 1609443, 1689704, 1523476, 1390138, 1556785, 1994145, 2550727, 3210933, 4069694, 5099264, 6082214, 6806120, 7215326, 7314950, 7134083, 6780208, 6432473, 6317260, 6487282, 6733646, 6843144, 6678029, 6131553, 5255749, 4267972]
12154D267972j003578j121036j182150q77810k99907J58221L03255K33162J42219
12145F20348P8097r7344m19236o73820p27598o31410n24146n42077o35716m88916
12135d041818N8511P84828J341584J533694J346337P56275n4650o31519p49944
12126C43298n39284j80546K25215N10437M72705J68504j89861m48581n66373m78751
12116f83237j72634K30207N91965Q06209R45706J078906J049831P11995J71621
12107D730569k39091l08682j31537J63024M83105O01404L55441l0892k10235j90617
12097E222489k22911l97959n78012o83227q15172q88466o91805j91318L72422
12088A126041O71148N52520J70643r1789r4396j10287l28985n50192n35502k83256
$$ y = [4267972, 3264394, 2143358, 961208, 83398, -216509, -58288, 244967, 478129, 620348, 698445, 601101, 181865, -491955, -1219553, -1850963, -2375109, -2917186, -3552902, -4041818, -3983307, -3198479, -1856895, -323201, 1023136, 1779411, 1724761, 1093242, 343298, -195986, -376532, -151317, 359120, 831825, 1000329, 810468, 361887, -204486, -683237, -855871, -625664, -33699, 772510, 1718216, 2797122, 3846953, 4558948, 4730569, 4491478, 4182796, 4051259, 4214283, 4697388, 5298792, 5654233, 5623341, 5413106, 5222489, 4999578, 4601619, 4023607, 3340380, 2525208, 1636742, 944937, 753619, 1126041, 1797189, 2349709, 2520352, 2428563, 2334167, 2223880, 1894895, 1344703, 809201, 525945]
12078E25945l6961q8300m19364p02196o89650m52584k65512k95116l62304j58677
12068b944719K87265O78403Q56436Q37552O76298L89048k0663l62781m45424l58299
12058d06884l04832l71907m99772n39326l69844p1693R7025Q469j67087k23907
12048b849758j47622o4378N2890L79795P71873Q61092N76074J60926k04962m65893
12038i29963o44551p34777o40626k68574L63788R14945J058122Q85485O31821
12029F35670M38832L26715L19410L48593K00328k04459o34538q23136r04068j039522
12019a336175j006710p10352l00625Q0692K19558J12622K2576N3484Q8035J89083
12009b587812M35257O58680P69974Q62624R64770Q37284M10212j15395p39469
$$ y = [525945, 488984, 400684, -18680, -720876, -1410526, -1863110, -2128622, -2423738, -2786042, -2944719, -2657454, -1979051, -1122615, -285063, 391235, 780283, 759620, 396839, -48585, -406884, -711716, -1083623, -1583395, -2122721, -2492565, -2564258, -2467233, -2458764, -2625851, -2849758, -2997380, -3061758, -3008868, -2629073, -1857200, -996108, -420034, -259108, -464070, -929963, -1574514, -2309291, -2949917, -3218491, -2854703, -1939758, -881636, 3849, 635670, 1074502, 1401217, 1720627, 2069220, 2269548, 2065089, 1430551, 607415, -296653, -1336175, -2342885, -3053237, -3353862, -3273170, -3053612, -2940990, -2918414, -2864930, -2776895, -2587812, -2152555, -1493875, -723901, 138723, 1103493, 1940777, 2350989, 2235594, 1496125]
12000A496125j343771j576853j374452r08793m14833m0362L26570O99961Q39075
11991b297333O29224J84786l11375p27811j012747j050005p03168j24868L01636
11982e111661L92934K08535p0226j75023J9297L52523N35581N14879M98580M96555
11972b338026M51460M69823N74327N92617L86482J35458O0220J58482L06071L75745
11962A172659L32053K98048M57045O95741P20411M99159K21017l2040k48638l47066
11952C768389k85822j58341o3645R2168L24485L88298J14966l21088o94612r65436
11942B199362j099859r50093n11880j01322Q9110J57037K18238J90692M2494j85855
11932D7924n20350p75135p32763m12580P995K48653J18197k65944n62213n29972
$$ y = [1496125, 152354, -1424499, -2798951, -3707744, -4122577, -4162939, -3836369, -3136408, -2297333, -1668109, -1483323, -1794698, -2522509, -3535256, -4585261, -5288429, -5413297, -5111661, -4718727, -4510192, -4580418, -4755441, -4736144, -4383621, -3848040, -3333161, -2834581, -2338026, -1886566, -1416743, -842416, -249799, 136683, 272141, 332361, 490843, 796914, 1172659, 1504712, 1802760, 2259805, 2955546, 3675957, 4175116, 4396133, 4364093, 4115455, 3768389, 3482567, 3324226, 3260581, 3352749, 3677234, 4065532, 4180498, 3859410, 3164798, 2199362, 1099503, 149410, -362470, -463792, -374682, -217645, 593, 191285, 233779, 47924, -472426, -1247561, -1980324, -2392904, -2384909, -2136256, -2018059, -2284003, -2846216, -3376188]
11922c376188k63694n1088q8924k61863l02257k26863k27139k80267k10916N8028
11912e231171L93337N42832M61099K80327J3290k45613j47517M15648J055261
11903b462507J311669J087013O89663N31426P43650J052850J076921P43900K97228
11894E071813k1644k21293m56288p36282q04789m49122J50215O27970Q58130R68491
11884D987201J001757P77465K65844l00118p73916j153349j433164j571448j501731
11875B98541j180954o84436j54855L18014N09366K24918k79120o62002q50166
11866b460694q22231m98298J38324Q97541J386524J438659J236840R37575N73962
11857B828202K73965O8901j62118l47516l28938k58602l71346m68552k41962N0033
$$ y = [-3376188, -3639882, -3690970, -3779894, -4041757, -4344014, -4570877, -4798016, -5078283, -5289199, -5231171, -4837834, -4295002, -3833903, -3553576, -3540286, -3785899, -3933416, -3517768, -2462507, -1150838, -63825, 625838, 1157264, 1900914, 2953764, 4030685, 4774585, 5071813, 5050169, 4828876, 4372588, 3636306, 2831517, 2382395, 2532610, 3160580, 4018710, 4987201, 5988958, 6766423, 7032267, 6732149, 5958233, 4804884, 3371720, 1800272, 298541, -882413, -1566849, -1721704, -1403690, -894324, -669406, -948526, -1610528, -2460694, -3282925, -3781223, -3642899, -2745358, -1358834, 79825, 1316665, 2254240, 2828202, 3102167, 3171068, 3008950, 2661434, 2332496, 2073894, 1702548, 1233996, 992034, 1042067]
11847A042067k6058m25647o84447n05269j75426q4512j65169p7406K59955O09782
11837b32130P65126O86516L85352L4791j32950j41019r8098O491J91517M35484
11827A901080O14307N68084L18193O0100q0674j80079k85768k98486j42783P5935
11817B549909J45927k2862l08984m80912l90736j83621r7394n0454J25951L12521
11807A599345L07434P093m93784q67115q83612o35672k97858J23582O11340J006022
11797D76775J167760R72519M08931j97316m27121j52774L57867O52535M93770
11788C752946r0694q38682j290550j262948r86567o85472m13856j29138J86922
11779a758039L37996K24600Q8937J28010K22813J71154j6261j36379j55127k00475
$$ y = [1042067, 1016009, 590362, -94085, -599354, -774780, -859292, -1024461, -1101867, -841912, -232130, 532996, 1219512, 1604864, 1639655, 1506705, 1365686, 1267588, 1274079, 1465596, 1901080, 2515387, 3083471, 3401664, 3461764, 3381090, 3201011, 2915243, 2616757, 2473974, 2549909, 2695836, 2672974, 2363990, 1883078, 1492342, 1308721, 1211327, 1160873, 1286824, 1599345, 1906779, 1913872, 1420088, 552973, -330639, -966311, -1264169, -1140587, -529247, 476775, 1644535, 2617054, 3025985, 2828669, 2401548, 2248774, 2606641, 3259176, 3752946, 3662252, 2823570, 1533020, 270072, -716495, -1401967, -1815823, -1944961, -1758039, -1420043, -1195443, -1106506, -978496, -755683, -584529, -600790, -737169, -892296, -1092771]
11769a092771k48769k36317j97812p4747K6682j4508M6626L81468Q86674J229948
11759G06474J127429P78570N28823M23637L66995L51765M07924M52204L42217
11750E486038J19590j9061p4417j41682r3647K93037R53956J579648J903075J653009
11740A1659546Q33888L2053k58453k70534m35366q14470j244805j559626j687908
11731F254325j644831j417640j123157r88843j017589r84221q05564o20791l91157
11722b739468L8137N57838Q74067Q25678N84058L95476L00402K50517J71752N1810
11712A310267N3927L46262P95168R88383P05787K04040k35557n59640p48878p62315
11702B097444n82188l01108p9335K3866N7487M0536k5802j36120k71596k84410
$$ y = [-1092771, -1341540, -1577857, -1775669, -1850416, -1823734, -1838242, -1791616, -1410148, -523474, 706474, 1833903, 2612473, 3141296, 3564933, 3931928, 4283693, 4691617, 5143821, 5486038, 5605628, 5586567, 5512150, 5370468, 5276821, 5569858, 6523814, 8103462, 10006537, 11659546, 12493434, 12525487, 12267034, 11996500, 11561134, 10746664, 9501859, 7942233, 6254325, 4609494, 3191854, 2068697, 1079854, 62265, -921956, -1727520, -2348311, -2739468, -2701331, -2143493, -1269426, -443748, 140310, 535786, 836188, 1086705, 1258457, 1310267, 1364194, 1710456, 2505624, 3494007, 4199794, 4403834, 4168277, 3608637, 2859759, 2097444, 1515256, 1214148, 1134813, 1158679, 1216166, 1256702, 1230900, 1094780, 823184, 538774]
11692E38774j02086Q6643R0248q1667j60508N4154L60662N28655N09096K86863
11682B110834j03369n30964q20034q36342o56826n17009n10862m90174l19231
11673b673977n8825J62877L17708M14925M00097K65255J33908P4283Q8082K01573
11663f74094L47056L76965L16961K89777L49435N07398P25428R48930J070750
11654D258606Q97747M05452j45870n53931p79288p96044o75841n68426n29384
11645A513021n45412m82844l39230l07245m19641n79808p52344q21744o16210
11636c351457r6624N58539J059661J305822J399998J354071J059900N56573K7743
11627C874226l34163n00127n82115n25904k53936k3324n0810k64891m44809l77944
$$ y = [538774, 436688, 523331, 613579, 531912, 371404, 425558, 786220, 1314875, 1823971, 2110834, 2007465, 1476501, 656467, -179875, -836701, -1353710, -1864572, -2354746, -2673977, -2732802, -2569925, -2252217, -1837292, -1437195, -1171940, -1038032, -963749, -875667, -674094, -327038, 49927, 366888, 656665, 1006100, 1513498, 2238926, 3187856, 4258606, 5156353, 5561805, 5415935, 4862004, 4082716, 3286672, 2610831, 2042405, 1513021, 967609, 484765, 145535, -161710, -581351, -1161159, -1913503, -2735247, -3351457, -3448081, -2889542, -1829881, -524059, 875939, 2230010, 3289910, 3846483, 3874226, 3540063, 3039936, 2457821, 1931917, 1677981, 1654657, 1603847, 1338956, 894147, 516203]
11617E16203j29701O8236J22715K0068j72734k82681j91847Q9738M00894N31787
11607I72678M24549J76295j27810l77020m50713l82170k81727j16457J97566N25704
11597E60895O77471P26024Q25785Q48313N93983J34661k22400k72732j86841k62102
11587C423057n18232q27357j161695j492787j552085j127727n23547j33145M8819
11578c864699J84208K98187L54785L80776L91290L58991L19727K64016K04741
11569a107978K26497L35229M15696L91823L43674L56544L91188L10377J1450m23920
11559A250580q13189j127730j385806j463053j260037q05104k37227J82477K92134
11550e366955L14985N05383P62676Q37130O44473L54320J79786K69580N30698
$$ y = [516203, 386502, 454738, 577453, 597521, 424787, 142106, -49741, 39997, 440891, 972678, 1397227, 1573522, 1445712, 1068692, 617979, 235809, -45918, -162375, 35191, 560895, 1238366, 1964390, 2790175, 3638488, 4232471, 4367132, 4144732, 3872000, 3685159, 3423057, 2904825, 2077468, 915773, -577014, -2129099, -3256826, -3780373, -3913518, -3864699, -3680491, -3382304, -3027519, -2646743, -2255453, -1896462, -1576735, -1312719, -1107978, -881481, -546252, -130556, 261267, 604941, 961485, 1352673, 1663050, 1674500, 1250580, 437391, -690339, -2076145, -3539198, -4799235, -5604339, -5841566, -5659089, -5366955, -5051970, -4546587, -3783911, -2946781, -2302308, -1947988, -1768202, -1498622, -967924]
11541i67924O76980O73657N27795J62515k87039o45108q14085p94943p37104o87632
11531b892888n43789k20250K74717O52689N77940J77651j04187o5529R2956J94389
11521a856301K99219M32625M16585K23658J32567J94214J10504j80592m68157
11512f95678o77342r23495j252813j421725j136936m42327L48804R19534J131328
11503d150650J083592R53672R01262R89307R66592N49670j14664o50334q73756
11494c45309p93020n41176k73996j257K50551L51940L43153M25971O30157Q07709
11484H54723P75333L94387j55657m86804l73649L8624L02981J23253l12765o65366
11474D95060p84672o06505j75134L09980O35594O59740L48724p8777l74597m51098
$$ y = [-967924, -290944, 382713, 910508, 1073023, 785984, 140876, -673209, -1468152, -2205256, -2892888, -3436677, -3656927, -3382210, -2729521, -2151581, -1973930, -2078117, -2143646, -2050690, -1856301, -1557082, -1124457, -707872, -484214, -351647, -157433, -46929, -227521, -695678, -1373020, -2296515, -3549328, -4971053, -6107989, -6550316, -6201512, -5281978, -4150650, -3067058, -2113386, -1212124, -222817, 743775, 1293445, 1178781, 528447, -345309, -1138329, -1679505, -1953501, -1954758, -1704207, -1352267, -1009114, -583143, 47014, 854723, 1630056, 2024443, 1868786, 1381982, 1008333, 1046957, 1349938, 1473191, 1160426, 495060, -289612, -896117, -1071251, -761271, -125677, 534063, 882787, 804010, 429413, -21685]
11464b1685l44903j46411R7566L22086M79614O04989P22617R02412J126335J179261
11454D921881R74717O05530J69942j55646k48549j77379j17428j58177k71708
11445E543183l70449l58678k46517j71401k06495k15856j24949p2379j40162k44992
11435C391305k50360j01022O1143K6904k14423n19568o31979m38392k00629j39353
11425I83626j58833m6538K01989L62368L73974L49638L54532L60770K87281R0855
11415C159662j50551k66160j81774o4809o4649p3647M6839K97157M92506M76195
11405C670769K28058j48535n12313p47876p28477n49120l88918j87814R4369K59279
11395I89422J18180j56348k43098r8584R2049K09218K35077J60896P5065R3387
$$ y = [-21685, -366588, -512999, -415433, -93347, 386267, 991256, 1713873, 2616285, 3742620, 4921881, 5896598, 6502128, 6672070, 6516424, 6267875, 6090496, 5973068, 5814891, 5543183, 5172734, 4814056, 4567539, 4396138, 4189643, 3973787, 3848838, 3776459, 3636297, 3391305, 3140945, 3039923, 3101066, 3127970, 2913547, 2393979, 1762000, 1323608, 1122979, 983626, 824793, 778255, 980244, 1342612, 1716586, 2066224, 2420756, 2781526, 3068807, 3159662, 3009111, 2742951, 2561177, 2496368, 2431719, 2358072, 2404911, 2702068, 3194574, 3670769, 3898827, 3750292, 3237979, 2490103, 1761626, 1212506, 823588, 635774, 730143, 989422, 1107602, 951254, 708156, 609572, 701621, 910839, 1145916, 1306812, 1381877, 1475264]
11385A475264R1794m8587j16501J9860Q5495j17535l56385l77633k06570J4018
11375D63220J58890K08719K88075M76641O60939O51201M09951K8797l27694m35201
11365B583538j93117K10622L72267Q8406m01221p73694r11953q32893o52457m87961
11355i98463l94352l32517j77521J13712M06515N84026P16675J003247J382092
11346B303414J526168J259403N64299l20732r45249j100184q47694m43340j70343
11337A825742m9161K3160J56049M99480R12981J045048P12912M6278n19664n29767
11327D123058K1712N27745M74116o6774o71692r35689q28787o65663o44842o11324
11317G21860l87490j20605o3128j81524l23927m29224m58893l70590j25651K67001
$$ y = [1475264, 1567058, 1518471, 1401970, 1421830, 1507325, 1389790, 1033405, 655772, 449202, 463220, 622110, 830829, 1118904, 1595545, 2256484, 2907685, 3317636, 3346433, 3018739, 2583538, 2390421, 2601043, 2973310, 3061716, 2660495, 1886801, 974848, 141955, -510502, -998463, -1392815, -1725332, -1902853, -1789141, -1382626, -798600, -81925, 921322, 2303414, 3829582, 5088985, 5653284, 5332552, 4387303, 3287119, 2439425, 1996085, 1825742, 1776581, 1799741, 1955790, 2455270, 3368251, 4413299, 5126211, 5172489, 4652825, 4123058, 4144770, 4672515, 5146631, 5079857, 4408165, 3472476, 2643689, 1978026, 1333184, 721860, 334370, 213765, 150637, -30887, -354814, -784038, -1242931, -1613521, -1739172, -1472171]
11307a472171N81529O32525N43773L94641J17348k62854n75133p20061q56149
11298a616552j079428j083562o60363n6015M78827Q15780Q96333P97218N71195
11289i36567K13777k55057o58288p75319o24999l09516P7436K49217P3943k02061
11279c147434l14273k63638j76230j73512k84456n04044q38021j046641q20741
11270g568990k71696K28448N09924N83832N10909M56579N20769N62071M74983
11261c993171L72588L27869K73454K22619K24144K12918O7198k98745o38099n39453
11251c768678J171N41913O84826L99411p2919l71170k95994l3927Q2090r6913
11241b930190m38495o49491n71557l26675j26755q2108j76771k32697n1858K77874
$$ y = [-1472171, -890642, -258117, 285656, 680297, 797645, 534791, -40342, -760403, -1616552, -2695980, -3779542, -4439905, -4495920, -4017093, -3201313, -2304980, -1507762, -936567, -722790, -977847, -1636135, -2411454, -3036453, -3345969, -3268533, -3019316, -2945373, -3147434, -3461707, -3725345, -3901575, -4075087, -4359543, -4863587, -5701608, -6748249, -7568990, -7840686, -7612238, -7102314, -6518482, -6007573, -5550994, -5030225, -4468154, -3993171, -3620583, -3292714, -3019260, -2796641, -2572497, -2359579, -2292381, -2591126, -3229225, -3768678, -3767507, -3225594, -2540768, -2141357, -2214276, -2585446, -2881440, -2915367, -2833277, -2930190, -3368685, -4018176, -4589733, -4916408, -5043163, -5125271, -5302042, -5534739, -5586597, -5308723]
11231e308723M55007L35659J72208K97008O52712R22825R40399O94789K24549
11222f13567k72325o28461q61530r43005p26821k55276K23875N99279R06298R92576
11212a578957P51975M43535K64357K07814J94491J06451j8517n3055j2623N5836
11202C61307J46499J89846J43089J45099L24051M25716J76705l18577q47075j310525
11192e63865j647815j674213j295982o86039j60334J06494K27821M21063P52944
11183d519926J050622J074094Q40989O05684N13940N08399M54244L25642J71186
11174A024874n1686k84611l82835m32186n50951n34705j80034L93697R63452J315662
11164A280677J312086R84779M95577j08647p38854j150639j311125j362878j316201
$$ y = [-5308723, -4853716, -4518057, -4345849, -4048841, -3396129, -2473304, -1532905, -838116, -613567, -885892, -1514353, -2375883, -3318888, -4045709, -4300985, -4077110, -3477831, -2571533, -1578957, -826982, -383447, -119090, 88724, 283215, 389666, 371149, 318094, 305471, 361307, 507806, 697652, 840741, 985840, 1309891, 1735607, 1912312, 1593735, 746660, -563865, -2211680, -3885893, -5181875, -5867914, -6028248, -5921754, -5693933, -5272870, -4519926, -3469304, -2395210, -1554221, -948537, -434597, 73802, 528046, 853688, 1024874, 973188, 688577, 305742, -126444, -677395, -1212100, -1392134, -998437, -34985, 1280677, 2592763, 3577542, 4073119, 3964472, 3225618, 2074979, 763854, -599024, -1915225]
11155a915225j130506q91935n94402p2754N30159P73520N93489L30229J71199
11146b206226J25042J99469M03809O89275Q68475O80208K45029j0483O259P2536
11136A073393P6006n6052l33975o78671j016431j164429r23350m06223R5178M66135
11126b868419O34393O06613N19638N37518P70720J136491J435049J514367J324117
11117E610487R27722M63265R41m26077p03729p97370p19252m73793j33185J61183
11107C910192J80065j54072o15618q71506p13062l50393k10166k89278l35234
11098E50928k86878j46657k090O2903J5503j05086j29169n3824j33947m62169
11088f90486q23306q68422n08632r3912M3692j22116m32267o56600o39856l52749
$$ y = [-1915225, -3045731, -3937666, -4532068, -4604822, -4074663, -3301143, -2707654, -2377425, -2206226, -2081184, -1881715, -1477906, -788631, 79844, 760052, 1005081, 994598, 1000857, 1073393, 1149399, 1093347, 759372, 80701, -935730, -2100159, -3023509, -3429732, -3334554, -2868419, -2234026, -1627413, -1107775, -570257, 200463, 1336954, 2772003, 4286370, 5610487, 6538209, 7001474, 7002415, 6576338, 5872609, 5075239, 4355987, 3882194, 3749009, 3910192, 4090257, 3936185, 3320567, 2449061, 1735999, 1385606, 1175440, 886162, 550928, 264050, 117393, 115303, 178206, 193709, 88623, -40546, -94370, -228317, -690486, -1513792, -2382214, -2890846, -2984758, -2941066, -3063182, -3495449, -4152049, -4791905, -5144654]
11078e144654J11967M75797N10573K74127m2182k67181k84619r8396J81333M17544
11068c865691M98532L76627K42787L38032O46022R64672J165313J171240R69724
11059B507258O87276M03967J48713o1987k97676m81831n13800l86817o6053L03229
11049B242279M44110L13047P1273j06978j0861K89541M43899L87134L14375J72738
11039D560557j82006n67220p30593o51213m91614m24354m35450m17933l23887
11030C36287j91485p2201k9164q0333j32278j30262j09239j57839k58854k12223
11020a037591P9711M67133O80149N68941J77681l10908o47466o07840j59151M05321
11010c84020O64379N31419L52764L36266K77983M8074j82012j91234Q636J68056
$$ y = [-5144654, -5032687, -4556890, -4046317, -3772190, -3814372, -4081553, -4366172, -4464568, -4283235, -3865691, -3367159, -2990532, -2747745, -2409713, -1763691, -799019, 366294, 1537534, 2507258, 3194534, 3598501, 3747214, 3685227, 3387551, 2905720, 2391920, 2005103, 1939050, 2242279, 2686389, 2999436, 3070709, 2963731, 2952870, 3242411, 3686310, 4073444, 4387819, 4560557, 4378551, 3811331, 3080738, 2429525, 1937911, 1513557, 1078107, 660174, 336287, 144802, 72601, 43437, -36896, -169174, -299436, -408675, -566514, -825368, -1037591, -957880, -490747, 189402, 758343, 936024, 625116, -22350, -630190, -789341, -384020, 280359, 811778, 1164542, 1500808, 1778791, 1826865, 1644853, 1453619, 1462255, 1630311]
11000A630311P4200j99712l84646l44403l29773m07515k55763L0064J37109P9594
10990B9466J0243k9317r1317j90198k84001k76731j05259J28922L05131L64235
10980a38826J52987k71480n60107n99670m89846j89029L61455Q76473R17481M96634
10970E56072l2719n48931r73310j026870o06906M3974N43907O70211O04565O64111
10960a05896Q47348Q99338O40161O3883o18900j103838j273243j158662p73108
10951b582917j75023M24948P64147P70298N35904J77342j90101m31767m65156
10942a172325m37857n48419o97348o81889n13772l19185j06038J49858M12245
10933c914730O00006N25204K16752m7420q6552J42615N28781Q46720R06383P23360
$$ y = [1630311, 1704511, 1504799, 1120153, 775750, 445977, 38462, -217301, -187237, -50128, 29466, 39709, 10392, -80925, -271123, -555124, -831855, -937114, -808192, -503061, -138826, 14161, -257319, -817426, -1417096, -1906942, -2095971, -1734516, -858043, 59438, 556072, 523353, -25578, -998888, -2025758, -2632664, -2588690, -2044783, -1374572, -770007, -105896, 741452, 1640790, 2280951, 2344834, 1725934, 622096, -651147, -1809809, -2582917, -2757940, -2332992, -1568845, -798547, -262643, -85301, -275402, -707169, -1172325, -1610182, -2158601, -2855949, -3537838, -4051610, -4370795, -4476833, -4326975, -3914730, -3314724, -2789520, -2572768, -2620188, -2706740, -2564125, -2035344, -1188624, -282241, 441119]
10923D41119M76997K28789k932o7635J19629M09927N64156N29850L68789L4897
10913C103586m13618o84365n19542p8379K24840K39080J15606K2357n9121l43160
10903A607284q19892j163125j197949r30099l52358L82949Q95772R79324Q21247
10894B23153P04272P21801P41152N45051J71276j64560l80828n77653r10147j286079
10884b12562j484228j352097r33401m46827K9176N26080R36663J086955R28780
10875i21461O10810L52825J42409q8238k53007k06365j4098J16727J94323L22280
10865B56205M07185L11230J82122J97093K79149K96165J51782j27383m22072o80202
10855H51274p98107p31881o63753o37146m42028j16218Q1421P2463l9367j97413
$$ y = [441119, 918116, 1146905, 1143973, 1076338, 1195967, 1605894, 2170050, 2699900, 3068689, 3103586, 2689968, 2005603, 1486061, 1407682, 1632522, 1871602, 1987208, 2009565, 1950444, 1607284, 787392, -375733, -1573682, -2503781, -2856139, -2473190, -1577418, -598094, 223153, 927425, 1649226, 2390378, 2935429, 3106705, 2942145, 2561317, 1983664, 1073517, -212562, -1696790, -3048887, -3982288, -4429115, -4399939, -3873859, -2937196, -1850241, -921461, -310651, 42174, 184583, 96345, -156662, -363027, -377125, -260398, -66075, 256205, 663390, 974620, 1156742, 1353835, 1632984, 1929149, 2080931, 1953548, 1531476, 851274, 53167, -678714, -1342467, -1979613, -2421641, -2537859, -2456438, -2383975, -2423342, -2620755]
10845b620755l64497l57947j18284K13113N24567P83599R06307P92755M77002
10836B35860P6496l06751n77503p31707p92369o61144l40772M9362M65729Q08609
10826a774190Q41990N28261K18307K24951L76071K67660j43842m72764l74895
10817c08451N3006M63334O56333O85333O13386M94305N27940P42532Q15444N95969
10807E339131K90943l4097m61946r01389j133323j048640p50298m57019l21126
10798E22236k33966o8866L9287q1406k49009j85832N3736K56864L01441K04664
10788E59149K7334j55317l24656m69596m74898l03098p1314J40567L55616N70669
10778a45544P55068P52169M13000j00500n83116q92245q12844k56152L68223M62265
$$ y = [-2620755, -2985252, -3343199, -3461483, -3248370, -2723803, -1940204, -1033897, -241142, 235860, 312356, 5605, -571898, -1303605, -2095974, -2757118, -3097890, -3048528, -2582799, -1774190, -932200, -403939, -185632, 39319, 415390, 683050, 539208, 66444, -308451, -255445, 207889, 864222, 1549555, 2162941, 2657246, 3185186, 3927718, 4743162, 5339131, 5630074, 5595977, 5134031, 4232642, 3099319, 2050679, 1300381, 843362, 522236, 288270, 219404, 258691, 177285, -71724, -257556, -203820, 53044, 354485, 559149, 586483, 431166, 106510, -363086, -837984, -1141082, -1212396, -1071829, -716213, -145544, 609524, 1361693, 1774693, 1674193, 1091077, 198832, -614012, -870164, -501941, -39676]
10768c9676J20612j57563l09867m62525n66727n22874k06037M05192R24416R93571
10758A78522P62321N10399K23490j85384n78236p16020n42767k39848j2086J20724
10748d78885K27141K99056L47308L43855K36899N1582j51659j98375q4997o4022
10738E27903j91614l75654n06279m27074j81343j03980m28198p21797m34565K13353
10728b629248O16231N51358J74578k64418m76662l47082m8884K41241M73581N78617
10718a130688N65292N36878N23944M91913M25003K98718J84922K70473N04970
10709B671425O45405O53395N93286M31751K20221J56584K71711L17093K69234
10700F230105K22623P608m40953q43382r67440r06506q41710q40178q15957o89113
$$ y = [-39676, 80936, -76627, -386494, -849019, -1415746, -1938620, -2144657, -1739465, -815049, 178522, 940843, 1451242, 1674732, 1489348, 911112, 195092, -347675, -587523, -599609, -478885, -251744, 47312, 394620, 738475, 975374, 1026956, 875297, 676922, 591925, 527903, 336289, -39365, -545644, -972718, -1154061, -1258041, -1686239, -2408036, -2842601, -2629248, -2013017, -1461659, -1287081, -1551499, -2028161, -2375243, -2424127, -2182886, -1709305, -1130688, -565396, -28518, 495426, 987339, 1412342, 1711060, 1895982, 2166455, 2671425, 3316830, 3970225, 4563511, 4995262, 5215483, 5372067, 5643778, 5960871, 6230105, 6452728, 6460336, 6019383, 5176001, 4208561, 3302055, 2460345, 1620167, 804210, 115097]
10690A15097m15496M8331M78884N57256K33404l56984r10262j095265q68206m70015
10680b683256j29891J5667L904K5365J58597K30030J28479j3755r30K15181M23299
10669a627310L92220J07210j50096r6577J09221J55293O4018j1551r7289k45951
$$ y = [115097, -300399, -252068, 226816, 784072, 1017476, 660492, -249770, -1345035, -2213241, -2683256, -2813147, -2797480, -2793576, -2768211, -2609614, -2379584, -2251105, -2264860, -2265790, -2050609, -1627310, -1235090, -1127880, -1277976, -1374553, -1265332, -1110039, -1046021, -1057572, -1154861, -1400812]
$$ [...]
##END NTUPLES=NMR SPECTRUM
##END=
