##TITLE=31P ikalashn
DE-54H_2
12.12.2024
##JCAMPDX= 6.0         $$ Bruker NMR JCAMP-DX V2.0
##DATA TYPE= NMR SPECTRUM
##DATA CLASS= NTUPLES
##ORIGIN= UXNMR, Bruker Analytische Messtechnik GmbH
##OWNER= root
$$ TOPSPIN		Version 1.3
$$ 2024-12-12 14:48:08.781 +0400  Irina@DPX200
$$ Compression mode = diff/dup
##.OBSERVE FREQUENCY= 81.01967998063
##.OBSERVE NUCLEUS= ^31P
##.ACQUISITION MODE= SIMULTANEOUS
##.ACQUISITION SCHEME= undefined
##.AVERAGES= 64
##.DIGITISER RES= 17
##SPECTROMETER/DATA SYSTEM= spect
##.PULSE SEQUENCE= zgpg
##.SOLVENT NAME= D2O
##.SHIFT REFERENCE= INTERNAL, D2O, 1, 298.5841
##AUDIT TRAIL= $$ (NUMBER, WHEN, WHO, WHERE, WHAT)
$$ ##TITLE= Audit trail, TOPSPIN		Version 1.3
$$ ##JCAMPDX= 5.01
$$ ##ORIGIN= Bruker BioSpin GmbH
$$ ##OWNER= Irina
$$ $$ F:/spectra/data/iren/nmr/P31dec/1/pdata/1/auditp.txt
$$ ##AUDIT TRAIL=  $$ (NUMBER, WHEN, WHO, WHERE, VERSION, WHAT)
(   1,<2024-12-12 14:47:25.843 +0400>,<Irina>,<DPX200>,<TOPSPIN 1.3>,
      <created by zg
	started at 2024-12-12 14:45:43.000 +0400,
	POWCHK disabled, PULCHK disabled
       configuration hash MD5:
       BE 6D 3F 07 2A EA 11 49 91 17 2B D3 AF B3 58 0D
       data hash MD5: 32K
       70 85 5A 87 D0 73 A8 77 DB BD D5 43 4C 8B C8 42>)
(   2,<2024-12-12 14:47:55.718 +0400>,<Irina>,<DPX200>,<TOPSPIN 1.3>,
      <Start of raw data processing
       efp BC_mod = 2 LB = 12 FT_mod = 6 PKNL = 1 PHC0 = 30.77854 PHC1 = 385.5591 SI = 32K 
       data hash MD5: 32K
       02 00 04 E6 E7 18 ED 66 28 8E E7 68 2E 16 C0 3A>)
(   3,<2024-12-12 14:47:58.078 +0400>,<Irina>,<DPX200>,<TOPSPIN 1.3>,
      <abs n ABSG = 5 
       data hash MD5: 32K
       3C 00 CF 44 C8 F7 CC 83 C9 9A C3 A3 CA 14 F6 97>)
$$ ##END=
$$ 
$$ $$ hash MD5
$$ $$ BF 5B 17 FB 9D BA 3A BF 27 C3 FB 9A C7 3D 82 AA
##$RELAX= 
##$RELAX= 
##$RELAX= 
##$RELAX= 
##$RELAX= 
##$RELAX= 
##$RELAX= 
##$RELAX= 
##$RELAX= 
##$RELAX= 
##$RELAX= 
$$ Bruker specific parameters
$$ --------------------------
##$DU= <F:/spectra>
##$EXPNO= 1
##$NAME= <P31dec>
##$PROCNO= 1
##$TYPE= <nmr>
##$USER= <iren>
##$AMP= (0..31)
100 100 100 100 100 100 100 100 100 100 100 100 100 100 100 100 100 100 
100 100 100 100 100 100 100 100 100 100 100 100 100 100 
##$ANAVPT= -1
##$AQSEQ= 0
##$AQ_mod= 1
##$AUNM= <au_zg>
##$AUTOPOS= <>
##$BF1= 81.014009
##$BF2= 200.13
##$BF3= 200.13
##$BF4= 200.13
##$BF5= 200.13
##$BF6= 200.13
##$BF7= 200.13
##$BF8= 200.13
##$BYTORDA= 1
##$CFDGTYP= 0
##$CFRGTYP= 5
##$CHEMSTR= <none>
##$CNST= (0..63)
1 1 145 1 1 1 1 1 1 1 1 1 1 1 1 1 1 1 1 1 1 1 1 1 1 1 1 1 1 1 1 1 1 1 
1 1 1 1 1 1 1 1 1 1 1 1 1 1 1 1 1 1 1 1 1 1 1 1 1 1 1 1 1 1 
##$CPDPRG= <waltz16>
##$CPDPRG1= <>
##$CPDPRG2= <waltz16>
##$CPDPRG3= <>
##$CPDPRG4= <mlev>
##$CPDPRG5= <mlev>
##$CPDPRG6= <mlev>
##$CPDPRG7= <mlev>
##$CPDPRG8= <mlev>
##$CPDPRGB= <>
##$CPDPRGT= <>
##$D= (0..63)
0 1 0 0 0 0 0 0 0 0.06 0 0.03 2e-005 3e-006 0 0 0.0002 0 0 0 0 0 0 0 0 
0 0 0 0 0 0 0 0 0 0 0 0 0 0 0 0 0 0 0 0 0 0 0 0 0 0 0 0 0 0 0 0 0 0 0 
0 0 0 0 
##$DATE= 1734000442
##$DBL= (0..7)
$$ [...]
##$SW_h= 37037.037037037
##$TD= 32768
##$TD0= 1
##$TE= 300
##$TE2= 300
##$TE3= 300
##$TEG= 300
##$TL= (0..7)
0 120 53 12 22 120 120 120 
##$TP= (0..7)
150 150 150 150 150 150 150 150 
##$TP07= 0
##$TPNAME0= <>
##$TPNAME1= <>
##$TPNAME2= <>
##$TPNAME3= <>
##$TPNAME4= <>
##$TPNAME5= <>
##$TPNAME6= <>
##$TPNAME7= <>
##$TPOAL= (0..7)
0.5 0.5 0.5 0.5 0.5 0.5 0.5 0.5 
##$TPOFFS= (0..7)
0 0 0 0 0 0 0 0 
##$TUNHIN= 0
##$TUNHOUT= 0
##$TUNXOUT= 0
##$USERA1= <user>
##$USERA2= <user>
##$USERA3= <user>
##$USERA4= <user>
##$USERA5= <user>
##$V9= 5
##$VALIST= <valist>
##$VCLIST= <CCCCCCCCCCCCCCC>
##$VD= 0
##$VDLIST= <DDDDDDDDDDDDDDD>
##$VPLIST= <PPPPPPPPPPPPPPP>
##$VTLIST= <TTTTTTTTTTTTTTT>
##$WBST= 1024
##$WBSW= 4
##$XGAIN= (0..3)
0 0 0 0 
##$XL= 0
##$YL= 0
##$YMAX_a= 1236
##$YMIN_a= -4568
##$ZGOPTNS= <>
##$ZL1= 120
##$ZL2= 120
##$ZL3= 120
##$ZL4= 120
##$ABSF1= 298.5841
##$ABSF2= -158.5842
##$ABSG= 5
##$ABSL= 5
##$ALPHA= 0
##$AQORDER= 0
##$ASSFAC= 0
##$ASSFACI= 0
##$ASSFACX= 0
##$ASSWID= 0
##$AUNMP= <proc_1d>
##$AXLEFT= 0
##$AXRIGHT= 0
##$AXTYPE= 0
##$AXUNIT= <>
##$AZFE= 0.1
##$AZFW= 0.5
##$BCFW= 0
##$BC_mod= 2
##$BYTORDP= 0
##$COROFFS= 0
##$CY= 12.5935478210449
##$DATMOD= 1
##$DC= 0
##$DFILT= <>
##$DTYPP= 0
##$F1P= 47.1127640792319
##$F2P= -24.0371245302204
##$FCOR= 0.5
##$FTSIZE= 32768
##$FT_mod= 6
##$GAMMA= 0
##$GB= 0
##$INTBC= 1
##$INTSCL= 7.269226e-011
##$ISEN= 30
##$LB= 12
##$LEV0= 0
##$LPBIN= 0
##$MAXI= 12.09355
##$MC2= 0
##$MEAN= 0
##$ME_mod= 0
##$MI= 0.7550151
##$NCOEF= 0
##$NC_proc= -12
##$NLEV= 6
##$NOISF1= 298.5841
##$NOISF2= 270.0111
##$NSP= 0
##$NTH_PI= 0
##$NZP= 0
##$OFFSET= 298.5841
##$PC= 1.4
##$PHC0= 30.77854
##$PHC1= 385.5591
##$PH_mod= 1
##$PKNL= yes
##$PPARMOD= 0
##$PPDIAG= 0
##$PPIPTYP= 0
##$PPMPNUM= 100
##$PPRESOL= 1
##$PSCAL= 0
##$PSIGN= 0
##$REVERSE= no
##$SF= 81.014009
##$SI= 32768
##$SIGF1= 270.0111
##$SIGF2= -158.5842
##$SINO= 77.54984
##$SIOLD= 32768
##$SREGLST= <31P.CDCl3>
##$SSB= 0
##$STSI= 32768
##$STSR= 0
##$SW_p= 37037.037037037
##$SYMM= 0
##$S_DEV= 0
##$TDeff= 32768
##$TDoff= 0
##$TI= <>
##$TILT= no
##$TM1= 0
##$TM2= 0
##$TOPLEV= 0
##$USERP1= <user>
##$USERP2= <user>
##$USERP3= <user>
##$USERP4= <user>
##$USERP5= <user>
##$WDW= 1
##$XDIM= 32768
##$YMAX_p= 278420750
##$YMIN_p= -12845712
$$ End of Bruker specific parameters
$$ ---------------------------------
##NTUPLES= NMR SPECTRUM
##VAR_NAME=  FREQUENCY,     SPECTRUM/REAL,   SPECTRUM/IMAG
##SYMBOL=    X,             R,               I
##VAR_TYPE=  INDEPENDENT,   DEPENDENT,       DEPENDENT
##VAR_FORM=  AFFN,          ASDF,            ASDF
##VAR_DIM=   32768,         32768,           32768
##UNITS=     HZ,            ARBITRARY UNITS, ARBITRARY UNITS
##FACTOR=    1.13031516577767, 1,            1
##FIRST=     37037.037037037, -6808049,      6045271
##LAST=      0,             1984627,         -10757547
##MIN=       0,             -12845712,       0
##MAX=       37037.037037037, 278420750,     0
$$ Real data points
##PAGE= N=1
##DATA TABLE= (X++(R..R)), XYDATA
$$ [...]
16425A40497j278900j227661j187306j148765j047456q17328m43191K8370N04717
16416f477023Q73741J044320R96136Q08902O22380N35630N52740O25717P12062
16407B94605P82747Q05424P49240O10958M16738J96071k2971k01425k94086k69972
16397C067329j40297K7689J33815R8855p9182l18501n12803n90806n14031k50516
16387I21552K00584P45991J182951J286067R66563L57859k94316q09052j125242
16378C432957j252996j218845j043187p47927l78627j8313K39373L43722L13956
16369c29887K19309J33671R2481P1553J5755j00776k50391l70061m00160l25947
16359a244453j93845q7924p6785j78515l63486n66452p03517p02423n23599j71581
$$ y = [140497, -1138403, -2366064, -3553370, -4702135, -5749591, -6566919, -7010110, -6981740, -6477023, -5603282, -4558962, -3562826, -2753924, -2131544, -1595914, -1043174, -417457, 294605, 1077352, 1882776, 2632016, 3242974, 3659712, 3855783, 3832812, 3631387, 3337301, 3067329, 2927032, 2954721, 3088536, 3187391, 3108209, 2789708, 2276905, 1686099, 1172068, 921552, 1122136, 1868127, 3051078, 4337145, 5303708, 5661567, 5367251, 4558199, 3432957, 2179961, 961116, -82071, -829998, -1208625, -1226938, -987565, -643843, -329887, -110578, 23093, 115574, 187127, 202882, 102106, -148285, -518346, -918506, -1244453, -1438298, -1526222, -1603007, -1781522, -2145008, -2711460, -3414977, -4117400, -4640999, -4812580]
16349d812580K92189P58737J115175J300983J332861J276909J202402J153082
16341C619758J133951J117762J076857R96331Q53641O23601L23835K7037j92160
16332I580613k97481k85285j81890m3506P5215J57923K27437L18757M42804N66713
16322A0561300O37785O34029N93299N83083O35109P28649Q29012R04509R15439
16313A7022214Q10428N22447k1051q57913j930258k991559l617924l519721k834548
16304B582115j962994j212688o75015l13255o6465J04683K11512K56210K48328
16295h27569K02229J31995M4345o7519k02540l23606l75048l32936k33913j49832
16285b134394j30788j72199k23681k30667j81340j02466j1480R0072J78851K05018
$$ y = [-4812580, -4520391, -3761654, -2646479, -1345496, -12635, 1264274, 2466676, 3619758, 4753709, 5871471, 6948328, 7944659, 8798300, 9421901, 9745736, 9772773, 9580613, 9283132, 8997847, 8815957, 8772451, 8847666, 9005589, 9233026, 9551783, 9994587, 10561300, 11199085, 11833114, 12426413, 13009496, 13644605, 14373254, 15202266, 16106775, 17022214, 17832642, 18355089, 18334038, 17476125, 15545867, 12554308, 8936384, 5416663, 2582115, 619121, -593567, -1268582, -1581837, -1648302, -1543619, -1332107, -1075897, -827569, -625340, -493345, -449000, -516519, -719059, -1042665, -1417713, -1750649, -1984562, -2134394, -2265182, -2437381, -2661062, -2891729, -3073069, -3175535, -3187015, -3096943, -2918092, -2713074]
16275b713074J40951K3817o2012m6648P3184K36295L69963M37487M42257M00248
16265f97532L23863K33982J66316J49844J77324K08428J99852J20717m9984l03727
16255E29083n72285p56982p98504o99981m86916j76786J82901M80538O03154N26702
16245a169076L16940O1336j72508l43919m45333m84723m59874l79942k93506k65982
16235c636587l40746n21760p62682r63548j010890q57066n62075k43853J1881
16226h887326J96868L46692M72029N36972N00809L59898J56995l2512j37460j30721
16216f617756m3292N9816J27011J48644J47483J44219J43725J68459K60211M18416
16206e043064N84908P04029P60500P58669O84773N19494L05778J54318J53720
$$ y = [-2713074, -2572123, -2548306, -2610318, -2656966, -2583782, -2347487, -1977524, -1540037, -1097780, -697532, -373669, -139687, 26629, 176473, 353797, 562225, 762077, 882794, 832810, 529083, -43202, -800184, -1598688, -2298669, -2785585, -2962371, -2779470, -2298932, -1695778, -1169076, -852136, -790800, -963308, -1307227, -1752560, -2237283, -2697157, -3077099, -3370605, -3636587, -3977333, -4499093, -5261775, -6225323, -7236213, -8093279, -8655354, -8899207, -8887326, -8690458, -8343766, -7871737, -7334765, -6833956, -6474058, -6317063, -6349575, -6487035, -6617756, -6661048, -6601232, -6474221, -6325577, -6178094, -6033875, -5890150, -5721691, -5461480, -5043064, -4458156, -3754127, -2993627, -2234958, -1550185, -1030691, -724913, -570595, -416875]
16197d16875K95087M69246N31194M02831J31450j49652l14784l13372j84608k7287
16187D23230O5522N4185n2615k20422l90494m86951m64531l38776j50041P4309
16177a486584K98582M52304M67513L36015J16447j12951l08382m59830n61659
16168a258545o09258n94340n11811l96195l06353k62567k38655k05854j52833
16159d536411p2564L9861J72653L06552M32435N34878N73348N11503L67238K08878
16149a461629J04105P8416R9580J03372N2681k6656o7741k0954J02908K44555
16139g91363L34984L19249J76678n9141l09413m89877n54931n12656l93599k27506
16129b507575n6464P5149J62033K41096L37720M29355M66934M06740K29060m0450
$$ y = [-416875, -121788, 347458, 878652, 1281483, 1412933, 1263281, 948497, 635125, 450517, 423230, 488752, 542937, 490322, 269900, -120594, -607545, -1072076, -1410852, -1560893, -1486584, -1188002, -735698, -268185, 67830, 184277, 71326, -237056, -696886, -1258545, -1867803, -2462143, -2973954, -3370149, -3676502, -3939069, -4177724, -4383578, -4536411, -4608975, -4569114, -4396461, -4089909, -3657474, -3122596, -2549248, -2037745, -1670507, -1461629, -1357524, -1279108, -1179528, -1076156, -1023475, -1050131, -1117872, -1138826, -1035918, -791363, -456379, -137130, 39548, -19593, -329006, -818883, -1373814, -1886470, -2280069, -2507575, -2564039, -2488890, -2326857, -2085761, -1748041, -1318686, -851752, -445012, -215952, -256402]
16119b56402l17728m85925m61136k53087K6976K25664K46846J19241l5001j04969
16109a295521o8845J4173P5563J00495J29922K19660L93354O11009P87271Q45180
16099A812261P54570N49741L11090J08711l5878j39628k27736l09809l68072l74210
16089B081040l28064k66785k39991k84027l87067m82241n07883m57195l59157
16080a231370k49610j77531j94843l05740m48387n39212n19364l89390k31275
16071d286722j60974k29180l75937m89158m98393m09457k73581j40076k4509Q6559
16061f801428J95210K66066K58728J78294P1523j6267o0659n1900J4268J38098
16051e808067L09500N09371P03958Q41992Q88590Q58332Q04840P81776Q01141
$$ y = [-256402, -574130, -1060055, -1521191, -1774278, -1747302, -1521638, -1274792, -1155551, -1190552, -1295521, -1364366, -1350193, -1274630, -1174135, -1044213, -824553, -431199, 179810, 967081, 1812261, 2566831, 3116572, 3427662, 3536373, 3500495, 3360867, 3133131, 2823322, 2455250, 2081040, 1752976, 1486191, 1246200, 962173, 575106, 92865, -415018, -872213, -1231370, -1480980, -1658511, -1853354, -2159094, -2607481, -3146693, -3666057, -4055447, -4286722, -4447696, -4676876, -5052813, -5541971, -6040364, -6449821, -6723402, -6863478, -6887987, -6801428, -6606218, -6340152, -6081424, -5903130, -5831607, -5847874, -5908533, -5960433, -5946165, -5808067, -5498567, -4989196, -4285238, -3443246, -2554656, -1696324, -891484, -109708, 691433]
16042F91433Q15346P56699O10365M29565K81373K01119J80149J73930J34801N1727
16032D326507l7504q3237p8806n9500n1641m4569r675O1691J41612J90171J98347
16021D553396J90292J75172J33966N8033l8407j40551k43510l43238m29808m88337
16011C427008n07293m95737m87242n04338n23572n01861m30910l47335k90325
16002f61605k58679k18442j49858q1075p4576j69135l36335m96802n69530n26425
15992c542462m27774l79951m23665m81580m38111k48428L6581L24082N48761O95243
15982d337304P67141P59006O63598N00708L30267K16915J85265K18676K78814
15973d16914L09159K34576n80l72391p77704j099313j258044j229198j048083
$$ y = [691433, 1506779, 2263478, 2873843, 3303408, 3584781, 3785900, 3966049, 4139979, 4274780, 4326507, 4289003, 4205766, 4126960, 4067460, 4015819, 3971250, 3961575, 4023266, 4164878, 4355049, 4553396, 4743688, 4918860, 5052826, 5110859, 5072452, 4931901, 4688391, 4345153, 3915345, 3427008, 2919715, 2423978, 1936736, 1432398, 908826, 406965, -23945, -371280, -661605, -920284, -1138726, -1288584, -1369659, -1444235, -1613370, -1949705, -2446507, -3016037, -3542462, -3970236, -4350187, -4773852, -5255432, -5693543, -5941971, -5905390, -5581308, -5032547, -4337304, -3570163, -2811157, -2147559, -1646851, -1316584, -1099669, -914404, -695728, -416914, -107755, 126821, 126241, -246150, -1023854, -2123167, -3381211, -4610409, -5658492]
15964e658492p94599n46573l38046j64784k3025Q0530J49487J99711K38590K51611
15954f605590K19392J52012R2879Q2840J35461K52209M41951P01689R78997J182869
15944b365291J237935J120520Q66953N58736K81714R5085K5747N6288J32491K13526
15934B223704K94073L61819L69616K80695J14561p9360k71383m51054n92297o52349
15924A598025o03903m55846k59657r3266j4408k2919o7867q3445k5367R8637K27621
15913B97605K94353K71891J81503P3866j3552q3635j53562k31080l18339m03788
15903h4738m52217m25648l14868j44251M4115J95943K57583K13353R6443m3355
15893f57640j62757k27894k27493j82221j31626j10093j28240j72673k19606k51560
$$ y = [-5658492, -6453091, -6999664, -7337710, -7502494, -7525519, -7444989, -7295502, -7095791, -6857201, -6605590, -6386198, -6234186, -6141307, -6058467, -5923006, -5670797, -5228846, -4527157, -3548160, -2365291, -1127356, -6836, 860117, 1418853, 1700567, 1795652, 1821399, 1877687, 2010178, 2223704, 2517777, 2879596, 3249212, 3529907, 3644468, 3565108, 3293725, 2842671, 2250374, 1598025, 994122, 538276, 278619, 185353, 170945, 148026, 80159, -3286, -28653, 69984, 297605, 591958, 863849, 1045352, 1119218, 1105666, 1022031, 868469, 637389, 319050, -84738, -536955, -962603, -1277471, -1421722, -1377607, -1181664, -924081, -710728, -614285, -657640, -820397, -1048291, -1275784, -1458005, -1589631, -1699724, -1827964, -2000637, -2220243, -2471803]
15883b471803k72801l16302m19192n71436p04131p45570o74797n12039k81995
15874f970066o45L12517O16461Q46487R45884R11314P90608O33961M61083K62233
15864a190163J3745k85499n67420p03919o00999k87548J03923M32802O27613O89909
15854a767556O39653M78808K12018j27988m88539q03679j005531j067944j025619
15845d956377r29385q03378o52749m81068k87248o4064J86447M41940O79904Q98338
15835e967640J089696J215543J245111J202181J143719J105799J091456J091192
15827C217057J090838J068064R92433Q32672N77937K61252n0650l04354m93536
15818G191713o39737p49868q08880q06350p47445o40074n01474l64048k41244
$$ y = [-2471803, -2744604, -3060906, -3480098, -4051534, -4755665, -5501235, -6176032, -6688071, -6970066, -6970711, -6658194, -6041733, -5195246, -4249362, -3338048, -2547440, -1913479, -1452396, -1190163, -1176418, -1461917, -2029337, -2733256, -3334255, -3621803, -3517880, -3085078, -2457465, -1767556, -1127903, -649095, -437077, -565065, -1053604, -1857283, -2862814, -3930758, -4956377, -5885762, -6689140, -7341889, -7822957, -8110205, -8174269, -7987822, -7545882, -6865978, -5967640, -4877944, -3662401, -2417290, -1215109, -71390, 1034409, 2125865, 3217057, 4307895, 5375959, 6368392, 7201064, 7779001, 8040253, 7989603, 7685249, 7191713, 6551976, 5802108, 4993228, 4186878, 3439433, 2799359, 2297885, 1933837, 1692593]
15809A692593j15643K4865J69435K85804L19132K21268j730k83562n37395o87549
15799A087218o84625n22124k28622J60164N95084R87578J228222J240154J025941
15790D888990O72606K89085n3463l06934m34322m52581m31104m21085m36086m92764
15780B822342o04835p45047q50340q56816p31479m89117j87185R4239K83459L48079
15770i16700L08229K28730J85900K09976K54542K41963J34375m4485k35635l75310
15760h415m17662l61669k46702j08863L3163J47337J83808J19609j2903j50625
15750h22922k40262k61553k36555k23129k86381m58718p06131r17392r58740p88252
15740e900035m97888k19120k1045R0631J27327J06511O0732K1897M824J9306P1034
$$ y = [1692593, 1576950, 1601815, 1771250, 2057054, 2376186, 2597454, 2595724, 2312162, 1774767, 1087218, 402593, -119531, -348153, -187989, 407095, 1394673, 2622895, 3863049, 4888990, 5561596, 5850681, 5797218, 5490284, 5055962, 4603381, 4172277, 3751192, 3315106, 2822342, 2217507, 1472460, 622120, -234696, -966175, -1455292, -1642477, -1548238, -1264779, -916700, -608471, -379741, -193841, 16135, 270677, 512640, 647015, 602530, 366895, -8415, -426077, -787746, -1034448, -1143311, -1110148, -962811, -779003, -659394, -672297, -822922, -1063184, -1324737, -1561292, -1784421, -2070802, -2529520, -3235651, -4153043, -5111783, -5900035, -6397923, -6617043, -6638088, -6547457, -6420130, -6313619, -6252887, -6230990, -6226166, -6206860, -6135826]
15729f135826J39342J88278K11732K49883L54724N29920O95463P39095O21521
15720b405868M13285K17404Q7140L4301O3876J67699L19216M95709O93247R04332
15710I90341J076423J117695R69306O64107K96972m9604l32226n17442n71063
15701C644509m95235l46897j97083p8446K3291J22807J91527J81700R0549k0782
15691C115940q8957j16240j54630k39208l63389n04459o41001p44920p80845p28182
15681a245891o08645m82898m01074l55153l00325k19041j34120o6769l091R2837
15671c724170K28147L51615L86711K93612J02045j04221k34932k45388j56256
15662c102837k9707O7887R5670O2972K9267N0961J26412K07301K48320K34214
$$ y = [-6135826, -5996484, -5808206, -5596474, -5346591, -4991867, -4461947, -3766484, -3027389, -2405868, -1992583, -1775179, -1688039, -1653738, -1589862, -1422163, -1102947, -607238, 86009, 990341, 2066764, 3184459, 4153765, 4817872, 5114844, 5065240, 4733014, 4215572, 3644509, 3149274, 2802377, 2605294, 2526848, 2550139, 2672946, 2864473, 3046173, 3136722, 3115940, 3026983, 2910743, 2756113, 2516905, 2153516, 1649057, 1008056, 263136, -517709, -1245891, -1854536, -2337434, -2738508, -3093661, -3393986, -3613027, -3747147, -3813916, -3817007, -3724170, -3496023, -3144408, -2757697, -2464085, -2362040, -2466261, -2701193, -2946581, -3102837, -3132544, -3064657, -2968987, -2906015, -2876748, -2825787, -2699375, -2492074, -2243754, -2009540]
15652b009540J67995N1551j04497k60344l53693l33504j96975J1138K40573M53389
15642b333907N98018O09969M67010K27150n701j54998k09656j87177p8650J33813
15632i34129M09024O35384P00905N67964K90832k5410k83098m25766m38600l40049
15622A57057j87849p0868n5811j41309k78529m18619n20070n43051m71560l22911
15612b853520j30335P1986K52098L79669M25770L61292J72690j02397l72129n45715
15602b340591n87672n23177m08572k89623j78210n6705J05242L18568N58646P82884
15592b619210R41255R77260Q56604O10547L30317J02419l9405r3368o3969J3860
15582A016310P5136P7356K1267p3656j85462k89017l58497l75878l38427k71599
$$ y = [-2009540, -1841545, -1789994, -1894491, -2154835, -2508528, -2842032, -3039007, -3027869, -2787296, -2333907, -1735889, -1125920, -658910, -431760, -437461, -592459, -802115, -989292, -1067942, -934129, -525105, 110279, 811184, 1379148, 1669980, 1644570, 1361472, 935706, 497106, 157057, -30792, -101660, -157471, -298780, -577309, -995928, -1515998, -2059049, -2530609, -2853520, -2983855, -2911869, -2659771, -2280102, -1854332, -1493040, -1320350, -1422747, -1794876, -2340591, -2928263, -3451440, -3860012, -4149635, -4327845, -4384550, -4279308, -3960740, -3402094, -2619210, -1677955, -700695, 155909, 766456, 1096773, 1199192, 1159787, 1066419, 1002450, 1016310, 1091446, 1168802, 1190069, 1116413, 930951, 641934, 283437, -92441, -430868, -702467]
15572g02467k25727k26632k48473k64892k84973l22745l75479m35357m88691n13459
15562d088895n00795m63876m19804l75674l17947j99326K7571L36029O16271P58171
15552d628275P21070N34247K71429J9777j62251k68506l20033l26892k79239j64791
15542d603464K783J79454L23903M25317M90436N17560M97344M27075L16390J86232
15532a236970N8510n5461j44512j86635j76491j53661j76869k79754m54090o50378
15522c456311p94548q26888p40192n80074m05181k41380p1383J34194L90278O93875
15512e897610J025623J348020J602126J720202J655380J398923R89496N18108
15504D360268R5647j95833l21765k89433j44522L3438J63716K05161J57509L9438
$$ y = [-702467, -928194, -1154826, -1403299, -1668191, -1953164, -2275909, -2651388, -3086745, -3575436, -4088895, -4589690, -5053566, -5473370, -5849044, -6166991, -6366317, -6338746, -6002717, -5386446, -4628275, -3907205, -3372958, -3101529, -3081752, -3244003, -3512509, -3832542, -4159434, -4438673, -4603464, -4600681, -4421227, -4097324, -3672007, -3181571, -2664011, -2166667, -1739592, -1423202, -1236970, -1178460, -1233921, -1378433, -1565068, -1741559, -1895220, -2072089, -2351843, -2805933, -3456311, -4250859, -5077747, -5817939, -6398013, -6803194, -7044574, -7115957, -6981763, -6591485, -5897610, -4871987, -3523967, -1921841, -201639, 1453741, 2852664, 3842160, 4360268, 4455915, 4260082, 3938317, 3648884, 3504362, 3537800, 3701516, 3906677, 4064186, 4103624]
15494D103624j27661l30885n62395q03762j018554j162691j209138j159089j026606
15485c297157q25175n74416l02077l2864K01724L51158L70418K55119N0261j79807
15475c982816l93928n76645p05271p38081o49977m73740k82474j27350n140J20834
15465g814588K89632N18053P71661R70554J050222J009650Q94654P51888O04644
15456i53630M56393K95557R6780j60265m69292q01526j112840j336837j404844
15447e390504j298881j071869q04687n46215k98009n1739J76479L61221N01592
15438h422612O12053O90386P28074P33330P17167O73805N95903N03469M29824
15429b738601L82183L34672K51418J22735j4245j01939j03007j4855J32855K88322
$$ y = [4103624, 3975963, 3645078, 3082683, 2278921, 1260367, 97676, -1111462, -2270551, -3297157, -4122332, -4696748, -4998825, -5031689, -4829965, -4478807, -4108389, -3853270, -3803009, -3982816, -4376744, -4953389, -5658660, -6396741, -7046718, -7520458, -7802932, -7930282, -7935422, -7814588, -7524956, -7006903, -6235242, -5264688, -4214466, -3204816, -2310162, -1558274, -953630, -497237, -201680, -104900, -265165, -734457, -1535983, -2648823, -3985660, -5390504, -6689385, -7761254, -8565941, -9112156, -9410165, -9461904, -9285425, -8924204, -8422612, -7810559, -7120173, -6392099, -5658769, -4941602, -4267797, -3671894, -3168425, -2738601, -2356418, -2021746, -1770328, -1647593, -1661838, -1763777, -1866784, -1881639, -1748784, -1460462]
15419a460462M05764M70881M86089M42524L28763J57557l7201k29756m12980n77639
15409d26460o94949p22603o17926l58329J4944L71684N58647N20793L44050J77934
15399h32215J27449J99766L24157M15499M23745L35630J55249r0424l37014n19139
15389B02703o27378p01906p75424q27552p89351o09715l27197n9523R2753J20400
15379d302190Q2506M2249L4805P0683J51993K75713M11921M92190M52567K98274
15369a989289J07177l5565j02916j28869j51211j66602j41766n5524P3737K01248
15359b389580K90569L30821L29373K90414J98339L9980j56830l38264m74521n70614
15349b450313o38840o70712o27151m64152j88789J13778L28901L95918L36210
$$ y = [-1460462, -1054698, -583817, -97728, 344796, 673559, 831116, 793915, 564159, 151179, -426460, -1121409, -1844012, -2461938, -2820267, -2805323, -2433639, -1874992, -1354199, -1010149, -832215, -704766, -505000, -180843, 234656, 658401, 994031, 1149280, 1058856, 721842, 202703, -424675, -1126581, -1902005, -2729557, -3518908, -4128623, -4455820, -4515343, -4422590, -4302190, -4219684, -4177435, -4142630, -4071947, -3919954, -3644241, -3232320, -2740130, -2287563, -1989289, -1882112, -1917677, -2020593, -2149462, -2300673, -2467275, -2609041, -2664565, -2590828, -2389580, -2099011, -1768190, -1438817, -1148403, -950064, -910084, -1066914, -1405178, -1879699, -2450313, -3089153, -3759865, -4387016, -4851168, -5039957, -4926179, -4597278, -4201360, -3865150]
15340c865150K11334Q4444R277J0779O0685R2819O5219P146j2301M3329J60323
15329c132096L17503N12792P43848R80541J154028J182269J034538P63727M65839
15320D022989K25926R5624P8205J21647J50463J16098J5859j27830k86546m24381
15310C988054n11586n52802n80772o22545o80976p41583p90736q15483p87128
15301b095557o62926m09667k9619M17563Q12626J040493J084416J019825R08417
15292B085571P50273N33653K74145K936k53053m78771o61885p77215q02362p45054
15282g1762o29850m65888k43145L6788L32113N76501P20619P51362O77713N13215
15272B197666K88039O6410p6095r8729k3426P7804J31521J11720M1290n5943j83651
$$ y = [-3865150, -3653816, -3569372, -3560095, -3549316, -3488631, -3395812, -3330593, -3323447, -3335748, -3292419, -3132096, -2814593, -2301801, -1557953, -577412, 576616, 1758885, 2793423, 3557150, 4022989, 4248915, 4344539, 4422744, 4544391, 4694854, 4810952, 4826811, 4698981, 4412435, 3988054, 3476468, 2923666, 2342894, 1720349, 1039373, 297790, -492946, -1308429, -2095557, -2758483, -3168150, -3197769, -2780206, -1967580, -927087, 157329, 1177154, 2085571, 2835844, 3369497, 3643642, 3646578, 3393525, 2914754, 2252869, 1475654, 673292, -71762, -701612, -1167500, -1410645, -1373857, -1041744, -465243, 255376, 1006738, 1684451, 2197666, 2485705, 2552115, 2476020, 2377291, 2353865, 2431669, 2563190, 2674910, 2716200, 2660257, 2476606]
15261B476606l45107n04325n83164n10550k90156j7155J77153K12588J15337r693
15251G21534o7414l8827K7168O6971M3675l8147j37164j99570j91484j11040L0000
15240A05702K18221M16793N58470N88737M98182L05419L7586k62388n30909p16637
15230A219176q14269q39469p89662o56985m59764k35495p578K13949L93550M70156
15220a506391M07371K22664k8407k81035m79592n80334n53258m03592j77748Q1978
15210c298344L67462O72688R71641J241768J465005J594192J554706J301681Q74570
15201F745369L86435m6333l65326n69522o74377o84717o06373m64202k88029j00013
15191C332912O2048J46117J42727J12639J38963K58162M33322N89081O62747O19507
$$ y = [2476606, 2131499, 1627174, 1044010, 533460, 243304, 226149, 403302, 615890, 731227, 721534, 654120, 615293, 642461, 709432, 753107, 714960, 577796, 378226, 186742, 75702, 105702, 323923, 740716, 1299186, 1887923, 2386105, 2691524, 2729110, 2466722, 1935813, 1219176, 404907, -434562, -1224224, -1881209, -2340973, -2576468, -2584046, -2370097, -1976547, -1506391, -1099020, -876356, -904763, -1185798, -1665390, -2245724, -2798982, -3202574, -3380322, -3298344, -2930882, -2258194, -1286553, -44785, 1420220, 3014412, 4569118, 5870799, 6745369, 7131804, 7085471, 6720145, 6150623, 5476246, 4791529, 4185156, 3720954, 3432925, 3332912, 3394960, 3541077, 3683804, 3796443, 3935406, 4193568, 4626890, 5215971, 5878718, 6498225]
15181F498225M49205J86653p2334k18789k12419j11337k0389j3609r8827k39600
15171F146779l96727n43735o61110p39342p78172p68991p03728o07518n25610
15162D21846m64138l69629j83054J01998M37227P48805R52850R61184P18031K58174
15152C583294k89261p70817j073914j149042j025117q02941n94173m49296l31496
15143b902763j58757J18176M72421Q15564J045674J098373R67950O96149L49100
15134B501887k479k91136m61446m86250l80747j96916J1278K14026L92304N21476
15124A821997N79422N61663M95344M36246M28018M58153M64892L85466J92381
15115E823582j03400m57891p97740j046339j163064j156280j064810r25577p45280
$$ y = [6498225, 6947430, 7134083, 7061749, 6842960, 6630541, 6519204, 6498815, 6485206, 6386379, 6146779, 5750052, 5206317, 4545207, 3805865, 3027693, 2258702, 1554974, 947456, 421846, -42292, -411921, -594975, -492977, -55750, 693055, 1645905, 2607089, 3325120, 3583294, 3294033, 2523216, 1449302, 300260, -724857, -1527798, -2121971, -2571267, -2902763, -3061520, -2943344, -2470923, -1655359, -609685, 488688, 1456638, 2152787, 2501887, 2499408, 2208272, 1746826, 1260576, 879829, 682913, 694191, 908217, 1300521, 1821997, 2401419, 2963082, 3458426, 3894672, 4322690, 4780843, 5245735, 5631201, 5823582, 5720182, 5262291, 4464551, 3418212, 2255148, 1098868, 34058, -891519, -1636799]
15106a636799n03460j87657J82840N59935Q82622J104017J211923J219867J142724
15097C976012R96349Q20754O78204O12606O13503O25159N93538M93292L09023
15088I718440K6569l33319o99639r92243j167080j222367j185999j108709j046161
15079A989492j027958j047366j077989j093058j078310j032970r57077q40385
15071f165621o68872m59515k75503j76853j60656j67269j46661j10695j12608
15062h444253j76524k58268k81239k06003n3396J30737L09124M61241N86675P01594
15052g230312Q17608R16996R54574R00934P80689O47483N31076M31522L46236
15043i03194K67677J64936j120k34749m77894o44696o95674o54042n52535l98543
$$ y = [-1636799, -2140259, -2327916, -2145076, -1585141, -702519, 401498, 1613421, 2833288, 3976012, 4972361, 5793115, 6471319, 7083925, 7697428, 8322587, 8916125, 9409417, 9718440, 9745009, 9411690, 8712051, 7719808, 6552728, 5330361, 4144362, 3035653, 1989492, 961534, -85832, -1163821, -2256879, -3335189, -4368159, -5325236, -6165621, -6834493, -7294008, -7569511, -7746364, -7907020, -8074289, -8220950, -8331645, -8444253, -8620777, -8879045, -9160284, -9366287, -9419683, -9288946, -8979822, -8518581, -7931906, -7230312, -6412704, -5495708, -4541134, -3640200, -2859511, -2212028, -1680952, -1249430, -903194, -635517, -470581, -471701, -706450, -1184344, -1829040, -2524714, -3178756, -3731291, -4129834]
15033d129834j83213J02002M49697Q18207J126066J282502J248198J075381Q74365
15024B663371P24842O26842N36368M19983K70668J03836n0764j66976k30954k41077
15014D656139k09078j64229j65881k77306m93252p26405q84857r37952r14590
15005a17411q70753q47250q35832p98293p15327n91195m29664k43373p3446K8080
14995e494464L7598j6147o4229m9886K9404J41170K58062L60552M19831M13521
14985c964588L69585L65870M52536N84157O55363N99974M42755K62840J19192
14976a12316J8265n4773j04507j36490j68925k20330l07226m43015o24035q35649
14966b989001j058641j245088j316840j217054r48346n54110q3840M06896Q42370
$$ y = [-4129834, -4313047, -4211045, -3761348, -2943141, -1817075, -534573, 713625, 1789006, 2663371, 3388213, 4015055, 4551423, 4971406, 5242074, 5345910, 5295146, 5128170, 4897216, 4656139, 4447061, 4282832, 4116951, 3839645, 3346393, 2619988, 1735131, 797179, -117411, -988164, -1835414, -2671246, -3469539, -4184866, -4776061, -5205725, -5449098, -5522544, -5494464, -5456866, -5473013, -5537242, -5587128, -5557724, -5416554, -5158492, -4797940, -4378109, -3964588, -3595003, -3229133, -2776597, -2192440, -1537077, -937103, -494348, -231508, -112316, -94051, -148824, -253331, -389821, -558746, -779076, -1086302, -1529317, -2153352, -2989001, -4047642, -5292730, -6609570, -7826624, -8774970, -9329080, -9412920, -9006024, -8163654]
14957h163654J144271J268501J227675J078379Q93412P50781P07023P41992P54263
14948D02643O47216M21696J76087J3109m5751n3447p5235j47772k73045m19121
14938F46380n18917n01258l53341j39564M7460J40571J24430M3843k6242m9279
14928e85917o6419j41912k67060l61260l72772l32520k96767k68695j97476l9920
14918b930718J93392M49179O68883Q06321Q41684P97342P10802N86451L95672
14909B519008J23729j92124m71362o34102o44770n27558l36172j10896J21499
14900a52748L27142M76870N69012O25019O53988O23197M82398K17481j24827m61004
14890C236528p07148q02427p37349n75938m21595l32393k81898k12599j12542
$$ y = [-8163654, -7019383, -5750882, -4523207, -3444828, -2551416, -1800635, -1093612, -351620, 402643, 1049859, 1471555, 1647642, 1660751, 1615000, 1561553, 1486318, 1338546, 1065501, 646380, 127463, -373795, -727136, -866700, -819240, -678669, -554239, -510396, -536638, -585917, -652336, -794248, -1061308, -1422568, -1795340, -2127860, -2424627, -2693322, -2890798, -2930718, -2737326, -2288147, -1619264, -812943, 28741, 826083, 1536885, 2123336, 2519008, 2642737, 2450613, 1979251, 1345149, 700379, 172821, -163351, -274247, -152748, 174394, 651264, 1220276, 1845295, 2499283, 3122480, 3604878, 3822359, 3697532, 3236528, 2529380, 1726953, 989604, 413666, -7929, -340322, -622220, -834819, -947361]
14881i47361k9695j5080n8235q5647l8267N4055J00448M5068q3204k02959k44413
14870a505290j93728r5943q245N1299R1264R7883K7994j46083l86200n82397o15506
14859c264952m45165j32887K17096N15758O91401O81642M70819J30589k10485
14850a346184m40467m97681l71475j18970J50119L53429M92303O15301P41704
14841d21921Q44073Q87202Q43201O89115M34516J41174j06398k44624k63178k15778
14831B587382j79024j92858k42204k66377j94690j5346K02163L64896M14624L43300
14821B821866J81851k3760k33881m24705n73734o35025n62133l69982j39918M7576
14811H8155J60361K03272J94617J65089J55999J84034K13961J88070P4797j08206
$$ y = [-947361, -977056, -992136, -1050371, -1136018, -1174285, -1120230, -1019782, -974714, -1057918, -1260877, -1505290, -1699018, -1794961, -1803206, -1751907, -1660643, -1562760, -1534766, -1680849, -2067049, -2649446, -3264952, -3710117, -3843004, -3625908, -3110150, -2418749, -1737107, -1266288, -1135699, -1346184, -1786651, -2284332, -2655807, -2774777, -2624658, -2271229, -1778926, -1163625, -421921, 422152, 1309354, 2152555, 2841670, 3276186, 3417360, 3310962, 3066338, 2803160, 2587382, 2408358, 2215500, 1973296, 1706919, 1512229, 1496883, 1699046, 2063942, 2478566, 2821866, 3003717, 2979957, 2746076, 2321371, 1747637, 1112612, 550479, 180497, 40579, 88155, 248516, 451788, 646405, 811494, 967493, 1151527, 1365488, 1553558, 1628355, 1520149]
14801A520149l00817m38004m87968m48627l28614j60229j0527O2175O6176O8992
14791d57294J20621J89112J80644K6491k44631n16589o66790o41886m74908k54638
14781b739868p0927L7606R7275J62121K63150L91497N14420O03998O51001O45941
14771E56214N61676L81198J49364k8989p1682j762P0108N2195n3393j82450k84936
14760A147543l56253m11108m45765m39739l92052l33552k92412k65566k40544
14751b029448k27590k37388k41020j95946j06920k8693j0517n4782j20420j54009
14741c406733j28006n6266L3308J30301K30951L22075L98265M67244N28683N74430
14731i05748O09317O38458O24327N01286K49842o8478l48116n06221n23303m22977
$$ y = [1520149, 1219332, 781328, 293360, -155267, -483881, -644110, -654637, -592462, -526286, -457294, -336673, -147561, 33083, 59574, -185057, -701646, -1368436, -2010322, -2485230, -2739868, -2810795, -2773189, -2675914, -2513793, -2250643, -1859146, -1344726, -740728, -89727, 556214, 1117890, 1499088, 1648452, 1619463, 1547781, 1546019, 1616127, 1668322, 1614929, 1432479, 1147543, 791290, 380182, -65583, -505322, -897374, -1230926, -1523338, -1788904, -2029448, -2257038, -2494426, -2735446, -2931392, -3038312, -3067005, -3077522, -3132304, -3252724, -3406733, -3534739, -3591005, -3557697, -3427396, -3196445, -2874370, -2476105, -2008861, -1480178, -905748, -296431, 342027, 966354, 1467640, 1717482, 1649004, 1300888, 794667, 271364, -151613]
14721a51613k25326N4262L70881O46661Q06402Q09660O58013L91942P7356k17540
14711C220698m45297n97997p02505p88635q60692q98842q91688q55500q08316
14702c628774p44406o49375n14265l15519j6049L74066P55836J005806J075913
14693b656767R99372Q23187N72621K61795r5481m77265q38842j109383j213325
14684c734088j108143q15541m24333n1668K27074M18732N78476P36675Q60668
14675c312148Q94460Q31335P34301O88376P39291Q63529R82456J008758Q93247
14666D323605O43455L06814n8394l99483o83803r10512j085823j189462j193142
14657b46745j092806r02431o32683k95614O3614L69555N66332O42856O09554M74239
$$ y = [-151613, -376939, -322677, 48204, 694865, 1501267, 2310927, 2968940, 3360882, 3438238, 3220698, 2775401, 2177404, 1474899, 686264, -174428, -1073270, -1964958, -2820458, -3628774, -4373180, -5022555, -5536820, -5852339, -5868388, -5494322, -4738486, -3732680, -2656767, -1657395, -834208, -261587, 208, -95273, -572538, -1411380, -2520763, -3734088, -4842231, -5657772, -6082105, -6133773, -5906699, -5487967, -4909491, -4172816, -3312148, -2417688, -1586353, -852052, -163676, 575615, 1439144, 2421600, 3430358, 4323605, 4967060, 5273874, 5215480, 4815997, 4132194, 3221682, 2135859, 946397, -246745, -1339551, -2241982, -2874665, -3170279, -3106665, -2737110, -2170778, -1527922, -918368, -444129]
14647d44129K64867O1891m2125j5660J03898K47641L48395L70560L14359J88852
14637A398549M458j95877l29746l38982k46574j19803K924J20116K17863K49516
14627G62444J81483M3955q3715j43243j41983j31339j55076k11428k62269k82671
14617d23842k83379k79922k61092j98204q2601N5778J67155K12191J87244J31156
14607g75516R8037J16866J78536K51687L04106L11236K55907J43524J2779q3742
14597H13420r6182Q082K01818L90770M88419M82269M21563L64525L37492L23970
14587C736146K79292J64210k4403k54506m81207o63702p78379q37859q89952r65319
14577g15679j033593j037183r45172p67005n48881l52287k07240q7626M8249J96846
$$ y = [-444129, -179262, -117371, -159496, -175156, -71258, 176383, 524778, 895338, 1209697, 1398549, 1403007, 1207130, 877384, 538402, 291828, 172025, 174949, 295065, 512928, 762444, 943927, 987882, 904167, 760924, 618941, 487602, 332526, 121098, -141171, -423842, -707221, -987143, -1248235, -1446439, -1529040, -1473262, -1306107, -1093916, -906672, -775516, -677479, -560613, -382077, -130390, 173716, 484952, 740859, 884383, 897162, 813420, 717238, 725320, 927138, 1317908, 1806327, 2288596, 2710159, 3074684, 3412176, 3736146, 4015438, 4179648, 4155245, 3900739, 3419532, 2755830, 1977451, 1139592, 249640, -715679, -1749272, -2786455, -3731627, -4498632, -5047513, -5399800, -5607040, -5694666, -5646417, -5449571]
14567e449571L14089L73571L87379L68689L20274K78336L04104M06575N21506
14558b175048N83619N96254O17484O97880Q46745J030954J182983J218973J066138
14549E665982P04767K04850k98693o93176r46633j070030j053972q89644o31694
14540I91757l80682j98803p6639K2037J18627K23679L38470M41386N09594N52278
14530B541704N88055N95848N29968L86594K17319P2447m2787j50776k60937l53309
14520D124126l93037l77354l73281m65216o55477q48478r35844q78832p09868
14511a513261m85293k64577j08160n0254p5186j32763j68393j42468m2709J01914
14501b881150K21551K45129J48562k9164j98973k64416j85900l758K00058L38888
$$ y = [-5449571, -5135482, -4761911, -4374532, -4005843, -3685569, -3407233, -3103129, -2696554, -2175048, -1591429, -995175, -377691, 320189, 1166934, 2197888, 3380871, 4599844, 5665982, 6370749, 6575599, 6276906, 5583730, 4637097, 3567067, 2513095, 1623451, 991757, 611075, 412272, 335633, 357670, 476297, 699976, 1038446, 1479832, 1989426, 2541704, 3129759, 3725607, 4255575, 4642169, 4859488, 4931935, 4889148, 4738372, 4477435, 4124126, 3731089, 3353735, 2980454, 2515238, 1859761, 1011283, 75439, -803393, -1513261, -1998554, -2263131, -2371291, -2421545, -2496731, -2629494, -2797887, -2940355, -2983064, -2881150, -2659599, -2414470, -2265908, -2295072, -2494045, -2758461, -2944361, -2948119, -2748061, -2409173]
14491b409173L49782K30659M2124j38545k62161l17264l12896k63853j93233j31408
14481c405968r4596o4189j53J09338K19983K68264K30381J33888J7793r4585j80697
14470b860541k13105j82235j01718J3843J61813L40730N44505P63237R61705J064075
14460D92309R94585P35342L34306j22304n32277q05662r03765q45679o74755m35045
14450a762945j71910P2972K75899M32596N56762O85634Q55386J042143J147139
14441C133676J081256Q58630N77121L24684J27131k7249j45548k33764l11518
14432E384419l89998m52990m78190m61058m09613l29290k13384m7864J63674L88706
14422C154412N82856P00427P06381O11225M73612L38357J90744j1983k69853n13722
$$ y = [-2409173, -2059391, -1828732, -1786608, -1925153, -2187314, -2504578, -2817474, -3081327, -3274560, -3405968, -3500564, -3564753, -3564906, -3455568, -3235585, -2967321, -2736940, -2603052, -2585259, -2679844, -2860541, -3073646, -3255881, -3357599, -3343756, -3181943, -2841213, -2296708, -1533471, -571766, 492309, 1486894, 2222236, 2556542, 2434238, 1901961, 1096299, 192534, -653145, -1327900, -1762945, -1934855, -1861883, -1585984, -1153388, -596626, 89008, 944394, 1986537, 3133676, 4214932, 5073562, 5650683, 5975367, 6102498, 6075249, 5929701, 5695937, 5384419, 4994421, 4541431, 4063241, 3602183, 3192570, 2863280, 2649896, 2602032, 2765706, 3154412, 3737268, 4437695, 5144076, 5755301, 6228913, 6567270, 6758014, 6746031, 6476178, 5962456]
14412E962456o63804p00428o64926o14294n92631o24498o97655p44182o78856
14403a8818m73282j74664J28797L49685M51171M78488N13421N84681O42040O16158
14393C097677M84420K84215Q3128o3083j37259j51856j22096o5266j1350J4221
14383C412751R987j0760l9548q1424j49303k39243l15998l41898l18362k84479
14373A641723k62657k21627j17066N5942K74635N13894P34686Q78774R01675Q01075
14363E201054O11727L90818K01855Q2475J2835o3407j76209l14349m61186n98724
14353D886889o83331o60456n24948l46034k04344j21764p6409n8881q7122j78480
14343A945120l14744m32390m57738l56951j57279O4568K16753K38323J36969j1582
$$ y = [5962456, 5298652, 4598224, 3933298, 3319004, 2726373, 2101875, 1404220, 660038, -18818, -492100, -666764, -537967, -188282, 262889, 741377, 1254798, 1839479, 2481519, 3097677, 3582097, 3866312, 3949440, 3886357, 3749098, 3597242, 3475146, 3409880, 3398530, 3412751, 3422738, 3411978, 3372430, 3291006, 3141703, 2902460, 2586462, 2244564, 1926202, 1641723, 1379066, 1157439, 1040373, 1096315, 1370950, 1884844, 2619530, 3498304, 4399979, 5201054, 5812781, 6203599, 6405454, 6487929, 6500764, 6437357, 6261148, 5946799, 5485613, 4886889, 4203558, 3543102, 3018154, 2672120, 2467776, 2346012, 2269603, 2210722, 2123600, 1945120, 1630376, 1197986, 740248, 383297, 226018, 290586, 507339, 745662, 882631, 871049]
14333H71049j22760j70720j93375k39457l14349l74951l79141l25216k34459j29055
14323a612434l3711L7002R3838J61458K59189L92774N47061O86676P82133Q35391
14313B149377Q69120Q90460Q74319P88372O28528M22514K04587J369j56850k40107
14303F431689k49156k14767j59800r0648k9559k8709j36123l52739o20140q46363
14293C703685r60780r49327q42028o93200n64975m92197m64416m61332m76041
14284b200611m74707l89827j97338M0553K30346L31724L72951L85606L65595K99547
14274a236161J92761Q4527M3514J17322K83719M60978N63800N49319M16463J92882
14264A669124n9186k58406l49941l30664k41303j36054m2770M7789J53937K71075
$$ y = [871049, 748289, 577569, 384194, 144737, -169612, -544563, -923704, -1248920, -1483379, -1612434, -1646145, -1609143, -1515305, -1353847, -1094658, -701884, -154823, 531853, 1313986, 2149377, 3018497, 3908957, 4783276, 5571648, 6200176, 6622690, 6827277, 6828646, 6671796, 6431689, 6182533, 5967766, 5807966, 5717318, 5687759, 5659050, 5522927, 5170188, 4550048, 3703685, 2742905, 1793578, 951550, 258350, -306625, -798822, -1263238, -1724570, -2200611, -2675318, -3065145, -3262483, -3221930, -2991584, -2659860, -2286909, -1901303, -1535708, -1236161, -1043400, -958873, -915359, -798037, -514318, -53340, 510460, 1059779, 1476242, 1669124, 1609938, 1351532, 1001591, 670927, 429624, 293570, 250800, 298589, 452526, 723601]
14254G23601L65329L96287L45671K28431R1832L57r866L0179N7554N1760M6096
14243B327231P4706J27502J49074Q2692o4058k03942k46850j72918j0534K10132
14233B273035M30459N36501M40992J71378j77068n24792p97335r11995q39393
14224F01782o33614l74405j11239J33435L49414N35391O84253P75150P89348P24859
14214C474374N85993L74227J07048j61096l51409m07155l39492k23085j34382
14205B925023r9572j01348j15912j30500j41032j56679j88938k24180k33349k07707
14195A325806j69267j47400j44901j39459j21443j05818j08938j37047j90453
14186F1080k66948l73275n18446o75272p75426p58227o09516l58828o1858K19843
$$ y = [723601, 1088930, 1485217, 1830888, 2059319, 2151151, 2151508, 2141642, 2171821, 2229375, 2281135, 2327231, 2401937, 2529439, 2678513, 2761205, 2697147, 2493205, 2246355, 2073437, 2062903, 2273035, 2703494, 3239995, 3680987, 3852365, 3675297, 3150505, 2353170, 1441175, 601782, -31832, -406237, -517476, -384041, -34627, 500764, 1185017, 1960167, 2749515, 3474374, 4060367, 4434594, 4541642, 4380546, 4029137, 3621982, 3282490, 3059405, 2925023, 2825451, 2724103, 2608191, 2477691, 2336659, 2179980, 1991042, 1766862, 1533513, 1325806, 1156539, 1009139, 864238, 724779, 603336, 497518, 388580, 251533, 61080, -205868, -579143, -1097589, -1772861, -2548287, -3306514, -3916030, -4274858, -4336716, -4116873]
14176d116873M42328N78924O11279N48737M36066L17221K00743O5014j03337k80627
14166a300525m23199n05084n28326n09914m68350m19381l86732l91679m11523
14157e344713l88101k95538j68450o2068q915j2627n8437j15975j42212j11063
14147f708099n1094k7075p8250k01833l83506n92273p55000p89243o66082m35115
14137a0687570j87632J5145J72142L07574M28074N22480N80927N98476N74181
14128g676203N05912L93198K61111J57815J08532Q8952N7891K077o2656j09228
14118f272599r8486O179K04956M65429P49427J006352J156056J126884R18007
14109g37795N94294K34732q5175k98559l84459l89026l80640l96874m41197m93405
$$ y = [-4116873, -3674545, -3095621, -2484342, -1935605, -1499539, -1182318, -981575, -916561, -1019898, -1300525, -1723724, -2228808, -2757134, -3267048, -3735398, -4154779, -4541511, -4933190, -5344713, -5732814, -6028352, -6196802, -6258870, -6267785, -6280412, -6338849, -6454824, -6597036, -6708099, -6759193, -6786268, -6864518, -7066351, -7449857, -8042130, -8797130, -9586373, -10252455, -10687570, -10875202, -10860057, -10687915, -10380341, -9952267, -9429787, -8848860, -8250384, -7676203, -7170291, -6777093, -6515982, -6358167, -6249635, -6160683, -6102792, -6100715, -6163371, -6272599, -6371085, -6364906, -6159950, -5694521, -4945094, -3938742, -2782686, -1655802, -737795, -143501, 91231, 6056, -292503, -676962, -1065988, -1446628, -1843502, -2284699, -2778104]
14099b778104n07778m27069k26048N8123L48203N64564O39670N36704K78034n1819
14089a565520l41381n00918m92278l35871r8783J37100L14975M23228M85135N28179
14079a446134N50538N21731M21045K68899J19836L1222L6564J28170K49493L10498
14069A191862K35341J8175k61807m84831n53545m33970j68929J44420M02854N39102
14059F28672N40754M39934K89776J45762M2510k5720q8077j60742k31753k61336
14049A319780j99732l7307J69513L41669M35637M57572M42443M25667M14875L86639
14039D156756L22944K42024J77486J39423J17684J13279J42112J98441K31978
14030E842127J91186Q5726j7850o0872l9829Q343M5882M9471Q517o8453j49130
$$ y = [-2778104, -3285882, -3712951, -3938999, -3880876, -3532673, -2968109, -2328439, -1791735, -1513701, -1565520, -1906901, -2407819, -2900097, -3235968, -3334751, -3197651, -2882676, -2459448, -1974313, -1446134, -895596, -373865, 47180, 316079, 435915, 467137, 503701, 631871, 881364, 1191862, 1427203, 1445378, 1183571, 698740, 145195, -288775, -457704, -313284, 89570, 628672, 1169426, 1609360, 1899136, 2044898, 2087408, 2061688, 1973611, 1812869, 1581116, 1319780, 1120048, 1082741, 1252254, 1593923, 2029560, 2487132, 2929575, 3355242, 3770117, 4156756, 4479700, 4721724, 4899210, 5038633, 5156317, 5269596, 5411708, 5610149, 5842127, 6033313, 6119039, 6101189, 6040317, 6000488, 6008831, 6054713, 6104184, 6112701, 6044248, 5895118]
14019E895118j96977j93878j42140n7524M2525J49302K51415L21953L31035K75462
14009F676291J98700J64760J96893K55705K88296K85417K74761K66595K40549
14000H847967J83555J03222O815j06450k32423l47006m06275l75375k65222j36156
13990G272652n8750p2990j79950l41526m88244n66381n83550n90635o27398o96864
13980C066364p65189p77451o93935n09555k43057P2887L92915O65236Q49186R38308
13970B995709R58681R30414Q41322O73682M52452K48963J28910J02183J22940
13961G455256J40489J38968J17355O7666n558p7879j36188j92863k54093k89694
13951F963459k49521j08945R9046K98306M27086M77272M70874M14703K98810J26458
$$ y = [5895118, 5698141, 5504263, 5362123, 5304599, 5347124, 5496426, 5747841, 6069794, 6400829, 6676291, 6874991, 7039751, 7236644, 7492349, 7780645, 8066062, 8340823, 8607418, 8847967, 9031522, 9134744, 9141559, 9035109, 8802686, 8455680, 8049405, 7674030, 7408808, 7272652, 7213902, 7140912, 6960962, 6619436, 6131192, 5564811, 4981261, 4390626, 3763228, 3066364, 2301175, 1523724, 829789, 320234, 77177, 150064, 542979, 1208215, 2057401, 2995709, 3954390, 4884804, 5726126, 6399808, 6852260, 7101223, 7230133, 7332316, 7455256, 7595745, 7734713, 7852068, 7919734, 7914176, 7836297, 7700109, 7507246, 7253153, 6963459, 6713938, 6604993, 6704039, 7002345, 7429431, 7906703, 8377577, 8792280, 9091090, 9217548]
13941I217548o7490k16132k55113j89531j07363r4305j56158k47175l28208l68901
13931G187172l46851k69568j61089l4278R2761J82045K14220K26859K92480M48683
13921G832434O41497P51230O84209M38967J07247j68472k67502j64923N7391K73219
13911A0185297L86089L56898J83678j15620m86161q27966j040785j088694j018728
13902F534008r27091q99920r46317r83205r03166o60209l02159P3110L97696O54166
13892B036913Q21864Q56545P42101N22571K74369Q0424J8134J16254L15877N10617
13882F295669O28706O52835N83729M32857K46235J01452O2106J30428K47621L35558
13872I717196L42392K68752J64144R2583Q4480J13030J27680J10293P3017J9456
$$ y = [9217548, 9150058, 8933926, 8678813, 8489282, 8381919, 8287614, 8131456, 7884281, 7556073, 7187172, 6840321, 6570753, 6409664, 6375386, 6468147, 6650192, 6864412, 7091271, 7383751, 7832434, 8473931, 9225161, 9909370, 10348337, 10455584, 10287112, 10019610, 9854687, 9912078, 10185297, 10571386, 10928284, 11111962, 10996342, 10510181, 9682215, 8641430, 7552736, 6534008, 5606917, 4706997, 3760680, 2777475, 1874309, 1214100, 911941, 985051, 1382747, 2036913, 2858777, 3715322, 4457423, 4979994, 5254363, 5334787, 5352921, 5469175, 5785052, 6295669, 6924375, 7577210, 8160939, 8593796, 8840031, 8941483, 9003589, 9134017, 9381638, 9717196, 10059588, 10328340, 10492484, 10585067, 10669547, 10782577, 10910257, 11020550, 11093567, 11113023]
13862A1113023m5830q2925l7522R3128K39334L18684L07336K47387J95866J78293
13852A2526774J78340J54709Q4480n3l1090L8077J93151L73622N28467O39201
13842A4685678O90145O53069N08469K70220l243k19778k90411j88108J5551J92232
13832A6313824K45060J60002j3420k18185m18644n88396o98387p23971o57000
13823A3400883n12132l31394j72361o7848l942N2840J11421J39254Q8772m6072
13813A2659421k04189l11591l44102l22807k72359j92390o6975R6810K53758L61661
13803A1657237M34869N31849O76524Q15550Q79057Q60134Q05479P57257P28365
13794A8146321P10951O88157O34253N24093L79102K81151K95394L99773N12594
$$ y = [11113023, 11067193, 10984268, 10946746, 11039874, 11279208, 11597892, 11905228, 12152615, 12348481, 12526774, 12705114, 12859823, 12944303, 12944250, 12913160, 12951237, 13144388, 13518010, 14046477, 14685678, 15375823, 16028892, 16537361, 16807581, 16804338, 16584560, 16294149, 16106041, 16121592, 16313824, 16558884, 16718886, 16705466, 16487281, 16068637, 15480241, 14781854, 14057883, 13400883, 12888751, 12557357, 12384996, 12317148, 12313206, 12366046, 12477467, 12616721, 12705493, 12659421, 12455232, 12143641, 11799539, 11476732, 11204373, 11011983, 10945008, 11041818, 11295576, 11657237, 12092106, 12623955, 13300479, 14116029, 14995086, 15855220, 16660699, 17417956, 18146321, 18857272, 19545429, 20179682, 20703775, 21082877, 21364028, 21659422, 22059195, 22571789]
13785B2571789N54595M72582K64226J4376j48354j68375r6152J589J09320K33825
13775B3809421L63140M78419N77135O66696P48625Q24020R11729J031449J149399
13766C0560033J174567J047197Q13923N91451M68128M50516M85432N15640N15794
13757C6622681M94009M74275M66434M49402L99490L20132K27654J36363O9141
13748C9659581O4829J59857L57143O18530Q86970J107944J237375J249558J140454
13739D6482241R30232O73466M45208L03091K68142L18078L92836M37869M48023
13730E0699186M66847N47631P14741R62112J270255J607808J924294K159587K270011
13721F2622472K242380K094466J871928J646507J511114J540279J733219K003294
$$ y = [22571789, 23126384, 23598966, 23863192, 23877568, 23729214, 23560839, 23464687, 23466276, 23575596, 23809421, 24172561, 24650980, 25228115, 25894811, 26643436, 27467456, 28379185, 29410634, 30560033, 31734600, 32781797, 33595720, 34187171, 34655299, 35105815, 35591247, 36106887, 36622681, 37116690, 37590965, 38057399, 38506801, 38906291, 39226423, 39454077, 39590440, 39659581, 39724410, 39884267, 40241410, 40859940, 41746910, 42854854, 44092229, 45341787, 46482241, 47412473, 48085939, 48531147, 48834238, 49102380, 49420458, 49813294, 50251163, 50699186, 51166033, 51713664, 52428405, 53390517, 54660772, 56268580, 58192874, 60352461, 62622472, 64864852, 66959318, 68831246, 70477753, 71988867, 73529146, 75262365, 77265659]
13713G7265659K231302K344542K354251K322131K305227K331448K410435K552079
13705I6117074K770730L077612L469896L917520M344271M635611M711756M597752
13697A27642222M401919M234963M145805M118213M125951M183491M329565M570332
13689A61752461M868124N189040N522447N843703O103811O262138O299247O206499
13681B08047470N999613N743709N518239N346441N195046N032824M852945M655274
13673B50391561M430731M158574L822535L428325K998117K560801K146606J762479
13665B75699729J371984R27694M21343j18370o72733j249595j844647k421705
13657B72113700k939554l367492l692451l942275m187609m501631m905932n350045
$$ y = [77265659, 79496961, 81841503, 84195754, 86517885, 88823112, 91154560, 93564995, 96117074, 98887804, 101965416, 105435312, 109352832, 113697103, 118332714, 123044470, 127642222, 132044141, 136279104, 140424909, 144543122, 148669073, 152852564, 157182129, 161752461, 166620585, 171809625, 177332072, 183175775, 189279586, 195541724, 201840971, 208047470, 214047083, 219790792, 225309031, 230655472, 235850518, 240883342, 245736287, 250391561, 254822292, 258980866, 262803401, 266231726, 269229843, 271790644, 273937250, 275699729, 277071713, 277999407, 278420750, 278302380, 277629647, 276380052, 274535405, 272113700, 269174146, 265806654, 262114203, 258171928, 253984319, 249482688, 244576756, 239226711]
13649B39226711n752278o064567o289738o442335o526019o548910o519301o418485
13641A88665078o210034n890547n503044n096281m708244m381868m156940m033094
13633A48685026l954879l861178l753695l686699l682867l690333l639017l519559
13625A18896799l389031l308723l288005l280927l230190l119309k981283k854758
13617I3444573k746275k640722k538416k475176k488793k555963k577791k455016
13609G2966421k194113j915009j736263j675984j667965j641626j566407j445203
13601E9123851j302948j180285j112108j096211j089540j046749r61189q69011
13593E0465810q16904q15463q16977p54792o13276m41473l03048k48994l25004
$$ y = [239226711, 233474433, 227409866, 221120128, 214677793, 208151774, 201602864, 195083563, 188665078, 182455044, 176564497, 171061453, 165965172, 161256928, 156875060, 152718120, 148685026, 144730147, 140868969, 137115274, 133428575, 129745708, 126055375, 122416358, 118896799, 115507768, 112199045, 108911040, 105630113, 102399923, 99280614, 96299331, 93444573, 90698298, 88057576, 85519160, 83043984, 80555191, 77999228, 75421437, 72966421, 70772308, 68857299, 67121036, 65445052, 63777087, 62135461, 60569054, 59123851, 57820903, 56640618, 55528510, 54432299, 53342759, 52296010, 51334821, 50465810, 49648906, 48833443, 48016466, 47261674, 46648398, 46206925, 45903877, 45654883, 45329879]
13584D5329879n43904q57078j194372j508867j763223j906233j884194j677669
13576C3994339j333138r43028n82360k80291m2830J22105K04579K13897J92806
13567C1546079K07982L08439M64918N74698N60267M35637K57365N4603j77082
13558C4232906m53506p87820j174047j569237j901976k112024k184284k143732
13550B1906280k017533j812807j535521j205584q55541n38008l18914k34794k51154
13541A3136424k85068k75195k14276j27917l9484M8609J40955K20674K43647J75371
13531A3023740K9488j53149l42718n12506o25728o57936o12435n05440l57371
13522I285945j91980k7140J20403K25171K76089L02877L52931M36351N04000M85866
$$ y = [45329879, 44785975, 43928897, 42734525, 41225658, 39462435, 37556202, 35672008, 33994339, 32661201, 31718173, 31135813, 30855522, 30812692, 30934797, 31139376, 31353273, 31546079, 31754061, 32062500, 32527418, 33102116, 33662383, 34098020, 34355385, 34409988, 34232906, 33779400, 32991580, 31817533, 30248296, 28346320, 26234296, 24050012, 21906280, 19888747, 18075940, 16540419, 15334835, 14479294, 13941286, 13622372, 13387578, 13136424, 12851356, 12576161, 12361885, 12233968, 12194484, 12243093, 12384048, 12604722, 12848369, 13023740, 13053228, 12900079, 12557361, 12044855, 11419127, 10761191, 10148756, 9643316, 9285945, 9093965, 9066825, 9187228, 9412399, 9688488, 9991365, 10344296, 10780647, 11284647, 11770513]
13512A1770513L51433J42608n5208j83975k47430k80218l08296l37583l52462
13503A0499382l33040k90273k62362k64737k72132k57864k15537j40003l4149
13494H429285N3945M6629q7463k92827m76973n91053o43432o51958o15490n23254
13484D647409l77698k11200p0777K0218P9666J44431K26789K98440L35574L63135
13474E455987M19247M98958N69598O18369O68424P57166Q91217J025096J095947
13465A2000009J064413R16737O60032L32256J545k59482m06588m38149l81462
13456A3489311k66633j26424j2058L0498j260p3464j50288k10060k42700k55509
13446A2181413k71673l10420l88375n19526o86866q43380r58801j043382j112762
$$ y = [11770513, 12121946, 12264554, 12209346, 12025371, 11777941, 11497723, 11189427, 10851844, 10499382, 10166342, 9876069, 9613707, 9348970, 9076838, 8818974, 8603437, 8463434, 8429285, 8483230, 8529859, 8442396, 8149569, 7672596, 7081543, 6438111, 5786153, 5170663, 4647409, 4269711, 4058511, 3987734, 4007952, 4087618, 4232049, 4458838, 4757278, 5092852, 5455987, 5875234, 6374192, 6943790, 7562159, 8230583, 8987749, 9878966, 10904062, 12000009, 13064422, 13981159, 14641191, 14973447, 14974992, 14715510, 14308922, 13870773, 13489311, 13222678, 13096254, 13084196, 13114694, 13113434, 13039970, 12889682, 12679622, 12436922, 12181413, 11909740, 11599320, 11210945, 10691419, 10004553, 9161173, 8202372, 7158990, 6046228]
13437F046228j149270j115106r93380q05403n83751l41401r4654J10848K38737
13428A312848K97745L20531L45528M11908N24254O23361O21596M71859K05656
13419E135286p4713k53887k85204k17055j37214r9523r9280r5657l7756J12874
13409C947871L50969O17718Q37894R62115R72886Q72119O84839M65417K81501
13400I993329J85157J74623J82037J30555Q073j22620j84466j53804o3371M2968
13390A0192481J25343J30390J4309j98773m14151n44298n84373o10805p10673
13381G399450r00496j112555j262866j314216j267103j111996q25597m24653Q469
13372h11563L74446O17854P38697P65541P29096O48621N22416L38999J16398p8735
$$ y = [6046228, 4896958, 3781852, 2788472, 1983069, 1399318, 1057917, 963263, 1074111, 1312848, 1610593, 1931124, 2276652, 2688560, 3212814, 3836175, 4457771, 4929630, 5135286, 5060573, 4806686, 4521482, 4304427, 4167213, 4067690, 3968410, 3872753, 3834997, 3947871, 4298840, 4916558, 5754452, 6716567, 7689453, 8561572, 9246411, 9711828, 9993329, 10178486, 10353109, 10535146, 10665701, 10673774, 10551154, 10366688, 10212884, 10149513, 10192481, 10317824, 10448214, 10462523, 10263750, 9849599, 9305301, 8720928, 8110123, 7399450, 6498954, 5386399, 4123533, 2809317, 1542214, 430218, -395379, -820032, -811563, -437117, 180737, 919434, 1684975, 2414071, 3062692, 3585108, 3924107, 4040505, 3961770]
13362C961770j70434j30144Q068J75289L00696L35092K72129J47765J0235j08993
13352D801473j95848k34994k07268j11672J2393R4150P6609m1605k03000l29063
13342C661175l68424l19757k23292j25347l5867P4767K32161M23066N96258O87721
13332D602461O58367N17175L15320J12996o2483k19486l58153m37955m03147k49300
13322D475795n3058Q6165J28344R8980K2909j01645k61188m07938m87618m71471
13312C029275l73932k50196j62706j37360j56676j92160k19981k09078j35645
13303A191541j4314J11398J98732K17915J70205J08513J12055K20074L92205N34317
13293C242641N61076M42053K02641j01900m09525o69186q55503r71908j034764
$$ y = [3961770, 3791336, 3661192, 3669260, 3844549, 4145245, 4480337, 4752466, 4900231, 4910466, 4801473, 4605625, 4370631, 4163363, 4051691, 4064084, 4158234, 4234843, 4193238, 3990238, 3661175, 3292751, 2972994, 2749702, 2624355, 2588488, 2663255, 2895416, 3318482, 3914740, 4602461, 5260828, 5778003, 6093323, 6206319, 6143836, 5924350, 5566197, 5128242, 4725095, 4475795, 4422737, 4508902, 4637246, 4736226, 4759135, 4657490, 4396302, 3988364, 3500746, 3029275, 2655343, 2405147, 2242441, 2105081, 1948405, 1756245, 1536264, 1327186, 1191541, 1177227, 1288625, 1487357, 1705272, 1875477, 1983990, 2096045, 2316119, 2708324, 3242641, 3803717, 4245770, 4448411, 4346511, 3936986, 3267800, 2412297, 1440389, 405625]
13284D05625j046699r91742q59592o57515m05529j39719R5676K65996L49924L45501
13274b638074K80259J94671J11511L3799l1175n5655j1466Q7737J85960K40612
13264a601821K66583L07948L76536M46460N04451N68535O44104O97513O89728
13255B900037O06073M53135K59567P4443o3372j57350k40208l32877m30712n21037
13245B547699n98989o66657p17453p17499o22309m39151k51337j40856j01978
13236a708530n4798O3203K27802L50734L69190L06564K40517K23689K48276K74205
13226E40852K64807K03335R8190k5728j40305k22027k56520k38284j66455m5838
13216A2027J07088K61050L75120M10717L53162K34761J23374O7123N2975K6901
$$ y = [405625, -641074, -1632816, -2492408, -3149923, -3555452, -3695171, -3599495, -3333499, -2983575, -2638074, -2357815, -2163144, -2051633, -2017834, -2049009, -2104664, -2116130, -2028393, -1842433, -1601821, -1335238, -1027290, -650754, -204294, 300157, 868692, 1512796, 2210309, 2900037, 3506110, 3959245, 4218812, 4293255, 4229883, 4072533, 3832325, 3499448, 3068736, 2547699, 1948710, 1282053, 564600, -152899, -775208, -1214359, -1465696, -1606552, -1708530, -1763328, -1700125, -1472323, -1121589, -752399, -445835, -205318, 18371, 266647, 540852, 805659, 1008994, 1107184, 1081456, 941151, 719124, 462604, 224320, 57865, 12027, 119115, 380165, 755285, 1166002, 1519164, 1753925, 1877299, 1944422, 1997397, 2024298]
13206B024298m9103j65612k88428m04293n35287p03335q85182j010292j018162
13197c035396r15026p62777o29313n44521m75063l53414j54588P5316K84712M75022
13187f035048O70864Q64107J005512J034968R18358O68166L43327K5666k21712
13178g25792l68677l98233l06032j21544Q7804K38047K69813J83216K9952j20082
13168a231528k06735k03014j19871O495J36024K49441L40814L91806L77135K77726
13158A8293Q0877j96309m87509p16054q48519q97237q82994q16501p07931n59787
13148f013671l55508q9026K00465M43407N79808N86314M84529L22214J46144J065
13138c694259o4240k6400P0768J48319J83945K27577L23907M58966N80831O56400
$$ y = [2024298, 1975195, 1809583, 1521155, 1116862, 581575, -121760, -1006942, -2017234, -3035396, -3950422, -4713199, -5342512, -5887033, -6362096, -6715510, -6870098, -6794782, -6510070, -6035048, -5364184, -4500077, -3494565, -2459597, -1541239, -873073, -529746, -504080, -725792, -1094469, -1492702, -1798734, -1920278, -1832474, -1594427, -1324614, -1141398, -1111446, -1231528, -1438263, -1641277, -1761148, -1754653, -1618629, -1369188, -1028374, -636568, -259433, 18293, 99170, -97139, -584648, -1300702, -2149221, -3046458, -3929452, -4745953, -5453884, -6013671, -6369179, -6458205, -6257740, -5814333, -5234525, -4648211, -4163682, -3841468, -3695324, -3694259, -3758499, -3784899, -3714131, -3565812, -3381867, -3154290, -2830383, -2371417, -1790586, -1134186]
13128a134186P09536P97504R41616J092135J171326J136528R90758P66064N09199
13119F980480K53245K481k44117m61398o02022o29123n34106l39283j08261N5839
13109D373735O3030r0203l08472m65241m79644l39469r1082J74995L64206M32795
13099C634650L94918K78805J01699j01762k56453k93079k15418r4066J848N5189
13089C506331J00250J80985K95855L90114M17989L83017L10809K20593J15201
13080E921144j7804j77877l25474l98007l53755k06940k3006J25990J98685J82063
13070D925019Q5783m0906j16082q4701L1941J70751K97156M18770N53273P10193
13060F951197Q86607J058115J186054J237687J191646J038563P90777M82853J52844
$$ y = [-1134186, -424650, 372854, 1314470, 2406605, 3577931, 4714459, 5705217, 6471281, 6980480, 7233725, 7236206, 6992089, 6530691, 5928669, 5299546, 4765440, 4426157, 4317896, 4373735, 4436765, 4346562, 4038090, 3572849, 3093205, 2753736, 2662654, 2837649, 3201855, 3634650, 4029568, 4308373, 4410072, 4308310, 4051857, 3758778, 3543360, 3449294, 3451142, 3506331, 3606581, 3787566, 4083421, 4473535, 4891524, 5274541, 5585350, 5805943, 5921144, 5903340, 5725463, 5399989, 5001982, 4648227, 4441287, 4418281, 4544271, 4742956, 4925019, 5010802, 4969896, 4853814, 4769113, 4801054, 4971805, 5268961, 5687731, 6241004, 6951197, 7837804, 8895919, 10081973, 11319660, 12511306, 13549869, 14340646, 14823499, 14976343]
13051A4976343j79979n14698q42080j125629j313475j368122j288937j112450
13043G230973q90067o62190m58967l06173k05465j28935n1787K2591Q3793J49583
13033D783356K50493L77523M75365M98356M51004L66700K71566J78436R7941M0658
13023G791398P934j6648o1906j54558l05351n01599p09985q84620r89920j025324
13013C149421j004705r23189p75074n83578l89662k28039j20598o9524m0534J9332
13003i66150J13573J77286J55195N8041p6326k34981m19968o14030p75624q50989
12993c433973p99321o31613m05258j64771P9577L10271M89082N94656O36175O27238
12983b697937N76882N01509M27276L92857M42991N76955O99482O72572M40161
$$ y = [14976343, 14796364, 14281666, 13439586, 12313957, 11000482, 9632360, 8343423, 7230973, 6340906, 5678716, 5219749, 4913576, 4708111, 4579176, 4527389, 4549980, 4633773, 4783356, 5033849, 5411372, 5886737, 6385093, 6836097, 7202797, 7474363, 7652799, 7750740, 7791398, 7799332, 7782684, 7720778, 7566220, 7260869, 6759270, 6049285, 5164665, 4174745, 3149421, 2144716, 1221527, 446453, -137125, -526787, -754826, -875424, -944948, -985482, -966150, -852577, -675291, -520096, -462055, -538381, -773362, -1193330, -1807360, -2582984, -3433973, -4233294, -4864907, -5270165, -5434936, -5355359, -5045088, -4556006, -3961350, -3325175, -2697937, -2121055, -1619546, -1192270, -799413, -356422, 220533, 920015, 1592587, 2032748]
12974B032748Q8089k19020l63920l61360l16334l01639l08858l02134k56349j43125
12964d51902O0499L34307O11612Q14526Q92685Q41828O92217M79504K23705o4808
12954D434173l69409o62897r04959j043734j040038q95468o47021l47318o0552
12945a537223J50822K58660K89968L07088L56188M34093M98775N03319M32480
12936A694170L13949J82180M4108j00542k30667l16774l48452l43512l35802l48954
12926B09704l84663m31969m70537m76296m31733l23771j45407Q3740K98557M21159
12916a651216M30982L79141L30859L11678L06593K91064K48093J63636K8192j40598
12906F98424k91766l82197m09342l92772l51348k99757k40087j60455m9135Q9370
$$ y = [2032748, 2120837, 1901817, 1537897, 1176537, 860203, 558564, 249706, -52428, -308777, -451902, -391403, -57096, 554516, 1369042, 2261727, 3103555, 3795772, 4275276, 4498981, 4434173, 4064764, 3401867, 2496908, 1453174, 413136, -482332, -1129353, -1476671, -1537223, -1386401, -1127741, -837773, -530685, -174497, 259596, 758371, 1261690, 1694170, 2008119, 2190299, 2234407, 2133865, 1903198, 1586424, 1237972, 894460, 558658, 209704, -174959, -606928, -1077465, -1553761, -1985494, -2309265, -2454672, -2370932, -2072375, -1651216, -1220234, -841093, -510234, -198556, 108037, 399101, 647194, 810830, 839022, 698424, 406658, 24461, -384881, -777653, -1129001, -1428758, -1668845, -1829300, -1878435, -1789065]
12896a789065K22624L11003L55497L95298M45653M76750M59999L97419L02086
12887A577264J76926K1955j47708k99399m03269m51485m52776m15054l34422j96463
12877i24431Q114K68874N47015P65111Q23647O66996L48909J5012j98899k45569
12867B074779j57323O567J99430L86382N19572N42149M31562K30945K2953j33608
12857D123408k41775l47765m88800o57484q05290q73612q30431o80984m47985
12848a250718j58621J51729M45137O99448R01218J009999R66481P57599M56142
12839C978414J85072M0898M9940J77405L54841N10242N89607N61966M24285K08064
12829G080734l0868k30110l31908l11430k12400j20606q8140j05392j39552j76926
$$ y = [-1789065, -1566441, -1255438, -899941, -504643, -58990, 417760, 877759, 1275178, 1577264, 1754190, 1776145, 1628437, 1329038, 925769, 474284, 21508, -393546, -727968, -924431, -916317, -647443, -100428, 664683, 1488330, 2155326, 2504235, 2519247, 2320348, 2074779, 1917456, 1924023, 2123453, 2509835, 3029407, 3571556, 4003118, 4234063, 4257016, 4123408, 3881633, 3533868, 3045068, 2387584, 1582294, 708682, -121749, -802733, -1250718, -1409339, -1257610, -812473, -113025, 788193, 1798192, 2764673, 3522272, 3978414, 4163486, 4204384, 4254324, 4431729, 4786570, 5296812, 5886419, 6448385, 6872670, 7080734, 7049866, 6819756, 6487848, 6176418, 5964018, 5843412, 5755272, 5649880, 5510328, 5333402]
12819E333402k25111k92641l79391m76289n65548o17641n97727m97384l53725
12810A327945k18852j17116k9552P5856J81171K22977J84548J34932J53861K51073
12800B166843L75586M78402N47480N98041O46052O85152O79276N86121L98914
12791G161867J64468n1969k26409l78511n15593o08170o23310n61022m55708l52408
12781C553235k67128j65014j980K14084M23031N53789N56446M28314K21479J2444
12771E528700j36775j96635j73081j00137j5678O2945J30894J73289J81356J76442
12761E631320J76831J56182O8346r3415k75223m01406m31175l78237k90199k05045
12751C957979j17575q512R7359J44406J14469L7627n9412j67480k63353l03524
$$ y = [5333402, 5108291, 4815650, 4436259, 3959970, 3394422, 2776781, 2179054, 1681670, 1327945, 1109093, 991977, 962425, 1038281, 1219452, 1442429, 1626977, 1761909, 1915770, 2166843, 2542429, 3020831, 3568311, 4166352, 4812404, 5497556, 6176832, 6762953, 7161867, 7326335, 7274366, 7047957, 6669446, 6153853, 5545683, 4922373, 4361351, 3905643, 3553235, 3286107, 3121093, 3119113, 3333197, 3756228, 4310017, 4866463, 5294777, 5516256, 5528700, 5391925, 5195290, 5022209, 4922072, 4906394, 4969339, 5100233, 5273522, 5454878, 5631320, 5808151, 5964333, 6032679, 5939264, 5664041, 5262635, 4831460, 4453223, 4163024, 3957979, 3840404, 3831892, 3929251, 4073657, 4188126, 4225753, 4166341, 3998861, 3735508, 3431984]
12741C431984k47161q2364J57441M07794O08191P18199P09964N70075L15309j3486
12731F575946l83671p66047j085905j231997j138369q37060m39308o8323K10814
12722H36080L90067M62615M13513K67638J18982R0698K45872N29979Q09596R64648
12712E129688R54118Q24623O63550N32200M27223K98509J08853j21964l27493
12703H489307m45803m64054m08676l01860j50785K3552J71662K49156K52776K04347
12693G619622J11560l5635k30652m32917n91528o70551o50583n34375l57610j72596
12683D054735j7198R6837J68099J87776J48408O1462m6974j47815k07612j94802
12673D102916j06391J0839P3627J6687j53485l64768n45927o74044p50459p63341
$$ y = [3431984, 3184823, 3102459, 3259900, 3667694, 4275885, 4994084, 5704048, 6274123, 6589432, 6575946, 6192275, 5426228, 4340323, 3108326, 1969957, 1132897, 693589, 625266, 836080, 1226147, 1688762, 2102275, 2369913, 2488895, 2579593, 2825465, 3355444, 4165040, 5129688, 6083806, 6908429, 7571979, 8104179, 8531402, 8829911, 8938764, 8816800, 8489307, 8043504, 7579450, 7170774, 6868914, 6718129, 6741681, 6913343, 7162499, 7415275, 7619622, 7731182, 7695547, 7464895, 7031978, 6440450, 5769899, 5119316, 4584941, 4227331, 4054735, 4037537, 4134374, 4302473, 4490249, 4638657, 4700119, 4653145, 4505330, 4297718, 4102916, 3996525, 4007364, 4080991, 4097678, 3944193, 3579425, 3033498, 2359454, 1608995, 845654]
12663H45654o90350n26248l01190o6742J32338K74010L55862L76649L22123J76758
12653H98864m3140k71238m27338m83240m73564m43089m01128l15847j45341J16355
12643a988706M23751P15379R51534J105423J141087J035639Q26220N97552M10916
12634E218795K70754J59551P7464M0729N8283J18345J81124J81046O7158j44855
12624F228394l73414n33050n96143n92528n63986n28742m74835l75732k25020
12615A964944o7926K2706K1056j4896L322J13203K75387M11696M69751M56994
12605C656237M16279L88619L97224M35078M65711M61283M34712M26869M77855
12596G559867O04690P78059R13095R06244P03058L41525o4981l96770n98270o93406
$$ y = [845654, 155304, -370944, -672134, -738876, -606538, -332528, 23334, 399983, 722106, 898864, 855724, 584486, 157148, -326092, -799656, -1242745, -1643873, -1959720, -2105061, -1988706, -1564955, -849576, 101958, 1207381, 2348468, 3384107, 4210327, 4807879, 5218795, 5489549, 5649100, 5726564, 5767293, 5825576, 5943921, 6125045, 6306091, 6373249, 6228394, 5854980, 5321930, 4725787, 4133259, 3569273, 3040531, 2565696, 2189964, 1964944, 1897018, 1919724, 1940780, 1925884, 1929206, 2042409, 2317796, 2729492, 3199243, 3656237, 4072516, 4461135, 4858359, 5293437, 5759148, 6220431, 6655143, 7082012, 7559867, 8164557, 8942616, 9855711, 10761955, 11465013, 11806538, 11741557, 11344787, 10746517, 10053111]
12586A0053111p43750p93912q48304q89783q98115q46758p21088n57083m26568
12577C327750l60520l11554k03581o621K24077L77676L78384K65239J72753K09559
12567D073162L69692N67224P12429P54281O95808N70730M10960K53693J39884
12558H547863Q2751O9578R2890J52730K41727L37409M00755M07284L81444L63213
12548A1077644L52243L27379L06770L42786M64583O49467Q39485R79759J041956
12539A6382072J007164Q54715N88881K54150q5242l70763n60432o42108o41493
12530A6786944n90125m92640l45918j70524L38J43984K43348K82021K61530K19358
12520A6338316K19159L06362M65165O30780P38378P46264O40684M45856K26497
$$ y = [10053111, 9309361, 8515449, 7667145, 6777362, 5879247, 5032489, 4311401, 3754318, 3327750, 2967230, 2655676, 2452095, 2445474, 2669551, 3047227, 3425611, 3690850, 3863603, 4073162, 4442854, 5010078, 5722507, 6476788, 7172596, 7743326, 8154286, 8407979, 8547863, 8630614, 8700192, 8793082, 8945812, 9187539, 9524948, 9925703, 10332987, 10714431, 11077644, 11429887, 11757266, 12064036, 12406822, 12871405, 13520872, 14360357, 15340116, 16382072, 17389236, 18243951, 18832832, 19086982, 19001740, 18630977, 18070545, 17428437, 16786944, 16196819, 15704179, 15358261, 15187737, 15188075, 15332059, 15575407, 15857428, 16118958, 16338316, 16557475, 16863837, 17329002, 17959782, 18698160, 19444424, 20085108, 20530964, 20757461]
12511B0757461O2787j027J4064N0288O3450L4726n5809k32050m80641p23478q55053
12500A8634718q10318o08538l42562j14170K3541P4184P2979N4027L5939K5149
12490A7044949J4603q820l5583k6228M6709J62038K59924K69639J47596p6025
12480A7798802l00739m28843m33451l60326k82800k48461k49106k47011k27006
12471A5021059j98659j59074q9547J0489J16519K10435K98164L90596M78347N44754
12461A6623083N93236O22220N92531M71214K87283J01400n9231k07603l49738
12452A8674395m50062m54216l50334j97787p7776k3749k2494o3391j52160k81450
12442A6600976m06213m60554m02642k39988l2305J14659R3912j12800l85485n46534
$$ y = [20757461, 20820248, 20819221, 20833285, 20883573, 20947023, 20981749, 20925940, 20693890, 20213249, 19489771, 18634718, 17824400, 17215862, 16873300, 16759130, 16782671, 16856855, 16929834, 16983861, 17019800, 17044949, 17059552, 17050732, 17015149, 16988921, 17035630, 17197668, 17457592, 17727231, 17874827, 17798802, 17498063, 17069220, 16635769, 16275443, 15992643, 15744182, 15495076, 15248065, 15021059, 14822400, 14663326, 14573779, 14584268, 14700787, 14911222, 15209386, 15599982, 16078329, 16623083, 17216319, 17838539, 18431070, 18902284, 19189567, 19290967, 19231736, 19024133, 18674395, 18224333, 17770117, 17419783, 17221996, 17144220, 17120471, 17097977, 17034586, 16882426, 16600976, 16194763, 15734209, 15331567, 15091579, 15059274, 15173933, 15267845, 15155045, 14769560, 14223026]
12432A4223026n06249l17936j04116M5069J12126J18769O4958p7061l02751n47713
12422A2708122p37410q27436p85903n92391k80489N5558L07701M06898L57024
12413A0611674K25744Q9069k4232j37560k80501m34448n24609m79313k96659n5335
12403H693830J27344J65652O2324r9977k30116k94205l13232l18882l33559l68623
12393G090556m10417m31834m34982m52845n08584n90813o56845o57062n72337
12384B374837m34285k95729j70238j5023K12598M96940P65900R38189R73311Q81245
12374E727745O91443M26651J14887j82667l89568m71587m55984l93069l10781
12365D757070k08936q8754L4141J51070K69025L79522M36137L88790K35676L0743
$$ y = [14223026, 13716777, 13398841, 13294725, 13339794, 13451920, 13570689, 13635647, 13558586, 13255835, 12708122, 11970712, 11143276, 10357373, 9764982, 9484493, 9540051, 9847752, 10254650, 10611674, 10837418, 10926487, 10902255, 10764695, 10484194, 10049746, 9525137, 9045824, 8749165, 8693830, 8821174, 8986826, 9049150, 8949173, 8719057, 8424852, 8111620, 7792738, 7459179, 7090556, 6680139, 6248305, 5813323, 5360478, 4851894, 4261081, 3604236, 2947174, 2374837, 1940552, 1644823, 1474585, 1459562, 1672160, 2169100, 2935000, 3873189, 4846500, 5727745, 6419188, 6845839, 6960726, 6778059, 6388491, 5916904, 5460920, 5067851, 4757070, 4548134, 4459380, 4493521, 4644591, 4913616, 5293138, 5729275, 6118065, 6353741, 6384484]
12355F384484j50162k44526k29069j43439p3733p7333j36109j93166k09432j81440
12345D746075j30886q0957l9503j7346m4397j35279k48594l18013l20959k82705
12335C127436k27627j60049q8523m7546p4644j68389k80144l51198l61055l29413
12325A038848k74887j93784q3167L1504J10102J36611J28774J10200Q3181K9490
12315A116872o5968j94186l19147l86548l47828k00596k900J79352L39310N16367
12305F34728P23739R16550J026678J017372R05315P34240N36899L16366N4000
12296F865887k51112n46461p43519p73901o30471l66008n8212K21182M07523M56591
12286D581499L80608K45714J17512K5199j6180K440N4891Q9568P0550j2135j47404
$$ y = [6384484, 6234322, 5989796, 5760727, 5617288, 5543555, 5466222, 5330113, 5136947, 4927515, 4746075, 4615189, 4534232, 4494729, 4477383, 4432986, 4297707, 4049113, 3731100, 3410141, 3127436, 2899809, 2739760, 2651237, 2603691, 2529047, 2360658, 2080514, 1729316, 1368261, 1038848, 763961, 570177, 487010, 518514, 628616, 765227, 894001, 1004201, 1087382, 1116872, 1050904, 856718, 537571, 151023, -196805, -397401, -400301, -220949, 118361, 634728, 1358467, 2275017, 3301695, 4319067, 5224382, 5958622, 6495521, 6811887, 6865887, 6614775, 6068314, 5324795, 4550894, 3920423, 3554415, 3496203, 3717385, 4124908, 4581499, 4962107, 5207821, 5325333, 5350532, 5334352, 5336792, 5391683, 5481251, 5551801, 5539666, 5392262]
12275E392262l02347m45035n72963o94953p93766q31400p79713o33955m27365
12266h9235k32121j11952o9799m9469J7341J67206L79087N78000O86499O82039
12256A957596N99125M83404L56993K21416P6047p3745k21127l66818n23077o87858
12246A821956q13298q37954p61664o48681n36798l81154j10517K80802P06434
12237a280874J039388J191891J166809J033038Q52344O45906M21984K07420L9022
12228E316928o8084j33202j85711k29428k40000k02766j43464j05450j01204j14713
12218C792906j47593k16183l06297l76784m05485m01258l74912l25370k60092
12209I78932k05779j79999j64316j25425n1923M7128J57443K64721L69075M84683
$$ y = [5392262, 5089915, 4644880, 4071917, 3376964, 2583198, 1751798, 972085, 338130, -89235, -321356, -433308, -503107, -552576, -535235, -368029, 11058, 589058, 1275557, 1957596, 2556721, 3040125, 3397118, 3618534, 3694581, 3620836, 3399709, 3032891, 2509814, 1821956, 1008658, 170704, -590960, -1239641, -1776439, -2157593, -2268110, -1987308, -1280874, -241486, 950405, 2117214, 3150252, 4002596, 4648502, 5070486, 5277906, 5316928, 5248844, 5115642, 4929931, 4700503, 4460503, 4257737, 4114273, 4008823, 3907619, 3792906, 3645313, 3429130, 3122833, 2746049, 2340564, 1939306, 1564394, 1239024, 978932, 773153, 593154, 428838, 303413, 251490, 298618, 456061, 720782, 1089857, 1574540]
12199A574540O12457P21314P53510O62997M66131K37186M6307p8549j31437j02308
12189D762148R453J65079K92461L28641K51217P6309j61136m19194o45979p88068
12179C870931q20884p57044o13003l80500n5116L01458N56124N90874M01064J02676
12169C196580j68935l71995n62105p88691j021192j187048j238137j158930r52674
12160d253127o53752l34367n9954J59595L52647N25041O34805O46700N92844N36813
12150a852755M93484M22449K84420Q1213j47990l48491m65919m58511l16534q4452
12140b393086J40946K59773K31650Q4371j26619l41240m92654n32902m57936k85111
12130c912808m5218K01759L91054M88404M84609L86635K34805R9033L0682K0321
$$ y = [1574540, 2186997, 2908311, 3661821, 4324818, 4790949, 5028135, 5074442, 4995893, 4864456, 4762148, 4771601, 4936680, 5229141, 5557782, 5808999, 5885308, 5724172, 5304978, 4658999, 3870931, 3050047, 2293003, 1680000, 1299500, 1244384, 1545842, 2101966, 2692840, 3093904, 3196580, 3027645, 2655650, 2093545, 1304854, 283662, -903386, -2141523, -3300453, -4253127, -4906879, -5241246, -5301200, -5141605, -4788958, -4263917, -3629112, -2982412, -2389568, -1852755, -1359271, -936822, -652402, -571189, -719179, -1067670, -1533589, -1992100, -2308634, -2393086, -2252140, -1992367, -1760717, -1676346, -1802965, -2144205, -2636859, -3169761, -3627697, -3912808, -3958026, -3756267, -3365213, -2876809, -2392200, -2005565, -1770760, -1671727, -1641045, -1620724]
12120a620724J6767o062k0937J0004R8068K36111M13386O14805Q17220R95202
12110A553840J128239J204193J209719J101503Q21618L82970j00443m97334p36247
12101F068058q05847p39463o07855m89444m33291m52143n33391o35532o93483
12092F77609o62000n61115m68316m55277n30629o43783p37471p85111p75244o89736
12082e631073n26455l20775j09180J15965L91177P27762J083284J380879J550190
12073a338226J565253J458254J291329J116968R60057Q12953O45580M36945K06057
12064G155170Q559j02615j09556l2328Q1425J73740J94705J16790m4118k19843
12054G221929l36121l84415m17876m74782n38282n78798o06071o46612p02643
$$ y = [-1620724, -1603957, -1610019, -1630956, -1620952, -1522884, -1286773, -873387, -258582, 558638, 1553840, 2682079, 3886272, 5095991, 6197494, 7019112, 7402082, 7301639, 6804305, 6068058, 5262211, 4522748, 3914893, 3425449, 2992158, 2540015, 2006624, 1371092, 677609, 15609, -545506, -1013822, -1469099, -1999728, -2643511, -3380982, -4166093, -4941337, -5631073, -6157528, -6478303, -6587483, -6471518, -6080341, -5352579, -4269295, -2888416, -1338226, 227027, 1685281, 2976610, 4093578, 5053635, 5866588, 6512168, 6949113, 7155170, 7163729, 7061114, 6951558, 6919230, 7000655, 7174395, 7369100, 7485890, 7441772, 7221929, 6885808, 6501393, 6083517, 5608735, 5070453, 4491655, 3885584, 3238972, 2536329]
12045B536329p65802q30470q73506q62054p90163o74507n16827l01198k2249K95455
12035b804992N94739Q03922Q72943P95560N96631L21461M0990j73409k91367l27223
12025D29255l18462k96938k59440j66718K9308L42056O93453R23641R13592O91210
12015B980957M07815K15903J57039J56227J13076n844j54518k64678k97533k59905
12005C048539k07066k26820l83853o51940r06257r99873q60211n29344j24585
11996a841410K45934N41388P65022R01635R14205P99417O05438L86784J60748
11987C479161q8958l66452o24971p87602q02668o70081m40366k04521n7597m8201
11977f12256j59037l27902m84461n77053n84836n16195l87385k04649K7162K85153
$$ y = [2536329, 1770527, 940057, 66551, -795503, -1585666, -2260173, -2777000, -3078198, -3100447, -2804992, -2210253, -1406331, -533388, 262172, 858803, 1180264, 1221254, 1047845, 756478, 429255, 110793, -186145, -445585, -612303, -582995, -240939, 452514, 1376155, 2289747, 2980957, 3388772, 3604675, 3761714, 3917941, 4031017, 4025173, 3870655, 3605977, 3308444, 3048539, 2841473, 2614653, 2230800, 1578860, 672603, -327270, -1187481, -1716825, -1841410, -1595476, -1054088, -289066, 612569, 1526774, 2326191, 2931629, 3318413, 3479161, 3390203, 3023751, 2398780, 1611178, 808510, 138429, -301937, -506458, -564055, -612256, -771293, -1099195, -1583656, -2160709, -2745545, -3261740, -3649125, -3853774, -3826612, -3541459]
11967c541459N18433O59986O66166N56142M02377K77030K06838J72757J47315
11958F5585J23137J13022J35605J92866K63913L35051M16327N09184N77499N73469
11948C305658M97087L93603K76355J11499j05658l14236m40454m58935l95206
11939B869713k93884k03678j73384k36391l91679n92211p59644q43789q66345
11930a491292q85447r24053r35217q30876n55438j52143K42165M90446N46242
11921d495613M52493K70670K5076k81216o14393q93335j017597r13130n81765
11912h048810j14400L65048P61046J013409J089414R91281P56156M39169J00327
11903b647360j98189m07410n17513n60757n83644o02723n78373m40199j46059
$$ y = [-3541459, -3023026, -2363040, -1696874, -1140732, -738355, -461325, -254487, -81730, 65585, 188722, 301744, 437349, 630215, 894128, 1229179, 1645506, 2154690, 2732189, 3305658, 3802745, 4196348, 4472703, 4584202, 4478544, 4164308, 3723854, 3264919, 2869713, 2575829, 2372151, 2198767, 1962376, 1570697, 978486, 218842, -624947, -1491292, -2376739, -3300792, -4236009, -5066885, -5622323, -5774466, -5532301, -5041855, -4495613, -4043120, -3772450, -3747374, -4028590, -4642983, -5536318, -6553915, -7467045, -8048810, -8163210, -7798162, -7037116, -6023707, -4934293, -3943012, -3186856, -2747687, -2647360, -2845549, -3252959, -3770472, -4331229, -4914873, -5517596, -6095969, -6536168, -6682227]
11894f682227K78283P46828J151073J407536J491615J436925J306618J151660
11886B288311R89826Q04824N52884K18863j25137l57340l98717k63972n2916J07229
11876C763855J32602J2590j98867m13837n61621o23265o23652n97684n54541m72594
11866a37014l24434j10619J13493K59272K88425K67464K99079M03335N11151N66406
11856B136558N75598N65562N45401N09711M52113L60291K12774N55k55938n14545
11846D588080p29293q55497q50214p02502m54747j61218J48774M47146O87362
11837B117891Q22497Q22214O84027M41144J55885r9441k84446m20903n55775p00465
11827B982628q29982r26024r85964j006929r83497r00483p30372m65666j59449
$$ y = [-6682227, -6403944, -5657116, -4506043, -3098507, -1606892, -169967, 1136651, 2288311, 3278137, 4082961, 4635845, 4854708, 4729571, 4372231, 3973514, 3709542, 3656626, 3763855, 3896457, 3909047, 3710180, 3296343, 2734722, 2111457, 1487805, 890121, 335580, -137014, -461448, -572067, -458574, -199302, 89123, 356587, 655666, 1059001, 1570152, 2136558, 2712156, 3277718, 3823119, 4332830, 4784943, 5145234, 5358008, 5358563, 5102625, 4588080, 3858787, 3003290, 2153076, 1450574, 995827, 834609, 983383, 1430529, 2117891, 2940388, 3762602, 4446629, 4887773, 5043658, 4944217, 4659771, 4238868, 3683093, 2982628, 2152646, 1226622, 240658, -766271, -1749768, -2650251, -3380623, -3846289, -4005738]
11818d005738Q3241J69506Q0799j24606l58026n43863o46222o70527o33294n40654
11808g189384l98954k25523l2845J89259M58483P55408J001617J114923J088501
11799c238515R87446Q74078P59637O17358M15641J40280j88011n11088p67180
11790i10354r24428r71007q99067p23269m99385l01084j73389j02621j9025J59837
11780e363792M59208Q08306J077433J161390J044447Q01097N30147K85851O4893
11771H68980j51877l53508n09240o06887o45688o07109m78373k94142j13594K2888
11761b868550R4480R5353M1115l7682j18598k04894l03245l90650m24480l72463
11751d489614k26076j448K65965N29991P37273Q30603P66196N42710K19472r6208
$$ y = [-4005738, -3922497, -3752991, -3672192, -3796798, -4154824, -4698687, -5344909, -6015436, -6648730, -7189384, -7588338, -7813861, -7846706, -7657447, -7198964, -6443556, -5441939, -4327016, -3238515, -2251069, -1376991, -617354, 4, 415645, 555925, 367914, -143174, -910354, -1834782, -2805789, -3704856, -4428125, -4927510, -5228594, -5401983, -5504604, -5523629, -5363792, -4904584, -4096278, -3018845, -1857455, -813008, -11911, 518236, 804087, 868980, 717103, 363595, -145645, -752532, -1398220, -2005329, -2483702, -2777844, -2891438, -2868550, -2774070, -2678717, -2637602, -2675284, -2793882, -2998776, -3302021, -3692671, -4117151, -4489614, -4715690, -4717138, -4451173, -3921182, -3183909, -2353306, -1587110, -1044400, -824928, -921136]
11741i21136l00557l57464l02320j76674J5275K73784N50201P51501Q01399P02652
11731A036661N36256L85561K69306J56422K6952r4742j59294j46771j04339j08770
11721A797242j78949k49765k45585j66554r2835j06554k27813m20145o24977p90993
11711a306928q91544r14715q44835o70162m01488p7371K40725M87705O21136O27490
11701c129987N19412L45858J82493Q6245O5294R7188J63864K57609L63880M63250
11691e84894N52374O43358P36489Q06020Q26875Q10405P90763P69854O95606N08958
11681F555808K03971j56990m65231o19888o09121n35745n28252o23786p48420
11672B472346p98576p30080n85318m55111m27585n47881p76677r98829j109035
$$ y = [-921136, -1221693, -1579157, -1881477, -2058151, -2042876, -1769092, -1218891, -467390, 334009, 1036661, 1572917, 1958478, 2227784, 2384206, 2411158, 2316416, 2157122, 2010351, 1906012, 1797242, 1618293, 1368528, 1122943, 956389, 863554, 757000, 529187, 109042, -515935, -1306928, -2198472, -3113187, -3958022, -4628184, -5029672, -5107043, -4866318, -4378613, -3757477, -3129987, -2610575, -2264717, -2082224, -1995979, -1930685, -1833497, -1669633, -1412024, -1048144, -584894, -32520, 610838, 1347327, 2153347, 2980222, 3790627, 4581390, 5351244, 6046850, 6555808, 6759779, 6602789, 6137558, 5517670, 4908549, 4372804, 3844552, 3220766, 2472346, 1673770, 943690, 358372, -96739, -524324, -1072205, -1848882, -2847711, -3956746]
11663c956746j084347r66498q07283o43317m78151k83720m7259K00912M15217
11654g651192N65806O41814O42932N76669M66881L53054K78186K73179L20180
11645c532491L49163L05984J89030J7386j72096l06756l31943k73734k02596j54988
11635d113041j17868o8882O837J32621L29259N67769P43637P38329N33135K28476
11625a019728n3804k52248l76816m88525o49405q58519j049673j152936j140140
11616g041794j021582q21794n67575k87704m317K64137M86385O32690P12228P77756
11606f871570Q80178J017552J131914J156824J076637R43232Q22864P31613O35668
11597A524912N01139L24009J22820o9934k15846k95619l28946l57841m02865m38787
$$ y = [-3956746, -5041093, -6007591, -6814874, -7458191, -7936342, -8220062, -8267321, -8066409, -7651192, -7085386, -6443572, -5800640, -5223971, -4757090, -4404036, -4125850, -3852671, -3532491, -3183328, -2877344, -2688314, -2670928, -2843024, -3149780, -3481723, -3755457, -3958053, -4113041, -4230909, -4299791, -4292954, -4160333, -3831074, -3263305, -2519668, -1781339, -1248204, -1019728, -1073532, -1325780, -1702596, -2191121, -2840526, -3699045, -4748718, -5901654, -7041794, -8063376, -8885170, -9452745, -9740449, -9744766, -9480629, -8994244, -8361554, -7649326, -6871570, -5991392, -4973840, -3841926, -2685102, -1608465, -665233, 157631, 889244, 1524912, 2026051, 2350060, 2472880, 2402946, 2187100, 1891481, 1562535, 1204694, 801829, 363042]
11587C63042m04049k41701M2357L54271N44746M95143K04762k00784n35562o49680
11577b7455n18923k48547K1186K05108K96071L32372L49340L60017L62268L52468
11567A483905L40139L39818L39077K90985J55119n1399k52081l63660l49424k40669
11557A691810j20895p7675j48771k93682m14621m24012l10675j44797j5308M2943
11547b15683P0569J34317K55190L89464M72421M63999L59088J87340J74j69055
11537A947824l20273m56200n62914o23952o28125n62174m18326k15706p848J44824
11527a702870K18992K32626K01622J11224o1510k97216n15774o27386o06689n07663
11517c554644m01365l15349k33492j30302j4109N2741J1595j12211k24912k48594
$$ y = [363042, -41007, -282708, -240351, 113920, 658666, 1153809, 1358571, 1157787, 622225, -27455, -546378, -794925, -773739, -568631, -272560, 59812, 409152, 769169, 1131437, 1483905, 1824044, 2163862, 2502939, 2793924, 2949043, 2897644, 2645563, 2281903, 1932479, 1691810, 1570915, 1493240, 1344469, 1050787, 636166, 212154, -98521, -243318, -258626, -215683, -145114, -10797, 244393, 633857, 1106278, 1570277, 1929365, 2116705, 2116879, 1947824, 1627551, 1171351, 608437, -15515, -643640, -1205814, -1624140, -1839846, -1847694, -1702870, -1483878, -1251252, -1049630, -938406, -999916, -1297132, -1812906, -2440292, -3046981, -3554644, -3956009, -4271358, -4504850, -4635152, -4649261, -4596520, -4584925, -4697136, -4922048, -5170642]
11507e170642j65872l805J97226L92419N38227O14367O33105O32784O60986P25221
11497i45984P54712O54923M08403R6974j66751l20890l86944m26606m61035m46698
11487a239896l37090j43591O8003K18244K54055J77550N0446m4970o0575L60J10104
11476i47360K49560M18966O21633Q31387R84430J022398R38461P80045O24775
11467E524295N35050N04828M64939L44733J17484j85358m86358p06523q10852
11458E302238q21503p98085p96807q31579q62524q17307o43494l58025l1024K75216
11448c82894N37878P65413R71602J146209J250424J242945J104836Q49212N23239
11439H008864J93157q2707k72367l85315m66961n54927o41206o79244o24929m74536
$$ y = [-5170642, -5336514, -5340319, -5143093, -4750674, -4212447, -3598080, -2964975, -2332191, -1671205, -945984, -191272, 463651, 872054, 969028, 802277, 481387, 94443, -332163, -793198, -1239896, -1576986, -1720577, -1652574, -1434330, -1180275, -1002725, -952279, -997249, -1057824, -1057464, -947360, -697800, -278834, 342799, 1174186, 2158616, 3181014, 4119475, 4899520, 5524295, 6059345, 6564173, 7029112, 7373845, 7491329, 7305971, 6819613, 6113090, 5302238, 4480735, 3682650, 2885843, 2054264, 1191740, 374433, -269061, -627086, -658110, -382894, 154984, 920397, 1891999, 3038208, 4288632, 5531577, 6636413, 7485625, 8008864, 8202021, 8119314, 7846947, 7461632, 6994671, 6439744, 5798538, 5119294, 4494365, 4019829]
11429D019829k73955r2534L1864J19773K07394K89060L19324K68780J57772K7612
11419E074919r8645k09708k83384k93460k26209q3528J12546L19700M85443N53970
11409E351644M85874K91777L8905j87776l32526l86347l79114l60620l72619m16097
11399C733101m43026m07686l31792k85108k93625k97135k07158R439K98681N56892
11389B332583P03996P23238O38048M75817K58572J4494k04372l33444l42332k58896
11379D007704j38448k2907N7993O3566m8761k73680n22450o62869o18663m28444
11369A413041j97395j0657J03126J57056J68938J50430J28337J37677J79262K03488
11359B433303J59111N0958o8481j44753j51869j04089m2404o465j9809p6409j31253
$$ y = [4019829, 3745874, 3653340, 3685204, 3804977, 4012371, 4301431, 4620755, 4889535, 5047307, 5074919, 4976274, 4766566, 4483182, 4189722, 3963513, 3879985, 3992531, 4312231, 4797674, 5351644, 5837518, 6129295, 6168200, 5980424, 5647898, 5261551, 4882437, 4521817, 4149198, 3733101, 3290075, 2882389, 2550597, 2265489, 1971864, 1674729, 1467571, 1477010, 1775691, 2332583, 3036579, 3759817, 4397865, 4873682, 5132254, 5146748, 4942376, 4608932, 4266600, 4007704, 3869256, 3846349, 3904342, 3967908, 3919147, 3645467, 3123017, 2460148, 1841485, 1413041, 1215646, 1204989, 1308115, 1465171, 1634109, 1784539, 1912876, 2050553, 2229815, 2433303, 2592414, 2643372, 2574891, 2430138, 2278269, 2174180, 2131776, 2125311, 2105502, 2029093, 1897840]
11348A897840j28506n2682N4154J34399J68842J75849J69255J42142R1032L2278
11338B684603k0805r8239k62765n31016q31317j049436j095484r52608o82283
11329b839350l68505o3488K08133M21328N58194O29523O64340O86799O97760O70486
11319A265220N91192M95306M31262M06959L90442L36969K10712K0478j58993k38742
11309C750805j96213q6239J9552Q1651R5915Q3604P4723Q3968J00777R3958K9457
11298D131958j01860k76378m56400o05867o97562p19766o75285n71890m12463
11289c85513k03998J4253J64375J75237M6740j44689l11221m16839m77020n04979
11279b043654m80150l74142j85949N0055K71495M10118M40188M07778L89689M23587
$$ y = [1897840, 1769334, 1716652, 1770806, 1905205, 2074047, 2249896, 2419151, 2561293, 2652325, 2684603, 2663798, 2565559, 2302794, 1771778, 940461, -108975, -1204459, -2157067, -2839350, -3207855, -3271343, -3063210, -2641882, -2083688, -1454165, -789825, -103026, 594734, 1265220, 1856412, 2351718, 2782980, 3189939, 3580381, 3917350, 4128062, 4148540, 3989547, 3750805, 3554592, 3468353, 3487905, 3569556, 3665471, 3749075, 3823798, 3907766, 4008543, 4102501, 4131958, 4030098, 3753720, 3297320, 2691453, 1993891, 1274125, 598840, 26950, -385513, -589511, -575258, -410883, -235646, -188906, -333595, -644816, -1061655, -1538675, -2043654, -2523804, -2897946, -3083895, -3033840, -2762345, -2352227, -1912039, -1504261, -1114572, -690985]
11269f90985M82199N06498M63205L74859K84994J99601Q2229j01920l43628n68210
11259F88842o59442n43259k55111R7446M19616O47469P29677O58590N02018L55017
11249B640863K65257K31063K40724K72959K95069K90814K70853K58263K75629
11240E041494L32724L97540L82014J92245j93103o94500j175225j505179j598424
11231A179586j441381j102575o88437k95860l601J41709J50517Q6988L0502K5125
11221a917427O1586J06766J36933J42741J28420J18105J41187J98725K52409K53984
11211c76571J89222Q8522p872q1749j34094j74777k13998k32771j74468o296K18615
11200i06237L87345M15841L06317J24314n3359j59697j38300M4979L69867P38324
$$ y = [-690985, -208786, 297712, 760917, 1135776, 1420770, 1620371, 1702600, 1600680, 1257052, 688842, 29400, -513859, -768970, -671524, -251908, 395561, 1125238, 1783828, 2285846, 2640863, 2906120, 3137183, 3377907, 3650866, 3945935, 4236749, 4507602, 4765865, 5041494, 5374218, 5771758, 6153772, 6346017, 6152914, 5458414, 4283189, 2778010, 1179586, -261795, -1364370, -2052807, -2348667, -2352268, -2210559, -2060042, -1973054, -1942552, -1917427, -1855841, -1749075, -1612142, -1469401, -1340981, -1222876, -1081689, -882964, -630555, -376571, -187349, -98827, -106699, -188448, -322542, -497319, -711317, -944088, -1118556, -1124852, -906237, -518892, -103051, 203266, 327580, 274221, 114524, -23776, 21203, 391070, 1129394]
11190A129394J008045J065818Q79296N19160J39668j12990j95322j63388r8625
11181D171056o1591q8178j80305k89829l38342k79298j37619J4478J04673R4228
11171C009273r795j76907l86739o27908q71047j057581j131763j084799r48371
11162c285637p59435n54191l69787k19989q4649N9165K09765L42628M24311M32672
11152c805147L73136K71778J63760R3293R0976J42931K04796K39263K36245K11864
11142a777105J91837J90994K09084K47294L15500M15947N28396O11596O25617
11133A559160N60490M41853L16054K24047J83215J90133K18680K24229J77417
11124D095278Q6892j2094q2687j14182j27984j44007j61188j92134k81894m63659
$$ y = [1129394, 2137439, 3203257, 4082553, 4601713, 4741381, 4628391, 4433069, 4269681, 4171056, 4109465, 4021287, 3840982, 3551153, 3212811, 2933513, 2795894, 2810372, 2915045, 3009273, 2999478, 2822571, 2435832, 1807924, 936877, -120704, -1252467, -2337266, -3285637, -4045072, -4599263, -4969050, -5189039, -5273688, -5214523, -5004758, -4662130, -4237819, -3805147, -3432011, -3160233, -2996473, -2903180, -2812204, -2669273, -2464477, -2225214, -1988969, -1777105, -1585268, -1394274, -1185190, -937896, -622396, -206449, 321947, 933543, 1559160, 2119650, 2561503, 2877557, 3101604, 3284819, 3474952, 3693632, 3917861, 4095278, 4182170, 4170076, 4087389, 3973207, 3845223, 3701216, 3540028, 3347894, 3066000, 2602341]
11114B602341p05189r07141r66692q44269n70633k16436J37214M22833O07262
11105d40710P10948Q02349R39913J106440J215055J178428R56140N58514N8393
11096G085470m04981o94758p66045o72889n04936l35487k09778j50056j65306
11087C181234k54891l99163n59782p04003q22690r13106r65441r77666r55477
11078c370985q87627p47684n33761k92874r0862M1591J18412J63901J91791K12274
11068e195824K43073L12613M41414O09435P57860Q28417P96776O75476N00904
11059b9856L27398K05551J51380J57572K12643K85082L22056K88576J88327L9697
11049B148426j38339l12575m41407n00932m96611m63912m57330n14703o18380
$$ y = [2602341, 1897152, 990011, 23319, -820950, -1391583, -1608019, -1470805, -1047972, -440710, 270238, 1072587, 2012500, 3118940, 4333995, 5512423, 6468563, 7027077, 7085470, 6680489, 5985731, 5219686, 4546797, 4041861, 3706374, 3496596, 3346540, 3181234, 2926343, 2527180, 1967398, 1263395, 440705, -472401, -1437842, -2415508, -3370985, -4258612, -5006296, -5540057, -5832931, -5923793, -5882202, -5763790, -5599889, -5408098, -5195824, -4952751, -4640138, -4198724, -3589289, -2831429, -2003012, -1206236, -530760, -29856, 297542, 503093, 654473, 812045, 1024688, 1309770, 1631826, 1920402, 2108729, 2148426, 2010087, 1697512, 1256105, 755173, 258562, -205350, -662680, -1177383, -1795763]
11040a795763o83885o07867l53854J2046L59943N59431N32524K89358o2936l55958
11030b106961m50649l30195j04050Q1431J42129R2555O183n0842n3198j3548K6393
11019b760752J6332n7505j42730j52840m4453J27361K40229K07354N1970j22408
11009b637442k29574k67342k89166l25415l66270m02032m23237l97128k87828
11000e625434r3834J44675L67107N15242N51909M79973L40673J91762R0488P2938
10990b964501J30395K16795K84390L06988K88293K62559K67703L04528L36041
10981e66809L30495K90507K40755J97955J59821J16757O1960K96m1430k5390O9061
10970H33978K26047L87384M82357M91269M63281M50941M37062L51384J67034n2392
$$ y = [-1795763, -2479648, -3087515, -3441369, -3429323, -3069380, -2509949, -1977425, -1688067, -1751003, -2106961, -2557610, -2887805, -2991855, -2910424, -2768295, -2675740, -2669557, -2720399, -2773597, -2787145, -2760752, -2744420, -2801925, -2944655, -3097495, -3141948, -3014587, -2774358, -2567004, -2515034, -2637442, -2867016, -3134358, -3423524, -3748939, -4115209, -4517241, -4940478, -5337606, -5625434, -5719268, -5574593, -5207486, -4692244, -4140335, -3660362, -3319689, -3127927, -3037439, -2964501, -2834106, -2617311, -2332921, -2025933, -1737640, -1475081, -1207378, -902850, -566809, -236314, 54193, 294948, 492903, 652724, 769481, 831441, 831737, 790307, 764917, 833978, 1060025, 1447409, 1929766, 2421035, 2884316, 3335257, 3772319, 4123703, 4290737, 4238345]
10960D238345k11627k67792k65333k94719m00509n39258o27799o05024m54127
10951E72157k03765Q2143L35997N20368O25822O41117N49516L54981R7118j54867
10941C420587l29468m02330m21358m66438n77265p22428q39225q84561q39312
10932b061798p01178m97376k80958j00547K1150Q2840R3556P5509O5673R2691
10922c210438J50441J98544J94173J33643N1762j6749o0258q7090j06150j09928
$$ y = [4238345, 4026718, 3758926, 3493593, 3198874, 2798365, 2259107, 1631308, 1026284, 572157, 368392, 450535, 786532, 1306900, 1932722, 2573839, 3123355, 3478336, 3575454, 3420587, 3091119, 2688789, 2267431, 1800993, 1223728, 501300, -337925, -1222486, -2061798, -2762976, -3260352, -3541310, -3641857, -3620707, -3537867, -3444311, -3368802, -3303129, -3210438, -3059997, -2861453, -2667280, -2533637, -2481875, -2498624, -2558882, -2645972, -2752122, -2862050]
$$ [...]
##END NTUPLES=NMR SPECTRUM
##END=
