##TITLE=31P ikalashn
DE-54H
11.12.2024
##JCAMPDX= 6.0         $$ Bruker NMR JCAMP-DX V2.0
##DATA TYPE= NMR SPECTRUM
##DATA CLASS= NTUPLES
##ORIGIN= UXNMR, Bruker Analytische Messtechnik GmbH
##OWNER= root
$$ TOPSPIN		Version 1.3
$$ 2024-12-11 16:12:56.640 +0400  Irina@DPX200
$$ Compression mode = diff/dup
##.OBSERVE FREQUENCY= 81.01967998063
##.OBSERVE NUCLEUS= ^31P
##.ACQUISITION MODE= SIMULTANEOUS
##.ACQUISITION SCHEME= undefined
##.AVERAGES= 64
##.DIGITISER RES= 17
##SPECTROMETER/DATA SYSTEM= spect
##.PULSE SEQUENCE= zgpg
##.SOLVENT NAME= D2O
##.SHIFT REFERENCE= INTERNAL, D2O, 1, 298.5841
##AUDIT TRAIL= $$ (NUMBER, WHEN, WHO, WHERE, WHAT)
$$ ##TITLE= Audit trail, TOPSPIN		Version 1.3
$$ ##JCAMPDX= 5.01
$$ ##ORIGIN= Bruker BioSpin GmbH
$$ ##OWNER= Irina
$$ $$ F:/spectra/data/iren/nmr/P31dec/1/pdata/1/auditp.txt
$$ ##AUDIT TRAIL=  $$ (NUMBER, WHEN, WHO, WHERE, VERSION, WHAT)
(   1,<2024-12-11 16:11:52.531 +0400>,<Irina>,<DPX200>,<TOPSPIN 1.3>,
      <created by zg
	started at 2024-12-11 16:10:09.046 +0400,
	POWCHK disabled, PULCHK disabled
       terminated by command 'halt'
       configuration hash MD5:
       BE 6D 3F 07 2A EA 11 49 91 17 2B D3 AF B3 58 0D
       data hash MD5: 32K
       04 7E 0A 3C DA 85 28 4A D9 4C 8E 9C 8F 4F AC 78>)
(   2,<2024-12-11 16:12:08.421 +0400>,<Irina>,<DPX200>,<TOPSPIN 1.3>,
      <Start of raw data processing
       efp BC_mod = 2 LB = 15 FT_mod = 6 PKNL = 1 PHC0 = 81.6438 PHC1 = 289.3192 SI = 32K 
       data hash MD5: 32K
       C5 E2 78 98 4E 56 8F 0D FE 29 80 D4 7F 5C F9 72>)
(   3,<2024-12-11 16:12:23.156 +0400>,<Irina>,<DPX200>,<TOPSPIN 1.3>,
      <apk 
       data hash MD5: 32K
       A6 8D F4 D2 B0 11 2B A5 76 50 40 FB 12 1E 15 31>)
(   4,<2024-12-11 16:12:29.859 +0400>,<Irina>,<DPX200>,<TOPSPIN 1.3>,
      <pk fgphup PHC0 = -9.8 PHC1 = 0 
       data hash MD5: 32K
       27 7A DE 98 7A AB 76 A3 63 03 B1 DF 2F 94 AB 4B>)
(   5,<2024-12-11 16:12:46.343 +0400>,<Irina>,<DPX200>,<TOPSPIN 1.3>,
      <abs n ABSG = 5 
       data hash MD5: 32K
       73 7C DA AF CE 47 81 8A 29 FE 10 D6 A5 91 7E E7>)
$$ ##END=
$$ 
$$ $$ hash MD5
$$ $$ B1 5D A2 F1 12 BD 4D AD EE E0 06 C6 8D 13 89 8C
##$RELAX= 
##$RELAX= 
##$RELAX= 
##$RELAX= 
##$RELAX= 
##$RELAX= 
##$RELAX= 
##$RELAX= 
##$RELAX= 
##$RELAX= 
##$RELAX= 
$$ Bruker specific parameters
$$ --------------------------
##$DU= <F:/spectra>
##$EXPNO= 1
##$NAME= <P31dec>
##$PROCNO= 1
##$TYPE= <nmr>
##$USER= <iren>
##$AMP= (0..31)
100 100 100 100 100 100 100 100 100 100 100 100 100 100 100 100 100 100 
100 100 100 100 100 100 100 100 100 100 100 100 100 100 
##$ANAVPT= -1
##$AQSEQ= 0
##$AQ_mod= 1
##$AUNM= <au_zg>
##$AUTOPOS= <>
##$BF1= 81.014009
##$BF2= 200.13
##$BF3= 200.13
##$BF4= 200.13
##$BF5= 200.13
##$BF6= 200.13
##$BF7= 200.13
##$BF8= 200.13
##$BYTORDA= 1
##$CFDGTYP= 0
##$CFRGTYP= 5
##$CHEMSTR= <none>
##$CNST= (0..63)
1 1 145 1 1 1 1 1 1 1 1 1 1 1 1 1 1 1 1 1 1 1 1 1 1 1 1 1 1 1 1 1 1 1 
1 1 1 1 1 1 1 1 1 1 1 1 1 1 1 1 1 1 1 1 1 1 1 1 1 1 1 1 1 1 
$$ [...]
##$SW_h= 37037.037037037
##$TD= 32768
##$TD0= 1
##$TE= 300
##$TE2= 300
##$TE3= 300
##$TEG= 300
##$TL= (0..7)
0 120 53 12 22 120 120 120 
##$TP= (0..7)
150 150 150 150 150 150 150 150 
##$TP07= 0
##$TPNAME0= <>
##$TPNAME1= <>
##$TPNAME2= <>
##$TPNAME3= <>
##$TPNAME4= <>
##$TPNAME5= <>
##$TPNAME6= <>
##$TPNAME7= <>
##$TPOAL= (0..7)
0.5 0.5 0.5 0.5 0.5 0.5 0.5 0.5 
##$TPOFFS= (0..7)
0 0 0 0 0 0 0 0 
##$TUNHIN= 0
##$TUNHOUT= 0
##$TUNXOUT= 0
##$USERA1= <user>
##$USERA2= <user>
##$USERA3= <user>
##$USERA4= <user>
##$USERA5= <user>
##$V9= 5
##$VALIST= <valist>
##$VCLIST= <CCCCCCCCCCCCCCC>
##$VD= 0
##$VDLIST= <DDDDDDDDDDDDDDD>
##$VPLIST= <PPPPPPPPPPPPPPP>
##$VTLIST= <TTTTTTTTTTTTTTT>
##$WBST= 1024
##$WBSW= 4
##$XGAIN= (0..3)
0 0 0 0 
##$XL= 0
##$YL= 0
##$YMAX_a= 1413
##$YMIN_a= -3369
##$ZGOPTNS= <>
##$ZL1= 120
##$ZL2= 120
##$ZL3= 120
##$ZL4= 120
##$ABSF1= 298.5841
##$ABSF2= -158.5842
##$ABSG= 5
##$ABSL= 5
##$ALPHA= 0
##$AQORDER= 0
##$ASSFAC= 0
##$ASSFACI= 0
##$ASSFACX= 0
##$ASSWID= 0
##$AUNMP= <proc_1d>
##$AXLEFT= 0
##$AXRIGHT= 0
##$AXTYPE= 0
##$AXUNIT= <>
##$AZFE= 0.1
##$AZFW= 0.5
##$BCFW= 0
##$BC_mod= 2
##$BYTORDP= 0
##$COROFFS= 0
##$CY= 12.5935478210449
##$DATMOD= 1
##$DC= 0
##$DFILT= <>
##$DTYPP= 0
##$F1P= 47.1127640792319
##$F2P= -24.0371245302204
##$FCOR= 0.5
##$FTSIZE= 32768
##$FT_mod= 6
##$GAMMA= 0
##$GB= 0
##$INTBC= 1
##$INTSCL= 7.269226e-011
##$ISEN= 30
##$LB= 15
##$LEV0= 0
##$LPBIN= 0
##$MAXI= 12.09355
##$MC2= 0
##$MEAN= 0
##$ME_mod= 0
##$MI= 0.7550151
##$NCOEF= 0
##$NC_proc= -12
##$NLEV= 6
##$NOISF1= 298.5841
##$NOISF2= 270.0111
##$NSP= 0
##$NTH_PI= 0
##$NZP= 0
##$OFFSET= 298.5841
##$PC= 1.4
##$PHC0= 94.614
##$PHC1= 284.3068
##$PH_mod= 1
##$PKNL= yes
##$PPARMOD= 0
##$PPDIAG= 0
##$PPIPTYP= 0
##$PPMPNUM= 100
##$PPRESOL= 1
##$PSCAL= 0
##$PSIGN= 0
##$REVERSE= no
##$SF= 81.014009
##$SI= 32768
##$SIGF1= 270.0111
##$SIGF2= -158.5842
##$SINO= 77.54984
##$SIOLD= 32768
##$SREGLST= <31P.CDCl3>
##$SSB= 0
##$STSI= 32768
##$STSR= 0
##$SW_p= 37037.037037037
##$SYMM= 0
##$S_DEV= 0
##$TDeff= 32768
##$TDoff= 0
##$TI= <>
##$TILT= no
##$TM1= 0
##$TM2= 0
##$TOPLEV= 0
##$USERP1= <user>
##$USERP2= <user>
##$USERP3= <user>
##$USERP4= <user>
##$USERP5= <user>
##$WDW= 1
##$XDIM= 32768
##$YMAX_p= 359303637
##$YMIN_p= -11529636
$$ End of Bruker specific parameters
$$ ---------------------------------
##NTUPLES= NMR SPECTRUM
##VAR_NAME=  FREQUENCY,     SPECTRUM/REAL,   SPECTRUM/IMAG
##SYMBOL=    X,             R,               I
##VAR_TYPE=  INDEPENDENT,   DEPENDENT,       DEPENDENT
##VAR_FORM=  AFFN,          ASDF,            ASDF
##VAR_DIM=   32768,         32768,           32768
##UNITS=     HZ,            ARBITRARY UNITS, ARBITRARY UNITS
##FACTOR=    1.13031516577767, 1,            1
##FIRST=     37037.037037037, 4867257,       2165061
##LAST=      0,             -6287938,        1607634
##MIN=       0,             -11529636,       0
##MAX=       37037.037037037, 359303637,     0
$$ Real data points
##PAGE= N=1
##DATA TABLE= (X++(R..R)), XYDATA
$$ [...]
16449A917247l40728k41692j44565o1612k489L0633L8669J8365l7373j30482k50893
$$ 1917247 1576519 1334827 1190262 1128650 1126161 1156794 1195463 1213828 1176455 1045973 795080
16438G95080l80488n01291n96356o45871o29830n36573l68653j46549Q8573K82232
$$ 795080 414592 -86699 -683055 -1328926 -1958756 -2495329 -2863982 -3010531 -2921958 -2639726
16428b639726L89157L97568L33202K37568J40695N2850k2350p2668p8720l1020
$$ -2639726 -2250569 -1853001 -1519799 -1282231 -1141536 -1088686 -1111036 -1183704 -1262424 -1293444
16418a293444N7138J55240K32738K73579K82128K79857K94862L49357M48696N75643
$$ -1293444 -1236306 -1081066 -848328 -574749 -292621 -12764 282098 631455 1080151 1655794
16408A655794O95818P74124P90706P44545O44821N01295L22052J16377j02032
$$ 1655794 2351612 3125736 3916442 4660987 5305808 5807103 6129155 6245532 6143500
16399F143500l12891m89745o06378o47556o15682n28758m12303k89832j78204
$$ 6143500 5830609 5340864 4734486 4086930 3471248 2942490 2530187 2240355 2062151
16390B062151r1998n0626p5396j72334l13485m37801m79812m08237k44899m9419
$$ 2062151 1970153 1919527 1844131 1671797 1358312 920511 440699 32462 -212437 -261856
16380b61856J15977K14071K39860K12342J59330J02698N1225L003m6968r9193
$$ -261856 -145879 68192 308052 520394 679724 782422 833647 836650 789682 690489
16370F90489j46709j79388j90137j75502j34444p3047r613L1412L4678O553k3686
$$ 690489 543780 364392 174255 -1247 -135691 -208738 -218351 -186939 -152261 -145708 -169394
16359a69394j6260N5623J83420L21906M14694M24823L45565J91007j7465k58470
$$ -169394 -185654 -130031 53389 375295 789989 1214812 1560377 1751384 1733919 1475449
16349A475449n11694p56426r71931j139541j242414j265178j197445j039684q09951
$$ 1475449 963755 207329 -764602 -1904143 -3146557 -4411735 -5609180 -6648864 -7458815
16340g458815n47706l05039j24962k3081J2245L621l1940q5512j46746j98660
$$ -7458815 -8006521 -8311560 -8436522 -8459603 -8447358 -8443737 -8475677 -8561189 -8707935 -8906595
16330h906595k26276k28397k17631k09819k11716k11760j80441q5635Q5494L14886
$$ -8906595 -9132871 -9361268 -9578899 -9788718 -10000434 -10212194 -10392635 -10478270 -10392776 -10077890
16320a0077890N61724P84969R64673J108319J242124J396136J590126J822760
$$ -10077890 -9516166 -8731197 -7766524 -6658205 -5416081 -4019945 -2429819 -607059
16312f07059K062661K240647K255001K013548J506601Q42199J88708l23588o51388
$$ -607059 1455602 3696249 5951250 7964798 9471399 10313598 10502306 10178718 9527330
16303I527330q18859q71946q46973p65341o43390m99935l54430k22314j14974
$$ 9527330 8708471 7836525 6989552 6224211 5580821 5080886 4726456 4504142 4389168
16294D389168m1557o218j103l806J1640N5462J14261J63916J87236J79317J44956
$$ 4389168 4347611 4341393 4340290 4336484 4348124 4403586 4517847 4681763 4868999 5048316 5193272
16283E193272R7027N2785K6567K4386M2494O6232O9812K3385r0564k61111m47166
$$ 5193272 5290299 5343084 5369651 5394037 5436531 5502763 5572575 5595960 5505396 5244285 4797119
16272D797119n95743o70254o69137o22151n68872n35824n26696n26562n11523
$$ 4797119 4201376 3531122 2861985 2239834 1670962 1135138 608442 81880 -429643
16263d29643m58566l54991k05670l3563J29122K52734L14769K98629J97102K1254
$$ -429643 -888209 -1243200 -1448870 -1482433 -1353311 -1100577 -785808 -487179 -290077 -268823
16253b68823j97121m16027n97042p11195p41138o85684n61141l93812k08940k4637
$$ -268823 -465944 -881971 -1479013 -2190208 -2931346 -3617030 -4178171 -4571983 -4780923 -4805560
16243d805560J47560L00063M27560N25440N90258O24128O37649O45559O58638
$$ -4805560 -4658000 -4357937 -3930377 -3404937 -2814679 -2190551 -1552902 -907343 -248705
16234b48705O78880O99120P05965O87805O45784N96938N61719N43538N19208M51236
$$ -248705 430175 1129295 1835260 2523065 3168849 3765787 4327506 4871044 5390252 5841488
16224E841488L11670J00414j49692l83027n44254o01039n51344m16097k29214
$$ 5841488 6153158 6253572 6103880 5720853 5176599 4575560 4024216 3608119 3378905
16215C378905l1059J39525K58375L26700L67543M07136M55564N02890N28502N09788
$$ 3378905 3347846 3487371 3745746 4072446 4439989 4847125 5302689 5805579 6334081 6843869
16205F843869M28325K80511Q7594j07626k56687l21215k84447j61516l65J37982
$$ 6843869 7272194 7552705 7640299 7532673 7275986 6954771 6670324 6508808 6508443 6646425
16195F646425K11001K13632J71058J16412P2494M3718J7893k0292p1646j18052
$$ 6646425 6857426 7071058 7242116 7358528 7431022 7474740 7492633 7472341 7400695 7282643
16185G282643j35396j10113m8859K2020O9137O8857J5538p9660j91857k86956
$$ 7282643 7147247 7037134 6988275 7010295 7079432 7148289 7163827 7084167 6892310 6605354
16175F605354l32900l15446k46522j57370q1300l7655k6018l2145m1331n0401
$$ 6605354 6272454 5957008 5710486 5553116 5471816 5434161 5408143 5375998 5334667 5284266
16165E284266o8844j07957j68302k37629l00691l50897l93356m37470m86403n34381
$$ 5284266 5215422 5107465 4939163 4701534 4400843 4049946 3656590 3219120 2732717 2198336
16155B198336n74405o08050o46096o95823p46962p73251p48522o61968n22891
$$ 2198336 1623931 1015881 369785 -326038 -1073000 -1846251 -2594773 -3256741 -3779632
16146c779632l54172j79535j4666J31856K54377L52176M33128N06230N65202N83497
$$ -3779632 -4133804 -4313339 -4328005 -4196149 -3941772 -3589596 -3156468 -2650238 -2085036 -1501539
16136a501539N34083M18421K73912J51259Q5005Q1501J25981J96113K70453L29346
$$ -1501539 -967456 -549035 -275123 -123864 -38859 42642 168623 364736 635189 964535
16126I64535L54530L34305K72167J88692J10824N5536K1842k961l1297o8595j13373
$$ 964535 1319065 1653370 1925537 2114229 2225053 2280589 2302431 2299470 2268173 2199578 2086205
16115B086205j58866j95008k12661k07739j80897j34803p3799m821O5113J33938
$$ 2086205 1927339 1732331 1519670 1311931 1131034 996231 922432 917611 982724 1116662
16105A116662K07273K95620M04835N23294O18828O54554O13500N11423L87609
$$ 1116662 1323935 1619555 2024390 2547684 3166512 3821066 4434566 4945989 5333598
16096E333598K81822K15569J88054J82915J78543J59892J28705J03206J05112
$$ 5333598 5615420 5830989 6019043 6201958 6380501 6540393 6669098 6772304 6877416
16087F877416J45417K19599L09971L88487M20425L73926K34291J2865k56257n27334
$$ 6877416 7022833 7242432 7552403 7940890 8361315 8735241 8969532 8982397 8726140 8198806
16077H198806p54524r00662r47590r09080q30185p59895p16556o79847o14775
$$ 8198806 7444282 6543620 5596030 4686950 3856765 3096870 2380314 1700467 1085692
16068A085692n02989l58580k20836j29679j02290j28047j80728k33979k69375
$$ 1085692 582703 224123 3287 -126392 -228682 -356729 -537457 -771436 -1040811
16059a040811k75397k42492j62218l3149J31370K99718M27028M69111L99772K24029
$$ -1040811 -1316208 -1558700 -1720918 -1754067 -1622697 -1322979 -895951 -426840 -27068 196961
16049A96961j8352k63692m48184n32673n13717m17311k83353j49471l8612M5233
$$ 196961 178609 -85083 -533267 -1065940 -1579657 -1996968 -2280321 -2429792 -2468404 -2423171
16039b423171J09265J58250J89368J99538J93172J80084J68611J64062J71589
$$ -2423171 -2313906 -2155656 -1966288 -1766750 -1573578 -1393494 -1224883 -1060821 -889232
16030h89232J95139K31363K68022K91712K96816K87433K74761K74298L00029L52861
$$ -889232 -694093 -462730 -194708 97004 393820 681253 956014 1230312 1530341 1883202
16020A883202M12091M41555M06876K90449R9345j32512l50981n00401n47859m98721
$$ 1883202 2295293 2736848 3143724 3434173 3533518 3401006 3050025 2549624 2001765 1503044
16010A503044l92545k81589k05919j78596j84193j87222j47401l8844J34509L39069
$$ 1503044 1110499 828910 622991 444395 260202 72980 -74421 -113265 21244 360313
16000C60313N29586O70322P45197P57476P24559O70635O18655N84242N72381N74655
$$ 360313 889899 1560221 2305418 3062894 3787453 4458088 5076743 5660985 6233366 6808021
15990F808021N66275N09496L70763J44360j37245m18098o49173q10098r07029
$$ 6808021 7374296 7883792 8254555 8398915 8261670 7843572 7194399 6384301 5477272
15981E477272r58333r84686j000388j003398r76371r02343p80275o27728m71439
$$ 5477272 4518939 3534253 2533865 1530467 554096 -348247 -1128522 -1756250 -2227689
15972b227689l34100k26408j48909r9021p3858o7072o6342n5462k0075M5705J36360
$$ -2227689 -2561789 -2788197 -2937106 -3036127 -3109985 -3177057 -3243399 -3298861 -3318936 -3273231 -3136871
15961c136871K39023L40771M33235N13786N84277O46047O92036P04539O66363
$$ -3136871 -2897848 -2557077 -2123842 -1610056 -1025779 -379732 312304 1016843 1683206
15952A683206N77950M60860L41926K37382J54505J00714Q1388Q9977J07900J17239
$$ 1683206 2261156 2722016 3063942 3301324 3455829 3556543 3637931 3727908 3835808 3953047
15942C953047J12353R9941R0670R0384R4167Q5664M5841l1387j30599k23325k86761
$$ 3953047 4065400 4165341 4256011 4346395 4440562 4526226 4572067 4540680 4410081 4186756 3899995
15931C899995l17921l34682l63295m18671m91921n58184n97833o07521n91052
$$ 3899995 3582074 3247392 2884097 2465426 1973505 1415321 817488 209967 -381085
15922c81085n47231m70462l57920k12947m6804J19615K61125L59644M08164M03829
$$ -381085 -928316 -1398778 -1756698 -1969645 -2016449 -1896834 -1635709 -1276065 -867901 -464072
15912d64072L43519K29724P7602q5835k28612l22554l52049l19607k45349j60297
$$ -464072 -120553 109171 186773 100938 -127674 -450228 -802277 -1121884 -1367233 -1527530
15902a527530r3290n5166l3290p263K7197N3643N4824L2318N414n055Q396L5080
$$ -1527530 -1620820 -1675986 -1709276 -1716539 -1689342 -1635699 -1580875 -1548557 -1543143 -1548198 -1539802 -1504722
15890a504722N1645L4640k3715j04792j70702j89394j56006r1684k5958J9275
$$ -1504722 -1453077 -1418437 -1442152 -1546944 -1717646 -1907040 -2063046 -2154730 -2180688 -2161413
15880b161413L3419R903n9797j79559l36738n01796o39372p17076p08955o01392
$$ -2161413 -2127994 -2118091 -2177888 -2357447 -2694185 -3195981 -3835353 -4552429 -5261384 -5862776
15870e862776m00448j33746J54713M16227O13025P28044P63386P33169O55502
$$ -5862776 -6263224 -6396970 -6242257 -5826030 -5213005 -4484961 -3721575 -2988406 -2332904
15861b332904N45504M14729K76256J45158L2690n5248j11725j25739q9814q928
$$ -2332904 -1787400 -1372671 -1096415 -951257 -918567 -973815 -1085540 -1211279 -1301093 -1310021
15851a310021J00805K20296L30108M07235M29074L87927K99701J92074Q1231l9733
$$ -1310021 -1209216 -988920 -658812 -251577 177497 565424 865125 1057199 1138430 1098697
15841A098697j89132l73397n74532p56959q84039r32723r00365q01975o61545
$$ 1098697 909565 536168 -38364 -795323 -1679362 -2612085 -3512450 -4314425 -4975970
15832d975970n03466l46922k04739q6964m395L2101J5971m8014j39222k28656
$$ -4975970 -5479436 -5826358 -6031097 -6118061 -6122456 -6090355 -6074384 -6122398 -6261620 -6490276
15822f490276k97052l45335l85605m24605m57265m70001m44086l60077k09069
$$ -6490276 -6787328 -7132663 -7518268 -7942873 -8400138 -8870139 -9314225 -9674302 -9883371
15813i883371l156K28579M55904O59343Q29057R56498J030690J042964R92832
$$ -9883371 -9886527 -9657948 -9202044 -8542701 -7713644 -6757146 -5726456 -4683492 -3690660
15804c690660Q89549P51362O03232M70316L68520K98760K50658K12240J75705
$$ -3690660 -2801111 -2049749 -1446517 -976201 -607681 -308921 -58263 153977 329682
15795C29682J35800Q8798L7960k083j3138J1407N9929J09017J34604J22365P4759
$$ 329682 465482 554280 592240 590157 577019 588426 648355 757372 891976 1014341 1089100
15784A089100R502m9991q4751q6570o0291k0736J5713M0822N8078P4473Q7730
$$ 1089100 1098602 1048611 963860 877290 816999 796263 811976 852798 910876 985349 1073079
15773A073079Q4586N1682j5652j12911k27846l41784m33202m83455m84011m41467
$$ 1073079 1157665 1209347 1193695 1080784 852938 511154 77952 -405503 -889514 -1330981
15763a330981l74514l05512k54414k34940k49021k85345l28798l70705m05575
$$ -1330981 -1705495 -2011007 -2265421 -2500361 -2749382 -3034727 -3363525 -3734230 -4139805
15754d139805m20396l94356l12810j80996k3653J29419K59941L66906M58142N35795
$$ -4139805 -4560201 -4954557 -5267367 -5448363 -5472016 -5342597 -5082656 -4715750 -4257608 -3721813
15744c721813N88710O00486N66128M99438M23199L52320K86153K17227J46770
$$ -3721813 -3133103 -2532617 -1966489 -1467051 -1043852 -691532 -405379 -188152 -41382
15735d1382R0134O7038Q8358J51417K43221L45710M40827N15446N64553N89561
$$ -41382 48752 115790 204148 355565 598786 944496 1385323 1900769 2465322 3054883
15725C054883N92155N68549N10293M13545K87817J52441K3798r1442j89982k63415
$$ 3054883 3647038 4215587 4725880 5139425 5427242 5579683 5603481 5512039 5322057 5058642
15715E058642l00799l00188k76154k55308k62021l02952l60066l98557l87481
$$ 5058642 4757843 4457655 4181501 3926193 3664172 3361220 3001154 2602597 2215116
15706B215116l20270k21380j34819j00311j31513k12750l15558m17940n10049
$$ 2215116 1894846 1673466 1538647 1438336 1306823 1094073 778515 360575 -149474
15697a49474n86303o36013o43196n94954m90420l43553j77335j3998J29547K40076
$$ -149474 -735777 -1371790 -2014986 -2609940 -3100360 -3443913 -3621248 -3635246 -3505699 -3265623
15687c265623L07300L25307K92948K16047J12354J2523m7886m3033L0522J53429
$$ -3265623 -2958323 -2633016 -2340068 -2124021 -2011667 -1999144 -2047030 -2090063 -2059541 -1906112
15677a906112K96131M31768N40324O08544O32333O18527N80115N27977M65931
$$ -1906112 -1609981 -1178213 -637889 -29345 602988 1221515 1801630 2329607 2795538
15668B795538L89650K89228J57772J716j57194k89821l71035l90572l59151l01578
$$ 2795538 3185188 3474416 3632188 3633904 3476710 3186889 2815854 2425282 2066131 1764553
15658A764553k38616j75948j11035m5697J1177N0962P1421P3768N6258J5661m4620
$$ 1764553 1525937 1349989 1238954 1193257 1204434 1255396 1326817 1400585 1456843 1472504 1427884
15647A427884j12735j77612k38630l04002l78931m55664n15165n38415n19423
$$ 1427884 1315149 1137537 898907 594905 215974 -239690 -754855 -1293270 -1812693
15638a812693m70663m14403l65948l23389k71285j95588r7757Q587J16470K35187
$$ -1812693 -2283356 -2697759 -3063707 -3387096 -3658381 -3853969 -3951726 -3943139 -3826669 -3591482
15628c591482L78123N44009P11350Q47615R21578R12191Q15756O49279M43016
$$ -3591482 -3213359 -2669350 -1958000 -1110385 -188807 723384 1539140 2188419 2631435
15619B631435K25612J7459j63076k95148l63359l69191l30981k71342k04586j34602
$$ 2631435 2857047 2874506 2711430 2416282 2052923 1683732 1352751 1081409 876823 742221
15609G42221o2457M506N1053O1870L1376l2447j12105j87917k43793k70899k69545
$$ 742221 679764 684270 735323 797193 828569 796122 684017 496100 252307 -18592 -288137
15598b88137k48109k19076j93290j74873j61012j48072j37939j36765j47119j62930
$$ -288137 -536246 -755322 -948612 -1123485 -1284497 -1432569 -1570508 -1707273 -1854392 -2017322
15588b017322j72561j64807j32509p6160r512L9555M0563k0576j30501k55042
$$ -2017322 -2189883 -2354690 -2487199 -2563359 -2572871 -2533316 -2492753 -2513329 -2643830 -2898872
15578b898872l58379m20252m39971m28779m00890l70533l52609l59697l93643
$$ -2898872 -3257251 -3677503 -4117474 -4546253 -4947143 -5317676 -5670285 -6029982 -6423625
15569f423625m39796m72270m66941m11359l06643j63380M511J83664L60147N15064
$$ -6423625 -6863421 -7335691 -7802632 -8213991 -8520634 -8684014 -8679503 -8495839 -8135692 -7620628
15559g620628O23596O63252O27382N33802M23107L46108L41632M13093N21601
$$ -7620628 -6997032 -6333780 -5706398 -5172596 -4749489 -4403381 -4061749 -3648656 -3127055
15550c127055O04700O07696N07523L19770Q7254j42871l35725m68180n20202m73879
$$ -3127055 -2522355 -1914659 -1407136 -1087366 -1000112 -1142983 -1478708 -1946888 -2467090 -2940969
15540b940969l23846q8259J91767M64150O80619Q07696Q32419P62444O20742M38573
$$ -2940969 -3264815 -3353074 -3161307 -2697157 -2016538 -1208842 -376423 386021 1006763 1445336
15530A445336K50263Q7328k9342r3572j11279r5541o3437l2784j5871j3518j7245
$$ 1445336 1695599 1782927 1753585 1660013 1548734 1453193 1389756 1356972 1341101 1327583 1310338
15519A310338j9756k2744l4494o2214j07082j64872k29446k93648l47086l77431
$$ 1310338 1290582 1267838 1233344 1171130 1064048 899176 669730 376082 28996 -348435
15509c48435l75931l42263k89504k46034k44119k98373l93423m92394n56560n58449
$$ -348435 -724366 -1066629 -1356133 -1602167 -1846286 -2144659 -2538082 -3030476 -3587036 -4145485
15499d145485m85273l40628j44237P4130K80685M39340N16878M96426L87112K18228
$$ -4145485 -4630758 -4971386 -5115623 -5041493 -4760808 -4321468 -3804590 -3308164 -2921052 -2702824
15489b702824K6182j53696k90682l62624l61641k97592j94385p9701K3875J00519
$$ -2702824 -2676642 -2830338 -3121020 -3483644 -3845285 -4142877 -4337262 -4416963 -4393088 -4292569
15479d292569J40748J44948J24276R2805O0626L4906J9590J1337K947p772j9753
$$ -4292569 -4151821 -4006873 -3882597 -3789792 -3729166 -3694260 -3674670 -3663333 -3660386 -3668158 -3687911
15468c687911l9327p9315j42857k13275k64135k78008k55173k07469j46721p8830
$$ -3687911 -3727238 -3806553 -3949410 -4162685 -4426820 -4704828 -4960001 -5167470 -5314191 -5393021
15458e393021n683P2187J56878K54136L66940M83573N74384O06659N64635M54353
$$ -5393021 -5398704 -5326517 -5169639 -4915503 -4548563 -4064990 -3490606 -2883947 -2319312 -1864959
15448a864959K93313J00985j00989k85662m23472m89827m71341l68643j98015
$$ -1864959 -1571646 -1470661 -1571650 -1857312 -2280784 -2770611 -3241952 -3610595 -3808610
15439c808610Q098K07602L64643M63745N09922N17459M98724M61406M14449L73381
$$ -3808610 -3800512 -3592910 -3228267 -2764522 -2254600 -1737141 -1238417 -777011 -362562 10819
15429A0819L54424L59790L70065L53954K87716J69062J9280j23942k21521k51068
$$ 10819 365243 725033 1095098 1449052 1736768 1905830 1925110 1801168 1579647 1328579
15419A328579k15840j38320m7206L2500Q6120J12812J21636J20758J09221P9085
$$ 1328579 1112739 974419 927213 959713 1045833 1158645 1280281 1401039 1510260 1589345
15409A589345K6026m0634r7188j15061p5332J7067J27428K02324J96118R6572
$$ 1589345 1615371 1574737 1477549 1362488 1287156 1304223 1431651 1633975 1830093 1926665
15399A926665o9963k57082m23317n44395o11094o25215n99736n55232n08128m61157
$$ 1926665 1856702 1599620 1176303 631908 20814 -604401 -1204137 -1759369 -2267497 -2728654
15389b728654m06664l37372k53721j64795q5057l0055j2495l5591q4214j24913
$$ -2728654 -3135318 -3472690 -3726411 -3891206 -3976263 -4006318 -4018813 -4054404 -4138618 -4263531
15379d263531j22320o1857M0159J47035K23411K52756K42216K15402J97260J98746
$$ -4263531 -4385851 -4447708 -4407549 -4260514 -4037103 -3784347 -3542131 -3326729 -3129469 -2930723
15369b930723K12988K25967K28007K14210J81427J32220P9710M2046L0538M4180
$$ -2930723 -2717735 -2491768 -2263761 -2049551 -1868124 -1735904 -1656194 -1614148 -1583610 -1539430
15359a539430P5102J18262J73452K36229K90986L17301L02340K47989J70010R0036
$$ -1539430 -1464328 -1346066 -1172614 -936385 -645399 -328098 -25758 222231 392241 482277
15349D82277K4196k2838n3843p3183q7285j05522j34801j74275k16237k48593
$$ 482277 506473 483635 429792 356609 269324 163802 29001 -145274 -361511 -610104
15339f10104k55092k17299j23511J8256J75190L01490L60553L41850K63526J62424
$$ -610104 -865196 -1082495 -1206006 -1187750 -1012560 -711070 -350517 -8667 254859 417283
15329D17283P5428K0218j0271l5104o7548j06345j39106j51198j33011q5242k3592
$$ 417283 492711 512929 502658 467554 400006 293661 154555 3357 -129654 -214896 -238488
15318b38488K3710L1996j910n8666j12401j46054j52780j27940o6909K6264J31702
$$ -238488 -214778 -182782 -184692 -243358 -355759 -501813 -654593 -782533 -849442 -823178 -691476
15307f91476K18799K59425K39913J67848P1139j2524n2497l9869Q853O3512J01402
$$ -691476 -472677 -213252 26661 194509 265648 253124 200627 160758 169611 233123 334525
15296C34525J19867J28376J32442J30069J19241R8714O0292j1509j27193k80101
$$ 334525 454392 582768 715210 845279 964520 1063234 1123526 1112017 984824 704723
15286G04723m44961n85591o65228o55128n41086l29471n0653K45653N03739O77437
$$ 704723 259762 -325829 -991057 -1646185 -2187271 -2516742 -2567395 -2321742 -1818003 -1140566
15276a140566P41840O98310N69688L88953J90326M335j47389k54467l12569l17044
$$ -1140566 -398726 299584 869272 1258225 1448551 1452886 1305497 1051030 738461 421417
15266D21417k65190j64868l9029Q0139J65771K09821K23752K25472K24831K17936
$$ 421417 156227 -8641 -47670 32469 198240 408061 631813 857285 1082116 1300052
15256A300052J89605J22118R717j30633k64231l56399l89940l72876l32509k98823
$$ 1300052 1489657 1611775 1621492 1490859 1226628 870229 480289 107413 -225096 -523919
15246e23919k88190k98229l15270l25860l22663l03258k68345k23520j78689j40438
$$ -523919 -812109 -1110338 -1425608 -1751468 -2074131 -2377389 -2645734 -2869254 -3047943 -3188381
15236c188381j05741o5851j5988L8779Q6038J14983J24903J26531J34882J56966
$$ -3188381 -3294122 -3359973 -3375961 -3337182 -3251144 -3136161 -3011258 -2884727 -2749845 -2592879
15226b592879J82200J85308J42815N0158p4317j97522k81549k93108k16974o7142
$$ -2592879 -2410679 -2225371 -2082556 -2032398 -2106715 -2304237 -2585786 -2878894 -3095868 -3163010
15216c163010J17510K92656M28240N14646N54316N51279N08730M31665L27902
$$ -3163010 -3045500 -2752844 -2324604 -1809958 -1255642 -704363 -195633 236032 563934
15207E63934K07272Q1496l4772j25137j78067j94147j84853j63474j39381j20970
$$ 563934 771206 852702 817930 692793 514726 320579 135726 -27748 -167129 -288099
15197b88099j19589j45502j98462k62798l12622l25591k97052k41963j82105j32866
$$ -288099 -407688 -553190 -751652 -1014450 -1327072 -1652663 -1949715 -2191678 -2373783 -2506649
15187b506649r8450o8984j9750P6248K25464M02519N62560O64088O84607O26227
$$ -2506649 -2605099 -2674083 -2693833 -2617585 -2392121 -1989602 -1427042 -762954 -78347 547880
15177E47880N14515L89756K90597K38247K31638K54123K84074L03552L03000K80503
$$ 547880 1062395 1452151 1742748 1980995 2212633 2466756 2750830 3054382 3357382 3637885
15167C637885K37774J78782J11589M7766j411k7875k9081j1765O965N645l1661
$$ 3637885 3875659 4054441 4166030 4213796 4212385 4184510 4155429 4143664 4150629 4156274 4124613
15156D124613j08303k15921l40196m63428n64746o26512o44383o26955n81346
$$ 4124613 4016310 3800389 3460193 2996765 2432019 1805507 1161124 534169 -47177
15147d7177n01499l75210k02179k792J89205L40855M30327M52067M19202L58843
$$ -47177 -548676 -923886 -1126065 -1128857 -939652 -598797 -168470 283597 702799 1061642
15137A061642K99282K61069K57646K93729L58046M23351M57340M34560L44368
$$ 1061642 1360924 1621993 1879639 2173368 2531414 2954765 3412105 3846665 4191033
15128D191033J95043J1244j76769l46222m87946o02051o89084p44982p62591p37409
$$ 4191033 4386076 4397320 4220551 3874329 3386383 2784332 2095248 1350266 587675 -149734
15118a49734o74162n89169n03487m30551l70154l14231k56673j97209j38878q5462
$$ -149734 -823896 -1413065 -1916552 -2347103 -2717257 -3031488 -3288161 -3485370 -3624248 -3709710
15108c709710m0385k456L9016J00344J91191L05648M23595N19676N75115N86065
$$ -3709710 -3750095 -3752551 -3713535 -3613191 -3422000 -3116352 -2692757 -2173081 -1597966 -1011901
15098a011901N61252N11862M44930L64218K72726J73270P0463k4859r5049j22856
$$ -1011901 -450649 61213 506143 870361 1143087 1316357 1386820 1361961 1266912 1144056
15088A144056j01227l9588L6227R1937R9300M9686m1918j44043k21382k48747
$$ 1144056 1042829 1003241 1039468 1131405 1230705 1280391 1238473 1094430 873048 624301
15078F24301k23357j66911j12346q6280j00570j51546k18866k66379k53914j58764
$$ 624301 400944 234033 121687 35407 -65163 -216709 -435575 -701954 -955868 -1114632
15068a114632Q211K05247L78628M84872N04366M42155L19542J64468N535j33323
$$ -1114632 -1106421 -901174 -522546 -37674 466692 908847 1228389 1392857 1398392 1265069
15058A265069k39214l10185l46353l44443l03537k33202j54232r2267o7611q6360
$$ 1265069 1025855 715670 369317 24874 -278663 -511865 -666097 -758364 -825975 -912335
15048i12335j38702k03379k54152k70010k47553k04375j67015j52349j57505j65528
$$ -912335 -1051037 -1254416 -1508568 -1778578 -2026131 -2230506 -2397521 -2549870 -2707375 -2872903
15038b872903j61655j46116j31015j24013j18160j00840p0925m4029l9673o2106
$$ -2872903 -3034558 -3180674 -3311689 -3435702 -3553862 -3654702 -3725627 -3769656 -3809329 -3871435
15028c871435r1269r1170k9262J07342L08021N45115P84699R96050J153792J233668
$$ -3871435 -3962704 -4053874 -4083136 -3975794 -3667773 -3122658 -2337959 -1341909 -188117 1045551
15018A045551J212890J081389Q53234N64035K57469k4976k48184l90028m50975
$$ 1045551 2258441 3339830 4193064 4757099 5014568 4989592 4741408 4351380 3900405
15009C900405m54864m33364m05772l72092l20951k41117j29970J784J30248K25725
$$ 3900405 3445541 3012177 2606405 2234313 1913362 1672245 1542275 1544059 1674307 1900032
14999A900032K66552K49643J88020J01441J1008o4432j15519j47879j77721k18758
$$ 1900032 2166584 2416227 2604247 2705688 2716696 2652264 2536745 2388866 2211145 1992387
14989A992387k71010l21178l53741l62488l53828l42148l43954l72922m30922
$$ 1992387 1721377 1400199 1046458 683970 330142 -12006 -355960 -728882 -1159804
14980a159804m99566n47230n49459n01304m12515k97841j71835m5488P6176J91937
$$ -1159804 -1659370 -2206600 -2756059 -3257363 -3669878 -3967719 -4139554 -4185042 -4108866 -3916929
14970c916929K98581L87485M45887M60037M19355L21948J78510J1309j51115k81165
$$ -3916929 -3618348 -3230863 -2784976 -2324939 -1905584 -1583636 -1405126 -1393817 -1544932 -1826097
14960a826097l59557l80311l50845k87645k10991j41095r4773p8709q1165p2870
$$ -1826097 -2185654 -2565965 -2916810 -3204455 -3415446 -3556541 -3651314 -3730023 -3811188 -3884058
14950c884058k3005P9168K15070L48966M50382N07907N28401N27949N21388N13637
$$ -3884058 -3907063 -3827895 -3612825 -3263859 -2813477 -2305570 -1777169 -1249220 -727832 -214195
14940b14195M96599M55922L84494K92812K08262J60848J62114J93994K18531K00694
$$ -214195 282404 738326 1122820 1415632 1623894 1784742 1946856 2140850 2359381 2560075
14930B560075J26714P245j32324k65855l78000m68610n47745o23864o91467p28795
$$ 2560075 2686789 2694034 2561710 2295855 1917855 1449245 901500 277636 -413831 -1142626
14920a142626p11840o33963n11834l70515k21856n8644J30264L42263N58921P56469
$$ -1142626 -1854466 -2488429 -3000263 -3370778 -3592634 -3651278 -3521014 -3178751 -2619830 -1863361
14910a863361R13685J012750J042893J008691R28378Q17458O77013N01235K93959
$$ -1863361 -949676 63074 1105967 2114658 3043036 3860494 4537507 5038742 5332701
14901E332701P5757j23488k78181l75296m14770m08231l78309l52598l50172l69888
$$ 5332701 5408458 5284970 5006789 4631493 4216723 3808492 3430183 3077585 2727413 2357525
14891B357525l92532l95715l68321l14572k48704j85433j31584q4331l5867K1553
$$ 2357525 1964993 1569278 1200957 886385 637681 452248 320664 236333 200466 222019
14881B22019R3231J79663K73897L61515M23949M44947M18551L54077K73190J98824
$$ 222019 315250 494913 768810 1130325 1554274 1999221 2417772 2771849 3045039 3243863
14871C243863J42731R9849N3879p065p5461j26048j36495j09086p3258o7641j17151
$$ 3243863 3386594 3486443 3540322 3533257 3457796 3331748 3195253 3086167 3012909 2945268 2828117
14860B828117k20561l53966m85090n85994o36039o21815n43860m24791l03751
$$ 2828117 2607556 2253590 1768500 1182506 546467 -75348 -619208 -1043999 -1347750
14851a347750k15676j74945j77368k10575k59080l04821l28687l12964k44602
$$ -1347750 -1563426 -1738371 -1915739 -2126314 -2385394 -2690215 -3018902 -3331866 -3576468
14842c576468j20893M5709K29189L97311N20010N77269N65116M95851L92988K86261
$$ -3576468 -3697361 -3651652 -3422463 -3025152 -2505142 -1927873 -1362757 -866906 -473918 -187657
14832a87657K07272J80596K11047K78600L48467L87707L76603L12646K08484Q4352
$$ -187657 19615 200211 411258 689858 1038325 1426032 1802635 2115281 2323765 2408117
14822B408117l9526j44841k14750k37349k12551j56184r6119n9788n8777q3303
$$ 2408117 2368591 2223750 2009000 1771651 1559100 1402916 1306797 1247009 1188232 1104929
14812A104929j13157j34244j45324j54064j70085j98152k32260k55833k51950
$$ 1104929 991772 857528 712204 558140 388055 189903 -42357 -298190 -550140
14803e50140k15504j53501p3054K6752J47254K75546L82421M38757M35300L87432
$$ -550140 -765644 -919145 -992199 -965447 -818193 -542647 -160226 278531 713831 1101263
14793A101263L22459K63115K20401J96691J92010K05267K28283K41699K21385
$$ 1101263 1423722 1686837 1907238 2103929 2295939 2501206 2729489 2971188 3192573
14784C192573J51921L5843j08753k58886l94417m97702n52764n50482m95057m04637
$$ 3192573 3344494 3380337 3271584 3012698 2618281 2120579 1567815 1017333 522276 117639
14774A17639l03509k08883j22828l8796M3550J11687J48942J48847J19293P2434
$$ 117639 -185870 -394753 -517581 -556377 -512827 -401140 -252198 -103351 15942 88376
14764H8376J3470n9294j46124k38076l15690l58752l61185l35780l02851k73775
$$ 88376 101846 42552 -103572 -341648 -657338 -1016090 -1377275 -1713055 -2015906 -2289681
14754b289681k46257k15381j85537j69465j79222k20381k90398l77644m62892
$$ -2289681 -2535938 -2751319 -2936856 -3106321 -3285543 -3505924 -3796322 -4173966 -4636858
14745d636858n24681n43945n06722m09693k65917j02488N0592J73011K59591L14793
$$ -4636858 -5161539 -5705484 -6212206 -6621899 -6887816 -6990304 -6939712 -6766701 -6507110 -6192317
14735f192317L42179L40085L08983K62410K27095K27825K69856L35840L98259
$$ -6192317 -5850138 -5510053 -5201070 -4938660 -4711565 -4483740 -4213884 -3878044 -3479785
14726c479785M34577M33872L92804L09417J85763L8313r9026j90718k22390k06742
$$ -3479785 -3045208 -2611336 -2218532 -1909115 -1723352 -1685039 -1784065 -1974783 -2197173 -2403915
14716b403915j67339j19880o8522j3583M2308R3840J34573J58245J61555J50679
$$ -2403915 -2571254 -2691134 -2759656 -2773239 -2730931 -2637091 -2502518 -2344273 -2182718 -2032039
14706b032039J47328J82374K73855M07133N36697O08881N90375M85374L29863
$$ -2032039 -1884711 -1702337 -1428482 -1021349 -484652 124229 714604 1199978 1529841
14697A529841J68740L4718n9826j20615j63093k00692k36320k62735k68120k42050
$$ 1529841 1698581 1733299 1673473 1552858 1389765 1189073 952753 690018 421898 179848
14687A79848j83846j10166n0770l0912n3900r8277j32738j37747j16028q4425
$$ 179848 -3998 -114164 -164934 -195846 -249746 -348023 -480761 -618508 -734536 -818961
14677h18961n8674m5325m1348l7114k4058m844O188l828l5209q0979j38342k07344
$$ -818961 -877635 -922960 -964308 -1001422 -1025480 -1030324 -1024136 -1027964 -1063173 -1144152 -1282494 -1489838
14665a489838k78116l25425l20099k46962j13199N6359K27833L67225M53452M87966
$$ -1489838 -1767954 -2093379 -2413478 -2660440 -2773639 -2717280 -2489447 -2122222 -1668770 -1180804
14655a180804M88266M71783M48142M23952M07706M05288M08620L89946L13018
$$ -1180804 -692538 -220755 227387 651339 1059045 1464333 1872953 2262899 2575917
14646B575917J55183p8506l57399o38058q78609j047201j124057j103824j000948
$$ 2575917 2731100 2652594 2295195 1657137 778528 -268673 -1392730 -2496554 -3497502
14637c497502q49470o89987n51270m41269l51483k67390j78350q2416J7654J21174
$$ -3497502 -4346972 -5036959 -5588229 -6029498 -6380981 -6648371 -6826721 -6909137 -6891483 -6770309
14627f770309K28289L32874M19781M68865M63681M01918K99233J82435P8563O520
$$ -6770309 -6542020 -6209146 -5789365 -5320500 -4856819 -4454901 -4155668 -3973233 -3894670 -3888150
14617c888150k8076l4808l3841m3478o6738q6776p5080q631J12841K60306L86844
$$ -3888150 -3916226 -3951034 -3984875 -4028353 -4095091 -4181867 -4256947 -4265578 -4152737 -3892431 -3505587
14606c505587M53380M52394M09215L57995L15373K74662K20498J48320P3478K3163
$$ -3505587 -3052207 -2599813 -2190598 -1832603 -1517230 -1242568 -1022070 -873750 -800272 -777109
14596g77109J9143O7105J59259K82066M18362N44524O30961O50072N88689M58462
$$ -777109 -757966 -690861 -531602 -249536 168826 713350 1344311 1994383 2583072 3041534
14586C041534K96821J53910O9715N5276R0621J39988J73881J84018J82771J88669
$$ 3041534 3338355 3492265 3561980 3617256 3707877 3847865 4021746 4205764 4388535 4577204
14576D577204K07993K27591K25654J88278J16735K5662o2019j24642j55282j66354
$$ 4577204 4785197 5012788 5238442 5426720 5543455 5569117 5507098 5382456 5227174 5060820
14566E060820j77216j99094k34127k81435l34035l70662l61729k91589j72688
$$ 5060820 4883604 4684510 4450383 4168948 3834913 3464251 3102522 2810933 2638245
14557B638245l4499R6449K02548K70955K94542K78444K40887K01494J66006J24024
$$ 2638245 2603746 2700195 2902743 3173698 3468240 3746684 3987571 4189065 4355071 4479095
14547D479095O2544j9620j08429j79678k07267j74813q5662L7794J64536K65314
$$ 4479095 4541639 4522019 4413590 4233912 4026645 3851832 3766170 3803964 3968500 4233814
14537D233814L19441L21173K83856K34326J97271J80012J68101J34772N9650n5744
$$ 4233814 4553255 4874428 5158284 5392610 5589881 5769893 5937994 6072766 6132416 6076672
14527F076672j88765l10834m01579m51653m57989m21225l48467k56111j67489
$$ 6076672 5887907 5577073 5175494 4723841 4265852 3844627 3496160 3240049 3072560
14518C072560j05455q3640j01256j44448j93000k28902k44231k44793k44265k49787
$$ 3072560 2967105 2883465 2782209 2637761 2444761 2215859 1971628 1726835 1482570 1232783
14508A232783k53553k40777k02734j39711n6490M0856J46677K56759L66165M65709
$$ 1232783 979230 738453 535719 396008 339518 380374 527051 783810 1149975 1615684
14498A615684N41789N79277N65941M97781L81505K32838P5349o1018j49086j78192
$$ 1615684 2157473 2736750 3302691 3800472 4181977 4414815 4490164 4429146 4280060 4101868
14488D101868j59655j19976q7861q1420j02291j40988j86226k25638k39795k03904
$$ 4101868 3942213 3822237 3734376 3652956 3550665 3409677 3223451 2997813 2758018 2554114
14478B554114j02129N7712K43234M09996N15904N31459M47183K77439N5644j79058
$$ 2554114 2451985 2509697 2752931 3162927 3678831 4210290 4657473 4934912 4990556 4811498
14468D811498l94692n70243o92067p49775p36052o51962n14344l56226k15866
$$ 4811498 4416806 3846563 3154496 2404721 1668669 1016707 502363 146137 -69729
14459f9729j21971q3761q8731j11076j28476j32198j21975r7240n6804l765N2254
$$ -69729 -191700 -275461 -364192 -475268 -603744 -735942 -857917 -955157 -1011961 -1015726 -963472
14448i63472R8690J28889J50080J80801K37604L22935M23489N17896N86987O20230
$$ -963472 -864782 -735893 -585813 -405012 -167408 155527 579016 1096912 1683899 2304129
14438B304129O17797N89546N47596M93079M10392K80245J02699r1263k52482l41148
$$ 2304129 2921926 3511472 4059068 4552147 4962539 5242784 5345483 5254220 5001738 4660590
14428D660590l45914k80692j68445l0674J12844K41933L37149L83368L73748L12022
$$ 4660590 4314676 4033984 3865539 3834865 3947709 4189642 4526791 4910159 5283907 5595929
14418E595929K11980R5117j4299r7130j44685j57404j41498j08682p5687n9269
$$ 5595929 5807909 5903026 5888727 5791597 5646912 5489508 5348010 5239328 5163641 5104372
14408E104372o9944j08582j65686k24758k71322l02079l26266l57252l98871m37981
$$ 5104372 5034428 4925846 4760160 4535402 4264080 3962001 3635735 3278483 2879612 2441631
14398B441631m51985m24621l56157k63108j70402r8149m8972p595M4618J13185
$$ 2441631 1989646 1565025 1208868 945760 775358 677209 628237 620642 665260 778445
14388G78445J86132K44314K77221K91746L07882L44055M00660M55879M80789M59940
$$ 778445 964577 1208891 1486112 1777858 2085740 2429795 2830455 3286334 3767123 4227063
14378D227063L97559L06832J97746P8095l7633j27631j72364j63719j08439k5297
$$ 4227063 4624622 4931454 5129200 5207295 5169662 5042031 4869667 4705948 4597509 4572212
14368D572212O2871J36540J81750J90576J63833J13485N9767K1598N738M545N363
$$ 4572212 4635083 4771623 4953373 5143949 5307782 5421267 5481034 5502632 5508370 5512915 5518278
14357E518278J418n956j2758j8972l1418o0175j11237j81029k54910l10571l26535
$$ 5518278 5519696 5513740 5500982 5482010 5450592 5390417 5279180 5098151 4843241 4532670 4206135
14346D206135k91229k06995q9390L6204J41200K01706K03194J42184K7404j21407
$$ 4206135 3914906 3707911 3618521 3654725 3795925 3997631 4200825 4343009 4370413 4249006
14336D249006k78394m17309n16195n62453n55621n02780m11238k87416j40047
$$ 4249006 3970612 3553303 3037108 2474655 1919034 1416254 1005016 717600 577553
14327E77553J8197J70531K96705L77608M05396L92780L70143L66595L87195M07098
$$ 577553 595750 766281 1062986 1440594 1845990 2238770 2608913 2975508 3362703 3769801
14317C769801L91278L22123K09422P9519m1506j39098k12515k68190l09963l34958
$$ 3769801 4161079 4483202 4692624 4772143 4730637 4591539 4379024 4110834 3800871 3465913
14307C465913l36945l12897k68430k19686j89453j96738k45764l24484m11699
$$ 3465913 3128968 2816071 2547641 2327955 2138502 1941764 1696000 1371516 959817
14298I59817m82102n08596m70130l62526k01227j4919J62729L01402L82809M04397
$$ 959817 477715 -30881 -501011 -863537 -1064764 -1079683 -916954 -615552 -232743 171654
14288A71654L76174L17777K57731K26574K42752L02553L82849M54200M93675M88089
$$ 171654 547828 865605 1123336 1349910 1592662 1895215 2278064 2732264 3225939 3714028
14278C714028M30246L19481J69613J1995j17395j98247k34807k47419k56006k68110
$$ 3714028 4144274 4463755 4633368 4645363 4527968 4329721 4094914 3847495 3591489 3323379
14268C323379k79043k83284k86809l06309l54371m27080n06675n72317o06991
$$ 3323379 3044336 2761052 2474243 2167934 1813563 1386483 879808 307491 -299500
14259b99500n99449n45394m48792l21681j80957m4042P3533J59975K10639K29662
$$ -299500 -898949 -1444343 -1893135 -2214816 -2395773 -2439815 -2366282 -2206307 -1995668 -1766006
14249a766006K27039K13964J98576J82250J59705J26027Q4117M2288O632j7252
$$ -1766006 -1538967 -1325003 -1126427 -944177 -784472 -658445 -574328 -532040 -525408 -542660
14239e42660j6043K7071J12228K09474K72453K69987K06809J18033M6016J6389
$$ -542660 -558703 -531632 -419404 -209930 62523 332510 539319 657352 703368 719757
14229G19757K7561N9767R2558J12708J10953Q1706L0866k1472n2339n0645k0498
$$ 719757 747318 807085 899643 1012351 1123304 1205010 1235876 1214404 1162065 1111420 1090922
14218A090922K7576Q5392J47055K02059K30233K07674J23315q625j54069k77311
$$ 1090922 1118498 1203890 1350945 1553004 1783237 1990911 2114226 2105601 1951532 1674221
14208A674221l55407l80289l53448k80605j69997l4754J03333K16603K84966L07462
$$ 1674221 1318814 938525 585077 304472 134475 99721 203054 419657 704623 1012085
14198A012085K96449K62231K08912J43656Q2147M0794K5951L3875O0945J10632
$$ 1012085 1308534 1570765 1779677 1923333 2005480 2046274 2072225 2106100 2167045 2277677
14188B277677J87778K84939L73085M06452L43841J75467o4846l12628n02722n97729
$$ 2277677 2465455 2750394 3123479 3529931 3873772 4049239 3984393 3671765 3169043 2571314
14178B571314n98658n34715m43206l51897k70482j92558j04977J413J25773K59105
$$ 2571314 1972656 1437941 994735 642838 372356 179798 74821 76234 202007 461112
14168D61112L89439N02976N81242O02078N49681M28029K65337J02243k9664j22015
$$ 461112 850551 1353527 1934769 2536847 3086528 3514557 3779894 3882137 3852473 3730458
14158C730458j85313k32893k70756k99898l21782l37747l43640l28324k82400
$$ 3730458 3545145 3312252 3041496 2741598 2419816 2082069 1738429 1410105 1127705
14149A127705k10559j31950o5650j6648K4602P4260J47966K52177L72939M75332
$$ 1127705 917146 785196 719546 702898 727500 801760 949726 1201903 1574842 2050174
14139B050174N23611N08572M56210M07368L87449L95085M15084M34033M43293
$$ 2050174 2573785 3082357 3538567 3945935 4333384 4728469 5143553 5577586 6020879
14130F020879M36345M09071L60736K93156K09755J15005J4650q2874j65073k16504
$$ 6020879 6457224 6866295 7227031 7520187 7729942 7844947 7859597 7776723 7611650 7395146
14120G395146k24740j89382j26269o1760k1442k1619o7226j53586k68382l93688
$$ 7395146 7170406 6981024 6854755 6792995 6771553 6749934 6682708 6529122 6260740 5867052
14110E867052n08729n93370o33279o24257n73306m99053m29449l90234l88569
$$ 5867052 5358323 4764953 4131674 3507417 2934111 2435058 2005609 1615375 1226806
14101A226806m06300m09793l69432k75682j42692J79J21885K01719K35670K33916
$$ 1226806 820506 410713 41281 -234401 -377093 -376914 -255029 -53310 182360 416276
14091D16276K11954J84883J66888J67766J85591K05670K10645J92644J55008J03679
$$ 416276 628230 813113 980001 1147767 1333358 1539028 1749673 1942317 2097325 2201004
14081B201004M0925l0739j01293j51852j62341j25556n5374K0376P4385R0172
$$ 2201004 2241929 2211190 2109897 1958045 1795704 1670148 1614774 1635150 1709535 1799707
14071A799707O5699R946o5007j48800k31785l04120l57552l85607l79463l24983
$$ 1799707 1865406 1875352 1810345 1661545 1429760 1125640 768088 382481 3018 -321965
14061c21965k08007k7003J96524M20017N95551O90450P00413O46377N58058M58902
$$ -321965 -529972 -556975 -360451 59566 655117 1345567 2045980 2692357 3250415 3709317
14051C709317L61928K71292J85129J03775L8752Q955K5572Q3844J69314K66096
$$ 3709317 4071245 4342537 4527666 4631441 4670193 4679148 4704720 4788564 4957878 5223974
14041E223974L55779M14103M18528L63651K66315J51821L6357p4677j74386k47139
$$ 5223974 5579753 5993856 6412384 6776035 7042350 7194171 7230528 7155851 6981465 6734326
14031F734326k76607k61019k20263j86823j86722k23287k73382k99058k68532
$$ 6734326 6457719 6196700 5976437 5789614 5602892 5379605 5106223 4807165 4538633
14022D538633j74179l8385R5706J86699K15002J80731Q7838n8436k37953m08095
$$ 4538633 4364454 4326069 4421775 4608474 4823476 5004207 5092045 5033609 4795656 4387561
14012D387561n17238n30088m42791k79378q0825J05656K39843L02204K97013K40797
$$ 4387561 3870323 3340235 2897444 2618066 2537241 2642897 2882740 3184944 3481957 3722754
14002C722754J47730K7706j01447k04999k42688j93828p1198Q8937K47369L74916
$$ 3722754 3870484 3898190 3796743 3591744 3349056 3155228 3084030 3172967 3420336 3795252
13992C795252M54920M80064M47606L58357K21544N9121r8834k25222l02666l22570
$$ 3795252 4250172 4730236 5177842 5536199 5757743 5816864 5718030 5492808 5190142 4867572
13982D867572k84321j99609r5545n013N4019Q8140J13808J38670J62708J89570
$$ 4867572 4583251 4383642 4288097 4283084 4337103 4425243 4539051 4677721 4840429 5029999
13972E029999K27591K84968L69081M83035O16571P43080Q29301Q50636Q02832
$$ 5029999 5257590 5542558 5911639 6394674 7011245 7754325 8583626 9434262 10237094
13963A0237094P04151N86226M77624L89647L15040K41074J65196R9188N8052M2905
$$ 10237094 10941245 11527471 12005095 12394742 12709782 12950856 13116052 13215240 13273292 13316197
13953A3316197L3023m124r1582k27739l87764n36621o42348o84477o59708n83843
$$ 13316197 13349220 13345096 13253514 13025775 12638011 12101390 11459042 10774565 10114857 9531014
13943I531014m84702l88143l08586k51426k22079k28346k71388l37576m04480
$$ 9531014 9046312 8658169 8349583 8098157 7876078 7647732 7376344 7038768 6634288
13934F634288m56284m92378n22891n58000n97848o26745o16756n42482l98812
$$ 6634288 6178004 5685626 5162735 4604735 4006887 3380142 2763386 2220904 1822092
13925A822092k07978p777J71363L19586M39296N28296N76403N78198N42526M85958
$$ 1822092 1614114 1606337 1777700 2097286 2536582 3064878 3641281 4219479 4762005 5247963
13915E247963M21560L56374K93770K33643J73514J13460O0044K4801J8535M4152
$$ 5247963 5669523 6025897 6319667 6553310 6726824 6840284 6900328 6925129 6943664 6987816
13905F987816R2223J44187J81032J89790J64303J02376M513j21756k56246l70709
$$ 6987816 7080039 7224226 7405258 7595048 7759351 7861727 7866240 7744484 7488238 7117529
13895G117529m43280m67533m49407m00429l33551k58567j77457q8104L896Q0664
$$ 7117529 6674249 6206716 5757309 5356880 5023329 4764762 4587305 4499201 4503097 4583761
13885D583761J20718J09334M4369n8790j65919k34772k35620j66018m8998Q0450
$$ 4583761 4704479 4813813 4858182 4799392 4633473 4398701 4163081 3997063 3948065 4028515
13875D028515J88428K48952K48205J89302R3662o122p9941j11652j00221n1730
$$ 4028515 4216943 4465895 4714100 4903402 4997064 4990942 4911001 4799349 4699128 4647398
13865D647398K5722J16843J94694K31284K16200J61626Q7082M086q0735j53910
$$ 4647398 4673120 4789963 4984657 5215941 5432141 5593767 5680849 5684935 5604200 5450290
13855E450290j94911j88353j34691m9751M6335J41813K35996L28076M02841M31532
$$ 5450290 5255379 5067026 4932335 4882584 4928919 5070732 5306728 5634804 6037645 6469177
13845F469177L92012K87731J45176m244j37440k38280k90869k81641k10202r4477
$$ 6469177 6861189 7148920 7294096 7289852 7152412 6914132 6623263 6341622 6131420 6036943
13835F036943L9830J75069L02879M10672M75897M80293M27477L42085K52198J74604
$$ 6036943 6076773 6251842 6554721 6965393 7441290 7921583 8349060 8691145 8943343 9117947
13825I117947J14489P4062N9533Q0578J43687K46282L76119N14302O39662P33953
$$ 9117947 9232436 9306498 9366031 9446609 9590296 9836578 10212697 10726999 11366661 12100614
13815A2100614P85370P88623P44669O61812N54682M38926L25698K21434J31901
$$ 12100614 12885984 13674607 14419276 15081088 15635770 16074696 16400394 16621828 16753729
13806A6753729O4017K1975J056j1915k6966l8792k9198J7231J00103K03621L06739
$$ 16753729 16817746 16839721 16840777 16828862 16801896 16763104 16733906 16751137 16851240 17054861 17361600
13795A7361600L93136M54307M84407M73404M10127K95786J52135J3301r0388j43088
$$ 17361600 17754736 18209043 18693450 19166854 19576981 19872767 20024902 20038203 19947815 19804727
13785A9804727j45844j13547o7591k6851j087J1315K1902M7424J01213J83149
$$ 19804727 19658883 19545336 19477745 19450894 19449807 19461122 19483024 19530448 19631661 19814810
13775A9814810K76298L56006M04236M16644M00113L66344L26074K86153K51143
$$ 19814810 20091108 20447114 20851350 21267994 21668107 22034451 22360525 22646678 22897821
13766B2897821K29339K36255K86501L79471M95614O07227O92020P40954P59128
$$ 22897821 23127160 23363415 23649916 24029387 24525001 25132228 25824248 26565202 27324330
13757B7324330P60605P61112P71689P94106Q21027Q42039Q50877Q48135Q38408
$$ 27324330 28084935 28846047 29617736 30411842 31232869 32074908 32925785 33773920 34612328
13748C4612328Q25351Q10234P95433P87966P98708Q37231R05918R98870J106016
$$ 34612328 35437679 36247913 37043346 37831312 38630020 39467251 40373169 41372039 42478055
13739D2478055J215117J310859J379089J415143J426391J426705J429213J441610
$$ 42478055 43693172 45004031 46383120 47798263 49224654 50651359 52080572 53522182
13731E3522182J464612J493176J518517J529572J515496J472777J415200J376712
$$ 53522182 54986794 56479970 57998487 59528059 61043555 62516332 63931532 65308244
13723F5308244J400201J516428J723352J977793K210653K362271K413745K391884
$$ 65308244 66708445 68224873 69948225 71926018 74136671 76498942 78912687 81304571
13715H1304571K350618K346893K420239K576899K786327K997654L167576L282014
$$ 81304571 83655189 86002082 88422321 90999220 93785547 96783201 99950777 103232791
13707A03232791L359575L435418L537573L674809L841614M027569M221062M411987
$$ 103232791 106592366 110027784 113565357 117240166 121081780 125109349 129330411 133742398
13699A33742398M598782M793911N019912N296466N625053N980642O318136O591481
$$ 133742398 138341180 143135091 148155003 153451469 159076522 165057164 171375300 177966781
13691A77966781O775040O876353O933999P001052P121108P309252P548968P804510
$$ 177966781 184741821 191618174 198552173 205553225 212674333 219983585 227532553 235337063
13683B35337063Q038567Q225090Q352060Q417767Q428237Q393311Q315101Q179222
$$ 235337063 243375630 251600720 259952780 268370547 276798784 285192095 293507196 301686418
13675C01686418P963878P657140P260110O775783O202214N539477M799591M003452
$$ 301686418 309650296 317307436 324567546 331343329 337545543 343085020 347884611 351888063
13667C51888063L167769K301240J415208N31357l27547j153860j958969k760783
$$ 351888063 355055832 357357072 358772280 359303637 358976090 357822230 355863261 353102478
13659C53102478l567368m369474n143069n857367o483831p002965p407525p701103
$$ 353102478 349535110 345165636 340022567 334165200 327681369 320678404 313270879 305569776
13651C05569776p893736q000761q046422q064006q084975q123433q169173q193794
$$ 305569776 297676040 289675279 281628857 273564851 265479876 257356443 249187270 240993476
13643B40993476q165882q067575p900207p673807p394351p064361o692091o295181
$$ 240993476 232827594 224760019 216859812 209186005 201791654 194727293 188035202 181740021
13635A81740021n897261n524576n202747m949424m766105m636187m532138m429203
$$ 181740021 175842760 170318184 165115437 160166013 155399908 150763721 146231583 141802380
13627A41802380m315391m188228m044047l873591l667931l430295l185455k976290
$$ 141802380 137486989 133298761 129254714 125381123 121713192 118282897 115097442 112121152
13619A12121152k843854k801838k822631k847169k818332k717598k574730k443573
$$ 112121152 109277298 106475460 103652829 100805660 97987328 95269730 92695000 90251427
13611I0251427k368482k367129k432200k539379k652387k727302k722890k615561
$$ 90251427 87882945 85515816 83083616 80544237 77891850 75164548 72441658 69826097
13603F9826097k409288k133748j831169j539616j284508j081106r37147q48567
$$ 69826097 67416809 65283061 63451892 61912276 60627768 59546662 58609515 57760948
13595E7760948p95543p48065o81442n93680n10511m69447m93318n75158o83994
$$ 57760948 56965405 56217340 55535898 54942218 54431707 53962260 53468942 52893784 52209790
13586E2209790p83149q48497q78231q89072r01813r27031r58681r76981r60796
$$ 52209790 51426641 50578144 49699913 48810841 47909028 46981997 46023316 45046335 44085539
13577D4085539r04266q24850p56273p31826p67736q55371r65515j061135j111895
$$ 44085539 43181273 42356423 41600150 40868324 40100588 39245217 38279702 37218567 36106672
13568C6106672j102437j031124r05630p43034n72144m28060l37220l05196l17343
$$ 36106672 35004235 33973111 33067481 32324447 31752303 31324243 30987023 30681827 30364484
13559C0364484l49392l80782m04546m28150m64937n24357o07179p03775p93679
$$ 30364484 30015092 29634310 29229764 28801614 28336677 27812320 27205141 26501366 25707687
13550B5707687q50803q56254q10867p35467o56493n88680n30042m72289m13199
$$ 25707687 24856884 24000630 23189763 22454296 21797803 21209123 20679081 20206792 19793593
13541A9793593l57773l10917k70617k24706j53101l8639J17390K88592M35565
$$ 19793593 19435820 19124903 18854286 18629580 18476479 18437840 18555230 18843822 19279387
13532A9279387N27032N50724N08832M08423K56912O4692j49043l54660n19443
$$ 19279387 19806419 20357143 20865975 21274398 21531310 21596002 21446959 21092299 20572856
13523B0572856o21340o60245o57888o44332o38686o37272o18471n60628m57578
$$ 20572856 19951516 19291271 18633383 17989051 17350365 16713093 16094622 15533994 15076416
13514A5076416l20509j69992k8968Q1343J46260J62079J38338R6423O0503M3553
$$ 15076416 14755907 14585915 14556947 14638290 14784550 14946629 15084967 15181390 15241893 15285446
13504A5285446L8828K3519k6058j15762k26925l30392m08686m64079n06454n38724
$$ 15285446 15324274 15347793 15321735 15205973 14979048 14648656 14239970 13775891 13269437 12730713
13494A2730713n55835n51126n18499m50785l39121j77523K5730K40023M19913
$$ 12730713 12174878 11623752 11105253 10654468 10315347 10137824 10163554 10403577 10823490
13485A0823490N24675N35059M57105L14632J38550m1625k02098l24255l93268
$$ 10823490 11348165 11883224 12340329 12654961 12793511 12751886 12549788 12225533 11832265
13476A1832265m02013l56607k73320j68056n0635P0733J82235K63179K92996K62584
$$ 11832265 11430252 11073645 10800325 10632269 10581634 10652367 10834602 11097781 11390777 11653361
13466A1653361J79760O2155p3299k12159l37574m30201m77566m83923m68565m53005
$$ 11653361 11833121 11895276 11821977 11609818 11272244 10842043 10364477 9880554 9411989 8958984
13456H958984m49158m56504m66975m71848m64067m34801l71613k64150j12593
$$ 8958984 8509826 8053322 7586347 7114499 6650432 6215631 5844018 5579868 5467275
13447E467275O9930K61727M38324N77076O61804O87563O62758O04507N28586M42417
$$ 5467275 5537205 5798932 6237256 6814332 7476136 8163699 8826457 9430964 9959550 10401967
13437A0401967L46815K42673J33877K2574r5222k23821l55964m68070n27930n08055
$$ 10401967 10748782 10991455 11125332 11147906 11052684 10828863 10472899 10004829 9476899 8968844
13427H968844l95951j99056N3193L11299N16682O20550O00851M70204K71030N5690
$$ 8968844 8572893 8373837 8427030 8738329 9255011 9875561 10476412 10946616 11217646 11273336
13417A1273336j38268k96868m17397m94685n22815n05214m57050l95848l30278
$$ 11273336 11135068 10838200 10420803 9926118 9403303 8898089 8441039 8045191 7714913
13408G714913k58290j75533q4009P415Q8424J50215J84007J81659J40827O9250
$$ 7714913 7456623 7281090 7197081 7204496 7292920 7443135 7627142 7808801 7949628 8018878
13398H018878j4710q6121j23562j20315q6210l7085J6723O9980J14926J40460
$$ 8018878 8004168 7918047 7794485 7674170 7587960 7550875 7567598 7637578 7752504 7892964
13388G892964J40461J21221J00602R9477J28905J79234K19963K14190J41443J2248
$$ 7892964 8033425 8154646 8255248 8354725 8483630 8662864 8882827 9097017 9238460 9250708
13378I250708j39310k77389l80242m40101m52885m11565l13244j73031k5677R0945
$$ 9250708 9111398 8834009 8453767 8013666 7560781 7149216 6835972 6662941 6637264 6728209
13368F728209J54055J60731J22311N7937j1188p0552j19185j63421k02124k23063
$$ 6728209 6882264 7042995 7165306 7223243 7212055 7141503 7022318 6858897 6656773 6433710
13358F433710k15033j79152j27808p4942k7173J6599N8157R3921J14415J09472
$$ 6433710 6218677 6039525 5911717 5836775 5809602 5826201 5884358 5978279 6092694 6202166
13348F202166P9050M2259L1277O9798J55827K66069L74837M65273N23745N31725
$$ 6202166 6281216 6323475 6354752 6424550 6580377 6846446 7221283 7686556 8210301 8742026
13338H742026M70871L37975J54428l9254j99914k97081l19272k73057j78941o5031
$$ 8742026 9212897 9550872 9705300 9666046 9466132 9169051 8849779 8576722 8397781 8332750
13328H332750M0756J17388J54549J53793J25496Q0410K1224n7896j63114k89725
$$ 8332750 8373506 8490894 8645443 8799236 8924732 9005142 9026366 8968470 8805356 8515631
13318H515631m17131n15826n60819n40756m60340l39181k05735q6560R6M1901
$$ 8515631 8098500 7582674 7021855 6481099 6020759 5681578 5475843 5389283 5389379 5431280
13308E431280L1282k7373j13209j99536k70833l25995l64087l71558l28413k26760
$$ 5431280 5462562 5435189 5321980 5122444 4851611 4525616 4161529 3789971 3461558 3234798
13298C234798q3978N7541J45276J42424M9191r7024k40071l25651l15473j96713
$$ 3234798 3150820 3208361 3353637 3496061 3545252 3448228 3208157 2882506 2567033 2370320
13288B370320J1201K55943M64352N69379N41164M02497K16818N6374k8160j9867
$$ 2370320 2381521 2637464 3101816 3671195 4212359 4614856 4831674 4888048 4859888 4840021
13278D840021O6759J91156K95061L19376K27235K1771k54461n40314p82149r47618
$$ 4840021 4906780 5097936 5392997 5712373 5939608 5961379 5706918 5166604 4384455 3436837
13268C436837j023431j007070r03987p32339n25854l25425j62527m7226K9259
$$ 3436837 2413406 1406336 502349 -229990 -755844 -1081269 -1243796 -1291022 -1261763
13259a261763Q0607J15614J41564J68511K03561K45667K90361L35365L79909M24147
$$ -1261763 -1181156 -1065542 -923978 -755467 -551906 -306239 -15878 319487 699396 1123543
13249A123543M71661N29006N99929O78818P49097P87828P73909O98292N72306
$$ 1123543 1595204 2124210 2724139 3402957 4152054 4939882 5713791 6412083 6984389
13240F984389M25672K90692J83307R7519J7440o7758j61421k64566l75075m83263
$$ 6984389 7410061 7700753 7884060 7981579 7999019 7931261 7769840 7505274 7130199 6646936
13230F646936n73456o29779o41088o05837n34729m46856l61910k93216k43213
$$ 6646936 6073480 5443701 4802613 4196776 3662047 3215191 2853281 2560065 2316852
13221B316852k04175j66737j31345j10849j19070j56748k08574k51212k64188
$$ 2316852 2112677 1945940 1814595 1703746 1584676 1427928 1219354 968142 703954
13212G03954k37846j75754r1685l475P4789J39656J98157K58783L22282L81311
$$ 703954 466108 290354 198669 195194 269983 409639 607796 866579 1188861 1570172
13202A570172M26549M49979M43397L99313L16082J99368N8504r3733k39600l61865
$$ 1570172 1996721 2446700 2890097 3289410 3605492 3804860 3863364 3769631 3530031 3168166
13192C168166m50768n02543n14538m86118m22820l35795k36562j33915l8344L1657
$$ 3168166 2717398 2214855 1700317 1214199 791379 455584 219022 85107 46763 78420
13182G8420N4487K1808n0204j26998j75020j78628j42175p9278j126Q6886J80436
$$ 78420 132907 154715 104511 -22487 -197507 -376135 -518310 -597588 -598714 -511828 -331392
13171c31392K72251L53358M15713M54462M69032M59102M19131L41253K25746Q6810
$$ -331392 -59141 294217 709930 1164392 1633424 2092526 2511657 2852910 3078656 3165466
13161C165466n4466j82336k89754l73986m36345m85310n31703n77712o12664o18137
$$ 3165466 3111000 2928664 2638910 2264924 1828579 1343269 811566 233854 -378810 -996947
13151i96947n75544m72041l04860q4390J64806M06952O03093P22267P51833P03337
$$ -996947 -1572491 -2044532 -2349392 -2433782 -2268976 -1862024 -1258931 -536664 215169 918506
13141I18506O09199N08533M29000L75750L33650K80231J99556Q8222m6014j86852
$$ 918506 1527705 2036238 2465238 2840988 3174638 3454869 3654425 3742647 3696633 3509781
13131C509781l11659l96268m22562l86092k99387j85440o4326N4468J68816K76598
$$ 3509781 3198122 2801854 2379292 1993200 1693813 1508373 1444047 1498515 1667331 1943929
13121A943929L71497M43735M83178M82224M39417L63386K71754J82902J08092
$$ 1943929 2315426 2759161 3242339 3724563 4163980 4527366 4799120 4982022 5090114
13112E090114M9845K475m7810j18645k22030l53848m86866n76455n84138n04207
$$ 5090114 5139959 5142434 5094624 4975979 4753949 4400101 3913235 3336780 2752642 2248435
13102B248435l70105k35626j45161j10950j09880j01536n5536L0877J36393K32734
$$ 2248435 1878330 1642704 1497543 1386593 1276713 1175177 1119641 1150518 1286911 1519645
13092A519645K97200L15724K85667K20066J44430Q4840N7354O3986R2202J19336
$$ 1519645 1816845 2132569 2418236 2638302 2782732 2867572 2924926 2988912 3081114 3200450
13082C200450J24725J02679O4098K4369r379l8836o7733r7195j21915j27322r6409
$$ 3200450 3325175 3427854 3491952 3516321 3506942 3468106 3400373 3303178 3181263 3053941 2957532
13071B957532k5981O3062J35188J64353J51212J15840P4676K7895l3276j13815
$$ 2957532 2931551 2994613 3129801 3294154 3445366 3561206 3635882 3663777 3630501 3516686
13061C516686k09126l04136l73257l86536l25437j96495k9101J39672K79243L70999
$$ 3516686 3307560 3003424 2630167 2243631 1918194 1721699 1692598 1832270 2111513 2482512
13051B482512M08732L98302L52568K79268J74089L0191j46417l32420m94147n98254
$$ 2482512 2891244 3289546 3642114 3921382 4095471 4125662 3979245 3646825 3152678 2554424
13041B554424o22517n65486m50348l15629j94664j00680k9431K8456P9111J25062
$$ 2554424 1931907 1366421 916073 600444 405780 305100 275669 304125 383236 508298
13031E08298J68439K11649K54232K91328L16468L22855L01129K41063J39426N342
$$ 508298 676737 888386 1142618 1433946 1750414 2073269 2374398 2615461 2754887 2760229
13021B760229j41586k75954l71657m09800l88411l28344k68408k47150k80446
$$ 2760229 2618643 2342689 1971032 1561232 1172821 844477 576069 328919 48473
13012D8473l52748m29447m78762m86789m58336m06519l41618k68278j89795j12067
$$ 48473 -304275 -733722 -1212484 -1699273 -2157609 -2564128 -2905746 -3174024 -3363819 -3475886
13002c475886m2499J5139O3950J09578J51419J80406J87315J72816J49930J38244
$$ -3475886 -3518385 -3503246 -3439296 -3329718 -3178299 -2997893 -2810578 -2637762 -2487832 -2349588
12992b349588J53596J97020K50281K84834K79117K29461J46967M6633o0097j65774
$$ -2349588 -2195992 -1998972 -1748691 -1463857 -1184740 -955279 -808312 -761679 -821776 -987550
12982i87550k64687l51422m19704m62415m75498m63710m40413m18758m02742l87444
$$ -987550 -1252237 -1603659 -2023363 -2485778 -2961276 -3424986 -3865399 -4284157 -4686899 -5074343
12972e074343l66218l34178k86103k18685j39361o9024k9733k6642m1652m6043
$$ -5074343 -5440561 -5774739 -6060842 -6279527 -6418888 -6487912 -6517645 -6544287 -6585939 -6631982
12962f631982k2848J9072N1613M8810M073o7967j39994j81657j67547q4598O2158
$$ -6631982 -6654830 -6635758 -6584145 -6535335 -6531262 -6599229 -6739223 -6920880 -7088427 -7173025 -7110867
12951g110867K48642M38257N93718O86760P02057O39437N16697L66563K23032
$$ -7110867 -6862225 -6423968 -5830250 -5143490 -4441433 -3801996 -3285299 -2918736 -2695704
12942b695704J05833J6323n3448j07822j41130j42072j03970l0894O4361J66150
$$ -2695704 -2589871 -2573548 -2626996 -2734818 -2875948 -3018020 -3121990 -3152884 -3088523 -2922373
12932b922373K61210L40833L98333M25670M15671L68230K92505K02709J12373
$$ -2922373 -2661163 -2320330 -1921997 -1496327 -1080656 -712426 -419921 -217212 -104839
12923a04839L1507l3744q0776j09868j23689j26695j22976j12728r0695n0240
$$ -104839 -73332 -107076 -187852 -297720 -421409 -548104 -671080 -783808 -874503 -924743
12913i24743R605Q0669J47875J94850K09647J88504J37769P2698J0302m1537q9790
$$ -924743 -915138 -834469 -686594 -491744 -282097 -93593 44176 116874 127176 85639 -4151
12902d151j48983k26690l17617m10073m92238n51126n71266n39317m50189l10469
$$ -4151 -153134 -379824 -697441 -1107514 -1599752 -2150878 -2722144 -3261461 -3711650 -4022119
12892d022119j41245K2216J42463K00686K07936J94841J90234K08636K52278L17396
$$ -4022119 -4163364 -4141148 -3998685 -3797999 -3590063 -3395222 -3204988 -2996352 -2744074 -2426678
12882b426678L95119M69623N22386N43382N38560N23937N12941N10423N15177
$$ -2426678 -2031559 -1561936 -1039550 -496168 42392 566329 1079270 1589693 2104870
12873B104870N24758N39672N64156O00608O42380O73298O75508O39330N67809
$$ 2104870 2629628 3169300 3733456 4334064 4976444 5649742 6325250 6964580 7532389
12864G532389M73249L69075K65179J70386R4317M3312J5684P58j8173n6986j22905
$$ 7532389 8005638 8374713 8639892 8810278 8904595 8947907 8963591 8964349 8946176 8889190 8766285
12853H766285k12232l15062m20879n19294n97166o37973o26505n55603m29782
$$ 8766285 8554053 8238991 7818112 7298818 6701652 6063679 5437174 4881571 4451789
12844D451789k64126p9119J06879K81863M35832N54328O21733O30749N85230M97102
$$ 4451789 4187663 4108544 4215423 4497286 4933118 5487446 6109179 6739928 7325158 7822260
12834G822260L84276K67678J65890R1835N2421M7672O6796Q5838P6771K5571n7947
$$ 7822260 8206536 8474214 8640104 8731939 8784360 8832032 8898828 8984666 9061437 9087008 9029061
12823I029061j47685k18234k58883k76712k87325l00667l13891l16555l01341
$$ 9029061 8881376 8663142 8404259 8127547 7840222 7539555 7225664 6909109 6607768
12814F607768k68773k22910j65804r6372j2008Q7298J91154K73548K99558K43976
$$ 6607768 6338995 6116085 5950281 5853909 5841901 5929199 6120353 6393901 6693459 6937435
12804F937435J09181p1508k48822l82041m58441m96458n30927n88581o67476p33920
$$ 6937435 7046616 6975108 6726286 6344245 5885804 5389346 4858419 4269838 3602362 2868442
12794B868442p41162o58960m93645k81902o4359J33960L01796M30572N10219N34372
$$ 2868442 2127280 1468320 974675 692773 628414 762374 1064170 1494742 2004961 2539333
12784B539333N06189M37602L44636K44681J55900R4634O9128P3842R0747R8645
$$ 2539333 3045522 3483124 3827760 4072441 4228341 4322975 4392103 4465945 4556692 4655337
12774D655337Q4856M9950K071n0900j02893j46234j67959j50611q2044L1617J65632
$$ 4655337 4740193 4790143 4792214 4741314 4638421 4492187 4324228 4173617 4091573 4123190 4288822
12763D288822K92421L97184M78059N34907N61210N46691M86678L86788K58034
$$ 4288822 4581243 4978427 5456486 5991393 6552603 7099294 7585972 7972760 8230794
12754H230794J11470m0246j82664l06585m11826m98981n57526n65898n06734l81858
$$ 8230794 8342264 8302018 8119354 7812769 7400943 6901962 6344436 5778538 5271804 4889946
12744D889946k11715k4320J53010K96912L90314M24996M02987L35168K37303J25715
$$ 4889946 4678231 4653911 4806921 5103833 5494147 5919143 6322130 6657298 6894601 7020316
12734G020316J3935r0231j85601k73356l49576m03279m23333m05774l53727k73555
$$ 7020316 7034251 6944020 6758419 6485063 6135487 5732208 5308875 4903101 4549374 4275819
12724D275819j74244o8051L3097J22863K00166K63266L05394L16629K89548K24397
$$ 4275819 4101575 4033524 4066621 4189484 4389650 4652916 4958310 5274939 5564487 5788884
12714E788884J31936L0802o2250j40233k03042k50159k80466k96695l03369k98684
$$ 5788884 5920820 5951622 5889372 5749139 5546097 5295938 5015472 4718777 4415408 4116724
12704D116724k72663k17015j37582n7108k692J4580R407J1823M6883J19315K10813
$$ 4116724 3844061 3627046 3489464 3432356 3429664 3444244 3453651 3465474 3512357 3631672 3842485
12693C842485K89574L24041K93551J96108N2189j01323k27437l04967l32220l18856
$$ 3842485 4132059 4456100 4749651 4945759 4997948 4896625 4669188 4364221 4032001 3713145
12683C713145k77059k19522j59847j08460o8272l7632j6474p505j3310l3080o0355
$$ 3713145 3436086 3216564 3056717 2948257 2879985 2842353 2825879 2818374 2805064 2771984 2711629
12672B711629q5716j04861j22353j44723j70815j89855j87708j54681q9711j873
$$ 2711629 2625913 2521052 2398699 2253976 2083161 1893306 1705598 1550917 1461206 1459333
12662A459333Q8723J56231J83844J76143J54994J42194J42710J39087J01174P581
$$ 1459333 1548056 1704287 1888131 2064274 2219268 2361462 2504172 2643259 2744433 2752014
12652B752014j36847l01864m46876n37118n54547n03536m10434l13929k48358
$$ 2752014 2615167 2313303 1866427 1329309 774762 271226 -139208 -453137 -701495
12643g01495k28291k43367k68318k81003k73789k53521k34165k24729k18187j90976
$$ -701495 -929786 -1173153 -1441471 -1722474 -1996263 -2249784 -2483949 -2708678 -2926865 -3117841
12633c117841j15081K5604K25524M58294O83382Q54088R26741Q72871O94846M36817
$$ -3117841 -3232922 -3207318 -2981794 -2523500 -1840118 -986030 -59289 813582 1508428 1945245
12623A945245J75406j2406q3513m0798Q0039K32213L74073M77843N32513N39991
$$ 1945245 2120651 2108245 2024732 1983934 2063973 2296186 2670259 3148102 3680615 4220606
12613D220606N05726M30561L11770J52775k9781k09492l59828m62676n12419n13102
$$ 4220606 4726332 5156893 5468663 5621438 5591657 5382165 5022337 4559661 4047242 3534140
12603C534140m69663l82104k49191p6357J20236L13947M69959N52992N44810M61837
$$ 3534140 3064477 2682373 2433182 2356825 2477061 2791008 3260967 3813959 4358769 4820606
12593D820606L52439K69637K41382K62632L09449L55755L80049L66729L09435
$$ 4820606 5173045 5442682 5684064 5946696 6256145 6611900 6991949 7358678 7668113
12584G668113K14326R7130k5838j45793k60579l62081m23612m05688k80712n4456
$$ 7668113 7882439 7979569 7953731 7807938 7547359 7185278 6761666 6355978 6075266 6020810
12574F020810K34576N33292P90857R66342J034975R96010Q73235P04664N28949
$$ 6020810 6255386 6788678 7579535 8545877 9580852 10576862 11450097 12154761 12683710
12565A2683710L74643K54512J67128J05051O1842L1704N838k7717p9921j55174
$$ 12683710 13058353 13312865 13479993 13585044 13646886 13678590 13684428 13656711 13576790 13421616
12555A3421616k45918l30912l83205l85543l38721k54379j43171j1559J35427
$$ 13421616 13175698 12844786 12461581 12076038 11737317 11482938 11339767 11328208 11463635
12546A1463635K92456M50885N93741O96177P35599P03791O10587M78569L36821
$$ 11463635 11756091 12206976 12800717 13496894 14232493 14936284 15546871 16025440 16362261
12537A6362261K16080J40499J17891J39212J89472K57988L38539M24082N06467
$$ 16362261 16578341 16718840 16836731 16975943 17165415 17423403 17761942 18186024 18692491
12528A8692491N83302O62678P57272Q70707R87599J076742J106460J062211R55391
$$ 18692491 19275793 19938471 20695743 21566450 22554049 23630791 24737251 25799462 26754853
12519B6754853Q17832O84503N75393M89323M12398L31501K42105J48378N9092
$$ 26754853 27572685 28257188 28832581 29321904 29734302 30065803 30307908 30456286 30515378
12510C0515378j6719p1218r8895j01794r3634r2982j08642j32831j50837j57198
$$ 30515378 30498659 30427441 30328546 30226752 30133118 30040136 29931494 29798663 29647826 29490628
12500B9490628j61661j78993k11599k39822k30167j57666k5706J31764K65636
$$ 29490628 29328967 29149974 28938375 28698553 28468386 28310720 28285014 28416778 28682414
12491B8682414L33745L19025K35399J16912l917j11861k06471k88587l53080l92832
$$ 28682414 29016159 29335184 29570583 29687495 29683578 29571717 29365246 29076659 28723579 28330747
12481B8330747m04512l89896l54843l07712k57239k10702j73171j48545j41802
$$ 28330747 27926235 27536339 27181496 26873784 26616545 26405843 26232672 26084127 25942325
12472B5942325j58084j96579k46334k90582l15314l14024k88559k49548k15508
$$ 25942325 25784241 25587662 25341328 25050746 24735432 24421408 24132849 23883301 23667793
12463B3667793k06874k35536k97058l71430m30593m48063m08742l17062j97521
$$ 23667793 23460919 23225383 22928325 22556895 22126302 21678239 21269497 20952435 20754914
12454B0754914q4083m402L1750L5844L4405N3563J02071J63880K05211J92029
$$ 20754914 20670831 20666429 20698179 20734023 20768428 20821991 20924062 21087942 21293153 21485182
12444B1485182J07153m1961k26217m06586n49642o38405o73139o63504o18540
$$ 21485182 21592335 21550374 21324157 20917571 20367929 19729524 19056385 18392881 17774341
12435A7774341n43218m45801l47231k78640k65420l11434l95976m83715n39320
$$ 17774341 17231123 16785322 16438091 16159451 15894031 15582597 15186621 14702906 14163586
12426A4163586n39336m77875l66245k28517r3409J6688R1980J32091J40580J24469
$$ 14163586 13624250 13146375 12780130 12551613 12458204 12474892 12566872 12698963 12839543 12964012
12416A2964012R5558O7214M7391L3744J4886k2935q7237j72893k62545l34066
$$ 12964012 13059570 13126784 13174175 13207919 13222805 13199870 13112633 12939740 12677195 12343129
12406A2343129l67885l50733k79106j61967k0964J10508J94118K05247J52120
$$ 12343129 11975244 11624511 11345405 11183438 11162474 11272982 11467100 11672347 11824467
12397A1824467P2870Q129k5242l7666n1962q6065j41827k02082k38069k25430
$$ 11824467 11897337 11905466 11880224 11842558 11790596 11704531 11562704 11360622 11122553 10897123
12387A0897123j59992o2163L3839R8253J17606R3658L5256m8909j52461k68371
$$ 10897123 10737131 10674968 10708807 10807060 10924666 11018324 11053580 11004671 10852210 10583839
12377A0583839l85207m86738n55085n76550n48475m83891m09922l57236l44060
$$ 10583839 10198632 9711894 9156809 8580259 8031784 7547893 7137971 6780735 6436675
12368F436675l67516m10620m56363m93875n14865n10191m72935m04851l19852
$$ 6436675 6069159 5658539 5202176 4708301 4193436 3683245 3210310 2805459 2485607
12359B485607k39598j81251j45615j15831o7773J5320J31989K61255L71513M33667
$$ 2485607 2246009 2064758 1919143 1803312 1735539 1750859 1882848 2144103 2515616 2949283
12349B949283M32037L69505K64527J42545K7366o4702j27341j62942j78007j77816
$$ 2949283 3381320 3750825 4015352 4157897 4185263 4120561 3993220 3830278 3652271 3474455
12339C474455j63683j32793p8839N310J22679K68028M25914N70477O70651P02563
$$ 3474455 3310772 3177979 3099140 3104450 3227129 3495157 3921071 4491548 5162199 5864762
12329E864762O61538N63572M35128K98317J62345K9705q8627j68625j88439j48464
$$ 5864762 6526300 7089872 7525000 7823317 7985662 8015367 7926740 7758115 7569676 7421212
12319G421212p6433j3674O842k3995r1065j68241k36420k92581l41060l78304
$$ 7421212 7344779 7331105 7337947 7313952 7222887 7054646 6818226 6525645 6184585 5806281
12309E806281l90403l65842l09013k41805j92823j82608k13096k66258l13712
$$ 5806281 5415878 5050036 4741023 4499218 4306395 4123787 3910691 3644433 3330721
12300C330721l31968l14073k71761k26881j98118j93094k09542k39870k73655
$$ 3330721 2998753 2684680 2412919 2186038 1987920 1794826 1585284 1345414 1071759
12291A071759k98529l02221k76615k21633j44071n0808N5868J74691K97501M05674
$$ 1071759 773230 471009 194394 -27239 -171310 -222118 -166250 8441 305942 711616
12281G11616M74668M83387M23106L02225J44648j5967j43036k08258k07376j67002
$$ 711616 1186284 1669671 2092777 2395002 2539650 2523683 2380647 2172389 1965013 1798011
12271A798011j30835j34070j86729k74884l71939m50715m94016n00234m77572
$$ 1798011 1667176 1533106 1346377 1071493 699554 248839 -245177 -745411 -1222983
12262a222983m31886l63087k73378j74514q3939j3640L7097Q0024J31759K06460
$$ -1222983 -1654869 -2017956 -2291334 -2465848 -2549787 -2563427 -2526330 -2446306 -2314547 -2108087
12252b108087L06049M11381M84261M83942L88906K09772j5473k39896m25542n50798
$$ -2108087 -1802038 -1390657 -906396 -422454 -33548 176224 160751 -79145 -504687 -1055485
12242a055485o08842o05950n62657n08381m64244m27099l71505k69057j09697
$$ -1055485 -1664327 -2270277 -2832934 -3341315 -3805559 -4232658 -4604163 -4873220 -4982917
12233d982917Q8942K88397M47312N40006N66386N49167N20474N06022N14992N38732
$$ -4982917 -4893975 -4605578 -4158266 -3618260 -3051874 -2502707 -1982233 -1476211 -961219 -422487
12223d22487N58480N57150N25703M63479L78090K84242J98602J33359R1691O6922
$$ -422487 135993 693143 1218846 1682325 2060415 2344657 2543259 2676618 2768309 2835231
12213B835231M6569J8732k3658q2331j53686k26427k81109k97975k69901k09093
$$ 2835231 2881800 2900532 2876874 2794543 2640857 2414430 2133321 1835346 1565445 1356352
12203A356352j40168q5372n7250o3305j09227j92598k96376l91766m50460m58893
$$ 1356352 1216184 1130812 1073562 1010257 901030 708432 412056 20290 -430170 -889063
12193h89063m23668l61700k84657j96697j05377k6279K5988M7360M2753J7513
$$ -889063 -1312731 -1674431 -1959088 -2155785 -2261162 -2287441 -2261453 -2214093 -2171340 -2153827
12183b153827k5999q4363j49824k11519k57606k77746k67381k30350j77232j21979
$$ -2153827 -2179826 -2264189 -2414013 -2625532 -2883138 -3160884 -3428265 -3658615 -3835847 -3957826
12173c957826p7677n0636l5602j7427K0450Q7776J86602L15022M67389O30879
$$ -3957826 -4035503 -4086139 -4121741 -4139168 -4118718 -4030942 -3844340 -3529318 -3061929 -2431050
12163b431050P86433R16312J008973J054311J036329R35824P44564M78646J78538
$$ -2431050 -1644617 -728305 280668 1334979 2371308 3307132 4051696 4530342 4708880
12154D708880j03571l20890m48929m94903m89388m65333m43233m28746m13204
$$ 4708880 4605309 4284419 3835490 3340587 2851199 2385866 1942633 1513887 1100683
12145A100683l76698l02379j93172p0459M2196J29330J81855J93998J65221J04010
$$ 1100683 723985 421606 228434 157975 200171 329501 511356 705354 870575 974585
12135I74585K9246l3635o2777n1267j0356L9505Q2963J16482J42689J62635J74039
$$ 974585 1003831 970196 907419 856152 845796 885301 968264 1084746 1227435 1390070 1564109
12124A564109J71517J45609Q5156j3988j39808k64325l57077m03398m10649l95156
$$ 1564109 1735626 1881235 1966391 1952403 1812595 1548270 1191193 787795 377146 -18010
12114a8010l64756l16487k46872j59057o2466L0692J09795J68698K04043K13078
$$ -18010 -382766 -699253 -946125 -1105182 -1167648 -1136956 -1027161 -858463 -654420 -441342
12104d41342J97584J70233J52655J62252J98533K44185K81806L08730L34172L63533
$$ -441342 -243758 -73525 79130 241382 439915 684100 965906 1274636 1608808 1972341
12094A972341L86038L75444L04561J66197j6764k04323l63503m80933n57051n94123
$$ 1972341 2358379 2733823 3038384 3204581 3187817 2983494 2619991 2139058 1582007 987884
12084I87884n91666n50312m74353l69291k41177r9689L9763J57766K37196K71428
$$ 987884 396218 -154094 -628447 -997738 -1238915 -1338604 -1298841 -1141075 -903879 -632451
12074f32451K67219K38345J95702J43318Q2048J6241m2017p5670p2433l3413K8646
$$ -632451 -365232 -126887 68815 212133 294181 310422 268405 192735 120302 86889 115535
12063A15535R8406J61790K03504K09112J74590J11923M2294j6827n9201q7888
$$ 115535 213941 375731 579235 788347 962937 1074860 1117154 1100327 1041126 953238
12053I53238j07729j18704j14781q7111k8016O3227J74159K81424L63788M13118
$$ 953238 845509 726805 612024 524913 496897 560124 734283 1015707 1379495 1792613
12043A792613M32542M28102M06205L77807L59369L64447L92472M27910M52460
$$ 1792613 2225155 2653257 3059462 3437269 3796638 4161085 4553557 4981467 5433927
12034E433927M56927M41484M08953L60429K94878K09079R8285l9942k00418l66651
$$ 5433927 5890854 6332338 6741291 7101720 7396598 7605677 7703962 7664020 7463602 7096951
12024G096951n12471o12101o52723o40346n99175n65337n69948o16681o73083
$$ 7096951 6584480 5972379 5319656 4679310 4080135 3514798 2944850 2328169 1655086
12015A655086o88709o28418m91288l00863q4431J36550L44013N19334O43406P00500
$$ 1655086 966377 337959 -153329 -454192 -538623 -402073 -58060 461274 1104680 1805180
12005A805180O83061N93385M42339K49925M9392j13254j94724j80739j02893k6659
$$ 1805180 2488241 3081626 3523965 3773890 3823282 3710028 3515304 3334565 3231672 3205013
11995C205013j3252q3207k09691l42937m42514m93906n04133m87367m53927m07662
$$ 3205013 3191761 3108554 2898863 2555926 2113412 1619506 1115373 628006 174079 -233583
11985b33583l48902k79397k05257j34801p4291k6686P145K8934M5909P0603J14421
$$ -233583 -582485 -861882 -1067139 -1201940 -1276231 -1302917 -1295772 -1266838 -1220929 -1150326 -1035905
11974a035905J79479K54704L17849L43604L16585K41921J45045N9922J4642K4095
$$ -1035905 -856426 -601722 -283873 59731 376316 618237 763282 823204 837846 861941
11964H61941Q9456J98916L29842M55142N52188O09590O28306O16469N81571N24945
$$ 861941 951397 1150313 1480155 1935297 2487485 3097075 3725381 4341850 4923421 5448366
11954E448366M41671L26808J84721L3885r9839j98379k60937k99571l26975l47163
$$ 5448366 5890037 6216845 6401566 6435451 6335612 6137233 5876296 5576725 5249750 4902587
11944D902587l55414l44348l08788k50284j80480j15098o2252k2013K468R41l5289
$$ 4902587 4547173 4202825 3894037 3643753 3463273 3348175 3285923 3263910 3266378 3267319 3232030
11933C232030j05812k01263l04933l96100m60213m98737n25228n48629n61857
$$ 3232030 3126218 2924955 2620022 2223922 1763709 1264972 739744 191115 -370742
11924c70742n48419m97836m13528l09320j99696r0518K2739J45953K71809L72657
$$ -370742 -919161 -1416997 -1830525 -2139845 -2339541 -2430059 -2407320 -2261367 -1989558 -1616901
11914a616901M10705L60544K26832M4575j36037k69694l31072l18477k45456j29847
$$ -1616901 -1206196 -845652 -618820 -574245 -710282 -979976 -1311048 -1629525 -1874981 -2004828
11904b004828Q887J47671K62995L37355L61855L36081K69204J79764Q9908J4388
$$ -2004828 -1995941 -1848270 -1585275 -1247920 -886065 -549984 -280780 -101016 -11108 3280
11894C280m8284j12592j90260k76075l49023l86403l78260l33382k74601k27252
$$ 3280 -45004 -157596 -347856 -623931 -972954 -1359357 -1737617 -2070999 -2345600 -2572852
11884b572852k07848k16755k36312k38472k02228j28803m1239K9995O1658M5852
$$ -2572852 -2780700 -2997455 -3233767 -3472239 -3674467 -3803270 -3844509 -3814514 -3752856 -3707004
11874c707004o454o8569j12008j24929j20160j24733j58376k17346k75334k99243
$$ -3707004 -3713458 -3782027 -3894035 -4018964 -4139124 -4263857 -4422233 -4639579 -4914913 -5214156
11864e214156k67694j81067n8425P4573J96822K95719L65688M04264M08252L75763
$$ -5214156 -5481850 -5662917 -5721342 -5646769 -5449947 -5154228 -4788540 -4384276 -3976024 -3600261
11854c600261L13476K38857J73049J32130J23363J45069J86821K31080K59426
$$ -3600261 -3286785 -3047928 -2874879 -2742749 -2619386 -2474317 -2287496 -2056416 -1796990
11845a796990K60292K31222J77100J09761M5274l800l2079l7419j9747J4260N1933
$$ -1796990 -1536698 -1305476 -1128376 -1018615 -973341 -977141 -1009220 -1046639 -1066386 -1052126 -1000193
11834a000193Q4200J11677J38582J63379J79804J86248J87275J82981J63285J18002
$$ -1000193 -915993 -804316 -665734 -502355 -322551 -136303 50972 233953 397238 515240
11824E15240M9181k9241r9283j44425j53424j24940o9644n157N4753J06834J53733
$$ 515240 564421 535180 435897 291472 138048 13108 -56536 -61693 -6940 99894 253627
11813B53627J94360K18517K07399J41945J8180j42486k98552m04491m28110l63907
$$ 253627 447987 666504 873903 1015848 1034028 891542 592990 188499 -239611 -603518
11803f03518k35475q2789N9317J79049K91273M22696N86351P62665R00450R39656
$$ -603518 -838993 -921782 -862465 -683416 -392143 30553 616904 1379569 2280019 3219675
11793C219675Q45003O27449L38044M3301j98164l49672m02982l75579k97823j97809
$$ 3219675 4064678 4692127 5030171 5073472 4875308 4525636 4122654 3747075 3449252 3251443
11783C251443r3996J577P5831J12939J00512L6200p1881k08326l51758m76765
$$ 3251443 3157447 3159024 3234855 3347794 3448306 3484506 3412625 3204299 2852541 2375776
11773B375776n60939n92504n72048n09664m21092l22828k26192j33954m1712N7531
$$ 2375776 1814837 1222333 650285 140621 -280471 -603299 -829491 -963445 -1005157 -947626
11763i47626J66955K80013L79900M46054M63123M27564L50075K53508J65499J08528
$$ -947626 -780671 -500658 -120758 325296 788419 1215983 1566058 1819566 1985065 2093593
11753B093593R3127J15288J55825J84978J75220J15804J8131r1256j83065k36183
$$ 2093593 2186720 2302008 2457833 2642811 2818031 2933835 2951966 2860710 2677645 2441462
11743B441462k45992k26868k02426j87321j77542j60259j32261j05624r6343j11578
$$ 2441462 2195470 1968602 1766176 1578855 1401313 1241054 1108793 1003169 906826 795248
11733G95248j45529j80800j92931j60649p8221L9598J63190K58952L00741K79264
$$ 795248 649719 468919 275988 115339 37118 76716 239906 498858 799599 1078863
11723A078863K06002J10101K7994j3872j4748J632O619j4003n7363j14743j81666
$$ 1078863 1284865 1394966 1422960 1409088 1394340 1395972 1402591 1388588 1331225 1216482 1034816
11712A034816k57002l34263l95939m19292l90234l13440k11812j17478n8192m4292
$$ 1034816 777814 443551 47612 -371680 -761914 -1075354 -1287166 -1404644 -1462836 -1507128
11702a507128o5033r7831j22183j28629j19786j05376r5592r6023j03136j01883
$$ -1507128 -1572161 -1669992 -1792175 -1920804 -2040590 -2145966 -2241558 -2337581 -2440717 -2542600
11692b542600p2449n720Q7713J85848K70150L31747L69981L91306M07456M28402
$$ -2542600 -2615049 -2620769 -2533056 -2347208 -2077058 -1745311 -1375330 -984024 -576568 -148166
11682a48166M54018M72294M65745M20064L27981J90246J9378j58800l12563m13213
$$ -148166 305852 778146 1243891 1663955 1991936 2182182 2201560 2042760 1730197 1316984
11672A316984m38374l76143k36546o0958Q7368J53967J23976K7730q2152j60718
$$ 1316984 878610 502467 265921 204963 292331 446298 570274 598004 515852 355134
11662C55134j85150j51015o3723O4422K13482L59074M82186N79154O61401P43059
$$ 355134 169984 18969 -44754 19668 233150 592224 1074410 1653564 2314965 3058024
11652C058024Q27585R04695R57617R72009R40027Q60580P40618N97246M53428
$$ 3058024 3885609 4790304 5747921 6719930 7659957 8520537 9261155 9858401 10311829
11643A0311829L25666K14508J07894o610j32233k60081l71902m50834m95863n24770
$$ 10311829 10637495 10852003 10959897 10953287 10821054 10560973 10189071 9738237 9242374 8717604
11633H717604n59874o09295o59160o80709o45882n41516l74444j67764M5994K31784
$$ 8717604 8157730 7548435 6889275 6208566 5562684 5021168 4646724 4478960 4524954 4756738
11623D756738L59537M10977L83488K90279J56244R866j25298k34854l13426l62935
$$ 4756738 5116275 5527252 5910740 6201019 6357263 6367129 6241831 6006977 5693551 5330616
11613E330616l88980l96102l87289l67491l43761l19719k90291k42295j62016
$$ 5330616 4941636 4545534 4158245 3790754 3446993 3127274 2836983 2594688 2432672
11604B432672m6688Q8786K16845L10514L56317L61360L49020L41342L40637L28719
$$ 2432672 2385984 2474770 2691615 3002129 3358446 3719806 4068826 4410168 4750805 5079524
11594E079524K84978K04192R8763j0851j05754j72553k05206k08718j99669j96712
$$ 5079524 5364502 5568694 5667457 5656606 5550852 5378299 5173093 4964375 4764706 4567994
11584D567994k06767k22152k33718k43853k62206k90679l16090l16531k74154
$$ 4567994 4361227 4139075 3905357 3661504 3399298 3108619 2792529 2475998 2201844
11575B201844j86071o8051N2451J51523K19831K58870K68389K40354J65233M4256
$$ 2201844 2015773 1947722 2000173 2151696 2371527 2630397 2898786 3139140 3304373 3348629
11565C348629j02409k39863l33225l60504l16098k10375p1010N9464J38364J43211
$$ 3348629 3246220 3006357 2673132 2312628 1996530 1786155 1715145 1774609 1912973 2056184
11555B056184Q0717k0938j27495k12466k66979l03953l50893m30633n43403o65944
$$ 2056184 2136901 2115963 1988468 1776002 1509023 1205070 854177 423544 -119859 -785803
11545g85803p65549q12774p86302o78009n00086k84640p1851J04869K28037K99471
$$ -785803 -1551352 -2364126 -3150428 -3828437 -4328523 -4613163 -4685014 -4580145 -4352108 -4052637
11535d052637L37995L68148M03500M37212M47050M07614L01016J27852q2981k78329
$$ -4052637 -3714642 -3346494 -2942994 -2505782 -2058732 -1651118 -1350102 -1222250 -1305231 -1583560
11525a583560m02750m23941l44954j98663l0392J21822K39773L24159L82986M19513
$$ -1583560 -1986310 -2410251 -2755205 -2953868 -2984260 -2862438 -2622665 -2298506 -1915520 -1496007
11515a496007M28030L97183L17351J90263L4126j24281k64967l81212m73561n41550
$$ -1496007 -1067977 -670794 -353443 -163180 -129054 -253335 -518302 -899514 -1373075 -1914625
11505a914625n80173n81366n39654m59401l57420k56491j73515j11636o2587j6364
$$ -1914625 -2494798 -3076164 -3615818 -4075219 -4432639 -4689130 -4862645 -4974281 -5036868 -5053232
11495e053232L1385Q0085J29936J86216K58154L51688M59202N54469O01846N78185
$$ -5053232 -5021847 -4941762 -4811826 -4625610 -4367456 -4015768 -3556566 -3002097 -2400251 -1822066
11485a822066M90967L77370K86215K56400L02295M08771N35973O33803O62074
$$ -1822066 -1331099 -953729 -667514 -411114 -108819 299952 835925 1469728 2131802
11476B131802O06597M83010L24978J62949J2214j18607k13073k46331j99469p5946
$$ 2131802 2738399 3221409 3546387 3709336 3721550 3602943 3389870 3143539 2944070 2868124
11466B868124R0497K42303L21020K96557J81912K0582j41975k77725l75900m34969
$$ 2868124 2958621 3200924 3521944 3818501 4000413 4020995 3879020 3601295 3225395 2790426
11456B790426m58364m51372m13817l36205k09406m0840J39681K89767L72584L73608
$$ 2790426 2332062 1880690 1466873 1130668 921262 880422 1020103 1309870 1682454 2056062
11446B056062L06598K04930J03966K5239k9652p4679j28065j99081k79623l46392
$$ 2056062 2362660 2567590 2671556 2696795 2667143 2592464 2464399 2265318 1985695 1639303
11436A639303l72566l40001k44918r9287O9076K22530L29068L78166L83310L67733
$$ 1639303 1266737 926736 681818 582531 651607 874137 1203205 1581371 1964681 2332414
11426B332414L45197L12900K61340J88251J02643J9911m4833q3700j00644j08267
$$ 2332414 2677611 2990511 3251851 3440102 3542745 3562656 3517823 3434123 3333479 3225212
11416C225212j19126j39431j68018j99310k27859k50836k68046k82294l00178
$$ 3225212 3106086 2966655 2798637 2599327 2371468 2120632 1852586 1570292 1270114
11407A270114l30348l78214m40146n01937n45231n59958n51860n35484n17806
$$ 1270114 939766 561552 121406 -380531 -925762 -1485720 -2037580 -2573064 -3090870
11398c090870m88059m25040l16452j72408k1510J04788J85080K12206J93500J49121
$$ -3090870 -3578929 -4003969 -4320421 -4492829 -4514339 -4409551 -4224471 -4012265 -3818765 -3669644
11388c669644J04419P9029Q3086J23332K07717L38320M98669O51114P50586P67183
$$ -3669644 -3565225 -3486196 -3403110 -3279778 -3072061 -2733741 -2235072 -1583958 -833372 -66189
11378f6189P01667N81689M42387L07995J88776R1640K8244Q782K8870O6529R5151
$$ -66189 635478 1217167 1659554 1967549 2156325 2247965 2276209 2284991 2313861 2380390 2475541
11367B475541J00002Q2509N0949R701m1747j02526j67721k31845k92657l50690
$$ 2475541 2575543 2658052 2709001 2718702 2676955 2574429 2406708 2174863 1882206 1531516
11357A531516m04029m44080m59541m45196m04411l44201k72331j98472j33425
$$ 1531516 1127487 683407 223866 -221330 -625741 -969942 -1242273 -1440745 -1574170
11348a574170q4939n4934m2068m6793p2337j21069j90048k66482l25282l35093
$$ -1574170 -1659109 -1714043 -1756111 -1802904 -1875241 -1996310 -2186358 -2452840 -2778122 -3113215
11338c113215k71997j30644P4745L16652N59811P62857Q82512Q86151P65834N42252
$$ -3113215 -3385212 -3515856 -3441111 -3124459 -2564648 -1801791 -919279 -33128 732706 1274958
11328A274958K58583k9804k69227m23868m86120m72958m11763l29486k49527j87075
$$ 1274958 1533541 1503737 1234510 810642 324522 -148436 -560199 -889685 -1139212 -1326287
11318a326287j43035j07164p0453l4048o762M691K641l672m233R704M4881J00253
$$ -1326287 -1469322 -1576486 -1646939 -1680987 -1687749 -1683058 -1680417 -1684089 -1688322 -1678618 -1633737 -1533484
11306a533484J63051K17791K60203K96958L31477L56876L66406L65400L67095
$$ -1533484 -1370433 -1152642 -892439 -595481 -264004 92872 459278 824678 1191773
11297A191773L77085L86071L78553L45137K85628K05528J14375K5133n1830j18564
$$ 1191773 1568858 1954929 2333482 2678619 2964247 3169775 3284150 3309283 3257453 3138889
11287C138889j92149k92758m24338n65218o77006p22187o79414n53997l78480
$$ 3138889 2946740 2653982 2229644 1664426 987420 265233 -414181 -968178 -1346658
11278a346658j98607n4425K8976M1914q138r3355j72854k15824k22915k22202
$$ -1346658 -1545265 -1599690 -1570714 -1528800 -1536938 -1630293 -1803147 -2018971 -2241886 -2464088
11268b464088k42474k89163l41229l66996l45014k75905j78882p6167K0728J09030
$$ -2464088 -2706562 -2995725 -3336954 -3703950 -4048964 -4324869 -4503751 -4579918 -4559190 -4450160
11258d450160J81657K22677K19720J80367J34113J15248J40424K01356K75568
$$ -4450160 -4268503 -4045826 -3826106 -3645739 -3511626 -3396378 -3255954 -3054598 -2779030
11249b779030L38484L66587L38344K40947Q0943j11115k91027m22514m93796n16658
$$ -2779030 -2440546 -2073959 -1735615 -1494668 -1413725 -1524840 -1815867 -2238381 -2732177 -3248835
11239c248835n11412m91863m59205m04109l13914j82152j6034J63559L30361M61608
$$ -3248835 -3760247 -4252110 -4711315 -5115424 -5429338 -5611490 -5627524 -5463965 -5133604 -4671996
11229d671996N40492N56906N12426M24786L24039K38632J79089J34631Q8792L7636
$$ -4671996 -4131504 -3574598 -3062172 -2637386 -2313347 -2074715 -1895626 -1760995 -1672203 -1634567
11219a634567q540l7202m3769l3315j7529j0164k0560m6947p6339r2523q2177
$$ -1634567 -1643107 -1680309 -1724078 -1757393 -1774922 -1785086 -1805646 -1852593 -1928932 -2021455 -2103632
11208b103632l4475N5954J78778L03432L92271M24194M07337L67895L27552K92278
$$ -2103632 -2138107 -2082153 -1903375 -1599943 -1207672 -783478 -376141 -8246 319306 611584
11198F11584K55843K04134J18428j2626j79416l53864n06250o17407o76967o78182
$$ 611584 867427 1071561 1189989 1177363 997947 644083 137833 -479574 -1156541 -1834723
11188a834723o22036n25529m19495l31901k68944k11241j28884j331J72546L76336
$$ -1834723 -2456759 -2982288 -3401783 -3733684 -4002628 -4213869 -4342753 -4344084 -4171538 -3795202
11178c795202N83747P66318Q99442R65896R55584Q64513O98392M78298K40428
$$ -3795202 -3211455 -2445137 -1545695 -579799 375785 1240298 1938690 2416988 2657416
11169B657416K6495j31018k18484k39582k08637j45601p0341M913P8522J54101
$$ 2657416 2683911 2552893 2334409 2094827 1886190 1740589 1670248 1675161 1753683 1907784
11159A907784K32697L10903L84550M48921M92940M97679M46010L35544J83362
$$ 1907784 2140481 2451384 2835934 3284855 3777795 4275474 4721484 5057028 5240390
11150E240390J8934j28350k36966k93799k93269k38289j39642j1023J36146K91682
$$ 5240390 5259324 5130974 4894008 4600209 4306940 4068651 3929009 3917986 4054132 4345814
11140D345814M39683N56375O20053O23761N76245M90691L74087K27853N5874j30449
$$ 4345814 4785497 5341872 5961925 6585686 7161931 7652622 8026709 8254562 8310436 8179987
11130H179987l13500m74041n96659o75413p16264p30317p21105o79412n92429
$$ 8179987 7866487 7392446 6795787 6120374 5404110 4673793 3952688 3273276 2680847
11121B680847m59189k98913j44971k9223L0614L2370j4612q9355j60485j99353
$$ 2680847 2221658 1922745 1777774 1748551 1779165 1811535 1796923 1707568 1547083 1347730
11111A347730j96625j64556j23671q8430o3334m7738m0468l8839l6171k5725r526
$$ 1347730 1151105 986549 862878 774448 711114 663376 622908 584069 547898 522173 512647
11100E12647j246j7583o3907j24619j66461j55809q1318L4283J42986J95135J63620
$$ 512647 511401 493818 429911 305292 138831 -16978 -98296 -64013 78973 274108 437728
11089D37728N6217r0399k30597l29693l72545l62273l16098k59195k14550j92730
$$ 437728 493945 403546 172949 -156744 -529289 -891562 -1207660 -1466855 -1681405 -1874135
11079a874135j90188j99778k24020k74564l55708m51626n32990n72992n55140
$$ -1874135 -2064323 -2264101 -2488121 -2762685 -3118393 -3570019 -4103009 -4676001 -5231141
11070e231141m72660l28272j35761Q0600K90668M65844N88278O57888O89537O98745
$$ -5231141 -5703801 -6032073 -6167834 -6087234 -5796566 -5330722 -4742444 -4084556 -3395019 -2696274
11060b696274O87310O42978N52706M15448K45622O9350q4419j95218k56753k73346
$$ -2696274 -2008964 -1365986 -813280 -397832 -152210 -82860 -167279 -362497 -619250 -892596
11050h92596k53825k09638j56381j13640r7984j11854j40294j61619j62218j41509
$$ -892596 -1146421 -1356059 -1512440 -1626080 -1724064 -1835918 -1976212 -2137831 -2300049 -2441558
11040b441558j03988m9719K5013J18637K16504K92585L22286K96921K27160J34780
$$ -2441558 -2545546 -2595265 -2570252 -2451615 -2235111 -1942526 -1620240 -1323319 -1096159 -961379
11030i61379M1787l8405j06073j71897k46623l34739m37285n54768o82057q00334
$$ -961379 -919592 -957997 -1064070 -1235967 -1482590 -1817329 -2254614 -2809382 -3491439 -4291773
11020d291773q76633q75042p75079n87303l57819j56841m9607o2352j68962l08669
$$ -4291773 -5168406 -6043448 -6818527 -7405830 -7763649 -7920490 -7970097 -8032449 -8201411 -8510080
11010h510080m18158m55366m06875k84163j15687O2053K13132L10222L42022L17193
$$ -8510080 -8928238 -9383604 -9790479 -10074642 -10190329 -10128276 -9915144 -9604922 -9262900 -8945707
11000h945707K60506K01038J58726J38640J37088J51417J80870K18266K46783
$$ -8945707 -8685201 -8484163 -8325437 -8186797 -8049709 -7898292 -7717422 -7499156 -7252373
10991g252373K50105K26017J88519J56647J41184J40325J44814J45747J39573
$$ -7252373 -7002268 -6776251 -6587732 -6431085 -6289901 -6149576 -6004762 -5859015 -5719442
10982e719442J29438J23510J29358J47196J70913J99067K42108L12591M06136
$$ -5719442 -5590004 -5466494 -5337136 -5189940 -5019027 -4819960 -4577852 -4265261 -3859125
10973c859125M95614N48415N51841N23110M94114M83734M81786M57594L84539
$$ -3859125 -3363511 -2815096 -2263255 -1740145 -1246031 -762297 -280511 177083 561622
10964E61622K59602J04338m8817j73800k63296l30273l95940m70108n39536n76030
$$ 561622 821224 925562 876745 702945 439649 109376 -286564 -756672 -1296208 -1872238
10954a872238n56900m78026l50797j93821k9145J21288K41922L25555L69542L74290
$$ -1872238 -2429138 -2907164 -3257961 -3451782 -3480927 -3359639 -3117717 -2792162 -2422620 -2048330
10944b048330L45755K95349K37121J86809J58706J56396J67476J72536J60941
$$ -2048330 -1702575 -1407226 -1170105 -983296 -824590 -668194 -500718 -328182 -167241
10935a67241J37937J19116J20607J51383K07569K69774L08842K99584K33261J20308
$$ -167241 -29304 89812 210419 361802 569371 839145 1147987 1447571 1680832 1801140
10925A801140j5455j43532k31416k53459k05615j12060j2169O0590Q8207O3958
$$ 1801140 1785685 1642153 1410737 1157278 951663 839603 827434 888024 976231 1040189
10915A040189j2419j31759k72173m05937n13051n88780o39019o68818o75628o53395
$$ 1040189 1027770 896011 623838 217901 -295150 -883930 -1522949 -2191767 -2867395 -3520790
10905c520790n99193n12047l89095k29531m3864J43744L05818M26539N06065N50850
$$ -3520790 -4119983 -4632030 -5021125 -5250656 -5294520 -5150776 -4844958 -4418419 -3912354 -3361504
10895c361504N63287N42695M94890M38640L99228L90034L97807L89271L36071
$$ -3361504 -2798217 -2255522 -1760632 -1321992 -922764 -532730 -134923 254348 590419
10886E90419K33142R3033o9728k41820m06252n45626o49310p11058p21697o70682
$$ 590419 823561 916594 846866 605046 198794 -346832 -996142 -1707200 -2428897 -3099579
10876c099579n55134l84891j80079L5084K38312M12478N46294O34669O78674O85004
$$ -3099579 -3654713 -4039604 -4219683 -4184599 -3946287 -3533809 -2987515 -2352846 -1674172 -989168
10866i89168O65360O34040O02584N74163N41703M91388M11799L04899J89877R2601
$$ -989168 -323808 310232 912816 1486979 2028682 2520070 2931869 3236768 3426645 3519246
$$ [...]
##END NTUPLES=NMR SPECTRUM
##END=
