##TITLE=1H ikalashn
DE-79k_TFA
22.11.2024
##JCAMPDX= 6.0         $$ Bruker NMR JCAMP-DX V2.0
##DATA TYPE= NMR FID
##DATA CLASS= NTUPLES
##ORIGIN= UXNMR, Bruker Analytische Messtechnik GmbH
##OWNER= root
$$ TOPSPIN		Version 1.3
$$ 2024-11-22 13:56:35.437 +0400  Irina@DPX200
$$ Compression mode = diff/dup
##.OBSERVE FREQUENCY= 200.131300845
##.OBSERVE NUCLEUS= ^1H
##.DELAY= (6, 6)
##.ACQUISITION MODE= SIMULTANEOUS
##.ACQUISITION SCHEME= undefined
##.AVERAGES= 64
##.DIGITISER RES= 18
##SPECTROMETER/DATA SYSTEM= spect
##.PULSE SEQUENCE= zg
##.SOLVENT NAME= CDCl3
##.SHIFT REFERENCE= INTERNAL, CDCl3, 1, 17.49637
##AUDIT TRAIL= $$ (NUMBER, WHEN, WHO, WHERE, WHAT)
$$ ##TITLE= Audit trail, TOPSPIN		Version 1.3
$$ ##JCAMPDX= 5.01
$$ ##ORIGIN= Bruker BioSpin GmbH
$$ ##OWNER= Irina
$$ $$ F:/spectra/data/iren/nmr/1H/4/audita.txt
$$ ##AUDIT TRAIL=  $$ (NUMBER, WHEN, WHO, WHERE, VERSION, WHAT)
(   1,<2024-11-22 13:55:09.765 +0400>,<Irina>,<DPX200>,<TOPSPIN 1.3>,
      <created by zg
	started at 2024-11-22 13:50:56.765 +0400,
	POWCHK disabled, PULCHK disabled
       configuration hash MD5:
       BE 6D 3F 07 2A EA 11 49 91 17 2B D3 AF B3 58 0D
       data hash MD5: 16K
       DD D9 6B F0 21 37 F2 E1 43 4B 41 20 55 6C 30 47>)
$$ ##END=
$$ 
$$ $$ hash MD5
$$ $$ 46 48 86 E5 BE 13 82 7A 28 59 80 76 57 74 79 63
##$RELAX= 
##$RELAX= 
##$RELAX= 
##$RELAX= 
##$RELAX= 
##$RELAX= 
##$RELAX= 
##$RELAX= 
##$RELAX= 
$$ Bruker specific parameters
$$ --------------------------
##$DU= <F:/spectra>
##$EXPNO= 4
##$NAME= <1H>
##$PROCNO= 1
##$TYPE= <nmr>
##$USER= <iren>
##$AMP= (0..31)
100 100 100 100 100 100 100 100 100 100 100 100 100 100 100 100 100 100 
100 100 100 100 100 100 100 100 100 100 100 100 100 100 
##$ANAVPT= -1
##$AQSEQ= 0
##$AQ_mod= 1
##$AUNM= <au_zg>
##$AUTOPOS= <>
##$BF1= 200.13
##$BF2= 200.13
##$BF3= 200.13
##$BF4= 200.13
##$BF5= 200.13
##$BF6= 200.13
##$BF7= 200.13
##$BF8= 200.13
##$BYTORDA= 1
##$CFDGTYP= 0
##$CFRGTYP= 5
##$CHEMSTR= <none>
##$CNST= (0..63)
1 1 145 1 1 1 1 1 1 1 1 1 1 1 1 1 1 1 1 1 1 1 1 1 1 1 1 1 1 1 1 1 1 1 
1 1 1 1 1 1 1 1 1 1 1 1 1 1 1 1 1 1 1 1 1 1 1 1 1 1 1 1 1 1 
##$CPDPRG= <>
##$CPDPRG1= <>
##$CPDPRG2= <>
##$CPDPRG3= <>
##$CPDPRG4= <mlev>
##$CPDPRG5= <mlev>
##$CPDPRG6= <mlev>
##$CPDPRG7= <mlev>
##$CPDPRG8= <mlev>
##$CPDPRGB= <>
##$CPDPRGT= <>
##$D= (0..63)
0 2 0 0 0 0 0 0 0 0.06 0 0.03 0 0 0 0 0.0002 0 0 0 0 0 0 0 0 0 0 0 0 0 
0 0 0 0 0 0 0 0 0 0 0 0 0 0 0 0 0 0 0 0 0 0 0 0 0 0 0 0 0 0 0 0 0 0 
##$DATE= 1732269308
##$DBL= (0..7)
120 120 120 120 120 120 120 120 
##$DBP= (0..7)
150 150 150 150 150 150 150 150 
##$DBP07= 0
##$DBPNAM0= <>
##$DBPNAM1= <>
##$DBPNAM2= <>
##$DBPNAM3= <>
##$DBPNAM4= <>
##$DBPNAM5= <>
##$DBPNAM6= <>
##$DBPNAM7= <>
##$DBPOAL= (0..7)
0.5 0.5 0.5 0.5 0.5 0.5 0.5 0.5 
##$DBPOFFS= (0..7)
0 0 0 0 0 0 0 0 
##$DE= 6
##$DECBNUC= <off>
##$DECIM= 32
##$DECNUC= <off>
##$DECSTAT= 4
##$DIGMOD= 1
##$DIGTYP= 9
##$DL= (0..7)
0 120 120 120 120 120 120 120 
##$DP= (0..7)
150 150 150 150 150 150 150 150 
##$DP07= 0
##$DPNAME0= <>
$$ [...]
##$SW= 21.9926040160658
##$SWIBOX= (0..15)
0 0 2 0 0 0 0 0 0 0 0 0 0 0 0 0 
##$SW_h= 4401.40845070422
##$TD= 16384
##$TD0= 1
##$TE= 300
##$TE2= 300
##$TE3= 300
##$TEG= 300
##$TL= (0..7)
0 120 120 120 120 120 120 120 
##$TP= (0..7)
150 150 150 150 150 150 150 150 
##$TP07= 0
##$TPNAME0= <>
##$TPNAME1= <>
##$TPNAME2= <>
##$TPNAME3= <>
##$TPNAME4= <>
##$TPNAME5= <>
##$TPNAME6= <>
##$TPNAME7= <>
##$TPOAL= (0..7)
0.5 0.5 0.5 0.5 0.5 0.5 0.5 0.5 
##$TPOFFS= (0..7)
0 0 0 0 0 0 0 0 
##$TUNHIN= 0
##$TUNHOUT= 0
##$TUNXOUT= 0
##$USERA1= <user>
##$USERA2= <user>
##$USERA3= <user>
##$USERA4= <user>
##$USERA5= <user>
##$V9= 5
##$VALIST= <valist>
##$VCLIST= <CCCCCCCCCCCCCCC>
##$VD= 0
##$VDLIST= <DDDDDDDDDDDDDDD>
##$VPLIST= <PPPPPPPPPPPPPPP>
##$VTLIST= <TTTTTTTTTTTTTTT>
##$WBST= 1024
##$WBSW= 25
##$XGAIN= (0..3)
0 0 0 0 
##$XL= 0
##$YL= 0
##$YMAX_a= 636944
##$YMIN_a= -1006490
##$ZGOPTNS= <>
##$ZL1= 120
##$ZL2= 120
##$ZL3= 120
##$ZL4= 120
##$ABSF1= 10
##$ABSF2= 0
##$ABSG= 5
##$ABSL= 3
##$ALPHA= 0
##$AQORDER= 0
##$ASSFAC= 0
##$ASSFACI= 0
##$ASSFACX= 0
##$ASSWID= 0
##$AUNMP= <proc_1d>
##$AXLEFT= 0
##$AXRIGHT= 0
##$AXTYPE= 0
##$AXUNIT= <>
##$AZFE= 0.1
##$AZFW= 0.1
##$BCFW= 1
##$BC_mod= 2
##$BYTORDP= 1
##$COROFFS= 0
##$CY= 7568.61572265625
##$DATMOD= 1
##$DC= 2
##$DFILT= <>
##$DTYPP= 0
##$F1P= 17.9538593292236
##$F2P= -4.03888763876832
##$FCOR= 0.5
##$FTSIZE= 32768
##$FT_mod= 4
##$GAMMA= 1
##$GB= 1
##$INTBC= 1
##$INTSCL= 1
##$ISEN= 128
##$LB= 0.02
##$LEV0= 0
##$LPBIN= 0
##$MAXI= 945.577
##$MC2= 0
##$MEAN= 0
##$ME_mod= 0
##$MI= -402.1523
##$NCOEF= 0
##$NC_proc= 0
##$NLEV= 6
##$NOISF1= 8.587773
##$NOISF2= 6.764455
##$NSP= 1
##$NTH_PI= 0
##$NZP= 0
##$OFFSET= 17.49637
##$PC= 1
##$PHC0= 310.6808
##$PHC1= -2.712526
##$PH_mod= 0
##$PKNL= yes
##$PPARMOD= 0
##$PPDIAG= 0
##$PPIPTYP= 0
##$PPMPNUM= 100
##$PPRESOL= 1
##$PSCAL= 0
##$PSIGN= 0
##$REVERSE= no
##$SF= 200.13
##$SI= 32768
##$SIGF1= 18.5376
##$SIGF2= -6.396296
##$SINO= 400
##$SIOLD= 32768
##$SREGLST= <1H.CDCl3>
##$SSB= 3
##$STSI= 0
##$STSR= 0
##$SW_p= 4401.40845070422
##$SYMM= 0
##$S_DEV= 0
##$TDeff= 0
##$TDoff= 0
##$TI= <>
##$TILT= no
##$TM1= 0
##$TM2= 0
##$TOPLEV= 0
##$USERP1= <user>
##$USERP2= <user>
##$USERP3= <user>
##$USERP4= <user>
##$USERP5= <user>
##$WDW= 1
##$XDIM= 8192
##$YMAX_p= 0
##$YMIN_p= 0
$$ End of Bruker specific parameters
$$ ---------------------------------
##NTUPLES= NMR FID
##VAR_NAME=  TIME,          FID/REAL,        FID/IMAG
##SYMBOL=    X,             R,               I
##VAR_TYPE=  INDEPENDENT,   DEPENDENT,       DEPENDENT
##VAR_FORM=  AFFN,          ASDF,            ASDF
##VAR_DIM=   8192,          8192,            8192
##UNITS=     SECONDS,       ARBITRARY UNITS, ARBITRARY UNITS
##FACTOR=    0.0002272,     1,               1
##FIRST=     0,             0,               0
##LAST=      1.8609952,     -131,            45
##MIN=       0,             -1006490,        -1006490
##MAX=       1.8609952,     636944,          636944
$$ Real data points
##PAGE= N=1
##DATA TABLE= (X++(R..R)), XYDATA
$$ [...]
$$ plain form
2062 -1270 -44 -106 -187 -178 342 736 797 850 -305 419 199 886 873 418 -307 -207 787 669 188 -286 -566
2083 -566 -313 212 -362 -776 -1293 -1033 -618 0 -177 -283 -581 332 913 1460 740 319 605 836 1274 188
2103 188 -578 -704 -639 -721 -583 -381 -1600 -1340 -252 -7 658 151 -34 538 1234 1174 720 97 142 463 299
2124 299 -90 -413 -444 -703 -276 -134 -131 -706 -735 95 466 526 43 -106 -41 277 594 -66 17 -365 128 528
2146 528 480 -53 -206 -440 109 502 38 -626 -687 -288 -196 595 -258 -729 -388 306 359 489 355 75 156 922
2168 922 1193 382 -62 -143 395 -44 -417 -676 -1225 -840 -936 -478 -463 -783 -910 334 719 935 888 493 954
2189 954 1056 879 484 368 9 112 -179 -246 -547 -529 -981 -427 -230 -384 -723 -672 -404 334 654 -12 -152
2210 -152 398 776 532 560 404 355 403 482 627 220 -213 -551 -509 23 -230 -911 -957 -524 -403 -145 -737 -619
$$ packed form
2062a270J226o2q1RN20L94O1N3j155P24k20O87j3m55p25J00R94j18m81m74k80
2083e66K53N25n74m14n17K60M15O18j77j06k98R13N81N47p20m21K86K31M38j086
2103A88p66j26O5q2J38K02j219K60J088K45O65n07j85N72O96o0m54o23M5L21j64
2124B99l89l23l1k59M27J42Ln75k9Q30L71O0m83j49O5L18L17o60Q3l82M93M00
2146E28m8n33j53k34N49L93m64o64o1L99R2P91q53m71L41O94N3J30j34k80Q1P66
2168I22K71q11m44q1N38m39l73k59n49L85r6M58J5l20j27J244L85K16m7l95M61
2189I54J02j77l95j16l59J03k91o7l01J8m52N54J97j54l39N1K68P38L20o66j40
2210a52N50L78k44K8j56m9M8P9J45m07m33l38M2N32k53o81m6M33J21K58n92J18
$$ plain form
2232 -619 -425 64 520 753 485 437 380 1080 1233 181 -47 352 263 471 14 -728 -1178 -849 -713 -630 -856
2253 -856 -846 -812 -484 377 682 182 16 526 907 926 370 443 -114 -12 403 313 145 -696 -376 -227 -257 -167
2275 -167 -487 -751 -220 486 62 -216 -459 -155 249 168 86 343 -232 322 468 438 445 181 -249 497 241 167
2297 167 -71 -320 -682 -32 -35 -427 -785 -274 -60 308 325 -190 -389 361 817 709 218 -406 123 85 -76
2318 -76 1 -289 -386 -613 -237 -101 -135 -366 -557 -110 632 581 315 32 371 496 808 57 -304 -315 45 238
2340 238 -174 -360 -431 -709 -238 71 174 -555 -76 -61 317 509 290 57 225 30 -98 46 -150 -141 -463
2361 -463 472 311 66 -418 -453 97 72 -264 -179 -556 -447 -387 -548 154 63 -313 -6 654 806 473 292 476
2383 476 714 476 167 124 -333 -659 -129 -746 -642 -682 -909 -519 -152 290 -295 -76 -103 684 513 525 704
$$ packed form
2232f19J94M89M56K33k68m8n7P00J53j052k28L99q9K08m57p42m50L29J36Q3k26
2253h56J0L4L28Q61L05n00j66N10L81J9n56P3n57J02M15r0j68q41L20J49l0R0
2275a67l20k64N31P06m24k78k43L04M04q1q2K57n75N54J46l0Pk64m30P46k56p4
2297A67k38k49l62O50ll92l58N11K14L68J7n15j99P50M56j08m91o24N29l8j61
2318g6P7k90r7k27L76J36l4k31j91M47P42n1k66k83L39J25L12p51l61j1L60J93
2340B38m12j86p1k78M71L09J03p29M79J5L78J92k19k33J68j95j28J44j96Rl22
2361d63R35j61k45m84l5N50k5l36Q5l77J09O0j61P02r1l76L07O60J52l33j81J84
2383D76K38k38l09m3m57l26N30o17J04m0k27L90L67M42n85K19k7P87j71J2J79
$$ plain form
2404 704 468 892 523 491 343 -97 -145 -117 -154 -590 -726 -452 -574 -334 110 -99 -543 -200 -198 389 -149 -222
2426 -222 -13 106 583 562 109 110 603 468 238 97 -155 -285 -11 -8 131 -552 -926 -522 -760 -556 -161 -452
2448 -452 -180 218 695 609 486 117 605 503 556 144 64 -243 -94 127 -402 -325 -478 -628 -178 134 -139
2469 -139 -301 -215 -183 386 304 169 -133 49 301 390 17 -122 270 -221 -159 375 331 -46 35 -315 720 -16
2491 -16 -389 -536 12 -131 84 1 -371 -407 525 382 265 331 316 494 602 272 -198 -138 -529 -121 -320 -279
2513 -279 219 -42 -411 188 290 292 304 -31 236 776 404 -128 -187 -52 299 56 63 -527 -429 -239 -315 69 -660
2536 -660 -242 -108 -265 212 23 351 88 224 429 680 286 -18 1 279 299 355 -469 18 -281 -187 212
2557 212 -471 -444 167 48 -191 84 -119 127 115 -188 418 391 207 209 138 569 973 314 48 -118 150 62
$$ packed form
2404G04k36M24l69l2j48m40m8K8l7m36j36K74j22K40M44k09m44L43KN87n38p3
2426b22K09J19M77k1m53JM93j35k30j41k52j30K74LJ39o83l74M04k38K04L95k91
2448d52K72L98M77q6j23l69M88j02N3m12q0l07J49K21n29P7j53j50M50L12k73
2469a39j62Q6L2N69q2j35l02J82K52Q9l73j39L92m91O2N34m4l77Q1l50J035p36
2491a6l73j47N48j43K15q3l72l6R32j43j17O6j5J78J08l30m70O0l91M08j99M1
2513b79M98k61l69N99J02KJ2l35K67N40l72n32n9J35L51k43Pn90R8J90p6L84p29
2536f60M18J34j57M77j89L28k63J36K05K51l94l04J9K78K0N6q24M87k99R4L99
2557B12o83K7O11j19k39K75k03K46j2l03O06k7j84Kp1M31M04o59k66j66K68q8
$$ plain form
2579 62 -272 -650 -763 -370 -79 -256 -323 -465 -162 -19 146 -161 176 148 725 578 467 243 268 425 449 358
2601 358 -91 -390 -441 -521 -395 -446 -381 -815 -426 -19 -297 -265 -119 -196 198 43 615 304 -265 374 55 312
2623 312 264 -40 114 50 -28 18 -110 -250 -300 -200 -57 42 -598 -470 -428 292 75 324 35 79 175 435 604
2646 604 11 326 67 183 239 -137 -217 -384 105 -211 -302 -302 -435 -402 -98 43 12 -153 -226 267 453 256 91
2669 91 15 -45 543 222 79 -314 -277 -158 -161 155 -119 -370 -405 70 316 273 -49 89 -135 439 166 381 -327
2692 -327 -270 -46 -204 186 -16 -526 -236 -388 81 72 -73 -69 -14 346 164 -146 176 -215 83 146 195 26 28
2715 28 266 434 295 -45 -42 39 261 -216 -291 -319 -485 -249 -230 -233 -280 -217 5 -204 407 162 103 388 29 381
2739 381 390 -87 -129 -409 -382 -161 139 -315 -417 -561 -132 -336 -276 -343 -306 -259 127 453 45 119 66 212 171 317
$$ packed form
2579F2l34l78j13L93K91j77o7j42L03J43J65l07L37k8N77j47j11k24K5J57K4r1
2601C58m49k99n1q0J26n1O5m34L89M07k78L2J46p7L94j55N72l11n69O39l19K57
2623C12m8l04J54o4p8M6j28j40n0J00J43R9o40J28M2P20k17K49k89M4R6K60J69
2646F04n93L15k59J16N6l76q0j67M89l16r1%j33L3L04J41l1j65p3M93J86j97j65
2669I1p6o0N88l21j43l93L7J19lL16k74k51l5M75K46m3l22J38k24N74k73K15p08
2692c27N7K24j58L90k02n10K90j52M69rj45MN5L60j82l10L22l91K98O3M9j69K
2715B8K38J68j39l40LQ1K22m77p5k8j66K36J9lm7O3K22k09O11k45n9K85l59L52
2739C81Rm77m2k80K7K21L00m54j02j44M29k04O0o7L7M7L86L26m08P4n3J46m1J46
$$ plain form
2763 317 -32 -339 -46 389 -9 -48 -544 -90 -129 -44 -62 -375 -116 -263 272 0 -154 -103 -228 129 192 -150
2785 -150 231 -56 187 615 180 270 -20 -524 -145 -43 -53 -338 -268 -417 211 -539 -332 28 -68 275 -30
2806 -30 -42 324 489 16 145 191 8 -160 78 166 455 -107 -535 -219 -189 -68 -240 280 -217 -99 61 168
2828 168 337 -86 -147 377 274 85 78 508 183 162 45 199 280 201 191 201 183 75 135 -219 196 261 175 -82
2852 -82 -81 -212 137 102 343 -272 -325 61 281 70 -88 -504 -98 -79 166 -13 -371 -78 38 29 143 -206 182
2875 182 155 -123 96 -14 108 -223 -288 364 308 325 -253 70 -79 -227 20 -44 -97 184 -247 263 31 -235
2897 -235 128 -130 164 264 93 20 367 494 11 -254 -12 -197 296 54 115 -154 -98 15 0 -261 124
2918 124 -473 -459 141 -61 216 432 335 245 363 84 -63 -492 73 469 53 -32 18 -176 -288 -204 75 -274
$$ packed form
2763C17l49l07K93M35l98l9m96M54l9Q5j8l13K59j47N35k72j54N1j25L57O3l42
2785a50L81k87K43M28m35R0k90n04L79J02j0k85P0j49O28p50K07L60r6L43l05
2806c0j2L66J65m73J29M6j83j68K38Q8K89n62m28L16L0J21j72N20m97J18J60J07
2828A68J69m23o1N24j03j89pM30l25k1j17J54Q1p9j0J0j8j08O0l54M15O5q6k57
2852h2Jj31L49l5K41o15n3L86K20k11j58m16M06J9K45j79l58K93J16rJ14l49L88
2875A82k7k78K19j10J22l31o5O52n6J7n78L23j49j48K47o4n3K81m31N10k32k66
2897b35L63k58K94J00j71p3L47J27m83k65K42j85M93k42O1k69N6J13j5k61L85
2918A24n97J4O00k02K77K16r7r0J18k79j47m29N65L96m16q5N0j94j12Q4K79l49
$$ plain form
2940 -274 -458 -444 -179 194 176 72 194 -112 -64 586 -101 198 678 79 388 181 -49 115 407 -186 -46
2961 -46 137 -387 -362 -53 175 143 -197 -386 218 153 -3 228 201 299 40 21 247 36 6 31 -36 278 -153
2984 -153 63 188 -210 -206 177 -157 -197 -288 120 -314 178 259 28 17 -76 545 319 -97 150 239 184 167 -100
3007 -100 -315 99 -338 116 153 -85 115 -271 -67 32 -299 170 62 310 51 197 -295 -220 87 -166 48
3028 48 36 -120 50 -300 74 109 116 -66 -320 -56 232 303 -27 -281 17 -55 -125 -67 -90 10 221 -335 -241 -304
3052 -304 -94 47 111 -25 139 -132 -17 -35 106 -103 151 117 -878 182 222 36 112 146 -254 197 32 -288
3074 -288 51 -281 -110 166 -488 -35 -214 -279 20 -222 71 58 -489 11 797 313 287 -1 208 141 229 307
3096 307 87 210 -218 -316 -69 -521 -392 161 88 -340 -136 37 206 149 -13 -4 72 242 127 354 434 -68
$$ packed form
2940b74j84J4K65L73j8j04J22l06M8O50o87K99M80n99L09k07k30J64K92n93J40
2961d6J83n24K5L09K28l2l40j89O04o5j56K31k7R8k59j9K26k11l0K5o7L14m31
2984a53K16J25l98ML83l34m0r1M08m34M92Q1k31j1r3O21k26m16K47Q9n5j7k67
3007a00k15M14m37M54L7k38K00l86K04R9l31M69j08K48k59J46m92P5L07k53K14
3028D8j2j56J70l50L74L5Pj82k54K64K88P1l30k54K98p2p0N8k3J00K11n56R4o3
3052c04K10J41O4j36J64k71J15j8J41k09K54l4r95J060M0j86P6L4m00M51j65l20
3074b88L39l32J71K76o54M53j79o5K99k42K93j3n47N00P86m84k6k88K09o7Q8P8
3096C07k20J23m28r8K47m52J29N53p3m28K04J73J69n7j62RP6J70j15K27Q0n02
$$ plain form
3118 -68 155 -115 238 -375 40 178 67 141 290 -29 -437 -139 130 0 -339 6 -142 -150 -231 88 47 118
3140 118 27 180 178 334 206 122 -63 -269 -176 161 83 -101 -538 -146 -158 -270 -142 267 -178 211 -256 -91
3162 -91 148 128 271 281 97 451 167 196 271 284 75 -224 -59 68 -382 -127 -336 49 32 -455 -99 230
3184 230 -339 -357 0 412 -30 -390 212 -17 394 -69 -18 247 -191 -134 176 193 -45 -440 -308 -107 -107 -56
3206 -56 212 -50 -119 259 166 89 -198 -53 305 -92 185 170 -41 -190 61 -53 35 35 -118 148 23 -320 -310
3229 -310 -67 298 -291 -129 168 -4 -226 -90 -346 -99 275 -278 -88 -205 232 87 -46 -47 197 129 -194
3250 -194 -145 -437 -152 -115 -100 -198 -163 -343 66 -229 -195 -168 252 -342 -104 386 102 -71 -388 -42 130 79 363
3273 363 97 -172 58 217 291 -180 -6 -116 160 259 173 306 -10 176 -90 -13 30 -15 294 134 80 -93
$$ packed form
3118f8K23k70L53o13M15J38j11P4J49l19m08K98K69j30l39L45j48qq1L19m1P1
3140A18r1J53kJ56j28q4j85k06R3L37p8j84m37L92j2j12J28M09m45L89m67J65
3162i1K39k0J43J0j84L54k84K9P5J3k09k99J65J27m50K55k09L85j7m87L56L29
3184B30n69j8L57M12m42l60O02k29M11m63N1K65m38N7L10J7k38l95J32K01%N1
3206e6K68k62o9L78r3p7k87J45L58l97K77j5k11j49K51j14Q8%j53K66j25l43J0
3229c10K43L65n89J62K97j72k22J36k56K47L74n53J90j17M37j45j33jK44o8l23
3250a94M9k92K85L7J5r8L5j80M09k95L4K7M20n94K38M90k84j73l17L46J72n1K84
3273C63k66k69K30J59P4m71J74j10K76R9q6J33l16J86k66P7M3m5L09j60n4j73
$$ plain form
3295 -93 190 -331 57 106 65 77 -71 332 109 191 280 111 95 281 192 -26 -153 163 96 -253 77 -114 -165
3318 -165 -295 -357 -68 41 -64 -545 -75 -45 289 -46 91 99 143 -41 364 219 -142 -57 58 280 -51 -239
3340 -239 -252 15 -65 -84 -80 -202 -131 93 -99 -158 -176 -271 245 122 -25 165 -102 184 -25 -310 38 400 34
3363 34 -60 131 77 -48 -132 -212 -131 -26 -308 178 -255 59 482 78 12 -173 -20 -10 -8 143 265 -11 -190
3386 -190 -295 0 110 -220 394 -63 297 275 76 -199 23 171 9 88 -28 84 -174 329 -426 -183 -345
3407 -345 -47 -439 82 304 -226 155 165 -3 -9 207 86 102 -114 199 -77 183 207 132 -37 335 227 -37
3429 -37 12 -72 266 -227 21 -79 -432 166 -61 -285 -128 -315 164 -61 281 -164 -166 89 -29 335 -360 153
3451 153 -125 -14 -174 -176 -47 -118 -98 -142 -213 -255 -29 -295 -93 -107 205 -112 -262 269 26 -65 122 26 377
$$ packed form
3295i3K83n21L88M9m1J2j48M03k23Q2Q9j69j6J86q9k18j27L16o7l49L30j91n1
3318a65j30o2K89J09j05m81M70L0L34l35J37QM4j84M05j45l61Q5J15K22l31j88
3340b39j3K67q0j9Mj22P1K24j92n9j8r5N16j23j47J90k67K86k09k85L48L62l66
3363C4r4J91n4j25q4q0Q1J05k82M86m33L14M23m04o6j85J53J0KJ51J22k76j79
3386a90j05K95J10l30O14m57L60k2j99k75K22J48j62P9j16J12k58N03p55K43j62
3407c45K98l92N21K22n30L81J0j68oK16j21J6k16L13k76K60K4p5j69L72j08k64
3429c7M9q4L38m93K48j00l53N98k27k24J57j87M79k25L42m45kK55j18L64o95N13
3451A53k78J11j60kJ29p1K0m4p1m2K26k66K02j4L12l17j50N31k43r1J87r6L51
$$ plain form
3474 377 -289 -35 89 -15 -181 -370 -138 -167 -33 -266 -148 -295 190 94 -141 -306 -104 326 -24 -20 8 173
3496 173 -1 284 73 283 211 102 6 32 -28 81 -428 31 -118 39 101 -178 172 -255 229 -258 50 326
3518 326 131 67 90 255 -60 124 194 33 65 123 -13 -231 -107 -44 45 -246 109 145 -140 -97 167 -210 -43
3541 -43 258 -180 37 -290 19 -27 6 243 -274 -253 -40 -170 52 52 -523 59 17 122 365 60 87 221 43
3564 43 73 -50 72 3 68 -86 136 174 -1 107 -20 25 183 51 -53 156 -257 -31 -45 -310 -195 -76
3586 -76 101 -180 32 84 -247 -77 -217 -169 8 -80 151 -9 296 284 42 119 -3 -469 178 199 -95 -195
3608 -195 151 -50 342 -166 -123 91 44 222 269 -26 -129 -75 88 -48 200 -220 15 -64 93 155 219 261 -49
3631 -49 124 -57 20 120 544 -337 303 247 63 -3 -28 94 497 -188 -460 -311 -54 222 -160 -35 23 18 145
$$ packed form
3474C77o66K54J24j04j66j89K32k9J34k33J18j47M85r6k35j65K02M30l50MK8J65
3496A73j74K85k11K10p2j09r6K6o0J09n09M59j49J57O2k79L50m27M84m87L08K76
3518C26j95o4K3J65l15J84P0j61L2N8j36k18J24O3Q9k91L55L6k85M3K64l77J67
3541d3L01m38K17l27L09m6L3K37n17K1K13j30K22%n75N82m2J05K43l05K7J34j78
3564D3L0j23J22o9O5j54K22L8j75J08j27M5J58j32j04K09m13K26j4k65J15J19
3586g6J77k81K12N2l31J70j40M8J77q8K31j60L05j2k42P7j22m66O47K1k94j00
3608a95L46k01L92n08M3K14m7J78M7k95j03N4J63j36K48m20K35p9J57O2O4M2l10
3631d9J73j81P7J00M24q81O40n6j84o6k5J22M03o85k72J49K57K76l82J25N8nJ27
$$ plain form
3654 145 119 -100 232 46 21 189 273 124 38 -172 -32 -27 -269 -159 266 122 -55 101 -233 -79 39 -45
3676 -45 -67 -316 -45 -304 376 191 159 162 238 167 220 -146 -86 -144 -274 96 373 -38 -34 382 -58 -286 62 96
3700 96 271 -239 74 -124 -230 235 -85 -10 20 0 234 283 74 107 0 330 252 -73 118 316 192 254 -237
3723 -237 112 138 208 52 -57 -4 15 231 173 206 -15 417 39 -145 -47 337 -254 3 -64 -203 85 -232 121
3746 121 -281 48 -345 159 -95 48 155 124 -51 -378 -296 72 146 182 81 410 -46 -230 -25 238 131
3767 131 -158 -35 -195 110 -77 -229 26 -262 157 -76 -60 -209 -1 -92 147 -75 -383 -189 -217 -228 -36
3788 -36 -71 -79 261 75 -279 207 19 -421 -141 -124 -228 -14 46 624 -215 85 187 243 228 59 -106 209 334
3811 334 -285 -77 -27 -98 -149 41 -169 196 166 -10 -11 -83 201 -310 50 447 226 -106 202 -120 -163 48 -187
$$ packed form
3654A45k6k19L32j86k5J68Q4j49q6k10J40Nk42J10M25j44j77J56l34J54J18q4
3676d5k2k49K71k59O80j85l2LP6p1N3l66O0n8j30L70K77m11MM16m40k28L48L4
3700I6J75n10L13j98j06M65l20P5L0k0K34M9k09L3j07L30p8l25J91J98j24O2m91
3723b37L49K6P0j56j09N3J9K16n8L3k21M32l78j84R8L84n91K57o7j39K88l17L53
3746A21m02L29l93N04k54J43J07l1j75l27Q2L68P4L6j01L29m56j84K05K63j07
3767A31k89J23j60L05j87j52K55k88M19k33J6j49K08r1K39k22l08J94k8j1J92
3788c6l5qL40j86l54M86j88m40K80J7j04K14O0N78q39L00J02N6j5j69j65L15J25
3811C34o19K08N0p1n1J90k10L65l0j76jp2K84n11L60L97k21l32L08l22m3K11k35
$$ plain form
3834 -187 251 65 -118 -254 -345 140 -187 -23 -58 92 271 131 -323 229 285 -39 344 100 270 92 65
3855 65 312 251 -178 23 -77 64 8 213 -72 95 -147 -123 169 -302 35 65 -182 630 297 49 -77 288
3877 288 -114 115 -58 143 264 19 -130 -111 7 -58 360 1 -319 223 274 172 -103 126 162 -108 -150 -77
3899 -77 -28 -158 100 331 267 299 167 -499 22 476 -49 -193 -215 -138 -89 -420 -12 54 237 -408 -120 134 295
3922 295 -87 -170 334 -247 -86 86 -103 -47 -167 -192 255 -199 181 -198 -197 -67 -289 -671 -47 457 -4 117
3944 117 -209 -73 114 97 -164 -132 26 226 309 -178 49 156 62 -113 26 -112 283 12 41 205 -112 153
3966 153 -208 27 45 43 64 -140 -570 88 186 -292 -37 -101 114 -223 48 260 -129 -71 -69 136 -130 61 72
3989 72 -2 -169 68 -40 135 -150 -60 -111 -275 -365 -91 249 155 -143 -313 -151 7 232 -230 -214 -277 405 -282
$$ packed form
3834a87M38j86j83j36r1M85l27J64l5J50J79j40m54N52N6l24L83k44J70j78k7
3855F5K47o1m29K01j00J41n6K05k85J67k42K4K92m71L37L0k47Q12l33k48j26L65
3877B88m02K29j73K01J21k45j49J9J18o5M18l59l20N42N1j02k75K29L6k70m2P3
3899g7M9j30K58K31o4L2j32o66N21M54n25j44k2P7M9l31M08O6J83o45K88K54J61
3922B95l82q3N04n81J61J72j89N6j20k5M47m54L80l79JJ30k22l82O24N04m61J21
3944A17l26J36J87j7k61L2J58K00Q3m87K27J07r4j75J39j38L95k71K9J64l17K65
3966A53l61K35J8kK1k04m30O58R8m78K55o4K15l37K71K12l89N8KK05k66J91J1
3989G2p4j67K37j08J75k85R0n1j64r0K74L40r4k98j70J62J58K25m62J6o3O82o87
$$ plain form
4012 -282 -322 -25 61 -40 -225 56 274 4 161 -61 698 50 52 -45 31 121 -400 -276 11 -216 98 222
4034 222 -137 -165 -105 -101 48 -8 86 71 115 -198 83 -131 103 141 -131 384 -70 -172 409 34 -127 36 -430
4057 -430 -69 -323 238 50 39 -364 -7 -131 -122 -80 -2 0 410 9 378 71 -194 205 -221 73 34 167 71
4080 71 -138 -389 -39 252 -243 -238 -281 109 -37 -281 92 96 31 72 541 153 -30 -165 -109 -44 -36 -40 358 -99 195
4105 195 338 -128 -107 304 52 -38 226 -17 108 -91 -101 -46 -313 -305 48 -129 -287 103 232 67 47 -120
4127 -120 -263 70 -87 619 36 -84 39 186 -251 14 -94 -86 369 -199 29 71 -103 -80 -69 -67 113 117 -9
4150 -9 225 93 185 -28 -157 -40 -313 -3 -414 113 75 -90 227 -104 27 -35 -131 -9 120 -178 -119 164
4172 164 -192 131 23 -10 -96 -304 -71 -95 155 41 287 -28 94 -12 -306 139 99 -147 -252 297 -189
$$ packed form
4012b82m0K97Q6j01j85K81K18k70J57k22P59o48Kr7P6R0n21J24K87k27L14J24
4034B22l59k8O0MJ49n6R4j5M4l13K81k14K34L8k72N15m54j02N81l75j61J63m66
4057d30L61k54N61j88j1m03L57j24RM2P8KM10m01L69l07k65L99m26K94l9J33r6
4080G1k09k51L50K91m95Nm3L90j46k44L73Mo5M1M69l88j83j35N6O5QmL98m57K94
4105A95J43m66K1M11k52r0K64k43J25j99j0N5k67QL53j77j58L90J29j65k0j67
4127a20j43L33j57P06n83j20J23J47m37K65j08QM55n68K28M2j74K3J1KJ80Mj26
4150iK34j32R2k13j29J17k73L10m11N27l8j65L17l31J31o2r6J22J29k98N9K83
4172A64l56L23j08l3q6k08K33k4K50j14K46l15J22j06k94M45m0k46j05N49m86
$$ plain form
4193 -189 -478 -28 -242 -54 -84 40 -48 -74 78 -175 1 -302 302 -407 191 150 -17 131 221 -176 -210 -367
4215 -367 -232 170 102 158 164 -79 -3 -54 240 47 -355 -180 -97 -134 -91 208 109 85 28 -76 60 69 286 -90 31
4240 31 -83 -51 17 86 -87 -130 175 227 -76 -50 41 397 230 75 275 -27 183 203 246 103 102 -195 -72 245
4264 245 -128 62 68 -118 -350 293 29 315 -77 -124 76 157 66 37 -55 58 -333 -254 -162 233 -143 -277 156
4287 156 150 -103 216 144 -292 -28 8 -113 77 114 130 -286 17 103 -287 19 -100 -102 -282 -112 154 12 -102
4310 -102 -11 114 -149 -373 -10 -75 -335 239 16 322 -106 -335 -95 19 -102 96 35 -107 277 -292 271
4331 271 -54 -156 192 447 9 223 -96 -59 -183 115 162 104 -294 110 178 -80 218 -16 317 99 23 -209
4353 -209 -152 333 149 -127 326 57 -121 -460 -248 200 -66 -122 383 -56 -187 -162 -72 -104 -132 118 454 -82
$$ packed form
4193a89k89M50k14J88l0J24q8k6J52k53J76l03O04p09N98m1j67J48R0l97l4j57
4215c67J35M02o8N6Ok43P6n1K94j93m02J75Q3l7M3K99r9k4n7j04J36RK17l76J21
4240C1j14L2O8O9j73m3L05N2l03K6R1L56j67j55K00l02K10K0M3j43jk97J23L17
4264B45l73J90Oj86k32O43k64K86l92m7K00Q1r1k9r2J13l91P9R2L95l76j34M33
4287A56ok53L19p2m36K64L6j21J90L7J6m16L03Q6l90L06j19kj80J70K66j42j14
4310a02R1J25k63k24L63o5k60N74k23L06m28k29K40J14j21J98o1j42L84n69N63
4331B71l25j02L48K55m38K14l19L7j24K98M7n8l98M04O8k58K98k34L33k18p6k32
4353b09N7M85j84k76M53k69j78l39K12M48k66n6N05m39j31K5R0l2k8K50L36n36
$$ plain form
4375 -82 1 -259 -158 -187 239 -89 -2 -56 -392 104 -56 394 -211 -4 -36 -74 60 -6 -105 -61 244 -163 -290
4398 -290 -92 343 -179 -4 184 356 -32 64 -20 -294 -464 -178 108 134 8 -426 -143 -254 -267 -136 -108 -223
4420 -223 39 168 -33 90 311 271 -197 96 158 199 48 222 -139 223 -185 303 -96 -81 -161 -71 250 -122
4442 -122 -15 241 233 163 171 159 204 -39 323 -176 176 15 -154 -14 -133 217 -205 -65 71 -122 -234 -114
4464 -114 -417 187 -149 106 -186 63 -78 194 34 -9 -329 -304 35 193 -88 -8 45 -124 175 -314 -84
4485 -84 21 -151 -483 175 -229 -377 -355 -118 -256 232 360 -4 -255 -288 55 73 0 -85 30 129 84 76 235
4508 235 250 120 -112 -51 11 155 233 -99 215 387 -60 148 -279 116 102 81 -97 -286 -274 -144 213 -527
4530 -527 -279 -252 -140 381 225 149 6 -260 12 -240 -237 51 -96 60 -84 18 373 136 51 -399 -287 -7
$$ packed form
4375h2Q3k60J01k9M26l28Q7n4l36M96j60M50o05K07l2l8J34o6r9M4L05m07j27
4398b90J98M35n22J75J88J72l88R6q4k74j70K86K86K6j26m34K83j11j3J31K8j15
4420b23K62J29k01J23K21m0m68K93O2M1j51J74l61L62m08M88l99J5q0R0L21l72
4442a22J07K56qp0Qj2M5k43L62m99L52j61j69J40j19L50m22J40J36j93j12J20
4464a14l03O04l36K55k92K49j41K72j60m3l20K5L39J58k81Q0N3j69K99m89K30
4485h4J05j72l32O58m04j48K2K37j38M88J28l64k51l3L43J8p3q5J15R9m5qJ59
4508B35J5j30k32O1O2J44P8l32L14J72m47K08m27L95j4k1j78j89J2J30L57p40
4530e27K48K7J12N21j56p6j43k66K72k52LK88j47J56j44J02L55k37q5m50J12K80
$$ plain form
4552 -7 -187 237 -192 -187 -109 -271 -109 179 156 -88 -329 -155 25 121 123 192 135 12 147 146 -7 156 -153 -58 91
4577 91 51 -122 -785 180 -95 109 16 72 93 -348 101 98 69 4 383 255 86 -154 296 359 -2 -89 74 -63
4601 -63 118 55 -300 -84 45 51 -69 55 410 -48 145 -86 -145 -370 289 163 -202 -50 4 -294 136 38
4623 38 232 26 -200 72 188 -224 284 142 -156 -494 146 51 139 15 74 117 304 21 1 86 93 -62 -141
4646 -141 264 125 120 58 76 8 -273 -43 -184 -227 -269 121 -191 106 -112 -227 0 74 128 -50 -23 154 -33
4669 -33 -383 127 -14 111 -188 -206 58 -170 116 89 -352 -237 -184 -314 379 -36 -300 -386 51 39 -170 158
4691 158 415 -154 32 286 133 149 -106 -163 -246 163 217 100 271 314 -106 -209 -64 110 282 -10 183 114
4713 114 -170 10 -413 51 -200 241 162 -131 -81 -87 222 166 122 -62 109 -207 118 96 -62 180 -243 -122
$$ packed form
4552gj80M24m29NP8j62J62K88k3k44k41J74J80R6KO9n7j23J35jj53J63l09R5J49
4577I1m0j73o63R65k75K04r3N6K1m41M49lk9o5L79j28j69k40M50O3l61q7J63j37
4601f3J81o3l55K16J29Oj20J24L55m58J93k31n9k25O59j26l65J52N4k98M30r8
4623C8J94k06k26K72J16m12N08j42k98l38O40r5Q8j24N9M3J87k83k0Q5Pj55p9
4646a41M05j39no2J8o8k81K30j41m3m2L90l12K97k18j15K27P4N4j78K7J77j87
4669c3l50N10j41J25k99j8K64k28K86k7m41J15N3j30O93m15k64q6M37j2k09L28
4691A58K57n69J86K54j53J6k55n7q3M09N4j17J71M3m20j03J45J74J72k92J93o9
4713A14k84J80m23M64k51M41p9k93N0oL09n6m4j84J71l16L25k2j58K42m23J21
$$ plain form
4735 -122 -9 -351 51 136 -47 75 -139 133 -356 -237 3 -97 42 92 195 -344 88 89 -81 166 -218
4756 -218 -259 -125 -81 -23 -43 -203 -228 287 80 -81 198 61 45 47 -177 -111 -237 35 -97 82 58 223 -334
4779 -334 35 -27 -16 -421 -92 157 -410 -22 -294 -114 -1 74 -132 -85 159 153 -157 -52 390 455 307 -71
4801 -71 -199 -140 22 -302 -29 -291 -15 -205 24 213 -176 68 155 -25 50 156 105 153 204 265 62 -39 163
4824 163 233 -187 -52 -394 5 -137 -138 463 405 -211 -255 254 -353 -186 -215 181 -29 -23 -326 309 -130 -154 291
4847 291 -5 -259 -390 26 -43 -69 45 -13 142 -567 266 51 199 70 -2 265 -68 -87 90 -279 103 -12
4869 -12 -88 226 -37 71 106 23 -162 61 -320 17 -190 48 96 -50 -118 6 38 -358 40 69 -374 268 117
4892 117 -99 -270 110 133 -2 -25 152 -30 258 146 -11 72 -284 -117 -508 250 -113 553 148 -202 -77
$$ packed form
4735a22J13l42M02Q5j83J22k14K72m89J19K40j00J39N0J03n39M32Jj70K47l84
4756b18m1J34M4N8k0j60k5N15k07j61K79j37j6Kk24O6j26K72j32J79k4J65n57
4779c34L69o2J1m05L29K49n67L88k72J80J13P5k06M7K44ol10J05M42O5j48l78
4801g1j28N9J62l24K73k62K76j90K29J89l89K44Q7j80P5J06n1M8N1O1k03j01K02
4824A63P0m20J35l42L99j42jO01n8o16m4N09o07J67k9L96k10Ol03O35m39k4M45
4847B91k96k54j31M16o9k6J14n8J55p09Q33k15J48j29p2K67l33j9J77l69L82j15
4869a2p6L14k63J08L5q3j85K23l81L37k07K38M8j46o8J24L2l96L98K9m43O42j51
4892A17k16j71L80K3j35k3J77j82K88j12j57Q3l56J67l91P58l63O66m05l50J25
$$ plain form
4913 -77 262 112 175 40 174 -242 156 175 -268 45 356 215 -18 62 272 92 -436 -115 89 174 -29 249
4935 249 187 -326 -80 133 -164 27 73 -337 -48 225 578 -198 -128 159 116 -123 107 308 -97 86 -40
4956 -40 30 195 -188 -263 -20 -16 -244 -241 -2 444 -147 135 -5 141 258 -472 -243 374 111 204 140 128 188 141
4980 141 -205 -11 -343 -160 -39 -151 28 -254 -170 -128 -176 -19 116 98 -171 1 158 -341 58 196 343
5001 343 255 -276 2 64 30 18 -28 111 -89 -49 -138 -228 -238 -195 481 -291 85 142 174 237 0 -202 -30 171
5025 171 8 -209 147 -284 19 -409 -32 -6 -158 -305 -48 -39 -156 237 85 -265 -228 -107 -207 -8 -17 -68
5047 -68 -280 271 -338 36 14 -96 215 14 98 -378 116 -168 185 -139 42 -94 466 -39 -5 66 -79 29
5069 29 170 117 -362 -78 -103 171 100 227 233 -39 234 -154 124 155 35 -104 -103 64 -20 -149 347 542 231
$$ packed form
4913g7L39j50O3j35J34m16L98J9m43L13L11j41k33Q0K10j80n28L21K04Q5k03K78
4935B49o2n13K46K13k97J91M6m10K89K73L53p76P0K87m3k39K30K01m05J83j26
4956d0P0J65l83p5K43Mk28LK39M46n91K82j40J46J17p30K29O17k63R3o4j2O0m7
4980A41l46J94l32J83J21j12J79k82Q4M2m8J57J35j8k69J72J57m99L99J38J47
5001C43q8n31K78O2l4j2m6J39k00M0q9r0j0M3O76p72L76N7L2O3k37k02J72K01
5025A71j63k17L56m31L03m28L77K6j52j47K57Rj17L93j52l50L7J21j00J99rn1
5047f8k12N51o09L74k2j10L11k01Q4m76M94k84L53l24J81j36N60n05L4P1j45J08
5069B9J41n3m79K84k5K74p1J27Ok72K73l88K78L1j20j39JJ67q4j29M96J95l11
$$ plain form
5092 231 10 213 -156 403 -125 0 162 54 239 -128 507 -415 81 -55 163 -116 -391 -153 -162 367 91
5113 91 -341 163 29 106 209 226 -188 207 203 212 -94 26 -325 -186 -191 -254 274 -269 -33 -78 -94 197 198 -52 107
5138 107 -373 -64 198 21 -307 -163 224 -131 286 48 42 -134 -234 125 211 41 205 327 168 204 -4
5159 -4 82 -104 -412 342 -109 94 347 -96 -25 -175 -162 -140 84 269 -127 65 -68 140 -29 56 -2 -443 190
5182 190 -252 0 106 -291 -49 138 30 -157 -345 387 -306 224 320 -13 393 -176 76 -374 78 32 -223
5203 -223 262 235 168 300 -97 61 335 -205 -201 -110 85 125 -151 -62 124 -84 26 43 -370 -72 208 55 -211
5226 -211 -164 -237 14 -113 -282 -129 23 379 -106 -476 102 5 103 -334 110 24 46 105 55 -40 -193 -18 23
5249 23 -249 -302 -160 55 170 374 -26 -165 73 238 -31 -134 -213 452 421 91 -151 -227 -196 -184 292 271 20
$$ packed form
5092B31k21K03l69N59n28J25J62j08J85l67O35r22M96j36K18k79k75K38rN29k76
5113I1m32N04j34P7J03J7m14L95mRl06J20l51J39no3N28n43K36m5j6K91Jk50J59
5138A07m80L09K62j77l28J44L87l55M17k38oj76j00L59Q6j70J64J22j59L6k08
5159dQ6j86l08P54m51K03K53m43P1j50J3K2K24J85l96J92j33K08j69Q5n8m41O33
5182A90m42K52J06l97K42J87j08j87j88P32o93N30R6l33M06n69K52m50M52m6k55
5203b23M85k7o7J32l97J58K74n40MR1J95M0k76Q9J86k08J10J7m13K98K80j53k66
5226b11M7p3K51j27j69J53J52L56m85l70N78r7R8m37M44q6K2N9n0r5j53J75M1
5249B3k72n3J42K15J15K04m00j39K38J65k69j03p9O65l1l30k42p6L1J2M76k1k51
$$ plain form
5272 20 -55 -123 -328 -205 -67 -63 -188 212 149 177 585 -70 -6 -10 103 40 53 -332 251 416 151 -51 -82 99
5296 99 48 102 -90 -400 -230 174 170 -395 345 53 76 -181 -313 -241 -95 71 -408 358 -8 263 -28 -182
5318 -182 10 -289 115 69 -49 376 -326 184 -321 -288 -111 -85 -22 -234 61 33 -56 133 -212 7 -189 -55
5340 -55 98 116 -48 258 302 3 -43 -210 -210 74 248 262 31 -526 -327 -133 -164 -29 118 190 133 -132 239
5363 239 -171 84 -237 -187 18 -8 -102 32 -15 20 -58 200 141 -127 -5 -2 35 -138 -20 -250 239 54 176
5386 176 216 -159 94 -121 -65 -127 -466 185 266 -132 259 156 0 135 -15 -68 -108 -149 -169 -11 -270 -33 3
5409 3 -479 32 255 2 -230 -112 -78 121 45 44 -311 45 317 -170 -5 161 -106 -335 -117 238 -23 181
5431 181 37 -252 -2 -32 -53 -44 240 3 -289 -27 318 -117 -96 139 -263 -173 -62 22 26 -239 -88 124 -113
$$ packed form
5272B0p5o8k05J23J38Mj25M00o3K8M08o55O4mJ13o3J3l85N83J65k65k02l1J81
5296I9n1N4j92l10J70M04mn65P40k92K3k57j32P2J46J66m79P66l66K71k91j54
5318a82J92k99M04m6j18M25p02N10n05L3J77K6O3k12K95k8q9J89l45K19j96J34
5340e5J53J8j64L06M4k99m6j67%K84J74J4k31n57J99J94l1J35J47P2n7k65L71
5363B39m10K55l21N0K05k6r4J34m7L5p8K58n9k68J22LL7j73J18k30M89j85J22
5386A76M0l75K53k15N6o2l39O51Q1l98L91j03j56J35j50n3m0m1k0J58k59K37L6
5409Cm82N11K23k53k32J18L4J99p6jl55L56K72m87J65J66k67k29K18L55k61K04
5431A81j44k89K50l0k1RK84k37k92K62L45m35K1K35m02R0J11Q4Mk65J51K12k37
$$ plain form
5454 -113 -92 -176 -141 -73 -136 -14 -41 79 81 192 115 126 119 115 -151 210 -166 -341 -149 296 -177 176 432 614 328
5479 328 -156 -125 -98 34 -6 132 -89 2 -242 55 -91 -21 218 -207 -177 -393 -74 -145 -236 223 245 2 -225
5502 -225 9 284 234 -418 379 27 -65 -170 -37 -136 209 -69 -150 148 -74 -304 -25 15 95 247 -45 -59
5524 -59 -357 120 72 38 3 203 360 13 78 -279 122 -206 97 -171 85 -98 -183 91 69 322 -190 -30
5546 -30 142 -315 -53 -16 -397 41 114 -105 -13 -25 -22 -143 -30 -38 -112 490 -23 82 318 -184 -272 7 91 169
5570 169 -67 192 73 197 111 266 54 362 -185 107 269 113 -66 173 10 126 -475 59 94 -156 190
5591 190 172 14 -274 -30 -9 265 239 180 -25 -36 108 -137 -28 -72 -22 87 -4 126 -82 -202 -364 296 -231
5614 -231 -23 -77 175 112 -12 70 482 283 -429 198 135 43 121 85 168 -87 237 -101 -571 29 -283 -263 286
$$ packed form
5454a13K1q4L5O8o3J22k7J20KJ11p7J1pmk66L61l76j75J92M45m73L53K56J82k86
5479C28m84L1K7J32m0J38k21R1k44K97j46P0K39m25L0k16L19p1r1M59K2k43k27
5502b25K34K75n0o52P97l52r2j05J33r9L45k78q1K98k22k30K79M0Q0J52k92j4
5524e9k98M77m8l4l5K00J57l47O5l57M01l28L03k68K56j83q5K74k2K53n12J60
5546c0J72m57K62L7l81M38P3k19R2j2Lj21J13qp4O02n13J05K36n02q8K79Q4P8
5570A69k36K59j19J24q6J55k12L08n47K92J62j56j79K39j63J16o01N34L5k50L46
5591A90j8j58k88K44K1K74k6n9k05j1J44k45J09m4N0J09r1J30k08j20j62O60n27
5614b31K08n4K52o3j24Q2M12j99p12O27o3r2P8l6Q3k55L24l38m70O00l12K0N49
$$ plain form
5637 286 29 -106 -80 -212 -131 -107 248 93 120 -108 -339 18 228 132 -106 36 -104 -179 508 14 -14 -89 51
5660 51 22 -117 -77 -447 133 137 -171 136 -466 -168 134 -88 -327 86 142 -68 51 25 60 -101 83 -43 -30
5683 -30 -343 82 -71 -112 -82 -213 85 -100 -371 272 -311 123 -11 -10 -3 208 60 -259 54 -115 -8 210
5705 210 177 54 166 134 -303 26 159 73 -32 -213 71 -258 182 237 -270 118 -202 250 -39 -698 84
5726 84 277 58 -139 126 -161 45 -90 -197 91 -70 57 -233 56 214 -133 341 268 316 131 -1 335
5747 335 18 -416 -275 -79 16 44 -214 -328 226 -134 37 147 324 -47 -434 46 -6 -32 53 -98 210 -124
5769 -124 378 263 -126 63 -7 -92 -199 -32 -105 50 53 -124 -12 -3 -7 -158 167 -105 -360 5 369 -318 44
5792 44 396 -49 -62 32 -262 83 75 -313 169 178 163 -43 -203 67 -36 30 17 -1 -165 -170 23 -204 93 -133
$$ packed form
5637B86k57j35K6j32Q1K4L55j55K7k28k31L57K10r6k38J42j40p5O87m94k8p5J40
5660E1k9j39M0l70N80Ml08L07o02K98L02k22k39M13N6k10J19k6L5j61J84j26J3
5683c0l13M25j53m1L0j31K98j85k71O43n83M34j34JPK11j48l19L13j69J07K18
5705B10l3j23J12l2m37L29J33q6j05j81K84l29M40N5n07L88l20M52k89o59P82
5726H4J93k19j97K65k87K06j35j07K88j61J27k90K89J58l47M74p3M8j85j32L36
5747C35l17m34J41J96R5K8k58j14N54l60J71J10J77l71l87M80n2k6Q5j51L08l34
5769a24N02j15l89J89p0q5j07J67p3J55Lj77J12Rmj51L25k72k55L65L64o87L62
5792D4L52m45j3R4k94L45ql88M82Rj5k06j60K70j03O6j3j8j64nJ93k27K97k26
$$ plain form
5816 -133 -335 144 -363 213 -63 -293 27 198 563 46 -162 64 170 102 -21 242 -152 -99 173 -42 -100
5837 -100 -315 -162 132 159 277 54 -293 84 -97 25 10 -91 -84 202 -79 -193 -86 74 172 -424 153 -34
5859 -34 205 -136 348 88 -200 -205 153 31 155 -8 -275 -105 102 -96 -346 -224 -33 -217 -250 -84 -381
5880 -381 -313 6 55 20 -223 -170 1 -140 -326 385 -131 -284 236 -503 279 -46 -113 -67 -159 -199 12 -102 -216
5903 -216 68 -81 -134 42 -121 -273 15 -154 210 108 111 270 16 -117 103 273 -66 -311 53 4 77 -38
5925 -38 -146 -6 -105 129 -127 60 -107 161 -45 49 226 151 -295 -280 -22 394 -228 230 123 11 -535 36
5947 36 136 -93 -173 -161 29 -64 -137 -110 246 137 -52 -80 -144 -23 -278 72 -163 -218 -240 -33 -8 -165 -21 146
5971 146 290 293 -21 -254 -174 202 -85 -211 -267 -282 254 29 240 243 -16 195 -150 -94 -280 -80 -47 37 56 -38
$$ packed form
5816a33k02M79n07N76k76k30L20J71L65n17k08K26J06o8j23K63l94N3K72k15n8
5837a00k15J53K94K7J18k23l47L77j81J22j5j01PK86k81j14J07J60R8n96N77j87
5859c4K39l41M84k60k88nL58j22J24j63k67J70K07j98k50J22J91j84l3J66k97
5880c81O8L19M9l5k43N3J71j41j86P11n16j53N20p39P82l25o7M6r2m0K11j14j14
5903b16K84j49n3J76j63j52K88j69L64j02LJ59k54j33K20J70l39k45L64m9P3j15
5925c8j08J40r9K34k56J87j67K68k06R4J77p5m46J5K58M16o22M58j07j12n46N71
5947C6J00k29q0J2J90r3p3K7L56j09j89k8o4J21k55L50k35n5k2K07K5j57J44J67
5971A46J44Ll14k33Q0L76k87j26n6j5N36k25K11Lk59K11l45N6j86K00L3Q4J9r4
$$ plain form
5995 -38 94 421 -155 -201 -85 -12 255 -225 -109 -7 22 -204 76 49 -56 27 -240 279 -288 -38 304 -303
6017 -303 -86 -217 17 -42 -44 -116 -170 220 -41 -317 211 323 -7 -135 -394 -231 120 -118 142 -313 64 273
6039 273 79 -456 472 231 306 -227 -65 -149 352 -2 -102 16 69 -408 142 -44 -255 308 156 277 171
6060 171 -191 251 -125 -48 16 302 -79 111 -8 -451 98 -113 -76 -161 -89 -83 -335 137 57 -369 61 -112 304
6083 304 -109 67 -441 365 -86 20 21 -75 -55 50 -22 102 -269 53 -74 -110 242 61 138 112 146 -136 -84
6106 -84 198 -185 -145 -8 -219 26 10 151 -64 9 67 137 3 181 -167 -77 -171 -310 -93 -362 -109 -227 -50
6129 -50 219 188 -21 399 -411 -177 107 -86 17 22 -21 -90 -144 -37 123 443 -42 325 258 233 -110 154 -168
6152 -168 -167 -10 -310 4 -57 -26 -108 50 -284 -458 31 117 -37 -222 -205 -98 -53 -72 -57 -227 -264 48 -180 -304
$$ packed form
5995c8J32L27n76m6J16P3K67m80J16J02K9k26K80k7j05Q3k67N19n67K50L42o07
6017c03K17j31K34n9kp2n4L90k61k76N28J12l30j28k59J63L51k38K60m55L77K09
6039B73j94n35R28k41P5n33J62q4N01l54j00J18N3m77N50j86k11N63j52J21j06
6060A71l62M42l76P7O4K86l81J90j19m43N49k11L7q5P2Ok52M72q0m26M30j73M16
6083C04m13J76n08Q06m51J06Jr6K0J05p2J24l71L22j27l6L52j81P7k6L4k82N2
6106h4K82l83M0J37k11K45j6J41k15P3N8P0j34J78l48R0r4j39K17k69K53j18J77
6129e0K69l1k09M20q10K34K84j93J03Nm3o9n4J07J60L20m85L67o7k5l43K64l22
6152a68JJ57l00L14o1L1q2J58l34j74M89Q6j54j85J7J07M5j9J5j70l7L12k28j24
$$ plain form
6176 -304 -468 -124 -56 66 380 -187 -70 -50 16 0 8 190 264 226 120 -136 78 -119 15 -127 331 -174 87
6199 87 180 -328 -222 217 127 -188 -109 295 -101 -207 -15 20 -245 -90 -275 -75 -321 54 -99 127 -44 51
6221 51 -137 167 124 -91 -472 75 54 65 -16 156 -5 46 249 -58 -11 59 -18 154 -48 -146 106 -41 -123 56
6245 56 291 209 -112 -115 -18 -120 -97 -236 45 114 22 -4 177 -256 -147 159 -186 -153 31 -172 117 45 167 134
6269 134 144 -44 85 -478 -347 91 -2 -77 -374 -105 0 -127 -110 -343 377 -272 35 114 139 114 32 -138 7
6292 7 -165 411 253 -168 -213 -105 36 66 171 -182 -206 103 -77 -246 -423 -330 -220 -93 356 267 107 179 49
6315 49 303 -5 52 -151 225 128 63 39 -30 -227 -58 -89 -390 -328 -56 -214 -221 -161 -246 -137 -19 -232 288 272
6339 272 231 166 -1 -307 -159 -120 -272 -225 -242 229 -174 -127 116 94 -247 324 306 366 80 -231 -100 245 -4
$$ packed form
6176c04j64L44O8J22L14n67J17K0O6j6QJ82P4l8j06k56K14j97J34j42M58n05K61
6199H7R3n08J06M39r0l15P9M04l96j06J92L5k65J55j85K00k46L75j53K26j71R5
6221E1j88L04m3k15l81N47k1J1q1J72j61N1K03l07M7P0p7J72k02r8K52j47q2J79
6245E6K35q2l21lR7j02K3j39K81O9r2k6J81m33J09L06l45L3J84k03K89p2J22l3
6269A34J0j88J29n63J31M38r3p5k97K69J05j27J7k33P20o49L07P9K5k5q2j70J45
6292Gj72N76j58m21m5J08J41L0J05l53k4L09j80j69j77R3J10J27M49q9j60P2j30
6315D9K54l08N7k03L76r7o5k4o9j97J69l1l01O2K72j58pO0q5J09J18k13N20j6
6339B72m1o5j67l06J48L9j52M7j7M71m03M7K43k2l41N71j8O0k86l11J31L45k49
$$ plain form
6362 -4 -25 101 85 291 91 194 -50 75 -36 278 -152 -109 -54 52 122 137 -229 -515 -56 60 108 208 -148
6385 -148 254 -100 -98 75 -50 137 -77 41 294 306 107 -120 229 347 186 -145 -282 94 -209 -26 58
6406 58 -170 146 107 -386 237 30 -19 -147 -61 9 3 -216 176 19 -178 -178 -274 33 -2 43 322 -181 -180 129 224
6431 224 -12 -137 -253 -171 6 -87 -122 -152 -262 78 -227 50 -98 194 -397 -90 302 16 -30 219 145 31
6453 31 -127 -115 350 123 -221 39 56 -436 90 -28 -480 1 277 119 -71 -171 -68 158 414 -251 -360
6474 -360 291 59 -173 -263 -90 -370 -236 204 -91 -183 137 100 52 -5 76 -219 16 295 -95 -95 125 -165 549
6497 549 62 53 182 314 -26 -108 84 -65 -41 151 -140 64 45 157 11 -170 -12 2 -363 -279 15 258
6519 258 53 103 -76 118 331 -178 -169 106 -80 -29 -23 144 256 -48 -52 50 201 145 262 -298 22 -241 -184
$$ packed form
6362dk1J26j6K06k00J03k44J25j11L14m30M3N5J06P0J5l66k86M59J16M8J00l56
6385a48M02l54KJ73j25J87k14J18K53J2j99k27L49J18j61l31j37L76l03J83Q4
6406E8k28L16l9m93O23k07m9j28Q6P0ok19L92j57j97%r6L07l5M5K79n03JL09R5
6431B24k36j25j16Q2J77r3l5l0j10L40l05K77j48K92n91L07L92k86m6K49p4j14
6453C1j58J2M65k27l44K60J7m92N26j18m52M81K76j58j90j00J03K26K56o65j09
6474c60O51k32k32r0J73k80J34M40k95r2L20l7m8n7Q1k95K35K79l90%K20k90P14
6497E49m87rJ29J32l40q2J92j49K4J92k91K04j9J12j46j81J58J4l65Q4K94K43
6519B58k05N0j79J94K13n09RK75j86N1OJ67J12l04mJ02J51n6J17n60L20k63N7
$$ plain form
6542 -184 72 -84 -20 -347 70 192 -42 180 473 -147 180 -209 -187 67 -135 -51 -358 244 -348 221 -277
6563 -277 171 -53 -452 -444 402 -88 175 53 15 -135 -299 223 95 -211 -45 -400 336 -89 -179 -222 102 -171
6585 -171 322 211 -21 -265 -5 225 -22 -155 124 91 502 17 63 96 122 -89 213 -181 215 -92 1 147
6607 147 358 -158 -8 -112 289 28 -61 2 -237 -1 330 -203 49 92 -357 -56 5 -151 -102 -156 -168 60
6629 60 -108 34 -28 288 53 -55 310 268 -15 196 -39 -477 -240 20 142 -282 55 -164 -257 -536 -42
6650 -42 12 -70 -167 -282 122 -230 68 -157 250 45 -57 163 -32 -63 259 -109 -330 169 235 60 22 267
6672 267 -111 93 37 46 27 16 -123 -232 100 -222 610 -239 182 -30 -66 5 -269 -13 -5 342 -5 45 -64
6695 -64 90 345 193 433 -231 158 -148 -373 -276 201 125 115 -28 -203 -25 -222 82 155 220 -172 271 99
$$ packed form
6542a84K56j56O4l27M17J22k34K22K93o20L27l89K2K54k02Q4l07O02n92N69m98
6563b77M48k24l99QQ46m90K63j22l8j50j64N22j28l06J66l55P36m25r0m3L24k73
6585a71M93j11k32k44K60K30k47j33K79l3M11m85M6L3K6k11L02l94L96l07R3J46
6607A47K11n16J50j04M01k61q9O3k39K36L31n33K52M3m49L01O1j56M9n4j2K28
6629F0j68J42o2L16k35j08L65m2k83K11k35m38K37K60J22m24L37k19r3k79M94
6650d2N4q2r7j15M04l52K98k25M07k05j02K20j95l1L22l68k21M99O6j75l8K45
6672B67l78K04n6Rj9j1j39j09L32l22Q32q49M21k12l6P1k74K56QL47l47N0j09
6695f4J54K55j52K40o64L89l06k25R7M77p6j0j43j75J78j97L04P3O5l92M43j72
$$ plain form
6717 99 -180 134 141 169 149 184 10 -420 400 5 -2 61 114 44 276 20 135 212 -111 74 354 210 -187 -184 196
6742 196 17 233 7 -155 -196 -103 66 -134 -57 -213 209 96 248 -438 251 199 -81 55 186 -53 -430
6763 -430 -62 -107 -131 261 329 314 61 190 -229 84 -304 -196 165 -40 49 111 25 21 106 79 -398 115 -112 319
6787 319 -335 -283 -226 -204 216 -105 -238 13 37 434 183 -32 196 202 59 493 77 26 145 12 180 46
6809 46 -425 8 -23 223 -123 -97 118 131 168 -147 -102 -10 -54 -158 -63 181 7 -197 -193 117 50 50 497 179 35
6834 35 22 -140 109 190 -159 -128 138 31 -119 -126 -38 -43 137 -88 144 -240 133 362 196 6 -5 86 -132 211
6858 211 -85 1 35 269 148 -68 -27 101 196 -146 -411 230 297 -100 -96 59 -23 -66 241 -19 -403 -82 -104
6881 -104 60 -266 23 -267 125 95 -359 -185 -99 -15 -42 20 -13 11 -319 328 -220 -144 -137 194 -52 -28 -96 218
$$ packed form
6717I9k79L14PK8k0L5j74m30Q20l95pO3N3p0K32k56J15P7l23J85K80j44l97LL80
6742A96j79K16k26j62m1R3J69k00P7j56M22j13J52o86O89n2k80J36J31k39l77
6763d30L68m5k4L92O8j5k53J29m19L13l88J08L61k05Q9O2q6mQ5k7m77N13k27M31
6787C19o54N2N7K2M20l21j33K51K4L97k51k15K28Oj43M34m16n1J19j33J68j34
6809D6m71M33l1K46l46K6K15J3L7l15M5R2m4j04R5K44j74k04ML10o7%M47l18j44
6834C5j3j62K49Q1l49L1K66j07j50pQ8nJ80k25K32l84L73K29j66j90j1R1k18L43
6858B11k96Q6L4K34j21k16M1J28R5l42k65O41O7l97MJ55q2m3L07k60l84L21k2
6881a04J64l26K89k90L92l0m54J74Q6Q4k7O2l3K4l30O47n48P6PL31k46K4o8L14
$$ plain form
6905 218 -148 -47 150 -67 179 65 94 80 374 -161 -46 222 -35 -131 -150 -159 134 307 148 59 -19 -72 61
6928 61 -44 102 -47 -56 65 -220 -108 -86 96 -37 185 72 -262 206 224 104 -124 -9 353 -137 14 163
6950 163 391 71 -34 212 153 65 107 129 -249 351 -110 -1 140 -113 10 288 -11 68 9 -96 44 -100
6972 -100 -100 -292 156 27 -353 104 177 -209 -64 -147 218 -121 125 370 240 -109 39 39 -109 -97 -185 -7 -41
6995 -41 -181 48 -105 87 163 148 323 11 -375 23 419 -141 -334 -43 221 -110 42 59 41 -63 -160 311
7017 311 -115 -129 424 94 148 110 -189 356 72 -189 -85 -27 94 22 153 26 40 -71 255 253 15 58 38
7040 38 209 60 -61 -345 -175 -120 -47 -199 -261 17 27 124 25 -188 20 132 -129 -67 -67 -287 159 248 -103 257
7064 257 158 -201 -82 -105 -139 -79 132 388 197 -112 176 257 118 -88 409 -23 192 -63 -78 121 -82 24
$$ packed form
6905B18l66J01J97k17K46j14K9j4K94n35J15K68k57r6j9rK93J73j59q9p8n3J33
6928F1j05J46j49rJ21k85J12K2J82j33K22j13l34M68J8j20k28J15L62m90J51J49
6950A63K28l20j05K46n9q8M2K2l78O00m61J09J41k53J23K78k99P9n9j05J40j44
6972a00%j92M48j29l80M57P3l86J45q3L65l39K46K45j30l49J48%j48J2q8J78l4
6995d1j40K29j53J92P6j5J75l12l86L98L96n60j93K91K64l31J52J7j8j04r7M71
7017C11m26j4N53l30N4l8k99N45k84k61J04N8J21p2J31j27J4j11L26kk38M3k0
7040C8J71j49j21k84J70N5P3j52o2K78J0R7r9k13K08J12k61O2%k20M46Q9l51L60
7064B57r9l59J19k3l4O0K11K56j91l09K88Q1j39k06M97m32K15k55j5J99k03J06
$$ plain form
7086 24 6 -143 391 -225 -409 284 -224 4 103 111 156 -68 -449 -225 157 -8 36 -10 100 77 283 -170 336
7109 336 -415 -468 -220 -89 197 17 -190 47 32 -250 393 -81 242 -330 12 331 -230 -293 -99 -9 52 -79
7131 -79 -233 187 57 -191 -98 -56 -52 -48 -100 104 -567 -136 -81 76 87 -337 -71 27 292 148 75 1 -157 -227 -3
7156 -3 139 -11 175 -136 -59 -174 104 196 -80 -261 195 -105 -372 -337 325 189 27 446 4 -128 393 -108
7178 -108 -87 61 -65 66 -43 199 32 199 -210 -8 42 147 -379 -209 -361 27 63 -132 375 -50 94
7199 94 -111 -49 319 -90 -134 -41 372 -77 -114 255 166 -217 -194 -66 -71 -135 -266 20 110 74 -229 -162 86 -76
7223 -76 -120 107 219 -123 25 81 -172 -136 203 -206 -146 183 14 126 321 -66 -269 87 -13 83 -162 5
7245 5 -41 248 30 221 -61 -91 107 -24 -107 -400 134 -63 396 19 26 -93 -116 104 -11 149 211 57 437
$$ packed form
7086B4j8j49N34o16j84O93n08K28R9QM5k24l81K24L82j65M4m6J10k3K06m53N06
7109C36p51n3K48J31K86j80k07K37j5k82O43m74L23n72L42L19n61o3J94R0O1j31
7131g9j54M20j30k48R3M2MMn2K04o71M31N5J57J1m24K66R8K65j44p3p4j58p0K24
7156cJ42j50J86l11P7j15K78R2k76j81M56l00k67L5O62j36j62M19m42j32N21n01
7178a08K1J48j26J31j09K42j67J67m09K02N0J05n26J70j52L88L6j95N07m25J44
7199I4k05O2L68m09m4R3M13m49l7L69q9l83K3J28no4j31K86R0l6l03O7K48j62
7223g6m4K27J12l42J48N6k53L6L39m09O0L29j69J12J95l87k03L56j00R6k45J67
7245Em6K89k18J91k82l0J98j31q3k93N34j97M59l77Pj19k3K20j15J60O2j54L80
$$ plain form
7268 437 178 38 -48 -182 -152 -84 106 -58 89 -181 -244 -54 -216 -194 258 -59 -203 -228 199 -274 37 -90
7290 -90 8 -282 62 7 144 81 112 72 -209 148 -31 -26 291 -37 -378 447 92 -317 26 191 -337 -182 -161
7313 -161 186 -168 -152 -224 205 3 -288 -44 166 -173 219 -14 208 -247 -251 -447 220 -42 158 266 -9
7334 -9 123 225 -303 89 -316 -34 -282 -2 232 171 468 -42 -85 45 -293 -252 288 161 86 57 -28 -434 226
7357 226 234 372 97 132 189 41 6 121 320 -282 29 -45 -386 -127 170 139 -170 -59 -265 344 -112 191
7379 191 -94 -328 -249 -93 -126 152 175 120 252 95 -51 -196 -268 487 168 69 -283 -391 -25 28 68 101 -258
7402 -258 -53 -148 -37 -90 249 45 84 57 -120 116 146 194 -63 224 80 74 -226 -65 227 44 -186 354 -66
7425 -66 298 268 -80 -166 186 -154 26 -323 139 -27 154 -255 523 332 -46 122 -124 -170 177 105 -87 198
$$ packed form
7268D37k59j40q6j34L0O8J90j64J47k70o3J90j62K2M52l17j44k5M27m73L11j27
7290i0R8k90L44n5J37o3L1m0k81L57j79NL17l28l41Q25l55m09L43J65n28J55K1
7313a61L47l54J6p2M29k02k91K44K10l39L92k33K22m55mj96O67k62K00J08k75
7334iJ32J02n28L92m05K82k48K80K34o1K97n10m3J30l38M1N40j27p5k9q5m06O60
7357B26QJ38k75L5N7j48l5J15J99o02L11p4l41K59K97l1l09J11k06O09m56L03
7379A91k85k34P9J56l3K78K3n5J32j57j46j45p2P55l19r9l52j08L66N3M0L3l59
7402b58K05r5J11n3L39k04L9k7j77K36L0M8k57K87j44ol00J61K92j83k30N40m20
7425f6L64l0l48q6L52l40J80l49M62j66J81m09P78j91l78J68k46m6L47p2j92K85
$$ plain form
7447 198 -150 89 -46 162 80 -86 -117 -73 28 -141 -255 -45 -204 144 166 -176 -45 68 -161 164 -174
7468 -174 368 -186 129 -273 85 -265 8 91 -148 301 -304 188 67 -255 123 271 20 391 259 -9
7488 -9 124 165 115 301 -172 -156 -155 -189 259 -3 134 -153 -18 69 11 -131 -97 -254 311 414 72 284 -85 184
7512 184 -82 16 76 -60 114 302 97 -15 103 -296 -266 -160 -171 254 -49 -73 98 96 -456 78 263 133
7534 133 101 164 -17 79 177 -102 278 -211 -283 157 214 30 50 7 -35 -144 90 139 -62 -73 -141 -16 -246 -140
7558 -140 -125 129 381 132 -470 -92 56 108 363 -396 -119 19 -295 -61 -184 -125 -73 -197 -158 -207 423 182
7580 182 -248 230 -400 -39 -20 -151 -57 -188 449 -157 194 -183 -141 -23 -21 -24 -46 -243 190 -124 -184 -229 109
7603 109 32 -50 -137 200 39 -72 390 369 590 -26 103 -79 -64 -253 -122 122 93 -288 11 241 240 -681 30
$$ packed form
7447A98l48K39j35K08q2j66l1M4J01j69j14K10j59L48K2l42J31J13k29L25l38
7468a74N42n54L15m02L58l50K73Q3k39M49o05M92j21l22L78J48k51L71j32k68
7488iJ33M1n0J86m73J6Jl4M48k62J37k87J35Q7n8j42L4j57N65J03l42K12l69K69
7512A84k66R8O0j36J74J88k05j12J18l99L0J06j1M25l03k4J71kn52N34J85j30
7534A33l2O3j81R6R8k79L80m89p2M40N7j84K0m3m2j09K34M9k01j1o8J25k30J06
7558a40J5K54K52k49o02L78J48N2K55p59K77J38l14K34j23N9N2j24L9m9O30k41
7580A82m30M78o30L61J9j31R4j31O37o06L51l77M2J18Klk2j97M33l14o0m5L38
7603A09p7q2q7L37j61j11M62k1K21o16J29j82J5j89J31K44k9l81K99K30jr21P11
$$ plain form
7626 30 150 -81 362 -460 -325 -115 -11 5 15 230 -195 323 223 -335 -57 -61 -29 -10 6 72 -128 291 -344
7649 -344 -103 52 257 -318 -191 -221 8 6 -111 59 83 -30 -99 240 -137 -229 348 30 135 -259 -60 128
7671 128 -45 631 -240 26 116 368 95 11 -39 337 161 -29 133 46 117 -273 310 238 137 511 50 270
7693 270 -139 231 295 35 265 -381 25 -59 -47 -398 136 158 71 10 -117 134 -171 187 -9 -127 332 -31
7715 -31 -38 -126 -200 335 228 13 -37 -211 235 -181 23 206 194 74 67 -35 -225 70 129 193 49 -138 -351 112
7739 112 -138 -8 263 40 -49 -126 -360 -145 -100 -244 0 -14 -203 -81 -228 -189 127 97 239 45 -291 -4
7761 -4 21 -21 -7 299 -20 -121 -44 101 223 -1 -217 -86 -137 101 377 3 -16 -60 235 -7 -129 286 295 -77
7785 -77 -92 51 -75 164 170 73 -246 378 -82 276 38 112 -153 -69 -9 183 -106 87 -55 61 -134 63 144
$$ packed form
7626C0J20k31M43q22J35K10J04J6J0K15m25N18j00n58K78mL2J9J6O6k00M19o35
7649c44K41J55K05n75J27l0K29kj17J70K4j13o9L39l77r2N77l18J05l94J99J88
7671A28j73O76q71K66R0K52k73q4n0L76j76j90J62q7P1l90N83p2j01L74m61K20
7693B70m09L70O4k60K30o46M06q4J2l51N34K2q7o1j27K51l05L58j96j18M59l63
7715c1pq8p4N35j07k15n0j74M46m16K04J83j2j20pj02j90K95N9O4j44j87k13M63
7739A12k50J30K71k23q9p7k34K15M5j44K44j4j89J22j47L9L16l0J42j94l36K87
7761dK5m2J4L06l19j01P7J45J22k24k16J31n1K38K76l74j9m4K95k42j22M15Rl72
7785g7j5J43j26K39Or7l19O24m60L58k38P4k65Q4O0J92k89J93j42J16j95J97Q1
$$ plain form
7808 144 89 -227 -157 -10 -3 144 44 -1 62 -179 -28 329 -313 56 -320 428 138 77 -29 -207 -88 -114 -86
7831 -86 -306 -174 -305 -75 -189 -88 177 -315 -165 171 330 -8 553 -31 43 311 -148 -50 -220 390 137
7852 137 221 -262 -48 -331 182 63 -2 -7 263 212 -449 136 -69 -133 185 -4 -37 -87 117 -47 -65 -150 -385
7875 -385 -155 98 -356 -145 155 165 -233 -140 -120 -187 4 43 207 52 4 276 -126 72 -408 -56 -49 -115 -23
7898 -23 -303 188 -48 -134 -36 219 -60 84 -11 37 60 102 116 -314 8 -51 -201 16 -131 109 67 133 -97 152
7922 152 -108 -519 -94 -1 -7 -23 94 -362 -99 -274 -71 30 299 49 61 263 143 256 183 -89 -158 87
7944 87 267 304 73 562 -95 98 -28 -38 -78 51 -54 78 178 -190 175 32 -184 211 134 57 9 150
7966 150 555 -263 -6 -196 -118 263 -92 84 251 -45 109 239 286 -217 -52 -213 -95 370 98 -287 276
$$ packed form
7808A44n5l16P0J47PJ47j00m5O3k41J51L57o42L69l76P48k90o1j06j78J19k6K8
7831h6k20J32j31K30j14J01K65m92J50L36J59l38N61n84P4K68m59R8j70O10k53
7852A37Q4m83K14k83N13j19o5nK70n1o61N85k05o4L18j89l3n0K04j64j8q5k35
7875c85K30K53m54K11L00J0l98R3K0o7J91L9J64j55m8K72m02J98m80L52Po6R2
7898b3k80M91k36q6R8K55k79J44r5M8K3M2J4m30L22n9j50K17j47K40m2O6k30K49
7922A52k60m11M25R3oj6J17m56K63j75K03J01K69k50J2K02j20J13p3k72o9K45
7944H7J80L7k31M89o57J93j26j0m0J29j05J32J00l68L65j43k16L95p7p7m8J41
7966A50M05q18K57j90P8L81l55J76J67k96J54J30M7n03J65j61J18M65k72l85N63
$$ plain form
7987 276 73 -31 -3 -139 186 -258 -157 156 106 -33 -509 -79 -143 -193 367 -148 -450 -41 -169 -206 -75 -240
8009 -240 -106 351 -171 -287 -94 -23 115 234 194 296 212 -149 102 -124 -11 -14 -102 -263 -7 -367 338 -464
8031 -464 -169 70 -132 222 112 -291 -242 -26 -229 -12 -58 92 -113 -39 -270 -261 289 227 132 306 -337 289
8053 289 -325 218 332 263 -98 -114 -5 15 207 -227 -82 118 -42 -29 -160 -256 -3 -236 -265 193 298 147
8075 147 4 -9 -190 -120 -51 147 -138 184 189 -102 -257 -238 -139 -412 -403 172 -12 -17 184 0 -49 -393 -18 6
8099 6 164 116 -81 74 -141 55 -87 193 297 40 -321 125 61 186 -48 -22 -98 -117 -179 127 -219 -213 -154 -388
8123 -388 121 166 -88 61 76 32 124 -207 320 242 -186 -289 -16 -47 107 131 -44 230 -97 -290 88 133 -40
8146 -40 86 -155 29 -141 -2 -76 211 42 -236 -235 -33 197 -141 -51 6 -152 -265 -44 -292 34 -212 195
$$ packed form
7987B76k03j04K8j36L25m44J01L13n0j39m76M30o4n0N60n15l02M09j28l7J31j65
8009b40J34M57n22j16J93P1J38J19m0J02q4l61K51k26J13lq8j61K56l60P05q02
8031d64K95K39k02L54j10m03M9K16k03K17m6J50k05P4k31RN50o2r5J74o43O26
8053B89o14N43J14o9l61j6J09K0J92m34J45K00j60J3j31r6K53k33k9M58J05j51
8075A47j43j3j81P0O9J98k85L22Nk91j55J9R9k73RN75j84nK01j84m9l44L75K4
8099FJ58m8j97J55k15J96j42K80J04k57l61M46o4J25k34K6p6j9o2L06l46ON9k34
8123c88N09M5k54J49J5m4R2l31N27p8m28j03K73l1J54K4j75K74l27j93L78M5j73
8146d0J26k41J84j70J39p4K87j69k78JK02K30l38R0N7j58j13K21k48L26k46M07
$$ plain form
8168 195 128 -171 84 39 -4 545 -20 221 39 44 180 -245 318 151 -211 430 205 202 293 -117 97 -266 -131
$$ packed form
8168A95o7k99K55m5m3N49n65K41j82NJ36m25N63j67l62O41k25lR1m10K14l63J35
8191a31
$$ Imaginary data points
##PAGE= N=2
##DATA TABLE= (X++(I..I)), XYDATA
$$ plain form
0 0 0 0 0 0 0 0 0 0 0 0 0 0 0 0 64 -64 64 -64 64 -128 128 -128 192 -192 256 -257 320 -384 448 -512 576
31 576 -641 757 -833 961 -1086 1214 -1345 1490 -1667 1857 -2062 2299 -2536 2810 -3100 3422
47 3422 -3774 4155 -4578 5040 -5552 6123 -6757 7470 -8280 9193 -10240 11474 -12918
60 -12918 14667 -16817 19538 -23108 28028 -35254 46974 -69139 126138 -591321 -1006490
71 -1006490 277404 366458 -262835 -450664 310186 636944 339190 122215 405506 443348
81 443348 157975 50218 311458 241494 -243879 -495126 -182264 -19058 -313094 -491965
91 -491965 -181045 15653 -161890 -204122 92709 154359 -101800 -99934 254659 344224 72773
102 72773 -22228 202788 279643 68846 -49785 89390 153256 -24183 -147204 -18506 63669
$$ packed form
0@%%%%%%%%%%%%%%O4j28J28j28J28j92K56k56L20l84M48n13N77p04Q32r60J088
31E76j217J398j590J794k047K300k559K835l157L524l919M361m835N346n910O522
47C422p196P929q733R618j0592J1675j2880J4227j5750J7473j9433K1714k4392
60a2918K7585l1484L6355m2646N1136o3282Q2228j16113J95277p17459m15169
71a006490J283894Q9054o29293j87829P60850L26758k97754k16975K83291L7842
81D43348k85373j07757K61240o9964m85373k51247L12862J63206k94036j78871
91d91965L10920J96698j77543m2232K96831O1650k56159J866L54593Q9565k71451
102G2773r5001K25016P6855k10797j18631J39175O3866j77439j23021J28698Q2175
$$ plain form
113 63669 -115048 -263954 -142663 -29608 -134316 -199741 -88064 -77492 -197209 -104819 160169
124 160169 167428 -44399 -2124 299911 384271 157234 26267 152370 246403 130636 -8488
135 -8488 -26528 -60932 -194831 -243927 -140175 -133512 -302160 -313252 -45834 106898 -46610
146 -46610 -128192 79333 233879 120874 35696 159474 237988 118301 22910 90775 131223
157 131223 10288 -106079 -60457 13750 -55203 -151411 -98038 -14209 -84962 -168742 -62550
168 -62550 63121 -23064 -143677 -42422 124114 99168 -9304 16425 111868 121409 83485
179 83485 83719 77965 23719 -4645 42048 63632 -28032 -137245 -113197 -19404 -34918 -140197
191 -140197 -153864 -66049 -23955 -32217 3444 44649 20319 16663 100622 149935 78988 14984
$$ packed form
113F3669j78717j48906J21291J13055j04708o5425J11677J0572j19717R2390K64988
124A60169P259k11827M2275L02035Q4360k27037j30967J26103R4033j15767j39124
135h488j8040l4404j33899m9096J03752O663j68648j1092K67418J52732j53508
146d6610q1582K07525J54546j13005q5178J23778P8514j19687r5391O7865M0448
157A31223j20935j16367M5622P4207o8953r6208N3373Q3829p0753q3780J06192
168f2550J25671q6185j20613J01255J66536k4946j08472K5729R5443R541l7924
179H3485K34n754n4246k8364M6693K1584r1664j09213K4048R3793j5514j05279
191a40197j3667Q7815M2094q262L5661M1205k4330l656Q3959M9313p0947o4004
$$ plain form
203 14984 58218 110029 68502 -3893 -20683 -12892 -42325 -78080 -64714 -42226 -76767 -114959
215 -114959 -66582 8706 -6612 -58412 -23132 48946 40919 8980 53262 99866 55952 7898
227 7898 52930 102321 47724 -38777 -39625 13785 12283 -45082 -71342 -47451 -37644 -56196 -44815
240 -44815 -10043 -23346 -61775 -28118 54036 62458 -667 -12139 46927 76745 46526 18841
252 18841 18223 17563 14811 22243 23656 -3774 -39207 -40617 -10976 -1254 -37881 -71513 -54708 -17765
266 -17765 -8771 -19435 -20460 -12790 698 27001 47494 39415 26378 35669 51962 51069 40054
279 40054 24168 -1890 -23382 -19515 -9190 -24818 -55854 -63973 -38556 -12397 -12917 -27461 -21953
292 -21953 1116 16969 22367 33153 33722 12897 3847 29327 44356 10736 -28375 -19832 12374
$$ packed form
203A4984M3234N1811m1527p2395j6790P791k9433l5755J3366K2488l4541l8192
215a14959M8377P5288j5318n1800L5280P2078q027l1939M4282M6604m3914m8054
227G898M5032M9391n4597q6501q48N3410j502n7365k6260K3891R807j8552J1381
240d4815L4772j3303l8429L3657Q2154Q422o3125j1472N9066K9818l0219k7685
252A8841o18o60k752P432J413k7430l5433j410K9641R722l6627l3632J6805L6943
266a7765Q994j0664j025P670J3488K6303K0493q079j3037R291J6293q93j1015
279D0054j5886k6058k1492L867J0325j5628l1036q119K5417K6159n20j4544N508
292b1953K3069J5853N398J0786N69k0825r050K5480J5029l3620l9111Q543L2206
$$ plain form
305 12374 18195 -2542 -14724 -9561 -917 3505 6196 2143 -17102 -33332 -20452 7979 4048
318 4048 -32645 -44406 -10836 20251 11203 -5464 2356 21122 31106 34986 36477 28348 10049
331 10049 -561 7060 13811 -5821 -38481 -45348 -20380 -3198 -14461 -29328 -22739 -4314 8492
344 8492 14050 14398 8687 1817 6518 18207 19515 1569 -21109 -21171 1623 15920 2485 -13732
358 -13732 -5229 15782 25941 21663 11897 2684 -1905 2110 7662 -366 -23777 -40675 -32611 -10672
372 -10672 -7099 -25735 -34956 -12780 16084 23031 17245 17495 22998 26147 28106 29455 20271 -195
386 -195 -14049 -6918 5541 -1185 -25057 -35626 -19774 -357 -1643 -12952 -15734 -7972 1220 9107
400 9107 12040 3412 -10143 -9783 6620 19630 9973 -8777 -8746 15029 32186 23427 5889 1075
$$ packed form
305A2374N821k0737j2182N163Q644M422K691m053j9245j6230J2880K8431l931
318D048l6693j1761L3570L1087r048j6667P820J8766R984L880J491q129j8299
331A0049j0610P621O751j9632l2660o867K4968J7182j1263j4867O589J8425J2806
344H492N558L48n711o870M701J1689J308j7946k2678o2K2794J4297j3435j6217
358a3732Q503K1011J0159m278r766r213m589M015N552q028k3411j6898Q064K1939
372a0672L573j8636r221K2176K8864O947n786K50N503L149J959J349r184k0466
386a95j3854P131J2459o726k3872j0569J5852J9417j286j1309k782P762R192P887
400I107K933q628j3555L60J6403J3010r657j8750L1K3775J7157q759j7538m814
$$ plain form
414 1075 8354 13534 9744 -636 -16434 -28294 -25445 -13227 -11934 -29323 -41880 -27962 1435
427 1435 15681 6781 1179 15703 35134 40022 33228 26002 19061 11454 8568 9531 1519 -19504
441 -19504 -34896 -29753 -15253 -13056 -26677 -32813 -19515 -108 7950 5219 4667 6610 10877 18379
455 18379 24445 19858 4177 -3726 7662 21376 16146 -4023 -14220 -3721 9056 5187 -9252
468 -9252 -17356 -16166 -11832 -6366 -4789 -13752 -25943 -22204 -287 15571 6668 -7510 1413 26486
482 26486 38195 26916 12431 11656 16821 14926 7671 -1675 -15705 -28044 -26526 -16421 -15658 -28957
496 -28957 -35831 -20995 998 9552 4795 3894 13721 25328 29921 28832 21795 11900 6208 8019
510 8019 10279 1938 -15217 -24110 -18155 -8688 -9418 -18484 -24244 -17385 -4734 2613 2443 -1549 -2655
$$ packed form
414A075P279N180l790j0380j5798j1860K849J2218J293j7389j2557J3918K9397
427A435J4246q900n602J4524J9431M888o794p226o941p607k886R63q012k1023
441a9504j5392N143J4500K197j3621o136J3298J9407Q058k731n52J943M267P502
455A8379O066m587j5681p903J1388J3714n230k0169j0197J0499J2777l869j4439
468i252q104J190M334N466J577q963j2191L739K1917J5858q903j4178Q923K5073
482B6486J1709j1279j4485p75N165j895p255r346j4030j2339J518J0105P63j3299
496b8957o874J4836K1993Q554m757r01R827J1607M593j089p037r895n692J811
510H019K260q341j7155q893N955R467p30r066n760O859J2651P347j70l992j106
$$ plain form
525 -2655 2561 12034 19374 15926 4024 189 12442 25479 19822 15 -9601 -77 10032 2806
539 2806 -14015 -21691 -19662 -15791 -13199 -11949 -15965 -22355 -17441 2849 18039 11423 130 7945
553 7945 28755 36511 24638 12068 11180 12913 8795 2215 -4412 -15477 -27467 -25861 -15965 -14842
567 -14842 -27428 -32660 -18435 -237 4219 1383 4615 13703 19766 23662 27629 26302 15446 7493
581 7493 12308 19431 10595 -9233 -20146 -13612 -6202 -11101 -22145 -27416 -22827 -13856 -6107 -4655
595 -4655 -8347 -10028 -1511 12240 20452 15514 6727 8273 20761 28850 22446 7587 484 5751
609 5751 11060 5091 -8974 -18771 -19495 -15728 -14238 -16805 -22384 -26145 -20323 -5434 4890 2221 -2304
624 -2304 5628 22248 29866 24042 18587 18697 18642 15235 11546 7282 -3903 -17942 -20314 -11856 -10388
$$ packed form
525b655N216R473P340l448j1902l835J2253J3037n657j9807r616R524J0109p226
539B806j6821p676K029L871K592J250m016o390M914K0290J5190o616j1293P815
553G945K0810P756j1873j2570q88J733m118o580o627j1065j1990J606R896J123
567a4842j2586n232J4225J8198M456k836L232R088O063L896L967j327j0856p953
581G493M815P123q836j9828j0913O534P410m899j1044n271M589Q971P749J452
595d655l692j681Q517J3751Q212m938q787J546J2488Q089o404j4859p103N267
609E751N309n969j4065r797p24L767J490k567n579l761N822J4889J0324k669m525
624b304P932J6620P618n824n455J10n5l407l689m264j1185j4039k372Q458J468
$$ plain form
639 -10388 -23547 -32778 -23194 -6234 -1280 -6026 -4775 3240 10033 14226 19000 19233 10563 4329 11295
654 11295 20152 13267 -4620 -11489 -1619 5924 -498 -11563 -13918 -10371 -6910 -3890 -4176 -9425 -15319
669 -15319 -11048 1657 7311 -614 -7973 -1392 13217 18261 13074 7537 7945 11606 13859 11630 4761
684 4761 -4892 -10457 -8745 -5172 -8859 -17692 -22444 -17119 -6103 490 -1192 -4379 266 11590 19140
699 19140 17578 10374 7112 8147 9543 7503 1887 -6907 -13102 -11881 -4320 -2068 -10103 -15928 -8884
714 -8884 3927 8216 3226 -711 1470 5504 7230 7982 4297 -3616 -6696 -145 7569 4325 -7171
729 -7171 -9998 487 9101 5755 -2466 -3994 -1590 1205 1841 689 -5070 -10705 -9125 566 6105
744 6105 -105 -6631 -2353 9316 14810 9822 3078 1958 5282 6856 3497 -2109 -8959 -13151 -10428
$$ packed form
639a0388j3159r231R584J6960M954m746J251Q015O793M193M774K33q670o234O966
654A1295Q857o885j7887o869R870P543o422j1065k355L547L461L020k86n249n894
669a5319M271J2705N654p925p359O581J4609N044n187n537M08L661K253k229o869
684D761r653n565J712L573l687q833m752N325J1016O593j682l187M645J1324P550
699A9140j562p204l262J035J396k040n616q794o195J221P561K252q035n825P044
714h884J2811M289m990l937K181M034J726P52l685p913l080O551P714l244j1496
729g171k827J0485Q614l346q221j528K404K795O36j152n759n635J580R691N539
744F105o210o526M278J1669N494m988o744j120L324J574l359n606o850m192K723
$$ plain form
759 -10428 -5619 -5440 -10812 -13245 -6715 4164 9850 6691 3556 6252 12352 14948 11886 5735 -466
774 -466 -2765 -903 528 -3600 -11758 -15095 -9403 -1032 -121 -5204 -7513 -1953 5356 8177 4426 696
790 696 -617 1580 5142 6220 1940 -3882 -4453 2237 8373 5718 -2842 -5442 1199 7249 4837 -3672
806 -3672 -8084 -5598 -2774 -2643 -4199 -6904 -9111 -6379 1074 7197 4730 -1249 867 10579 14933
821 14933 9505 1968 584 2701 2568 173 -2786 -7527 -11816 -9674 -2236 -8 -6166 -10308 -3276
836 -3276 6906 8454 2762 103 3382 6498 6557 5372 2004 -2769 -4455 -970 3390 578 -7067
851 -7067 -8165 -1252 5014 3233 -2151 -4041 -660 3359 4698 1809 -2837 -4443 -1857 2348 2866
866 2866 -1371 -5087 -4390 1448 6116 3701 -2651 -4139 584 5326 4426 -1105 -3654 -2763 186 2605
$$ packed form
759a0428M809J79n372k433O530J0879N686l159l135K696O100K596l062o151o201
774d66k299J862J431m128q158l337N692Q371R11n083k309N560P309K821l751l730
790F96j313K197L562J078m280n822n71O690O136k655q560k600O641O050k412q509
806c672m412K486K824J31j556k705k207K732P453O123k467n979K116R712M354
821A4933n428p537j384K117j33k395k959m741m289K142P438K228o158m142P032
836c276J0182J548n692k659L279L116N9j185l368m773j686L485M360k812p645
851g067j098O913O266j781n384j890L381M019J339k889m646j606K586M205N18
866B866m237l716O97N838M668k415o352j488M723M742r00n531k549Q91K949K419
$$ plain form
882 2605 1585 -2414 -5110 -3484 3756 6747 2135 -4136 -2570 4489 6618 1315 -3735 -4536 -2244
897 -2244 -1030 -723 -2003 -5225 -6889 -3022 3542 5061 -94 -3079 1875 9096 9564 4080 1238 1724
913 1724 3321 3529 1616 -2173 -6617 -7813 -4478 -1208 -3755 -8842 -9766 -2649 3262 3687 -442 -1321
929 -1321 2990 6999 8524 6542 3424 702 1556 5204 5454 367 -6020 -5588 -442 2487 -1781 -7541
945 -7541 -7151 -2593 211 -213 -2843 -4402 -3639 -442 3616 3869 716 -1702 1652 7646 9067 5188
961 5188 845 1904 5615 6296 2270 -2466 -4925 -4899 -4067 -3860 -6179 -9714 -10442 -6530 -445 1349 -1828
978 -1828 -2830 2321 9040 10823 7693 4715 4732 6350 6905 4375 168 -4874 -6455 -3540 -1433 -3763
994 -3763 -9241 -9755 -3980 1624 855 -2809 -2800 1157 4125 4685 3532 1237 -667 851 4161 5548 1592
$$ packed form
882B605j020l999k696J626P240K991m612o271J566P059K129n303n050q01K292
897b244J214L07j280l222j664L867O564J519n155k985M954P221M68n484k842M86
913A724J597K08j913l789m444j196L335L270k547n087r24P117N911M25m129q79
929a321M311M009J525j982l118k722Q54L648K50n087o387M32N146K929m268n760
945g541L90M558K804m24k630j559P63L197M058K53l153k418L354N994J421l879
961E188m343J059L711O81m026m736k459K6Q32K07k319l535p28L912O085J794l177
978a828j002N151O719J783l130k978J7J618N55k530m207n042j581K915K107k330
994c763n478n14N775N604p69l664RL957K968N60j153k295j904J518L310J387l956
$$ plain form
1011 1592 -3088 -2026 2697 5083 1801 -3063 -3726 -734 709 -234 -3711 -6149 -6512 -3598 -572 335
1027 335 -2963 -4224 -55 6060 7554 4465 1980 3071 6701 6881 3757 -643 -3525 -3760 -2312 -2084
1043 -2084 -4356 -7425 -8406 -3769 1585 1748 -808 -1671 2505 7287 7833 4188 1301 974 1743 1935 976
1060 976 -2089 -5934 -6132 -2140 698 -502 -4667 -4542 538 4522 3860 352 -1060 501 2390 3248
1076 3248 1790 -1115 -3115 -2115 1646 3058 -67 -3426 -2207 2602 4285 1182 -2395 -3114 -1176
1091 -1176 -5 -309 -2878 -4714 -4676 -1904 2265 2909 228 -902 2556 7087 7897 4148 644 1080
1107 1080 2927 2391 -269 -3752 -6465 -6782 -4829 -3255 -3516 -6054 -5557 -916 4650 5033 2486 1509
1123 1509 4397 7326 7160 3696 1231 -264 -224 1072 730 -2596 -5809 -5613 -1472 931 -1200 -5045
$$ packed form
1011A592m680J062M723K386l282m864o63K992J443r43l477k438l63K914L026R07
1027C35l298j261M169O115J494l089k485J091L630J80l124m400k882k35J448K28
1043b084k272l069r81M637N354J63k556q63M176M782N46l645k887l27P69J92r59
1060I76l065l845j98L992K838j200m165J25N080L984o62l508j412J561J889Q58
1076C248j458k905k000J000L761J412l125l359J219M809J683l103l577p19J938
1091a176J171l04k569j836L8K772M169O44k681j130L458M531Q10l749l504M36
1107A080J847n36k660l483k713l17J953J574k61k538M97M641N566L83k547r77
1123A509K888K929j66l464k465j495M0J296l42l326l213J96M141K403k131l845
$$ plain form
1139 -5045 -4079 -406 2086 861 -1293 -2272 -1143 1375 3000 2602 546 -911 1204 5011 5638 2721
1155 2721 -549 328 2489 3074 163 -3838 -4831 -4258 -2519 -2858 -4451 -5663 -5356 -1658 1683 2788
1171 2788 1013 -59 2645 7276 7596 4605 1018 1267 2570 2607 116 -2858 -4464 -4911 -2592 -660
1187 -660 -1846 -4881 -4785 -1152 2744 2559 -411 -1708 973 3427 3557 1265 44 -675 468 1834
1203 1834 2292 262 -2186 -2034 1373 3673 854 -2717 -2550 381 1444 539 -1788 -2908 -2586 -125
1219 -125 1157 679 -1296 -2263 -378 3271 3911 972 -881 -115 2426 3188 1021 -1652 -2480 -1338 206
1236 206 398 -1018 -2593 -2832 -107 2475 1952 -195 -1594 813 3725 3177 811 -1387 -1614 55
1252 55 305 31 -2143 -3765 -2880 -394 1724 369 -1874 -1756 1505 4623 3703 641 43 1265 2043
$$ packed form
1139e045R66L673K492j225k154r79J129K518J625l98k056j457K115L807O27k917
1155B721l270Q77K161N85k911m001r93N73J739l39j593j212L07L698L341J105
1171B788j775j072K704M631L20k991l587K49J303L7k491k974j606m47K319J932
1187f60j186l035R6L633L896j85k970j297K681K454J30k292j221p19J143J366
1203A834M58k030k448J52L407K300k819l571J67K931J063r05k327j120L22K461
1219a25J282m78j975r67J885L649O40k939j853P66K541P62k167k673q28J142J544
1236B06J92j416j575k39K725K582n23k147j399K407K912n48k366k198k27J669
1252E5K50k74k174j622Q85K486K118j355k243J18L261L118r20l062n98J222P78
$$ plain form
1269 2043 2690 578 -2069 -2765 -1959 -335 -301 -2580 -4317 -3328 -17 2151 599 -1552 -1208 1521 3196
1286 3196 2783 867 -494 144 1657 2700 1498 -572 -1750 -518 1927 2240 -502 -2802 -2285 325
1302 325 767 -1372 -3003 -3321 -2004 -633 -51 -423 -1518 -1732 1248 4483 4358 1869 854 2215 4776
1319 4776 4058 1388 -1251 -1724 -1389 -721 -1738 -4056 -5175 -4901 -1813 64 -501 -2217 -1689 2211 4429
1336 4429 4069 1569 1154 1904 3651 2799 1189 -1285 -2185 -1170 8 429 -1305 -3380 -2494 143 1270
1353 1270 32 -2078 -1832 -253 1670 871 -211 -1619 -879 165 1622 2028 27 -721 1123 3196
1369 3196 3762 1111 -753 -495 756 742 -805 -2901 -3472 -3241 -1296 -687 -1221 -2300 -1967 969 3593
1386 3593 3576 1638 705 1749 3181 2750 727 -1635 -1872 -1394 -430 -915 -2651 -3659 -2531 -159 1717
$$ packed form
1269B043O47k112k647o96Q06J624L4k279j737R89L311K168j552k151L44K729J675
1286C196m13j916j361O38J513J043j202k070j178J232K445L13k742k300N17K610
1302C25M42k139j631l18J317J371N82l72j095k14K980L235j25k489j015J361K561
1319D776p18k670k639m73L35O68j017k318j119K74L088J877n65j716N28L900K218
1336D429l60k500m15P50J747q52j610k474r00J015J178M21j734k075Q86K637J127
1353A270j238k110K46J579J923p99j082j408P40J044J457M06k001p48J844K073
1369C196N66k651j864K58J251j4j547k096n71K31J945O09n34j079L33K936K624
1386C593j7j938r33J044J432m31k023k362k37M78R64m85j736j008J128K372J876
$$ plain form
1403 1717 1168 -855 -19 2156 3655 2619 134 -992 -437 629 254 -722 -2106 -3020 -1892 61
1419 61 994 -546 -1960 -1030 1909 2707 1032 -786 -505 358 993 902 -292 -1560 -936 334 1848 1786
1437 1786 -174 -1282 240 1881 1750 -316 -2353 -2103 -885 -390 -1414 -2921 -2897 -1687 294 1403
1453 1403 1822 736 839 3194 4703 3722 1628 -60 559 1437 360 -1560 -3225 -3668 -3235 -2072 -1848
1470 -1848 -2787 -3539 -1761 1123 2370 1620 777 737 2745 3871 2753 1265 386 447 1116 1204 -7 -1496
1488 -1496 -2743 -1559 76 16 -1814 -2686 -2169 -196 -119 -1015 -2239 -1959 -539 934 1535 620 481 919
1506 919 2724 4132 3564 1547 105 1244 1850 1445 -1358 -2794 -2940 -2212 -1729 -2581 -3345 -3475 -2214
1523 -2214 -156 1156 944 12 1207 3115 4741 3322 1562 543 1377 1607 1032 -736 -1640 -2333 -1484
$$ packed form
1403A717n49k023Q36K175J499j036k485j126N55J066l75r76j384r14J128J953
1419F1R33j540j414R30K939P98j675j818K81Q63O35r1j194j268O24J270J514o2
1437A786j960j108J522J641j31k066k037K50J218M95j024j507K4J210J981J109
1453A403M19j086J03K355J509r81k094j688O19Q78j077j920j665m43M33J163K24
1470a848r39p52J778K884J247p50q43m0K008J126j118j488q79O1O69Q8j211j489
1488a496j247J184J635o0j830q72N17J973P7q96j224K80J420J473O01r15j39M38
1506I19J805J408n68k017j442J139O06m05k803j436j46P28M83q52p64j30J261
1523b214K058J312k12r32J195J908J626j419j760j019Q34K30n75j768r04o93Q49
$$ plain form
1540 -1484 -687 -794 -2032 -2818 -2330 -5 891 206 -1412 -709 633 2063 1548 707 -60 402 1617 1684
1558 1684 1435 -375 -864 82 1591 1146 -714 -2133 -1537 -118 245 -1162 -1727 -2127 -1144 562 803
1575 803 507 -539 29 1456 2843 2377 113 -402 739 1490 1155 -781 -1584 -1715 -1082 -525 -944 -1876
1593 -1876 -2125 -832 495 1777 1202 -123 533 2130 2798 2072 -130 -1058 -410 824 117 -859 -2171
1610 -2171 -2128 -1514 -346 -86 -678 -1766 -646 970 2129 1340 7 -5 1428 2021 1425 389 -772
1627 -772 -523 147 774 -116 -1722 -2039 -857 131 226 -1037 -1696 -1012 200 931 -158 -958 -428 387 1363
1646 1363 1628 1384 135 306 1746 2187 1777 -75 -1234 -276 561 -173 -1374 -2883 -2383 -1930 -1340 -1081
1664 -1081 -1796 -1888 -925 1234 2608 1623 1162 991 2777 3815 2226 1070 -109 26 -73 -401 -1248 -2695
$$ packed form
1540a484P97j07j238p86M88K325Q96o85j618P03J342J430n15q41p67M62J215O7
1558A684k49j810m89R46J509m45j860j419N96J419L63j407n65m00R83J706K41
1575H03k96j046N68J427J387m66k264n15J141P51l35j936q03j31O33N57m19r32
1593a876k49J293J327J282n75j325O56J597O68p26k202r28O48J234p07r76j312
1610b171M3O14J168K60n92j088J120J616J159p89j333j2J433N93n96j036j161
1627g72K49O70O27q90j606l17J182R88R5j263o59O84J212P31j089q00N30Q15R76
1646A363K65k44j249J71J440M41m10j852j159R58Q37p34j201j509N00M53N90K59
1664a081p15r2R63K159J374r85m61j71J786J038j589j156j179J35r9l28q47j447
$$ plain form
1682 -2695 -2925 -1845 -852 -1037 -1447 -1900 -1089 1124 1595 731 -179 235 1377 1900 1569 530 -142 289
1700 289 402 1311 999 -365 -1012 -265 658 620 -817 -1732 -1945 -813 -557 -1356 -1645 -1667 -679 542 1068
1719 1068 893 678 533 2163 3180 2367 562 -101 738 829 78 -1609 -2408 -2330 -1573 -1079 -1040 -1408 -1497 -425
1739 -425 909 1533 1154 370 350 1613 2269 1172 -391 -1043 -598 -18 160 -344 -957 -942 -365 658 668
1758 668 -91 -852 -283 877 1018 264 -1039 -1122 63 516 193 -266 -463 -617 628 891 933 -196 -636
1777 -636 417 1177 782 -734 -1157 -1133 -95 214 -301 -830 -634 30 857 1662 1173 503 148 1260 1694
1796 1694 772 -662 -1213 -895 -403 -1006 -1686 -1998 -1680 -561 332 561 287 -120 751 2034 2381 1502 587
1815 587 665 811 1447 131 -970 -1546 -1282 -1060 -941 -1282 -1441 -1841 -1001 310 505 -149 -974 105 987
$$ packed form
1682b695k30J080R93j85m10m53Q11K213M71q64r10M14J142N23l31j039o72M31
1700B89J13R09l12j364o47P47R23l8j437r15k13J132K56p99k89k2R88J221N26
1719A068j75k15j45J630J017q13j805o63Q39R1p51j687p99P8P57M94L9l68q9J072
1739d25J334O24l79p84k0J263O56j097j563o52M45N80J78n04o13J5N77J023J0
1758F68p59p61N69J160J41p54j303q3J185M53l23m59j97j54J245K63M2j129m40
1777f36J053P60l95j516m23K4J038L09n15n29J96O64Q27Q05m89o70l55J112M34
1796A694r22j434n51L18M92o03o80l12L18J119Q93K29k74m07Q71J283L47q79r15
1815E87P8J46O36j316j101n76K64K22J19l41j59m00Q40J311J95o54q25J079Q82
$$ plain form
1834 987 1004 475 -513 -46 505 1081 1305 420 147 177 843 1193 335 -1070 -1825 -996 -470 -976 -1295 -2300
1854 -2300 -1636 -717 3 116 -27 -95 720 2067 2911 1853 776 769 1651 1781 565 -765 -1323 -989 -906
1873 -906 -1048 -1440 -1695 -1822 -853 -252 326 -268 -318 487 1164 1576 1097 651 253 1273 1819 857 44 -278
1893 -278 -94 146 171 47 -1120 -1633 -701 -222 -98 -733 -1355 -606 3 600 360 -169 -232 403 974 1088
1913 1088 581 182 314 772 1253 468 -424 -631 -745 179 -265 -1103 -1183 -790 -503 -226 141 -648 -92 368
1933 368 1027 1562 364 437 380 890 1023 304 -648 -743 -637 -79 -441 -597 -1403 -1007 -236 711 301 -6 -109
1954 -109 293 905 1418 634 -365 -289 321 739 98 -481 -981 -928 -298 144 -150 -969 -1250 -29 571 957
1974 957 223 -426 -26 934 844 227 426 -336 -25 510 499 102 -300 -357 181 389 42 -857 -1067 -564 -93
$$ packed form
1834I87J7n29r88M67N51N76K24q85k73L0O66L50q58j405p55Q29N26n06l19j005
1854b300O64R19P20J13j43o8Q15J347Q44j058j077pQ82J30j216j330n58L34Q3
1873i06j42l92k55j27R69O01N78n94n0Q05O77M12m79m46l98J020N46r62q13l22
1893b78J84K40K5j24j167n13R32M79J24o35o22P49O09N97k40n29o3O35N71J14
1913A088n07l99J32M58M81p85q92k07j14R24m44q38q0L93K87K77L67p89N56M60
1933C68O59N35j198P3n7N10J33p19r52r5J06N58l62j56q06L96P71R47m10l07j03
1954a09M02O12N13p84r99P6O10M18o41n79n00N3O30M42k94q19k81J221O00L86
1974I57p34o49M00R60r0o17J99p62L11N35j1l97m02n7N38K08l47q99k10N03M71
$$ plain form
1995 -93 -140 -793 -765 -763 -118 605 1116 174 282 648 1659 1877 1135 558 -20 662 237 -285 -1068 -1436 -1386 -1103
2017 -1103 -792 -1148 -1307 -820 -290 721 619 867 495 1113 1756 2157 1138 224 188 110 804 -147 -725 -1202
2037 -1202 -878 -301 -229 -154 -1067 -1358 -537 385 326 -690 -634 -373 332 664 548 705 569 547 1256 1252 943 375
2059 375 51 658 625 -83 -967 -1361 -1398 -750 -822 -1331 -1614 -668 -575 338 354 247 731 771 1667 1999 1081 521
2081 521 447 770 380 -254 -806 -1189 -625 -942 -217 -864 -810 -1002 -329 120 602 -70 -88 12 473 813 409
2102 409 -145 -60 490 265 1003 -14 -362 2 339 372 393 -212 -961 -289 187 80 -366 -977 -489 233 407
2123 407 538 294 -270 47 807 1173 403 226 -61 270 566 213 -871 -956 -658 -368 -243 -409 -796 -496
2143 -496 254 795 567 530 342 493 995 1196 -179 -385 -535 -225 -375 -498 -990 -1101 -449 -141 -98 -136 -392
$$ packed form
1995i3m7o53K8KO45P23N11r42J08L66J011K18p42n77n78O82m25n22p83l68N0K83
2017a103L11l56j59M87N30J011j02K48l72O18O43M01j019r14l6p8O94r51n78m77
2037a202L24N77P2P5r13k91Q21R22n9j016N6K61P05L32j16J57j36k2P09ml09n68
2059C75l24O07l3p08q84l94l7O48p2n09k83R46R3R13J6j07M84M0Q96L32r18n60
2081E21p4L23l90o34n52l83N64l17P25o47N4j92O73M49M82o72j8J00M61L40m04
2102D09n54Q5N50k25P38j017l48L64L37L3K1o05p49O72M76j07m46o11M88P22J74
2123D07J31k44n64L17P60L66p70j77k87L31K96l53j084q5K98K90J25j66l87L00
2143d96P50N41k28l7j88J51N02K01j375k06j50L10j50j23m92j11O52L08M3l8k56
$$ plain form
2164 -392 -23 149 585 816 17 117 234 905 360 172 -38 -127 104 83 133 -86 -684 -397 144 218 -228
2185 -228 -554 -1061 -208 -7 176 -70 -367 80 669 1067 565 738 430 607 765 638 219 -572 -472 -375
2205 -375 -400 -585 -1454 -979 -1161 -589 -37 -582 -524 -191 717 941 717 655 641 792 950 1117 874 -140 -241
2226 -241 197 146 -405 -559 -1223 -559 -169 -9 -44 -622 -812 -475 866 734 94 114 760 645 744 824 354
2247 354 160 57 255 313 68 -206 -507 -38 -12 -128 -775 -1036 -923 -352 -131 -547 -810 14 335 631 648
2268 648 357 507 568 684 735 736 114 -334 26 204 -248 -485 -872 -842 -667 -82 -700 -418 -447 540 887 367
2290 367 125 154 357 443 812 490 -154 -82 139 99 -169 -413 -693 -537 -268 24 -294 -190 -335 -47 439
2311 439 389 131 -257 163 209 709 224 -105 -253 203 466 4 36 -34 -447 -19 195 11 -193 -355 15
$$ packed form
2164c92L69J72M36K31p99J00J17O71n45j88k10q9K31k1N0k19n98K87N41P4m46
2185b28l26n07Q53K01J83k46k97M47N89L98n02J73l08J77J58j27m19p91J00R7
2205c75k5j85q69M75j82N72N52n45N8L33R08K24k24o2j4J51J58J67k43j014j01
2226b41M38n1n51j54o64O64L90J60l5n78j90L37J341j32o40K0O46j15R9Q0m70
2247C54j94j03J98N8k45k74l01M69K6j16o47k61J13N71K21m16k63Q24L21K96J7
2268F48k91J50O1J16N1Jo22m48L60J78m52k37l87L0J75N85o18K82k9R87L47n20
2290C67k42K9K03Q6L69l22o44P2K21m0k68k44k80J56K69K92l18J04j45K88M86
2311D39n0k58l88M20M6N00m85l29j48M56K63m62L2p0m13M28K14j84k04j62L70
$$ plain form
2332 15 537 -269 79 -425 9 110 363 517 253 163 -218 461 441 -93 -305 -328 -369 -53 -384 -769 -388 -322
2354 -322 -211 15 -33 54 105 719 841 869 361 87 235 550 482 -434 -266 -831 -113 -525 -586 -493 -624 -693 -563
2377 -563 256 -19 -265 -153 420 348 603 351 -271 118 -68 626 34 -20 -78 -32 331 166 -328 -519 -306
2398 -306 -290 -182 -333 -479 -989 -260 346 47 171 22 61 523 878 790 511 241 670 462 519 123 -580
2419 -580 -488 -423 -420 -835 -735 -789 -572 -313 -265 -239 -145 338 479 515 465 365 426 -24 638 469 123 148 -232 -163
2443 -163 -233 -142 -267 -170 -109 -37 186 289 -468 -81 -271 331 294 -66 -166 -219 261 378 179 197 35 435 96
2466 96 246 -118 8 -458 -154 -159 -214 -968 -760 -235 -219 211 -344 -379 222 103 459 574 349 36 179 218
2488 218 460 -39 -286 -455 -310 -229 -157 -83 -126 44 282 -42 50 302 107 132 268 221 171 -258 -153 -325 -48
$$ packed form
2332A5N22q06L48n04M34J01K53J54k64r0l81O79k0n34k12k3m1L16l31l85L81O6
2354c22J11K26m8Q7N1O14J22K8n08k74J48L15o8r16J68n65P18m12o1R3j31o9J30
2377e63Q19k75k46J12N73p2K55k52o22L89j86O94n92n4n8M6L63j65m94j91K13
2398c06J6J08j51j46n10P29O06k99J24j49L9M62L55q8k79k70M29k08N7l96p03
2419e80R2O5Lm15J00n4K17K59M8K6R4M83J41L6n0j00O1m50O62j69l46K5l80O9
2443a63p0R1j25R7O1P2K23J03p57L87j90O02l7l60j00n3M80J17j99J8j62M00l39
2466I6J50l64J26m66L04nn5p54K08N25J6M30n55l5O01j19L56J15k25l13J43L9
2488B18K42m99k47j69J45Q1P2P4m3J70K38l24R2K52j95K5J36m7n0m29J05j72K77
$$ plain form
2511 -48 -309 -326 -202 -34 348 -292 138 -219 -153 85 173 297 -118 -177 313 137 457 -319 22 -93 19 497
2533 497 138 55 264 -220 -56 167 -503 -46 -125 -440 121 133 -271 -419 -23 90 200 465 372 -40 533
2554 533 497 362 207 30 490 233 337 -428 -565 -621 -555 -147 -629 -199 -364 -370 117 299 486 336 -11 434
2576 434 552 833 907 2 385 462 183 16 -321 -389 -190 -65 126 -327 -288 47 -134 337 98 -309 -212 -485
2598 -485 256 487 282 358 247 476 400 190 396 -33 -7 -118 81 -258 -343 -802 -358 133 -72 -440 -181
2619 -181 -191 -234 83 221 124 -266 514 430 369 335 50 -96 300 313 -214 -281 -622 -261 -281 6 -266 -391 25
2642 25 -73 -54 314 56 -78 136 286 254 54 -6 298 264 256 -6 -124 -110 28 103 -175 -243 -208 -250 54 161
2666 161 67 -220 -168 -20 241 10 26 -99 -116 61 415 565 119 -93 -129 249 -9 530 -366 -299 -138 -210
$$ packed form
2511d8k61j7J24J68L82o40M30l57O6K38Q8J24m15n9M90j76L20p76L41j15J12M78
2533D97l59q3K09m84J64K23o70M57p9l15N61J2m04j48L96J13J10K65r3m12N73
2554E33l6j35j55j77M60k57J04p65j37n6O6M08m82M30j65oM87J82J87j50l47M45
2576D34J18K81P4r05L83P7k79j67l37o8J99J25J91m53L9L35j81M71k39m07R7k73
2598d85P41K31k05P6j11K29p6k10K06m29K6j11J99l39q5m59M44M91k05l68K59
2619a81j0m3L17J38r7l90P80q4o1l4k85j46L96J3n27o7l41L61k0K87k72j25M16
2642B5r8J9L68k58j34K14J50l2k00o0L04l4qk62j18J4J38P5k78o8L5m2L04J07
2666A61r4k87N2J48K61k31J6j25j7J77L54J50m46k12l6L78k58N39q96O7J61p2
$$ plain form
2688 -210 -30 67 -281 145 110 352 -213 -3 -284 124 400 240 433 -102 -211 133 -217 -165 -159 -50 -431 223
2710 223 105 -183 20 123 381 107 261 199 163 140 619 212 -160 -141 -86 -234 -170 150 0 -452 -489 -370
2732 -370 34 200 -233 -81 -236 -168 14 171 -108 -73 498 290 177 -174 120 115 -56 -126 -366 -358 -187 -75
2754 -75 -413 -214 -432 -385 90 -157 -239 -216 -389 193 218 671 63 374 226 513 447 341 247 -198 -376 -126
2776 -126 -80 -247 -550 -77 -177 -285 298 157 -169 -240 143 461 323 256 11 421 163 353 -1 -61 410
2797 410 155 77 32 -74 -245 -620 -254 379 -99 -577 -568 -441 -77 -64 -402 -445 251 191 206 427 166 357 87
2820 87 118 455 -140 114 78 -142 -140 -414 -197 -340 -49 56 -29 -89 -162 25 74 596 114 187 -86 95 345
2843 345 320 111 -382 -261 -262 -71 -37 -366 -309 -42 306 244 273 -567 35 228 -42 263 -257 -107 -70 62 140
$$ packed form
2688b10J80R7l48M26l5K42n65K10k81M08K76j60J93n35j09L44l50N2OJ09l81O54
2710B23j18k88K03J03K58k74J54o2l6k3M79m07l72J9N5j48O4L20j50m52l7J19
2732c70M04J66m33J52j55O8J82J57k79L5N71k08j13l51K94nj71p0k40QJ71J12
2754g5l38J99k18M7M75k47q2K3j73N82K5M53o08L11j48K87o6j06r4m45j78K50
2776a26M6j67l03M73j00j08N83j41l26p1L83L18j38o7k45M10k58J90l54o0M71
2797D10k55p8m5j06j71l75L66O33m78m78RJ27L64J3l38m3O96o0J5K21k61J91k70
2820H7L1L37n95K54l6k20Kk74K17j43K91J05q5o0p3J87M9N22m82P3k73J81K50
2843C45k5k09m93J21jJ91L4l29N7K67L48o2K9q40O02J93k70L05n20J50L7J32P8
$$ plain form
2866 140 -433 -237 82 86 245 -144 76 79 54 101 -5 -211 -599 166 343 -25 249 104 -75 -72 -2 114 -5
2889 -5 -94 -86 -106 188 27 -226 -130 17 305 -301 -278 0 -151 -302 275 112 -159 -106 144 246 208 92 -93
2912 -93 213 -55 228 176 -85 -247 -133 -169 -260 315 -208 -158 -216 -6 14 199 463 63 220 202 497 -232 13
2935 13 228 94 554 -110 -555 138 377 -318 -165 -125 -29 26 -137 -187 -61 -514 -245 -314 159 149 80 200 164
2958 164 189 54 56 157 17 168 -234 131 216 109 -149 -310 -214 259 0 -47 -87 -135 290 20 144 81 17
2981 17 99 218 174 127 32 120 96 99 -297 -121 16 65 -340 -65 -198 -40 -200 102 131 -451 -300 -237 -6 185
3005 185 -314 262 -197 98 -186 -184 -65 -43 -647 -32 182 -302 -80 -85 -176 -338 452 -265 -323 -380 336 27 -68
3028 -68 136 30 154 166 167 -168 9 6 27 -115 301 -39 -166 223 -252 -153 17 137 23 27 -141 -146 -39 -13
$$ packed form
2866A40n73J96L19MJ59l89K20Lk5M7j06k06l88P65J77l68K74j45j79LP0J16j19
2889eq9Qk0K94j61k53R6J47K88o06K3K78j51j51N77j63k71N3K50J02l8j16j85
2912i3L06k68K83n2k61j62J14l6r1N75n23N0n8K10K0J85K64m00J57j8K95p29K45
2935A3K15j34M60o64m45O93K39o95J53M0R6N5j63n0J26m53K69o9M73j0o9J20l6
2958A64K5j35KJ01j40J51m02L65Q5j07k58j61R6M73k59m7m0m8M25k70J24o3o4
2981A7Q2J19m4m7r5Q8k4Ll96J76J37M9m05K75j33J58j60L02K9n82J51O3K31J91
3005A85m99N76m59K95k84KJ19K2o04O15K14m84K22nr1j62P90p17n8n7P16l09r5
3028f8K04j06J24J2Jl35J77lK1j42M16l40j27L89m75R9J70J20j14Mj68nJ07K6
$$ plain form
3052 -13 -288 37 344 -169 -98 -42 -185 45 13 -238 -260 -127 -46 323 150 -94 -269 11 316 16 -140 42
3074 42 -61 317 -104 93 80 35 -46 97 252 -216 -171 -115 -58 -283 -375 157 -146 -254 110 243 259 -6 461
3097 461 231 -5 -57 -308 75 222 31 -162 213 -54 20 53 -146 43 -463 -290 -223 254 28 -58 -73 50
3119 50 59 461 219 83 393 705 131 213 78 27 -330 376 26 -147 -392 -33 339 -388 -168 -48 19 11 -106
3142 -106 117 80 156 269 342 -142 226 -289 81 311 233 294 -79 -119 -106 266 -28 -246 -54 -241 -419 83
3164 83 -47 327 -33 -82 -360 215 394 -53 192 -281 -13 422 213 200 16 -80 139 20 -334 -147 -411
3185 -411 -110 -48 -42 -19 59 449 134 -195 15 356 -96 99 47 492 -82 -234 123 -118 -20 -100 31 -419 5
3208 5 -364 44 -46 1 -220 518 70 -354 -322 -379 -297 -198 112 -252 204 312 -90 53 -101 -20 200 16 75
$$ packed form
3052a3k75L25L07n13P1N6j43K30l2k51k2J33Q1L69j73k44j75K80L05l00j56J82
3074D2j03L78m21J97j3m5q1J43J55m68M5N6N7k25r2N32l03j08L64J33J6k65M67
3097D61k30k36n2k51L83J47j91j93L75k67P4L3j99J89n06J73O7M77k26q6j5J23
3119E0RM02k42j36L10L12n74Q2j35n1l57P06l50j73k45L59L72p27K20J20O7qj17
3142a06K23l7P6J13P3m84L68n15L70K30p8O1l73m0J3L72k94k18J92j87j78N02
3164H3j30L74l60m9k78N75J79m47K45m73K68M35k09j3j84r6K19j19l54J87k64
3185d11L01O2OK3P8L90l15l29K10L41m52J95n2M45n74j52L57k41R8q0J31m50M24
3208El69M08r0M7k21P38m48m24L2n7Q2R9L10l64M56J08m02J43j54Q1K20j84N9
$$ plain form
3231 75 -112 253 21 81 -193 -156 522 -282 151 -84 484 -29 114 -338 138 125 154 382 -446 159 -169 199
3253 199 -93 -179 -15 -20 -379 0 11 55 158 -14 -46 271 -139 -34 -173 -121 127 -165 150 224 -85 -227 -193
3276 -193 -153 261 10 218 -90 284 70 -172 208 105 162 343 385 108 24 221 -26 -123 -99 108 155 -11
3298 -11 -156 -17 -388 -183 -259 33 -82 340 -162 35 463 -76 262 -21 102 145 37 283 175 -8 -135
3319 -135 72 245 8 -96 197 -24 39 50 -288 -176 120 -79 -33 163 158 520 343 76 -114 170 34 -49
3341 -49 -90 354 -170 6 -360 -90 1 -273 -221 -61 -181 23 134 -93 -378 -127 287 151 -17 -331 202
3362 202 179 -33 139 338 42 71 93 -97 -300 99 72 -358 -95 142 -99 -31 -239 -315 -26 -40 -121 -319 118
3385 118 300 122 134 236 257 253 312 405 23 -53 -301 141 188 52 -10 -17 26 -210 -55 29 177 69 265 137
$$ packed form
3231G5j87L65k32O0k74L7O78q04M33k35N68n13J43m52M76j3K9K28q28O05l28L68
3253A99k92q6J64nl59L79J1M4J03j72l2L17m10J05j39N2K48k92L15P4l09j42L4
3276a93M0M14k51K08l08L74k14k42L80j03N7J81M2k77q4J97k47r7K4K07M7j66
3298a1j45J39l71K05p6K92j15M22n02J97M28n39L38k83J23M3j08K46j08j83j27
3319a35K07J73k37j04K93k21O3J1l38J12K96j99M6J96nL62j77k67j90K84j36q3
3341d9m1M44n24J76l66K70R1k74N2J60j20K04J11k27k85K51M14j36j68l14N33
3362B02k3k12J72J99k96K9K2j90k03L99k7m30K63K37k41O8k08p6K89j4q1j98M37
3385A18J82j78J2J02K1mN9R3l82p6k48M42M7j36o2pM3k36J55Q4J48j08J96j28
$$ plain form
3409 137 -134 -139 -214 -91 -56 171 -45 95 78 -1 177 -113 -338 -75 109 -118 -130 240 -65 261 316 23 -126
3432 -126 -335 -142 -345 -37 76 136 -102 47 -471 195 14 -114 -314 96 -395 -254 49 -59 -220 414
3452 414 372 -124 204 -70 25 -105 127 364 30 109 98 -218 -45 -79 -167 -60 44 -193 -19 -17 -32 -125 35
3475 35 202 90 22 56 211 264 33 120 -45 -142 -222 -39 -474 -158 -211 156 -339 -70 96 -273 93 -43 196
3498 196 -66 77 168 270 -78 248 -135 26 19 350 226 -228 63 -147 41 14 -41 -287 -311 163 -68 -503
3520 -503 8 46 346 127 -4 208 365 -100 160 -44 92 -17 253 -112 -302 -66 121 -251 59 -7 -38
3541 -38 143 -515 186 -364 -100 281 90 286 -91 92 -217 -203 152 171 -291 -185 66 161 -164 -278 -18
3562 -18 -49 -21 53 337 -73 183 274 10 154 -169 208 -128 -193 73 68 -32 198 204 -112 333 -640 347 134
$$ packed form
3409A37k71np5J23L5K27k16J40j7p9J78k90k25K63J84k27j2L70l05L26N5k93j49
3432a26k09J93k03L08J13O0k38J49n18O66j81j28k00M10m91J41L03j08j61O34
3452D14m2m96L28k74R5j30K32K37l34P9j1l16J73l4q8J07J04k37J74Kj5r3J60
3475C5J67j12o8L4J55N3k31Q7j65r7q0J83m35L16n3L67m95K69J66l69L66j36K39
3498A96k62J43R1J02l48L26l83J61pL31j24m54K91k10J88k7n5k46k4M74k31m35
3520e03N11L8L00k19j31K12J57m65K60k04J36j09K70l65j90K36J87l72L10o6l1
3541c8J81o58P01n50K64L81j91J96l77J83l09J4L55J9m62J06K51R5l25j14K60
3562a8l1K8P4K84m10K56R1k64J44l23L77l36o5K66nj00K30Ol16M45r73R87k13
$$ plain form
3585 134 229 355 0 246 -79 92 249 -139 28 -342 -32 121 230 148 -246 -376 80 -184 47 -206 -105
3606 -105 31 66 132 -172 31 -220 -317 -180 -345 13 304 -33 218 -160 38 133 -241 -70 15 -142 -45 -260
3628 -260 -365 -432 294 40 -154 -243 -25 -49 -409 353 124 -78 -123 -292 154 -79 -3 34 266 70 -26 249
3650 249 183 -47 -170 -165 -298 -157 118 407 107 -179 279 -211 127 -50 -148 107 57 -422 4 155 506 -96
3672 -96 218 151 -197 -62 -128 -240 -500 10 -157 -122 40 -62 -381 485 310 -73 -482 65 145 30 -34 -117
3694 -117 -365 372 157 -59 419 -148 -56 -274 -56 -363 -389 -456 18 1 9 -243 135 -208 272 10 168 205
3716 205 1 130 152 -262 -196 181 79 -17 -69 78 138 124 64 2 43 -189 13 -14 -14 -57 105 12 94 61 -244
3741 -244 24 58 -39 62 43 -97 -24 -1 86 -332 151 360 -111 15 -188 168 96 -97 461 -65 -81 124 -231
$$ packed form
3585A34R5J26l55K46l25J71J57l88J67l70L10J53J09q2l94j30M56k64K31k53J01
3606a05J36L5O6l04K03k51r7J37j65L58K91l37K51l78J98R5l74J71Q5j57R7k15
3628b60j05o7P26k54j94q9K18k4l60P62k29k02m5j69M46k33P6L7K32j96r6K75
3650B49o6k30j23Nj33J41K75K89l00k86M58m90L38j77r8K55n0m79M26J51L51o02
3672i6L14o7l48J35o6j12k60N10j67L5J62j02l19Q66j75l83m09N47Q0j15o4q3
3694a17k48P37k15k16M78n67R2k18K18l07k6o7M74j7Qk52L78l43M80k62J58L7
3716B05k04J29K2m14O6L77j02r6n2J47O0j4o0o2M1k32K02k7%m3J62r3Q2l3l05
3741b44K68L4r7J01j9j40P3K3Q7m18M83K09m71J26k03L56p2j93N58n26j6K05l55
$$ plain form
3764 -231 256 -11 -380 -287 -13 -113 8 14 -88 -302 127 97 245 -5 -60 125 103 31 -129 -175 -81 92 214
3787 214 -27 -229 336 137 -388 -21 -97 -601 -128 -48 240 305 252 331 7 -68 387 222 -133 805 153 -482
3809 -482 -35 307 -208 -193 138 -30 34 -340 -181 -156 -221 -54 -211 -206 123 402 -209 -238 -106 111 397 178
3831 178 61 0 191 275 316 87 130 29 -126 291 -264 -83 3 158 -115 284 229 -195 141 -307 -215 -360
3853 -360 -184 -141 159 132 391 318 167 138 -219 308 277 -242 165 -299 133 23 -34 20 -279 -326 64 -7 289
3876 289 -38 -220 -156 108 -65 1 -38 187 256 275 -194 -8 -70 191 15 292 287 -173 237 -144 231 156 -242
3899 -242 62 207 -28 27 -66 13 -153 188 94 88 -243 -123 254 5 23 -15 80 -115 -26 -334 -117 -158 -162 -111 324
3924 324 152 -197 -260 -200 -190 -256 85 128 -304 257 -258 -125 -67 -105 -233 -93 26 -115 98 132 29 -355 4
$$ packed form
3764b31M87k67l69R3K74j00J21Oj02k14M29l0J48k50n5J85k2p2j60m6R4J73J22
3787B14k41k02N65j99n25L67p6n04M73Q0K88O5n3P9l24p5M55j65l55R38o52o35
3809d82M47L42n15J5L31j68O4l74J59K5o5J67j57NL29K79o11k9J32K17K86k19
3831A78j17o1J91Q4M1k29M3j01j55M17n55J81Q6J55k73L99n5m24L36m48R2j45
3853c60J76M3L00k7K59p3j51k9l57N27l1n19M07m64M32j10n7N4k99m7L90p1K96
3876B89l27j82O4K64j73O6l9K25O9J9m69J86o2K61j76K77nm60M10l81L75p5l98
3899b42L04J45k35N5r3P9j66L41r4ol31J20L77k49J8l8R5j95Q9l08K17m1mN1M35
3924C24j72l49o3O0J0o6L41M3m32N61n15J33N8l8j28J40J19j41K13L4j03l84L59
$$ plain form
3947 4 7 -113 80 14 -39 -244 313 8 123 28 -58 -209 -110 240 -115 33 175 -502 16 -81 -130 51 374 174
3971 174 -217 97 -37 -67 69 -111 -23 285 -54 296 -45 95 -164 293 -242 -103 -468 67 267 138 -201
3992 -201 -64 65 -50 385 -160 -74 258 -232 -12 166 199 -69 -127 -155 36 -7 -45 26 250 -244 -168 -110 -129
4015 -129 17 -508 97 375 155 -241 174 -128 309 152 98 -279 -226 -364 304 -27 -269 -409 8 -96 -139
4036 -139 -63 -4 -260 -116 413 -74 17 136 243 -151 72 336 -34 -55 101 59 -152 -52 137 15 191 -17
4058 -17 30 -93 134 41 -265 -109 -215 -155 61 8 -8 -82 488 238 159 151 14 63 -190 20 253 65 -121 -232
4082 -232 -153 283 -91 115 -11 59 -62 -38 399 -131 229 -102 134 -68 -37 -358 118 392 -1 -150 -351
4103 -351 -271 -56 -17 10 531 243 -365 81 190 -45 157 -26 -93 97 192 321 43 -66 -453 90 -202 308
$$ packed form
3947DLj20J93o6n3k05N57l05J15r5q6j51R9L50l55J48J42o77N18r7m9J81L23k00
3971A74l91L14j34l0J36j80Q8L08l39L50l41J40k59M57n35J39l65N35K00j29l39
3992b01J37J29j15M35n45Q6L32m90K20J78L3k68n8k8J91m3l8P1K24m94P6N8j9
4015a29J46n25O05K78k20l96M15l02M37j57n4l77N3j38O68l31k42j40M17j04m3
4036a39P6N9k56J44N29m87R1J19J07l94K23K64l70k1J56m2k11J00J89j22J76k08
4058a7M7j23K27r3l06J56j06O0K16n3j6p4N70k50p9qj37M9k53K10K33j88j86j11
4082b32P9M36l74K06j26P0j21K4M37n30L60l31K36k02L1l21M76K74l93j49k01
4103c51Q0K15L9K7N21k88o08M46J09k35K02j83o7J90R5J29k78j09l87N43k92N10
$$ plain form
4125 308 342 -27 -80 -56 11 177 88 -28 66 99 42 -88 20 -326 50 -227 -100 -70 12 245 76 16 -5 138
4149 138 128 346 53 -288 -484 -331 130 114 200 -135 -124 371 96 50 228 -63 225 221 122 58 -254 49 72
4172 72 -221 36 -28 48 0 -182 43 42 151 -110 -213 32 86 30 135 133 12 336 219 -137 38 -129 112
4195 112 192 -408 -324 138 41 -31 11 -7 -230 105 183 -68 -83 -328 -382 -109 55 64 273 65 253 190 -86 39
4219 39 -73 -5 269 -56 246 -84 174 35 -11 89 -209 55 -12 176 -62 156 9 33 -63 278 266 114
4241 114 4 -265 197 384 -304 227 -79 64 -74 -263 354 -276 -31 115 -313 -56 153 242 -374 65
4261 65 79 4 216 -277 99 85 80 303 81 100 79 -13 292 -31 182 -354 -172 20 -41 -3 -233 -41 -6 -279
4285 -279 -22 91 128 -184 194 -268 -274 -191 -103 84 -104 230 80 15 -61 455 -187 25 161 137 108 -204 -378
$$ packed form
4125C08L4l69n3K4O7J66q9j16R4L3n7j30J08l46L76k77J27L0Q2K33j69o0k1J43
4149A38j0K18k93l41j96J53M61j6Q6l35J1M95k75m6J78k91K88mr9o4l12L03K3
4172G2k93K57o4P6m8j82K25jJ09k61j03K45N4n6J05kj21L24j17l56J75j67K41
4195A12Q0o00Q4M62r7p2M2j8k23L35P8k51j5k45n4K73J64RK09k08J88o3k76J25
4219C9j12O8K74l25L02l30K58j39m6J00k98K64o7J88k38K18j47K4r6L41j2j52
4241A14j10k69M62J87o88N31l06J43j38j89O17o30K45J46m28K57K09Q9o16M39
4261F5J4p5K12m93L76j4nK23k22J9k1r2L05l23K13n36J82J92o1L8k30J92L5k73
4285b79K57J13L7l12L78m62oQ3Q8J87j88L34j50o5p6N16o42K12J36k4k9l12j74
$$ plain form
4308 -378 -351 166 178 197 300 28 233 -184 -522 -142 142 -294 -65 -28 353 -38 93 -127 -92 299 65 436
4330 436 23 23 309 -20 64 321 175 -237 139 316 -45 61 399 -461 211 260 203 -222 -218 202 235 275 -17
4353 -17 -182 -19 315 -65 189 23 376 14 -73 -76 8 -83 -356 -132 -42 -95 -355 8 161 -459 100 7 -340
4376 -340 -79 20 22 -115 97 220 -176 313 -269 252 56 23 -175 -373 -246 -138 162 -9 30 -186 315 165
4398 165 -9 -72 77 -19 213 187 469 -17 317 152 146 23 -33 108 176 -103 403 -248 273 59 73 129 150
4421 150 268 -235 327 141 420 -200 -265 386 -77 151 -138 -104 8 -84 71 -193 3 78 -158 -5 -88 136
4443 136 -153 47 -145 -314 141 -260 327 -312 -26 120 257 -181 236 -8 275 -186 -99 179 -101 -2 -235
4464 -235 -104 -37 238 -77 158 -139 148 244 -89 -43 -302 241 -573 -56 84 83 -203 193 182 185 126 -215 154
$$ packed form
4308c78K7N17J2J9J03k72K05m17l38L80K84m36K29L7L81l91J31k20L5L91k34L71
4330D36m13%K86l29Q4K57j46m12L76J77l61J06L38q60O72M9n7m25MM20L3M0k92
4353a7j65J63L34l80K54j66L53l62q7lQ4r1k73K24R0n3k60L63J53o20N59r3l47
4376c40K61R9Kj37K12J23l96M89n82N21j96l3j98j98J27J08L00j71L9k16N01j50
4398A65j74o3J49r6K32k6K82m86L34j65oj23n6J41O8k79N06o51N21k14J4N6K1
4421A50J18n03N62j86K79o20o5O51m63K28k89L4J12r2J55k64J96P5k36J53q3K24
4443A36k89K00j92j69M55m01N87o39K86J46J37m38M17k44K83m61Q7K78k80R9k33
4464b35J31O7K75l15K35k97K87R6l33M6k59N43q14N17J40jk86L96j1Ln9l41L69
$$ plain form
4487 154 -14 -156 55 336 -26 -287 -305 -99 -288 230 -274 130 -226 149 225 -17 -126 28 258 -1 -67
4508 -67 40 -127 391 -109 -57 -357 -273 -67 -78 -222 260 490 -42 -105 134 240 -84 -143 81 107 115 121 -143 304
4532 304 -155 31 -133 -62 2 -360 -141 147 -93 129 106 -130 10 326 137 342 -5 37 208 -31 -292
4553 -292 -300 113 -63 301 -306 -249 -139 7 61 465 -308 -248 -203 -6 314 -148 29 43 -122 289 -167 126
4575 126 -34 207 99 357 -190 -186 164 236 190 -430 -128 -132 -145 -43 28 39 65 58 96 -119 413 -189 210 171 -367
4600 -367 -43 -241 39 -128 -273 245 -98 117 -262 -215 232 -15 80 193 109 413 256 -100 189 77 -121
4621 -121 284 97 -369 114 223 237 -50 3 184 -41 -10 -359 -2 -17 223 -90 -322 169 -98 -196 -219 -80
4643 -80 -78 -14 -275 -112 185 -127 312 -38 71 158 -84 -265 -279 36 46 -19 -46 -227 -103 -207 -48 53 -49
$$ packed form
4487A54j68j42K11K81l62k61j8K06j89N18n04M04l56L75P6k42j09J54K30k59o6
4508f7J07j67N18n00N2l00Q4K06j1j44M82K30n32o3K39J06l24n9K24K6QOk64M47
4532C04m59J86j64P1O4l62K19K88k40K22k3k36J40L16j89K05l47M2J71k39k61
4553b92qM13j76L64o07N7J10J46N4M04p73O0M5J97L20m62J77J4j65M11m56K93
4575A26j60K41j08K58n47ML50P2m6o20L02mj3J02P1J1K6pL8k15N32o02L99l9n38
4600c67L24j98K80j67j45N18l43K15l79M7M47k47R5J13q4L04j57l56K89j12j98
4621a21M05j87m66M83J09J4k87N3J81k25L1l49L57j5K40l13k32M91k67r8k3J39
4643h0KO4k61J63K97l12M39l50J09Q7k42j81j4L15J0o5k7j81J24j04J59J01j02
$$ plain form
4666 -49 -1 -197 -164 155 214 29 -247 -181 94 256 -255 56 -116 -344 25 -50 -274 12 161 80 405 144
4688 144 -69 122 202 -524 163 96 -148 -21 227 -220 -370 300 -198 -31 -185 -268 223 21 57 -242 -42
4709 -42 -135 -173 64 144 -361 -196 -60 -151 344 -204 -95 270 -76 -81 31 5 -277 95 -29 331 348 58 543
4732 543 269 -2 -199 -121 164 -92 102 18 -188 241 104 1 -279 -27 -117 -120 -111 -35 -24 -107 -275 -112 191
4755 191 15 8 88 123 -16 -153 162 268 39 69 208 -110 292 -282 -13 -27 69 -65 277 -126 243 -74
4777 -74 -188 -122 204 -158 -126 110 30 -232 340 -268 -174 -151 3 85 336 334 60 -69 -202 30 60 384 -248
4800 -248 -181 157 105 380 50 -71 -64 61 259 -196 126 106 159 -77 -85 -301 -125 108 199 -14 221 588 270
4823 270 358 181 81 19 -218 -53 68 98 -167 147 420 -190 -95 -41 -53 105 -24 55 -39 210 122 453 -358
$$ packed form
4666d9M8j96L3L19N9j85k76O6K75J62n11L11j72k28L69p5k24K86J49q1L25k61
4688A44k13J91Q0p26O87o7k44J27K48m47j50O70m98J67j54q3M91k02L6k99K00
4709d2r3l8K37Q0n05J65J36r1M95n48J09L65l46nJ12k6k82L72j24L60J7k90M85
4732E43k74k71j97P8K85k56J94q4k06M29j37j03k80K52r0lRP6J1q3j68J63L03
4755A91j76pQ0L5j39j37L15J06k29L0J39l18M02n74K69j4R6j34L42m03L69l17
4777g4j14O6L26l62L2K36q0k62N72o08R4K3J54Q2K51kk74j29j33K32L0L24o32
4800b48O7L38n2K75l30j21PJ25J98m55L22k0N3k36qk16J76K33R1k13K35L67l18
4823B70Q8j77j00o2k37J65J21L0k65L14K73o10R5N4j2J58j29P9r4K49q8L31q11
$$ plain form
4846 -358 -59 92 -204 -106 110 17 -102 -456 -359 -171 178 273 -82 -48 97 -76 -69 38 -285 -54 449 -6
4868 -6 -265 77 326 29 -63 -141 -122 -40 226 42 -120 39 126 -208 65 458 -280 258 165 204 92 -22 -269
4891 -269 -147 106 -208 -162 -103 166 -12 235 72 43 338 133 372 207 -66 118 -97 163 -122 -36 -176
4912 -176 -168 -288 249 25 -52 -67 83 -82 248 62 -11 -223 -555 -78 -109 -147 -398 319 -26 267 180 221 246
4935 246 -36 161 -20 -99 303 35 -193 -48 397 104 -198 -199 -274 -247 -105 -396 120 -281 -443 -87 28 88
4957 88 313 265 287 138 43 4 694 247 -39 135 -54 75 -101 -6 -61 -75 -167 -215 107 -81 -117 -126 -20 255
4981 255 152 137 -191 568 -110 -186 -35 14 53 -155 265 -73 -106 312 151 93 -57 -55 -18 -92 195 -13 -52 -126
5005 -126 91 16 -170 -71 -20 170 279 -78 -108 407 -258 5 293 108 227 -211 283 -201 -412 218 231 129
$$ packed form
4846c58K99J51k96R8K16r3j19l54R7J88L49R5l55L4J45j73PJ07l23K31N03m55
4868fk59L42K49k97r2p8J9Q2K66j84j62J59Q7l34K73L93p38N38r3L9j12j14k47
4891b69J22K53l14M6N9K69j78K47j63k9K95k05K39j65k73J84k15K60k85Q6j40
4912a76Qj20N37k24p7j5J50j65L30j86p3k12l32M77l1l8k51P17l45K93q7M1K5
4935B46k82J97j81p9M02k68k28J45M45k93l02jp5K7J42k91N16m01j62L56J15O0
4957H8K25m8K2j49r5l9O90m47k86J74j89J29j76R5n5j4r2m8L22j88l6rJ06K75
4981B55j03j5l28P59o78p6J51M9L9k08M20l38l3M18j61n8j50KL7p4K87k08l9p4
5005a26K17p5j86R9N1J90J09l57l0N15o65K63K88j85J19m38M94m84k11O30J3j02
$$ plain form
5027 129 -35 342 -2 181 -118 224 79 -141 -245 9 54 -442 -86 -32 -29 138 35 196 -8 -97 116 -190
5049 -190 136 -180 183 -48 -181 93 228 5 4 107 67 23 164 53 -78 58 -59 165 49 -9 226 -102
5071 -102 -149 112 177 105 214 -10 40 -132 -169 117 -64 -86 205 -167 111 -64 193 141 0 -186 -98 79 -108
5094 -108 82 84 -18 -62 245 135 32 385 166 -17 -79 7 121 518 -64 77 232 45 40 286 -53 180
5116 180 -86 -202 22 300 -97 -301 209 -25 -32 -143 -228 174 26 169 12 200 -89 -78 -126 -44 348 392
5138 392 -94 151 -199 -101 -125 108 -314 -95 183 -457 -164 -21 121 -25 249 20 41 -205 -66 -113 -17 -49
5160 -49 283 57 136 -126 -72 220 28 -13 -54 -111 281 12 -286 198 113 153 104 -435 -231 -22 -201 -31 -121
5183 -121 -248 188 187 116 34 -173 -491 51 107 176 -308 0 195 -198 157 156 118 -137 54 -39 409 323 -38 -78
$$ packed form
5027A29j64L77l44J83k99L42j45k20j04K54M5m96L56N4LJ67j03J61k04q9K13l06
5049a90L26l16L63k31j33K74J35k23jJ03m0m4J41j11j31J36j17K24j16n8K35l28
5071a02m7K61O5p2J09k24N0j72l7K86j81k2K91l72K78j75K57n2j41j86Q8J77j87
5094a08J90Kj02m4L07j10j03L53k19j83o2Q6J14L97n82J41J55j87nK46l39K33
5116A80k66j16K24K78l97k04N10k34pj11q5M02j48J43j57J88k89J1m8Q2L92M4
5138C92m86K45l50R8k4K33m22K19K78o40K93J43J42j46K74k29K1k46J39m7R6l2
5160d9L32k26P9k62N4K92j92m1m1n7L92k69k98M84q5M0m9n39K04K09j79J70r0
5183a21j27M36jp1q2k07l18N42N6O9m84L08J95l93L55jl8k55J91r3M48q6l61m0
$$ plain form
5207 -78 -31 -147 21 290 94 -83 -15 -6 8 104 247 -118 -211 47 213 149 -359 15 37 308 124 169 -212 -71
5231 -71 -157 -123 -223 113 77 206 493 -74 97 -147 142 -60 -277 352 -126 -19 92 -158 64 99 -11 -244
5253 -244 93 -189 183 364 60 -152 113 -158 -66 -12 154 124 137 63 -175 -199 140 -380 74 99 -39 -82 79
5276 79 -274 232 -348 98 -444 -5 -20 235 10 -321 -78 48 -291 86 197 122 181 -149 -137 -314 482 -47
5298 -47 74 -385 -77 76 -268 47 181 -203 302 -156 428 -200 -195 196 -17 -119 -80 305 -229 23 -10 132
5320 132 -164 -35 153 -81 105 275 47 -365 218 -231 101 311 29 -12 -134 -12 129 -164 234 -7
5340 -7 -144 165 -21 263 57 289 69 89 115 -216 95 -92 -23 328 -329 55 111 -207 36 202 -113 147
5362 147 -18 34 -23 -44 -15 73 -137 22 -163 -96 281 -256 25 -285 -230 110 84 215 58 137 97 74 373 -61
$$ packed form
5207g8M7j16J68K69j96j77O8RJ4R6J43l65r3K58J66o4n08L74K2K71j84M5l81J41
5231g1q6L4j00L36l6J29K87n67J71k44K89k02k17O29m78J07J11k50K22L5j10k33
5253b44L37k82L72J81l04k12K65k71R2N4J66l0J3p4k38k4L39n20M54K5j38m3J61
5276G9l53N06n80M46n42M39j5K55k25l31K43J26l39L77J11p5N9l30J2j77P96n29
5298d7J21m59L08J53l44L15J34l84N05m58N84o28NL91k13j02L9L85n34K52l3J42
5320A32k96J29J88k34J86J70k28m12N83m49L32K10k82m1j22J22J41k93L98k41
5340gj37L09j86K84k06K32k20K0K6l31L11j87O9L51o57L84N6l18K43J66l15K60
5362A47j65N2n7k1K9Q8k10J59j85O7L77n37K81l10N5L40k6J31j57P9m0k3K99m34
$$ plain form
5386 -61 -230 13 -130 141 246 -5 -136 -54 91 151 306 47 -66 -2 110 -71 -264 -49 248 182 -158 162
5408 162 -165 -75 283 435 -68 118 224 41 -6 18 -125 104 147 -56 492 -68 232 -6 -61 166 -39 -26
5430 -26 -211 -319 -329 -38 -159 -74 68 -72 22 -185 -115 -33 -237 33 -17 -203 -153 204 9 116 -107 -285 2
5453 2 -209 -266 80 153 -105 98 75 125 -251 -61 -338 -84 -120 380 145 -273 -337 9 202 -417 -24 -205 86
5476 86 113 292 31 141 12 -95 -120 186 -24 27 -41 -183 235 -249 -172 -348 -107 -29 -67 -34 -138 120 46
5499 46 209 -260 411 29 398 272 32 227 -130 128 206 44 -32 -216 -292 -248 35 -340 358 -38 -171 -80
5521 -80 416 273 -85 -70 -148 226 7 104 85 23 -64 72 235 45 237 295 -273 -262 116 20 -235 0 -24 -190
$$ packed form
5386f1j69K43j43K71J05k51j31Q2J45O0J55k59j13O4J12j81j93K15K97o6l40L20
5408A62l27R0L58J52n03J86J06j83m7K4j43K29M3k03N48n60L00k38n5K27k05J3
5430b6j85j08j0K91j21Q5J42j40R4k07P0Q2k04K70n0j86N0L57j95J07k23j78K87
5453Bk11n7L46P3k58K03k3N0l76J90k77K54l6N00k35m18o4L46J93o19L93j81K91
5476H6K7J79k61J10j29j07k5L06k10N1o8j42M18m84P7j76K41P8l8L3j04K58p4
5499D6J63m69O71l82L69j26k40J95l57K58P8j62p6j84p6M4K83l75O98l96j33R1
5521h0M96j43l58J5p8L74k19R7j9o2q7J36J63j90J92N8n68J1L78r6k55K35k4j66
$$ [...]
8191D5
##END NTUPLES=NMR FID
##END=
