##TITLE=1H ikalashn
DE-78_oil2
19.11.2024
##JCAMPDX= 6.0         $$ Bruker NMR JCAMP-DX V2.0
##DATA TYPE= NMR FID
##DATA CLASS= NTUPLES
##ORIGIN= UXNMR, Bruker Analytische Messtechnik GmbH
##OWNER= root
$$ TOPSPIN		Version 1.3
$$ 2024-11-19 16:34:27.562 +0400  Irina@DPX200
$$ Compression mode = diff/dup
##.OBSERVE FREQUENCY= 200.131300845
##.OBSERVE NUCLEUS= ^1H
##.DELAY= (6, 6)
##.ACQUISITION MODE= SIMULTANEOUS
##.ACQUISITION SCHEME= undefined
##.AVERAGES= 64
##.DIGITISER RES= 18
##SPECTROMETER/DATA SYSTEM= spect
##.PULSE SEQUENCE= zg
##.SOLVENT NAME= CDCl3
##.SHIFT REFERENCE= INTERNAL, CDCl3, 1, 17.49637
##AUDIT TRAIL= $$ (NUMBER, WHEN, WHO, WHERE, WHAT)
$$ ##TITLE= Audit trail, TOPSPIN		Version 1.3
$$ ##JCAMPDX= 5.01
$$ ##ORIGIN= Bruker BioSpin GmbH
$$ ##OWNER= Irina
$$ $$ F:/spectra/data/iren/nmr/1H/4/audita.txt
$$ ##AUDIT TRAIL=  $$ (NUMBER, WHEN, WHO, WHERE, VERSION, WHAT)
(   1,<2024-11-19 16:33:56.140 +0400>,<Irina>,<DPX200>,<TOPSPIN 1.3>,
      <created by zg
	started at 2024-11-19 16:29:42.828 +0400,
	POWCHK disabled, PULCHK disabled
       configuration hash MD5:
       BE 6D 3F 07 2A EA 11 49 91 17 2B D3 AF B3 58 0D
       data hash MD5: 16K
       D0 35 FB 59 62 3A 72 1F C7 D0 40 91 0B CC 6E 99>)
$$ ##END=
$$ 
$$ $$ hash MD5
$$ $$ 7D E4 78 EE DA 80 4B C1 59 20 BA 13 7B 2A 24 EA
##$RELAX= 
##$RELAX= 
##$RELAX= 
##$RELAX= 
##$RELAX= 
##$RELAX= 
##$RELAX= 
##$RELAX= 
##$RELAX= 
$$ Bruker specific parameters
$$ --------------------------
##$DU= <F:/spectra>
##$EXPNO= 4
##$NAME= <1H>
##$PROCNO= 1
##$TYPE= <nmr>
##$USER= <iren>
##$AMP= (0..31)
100 100 100 100 100 100 100 100 100 100 100 100 100 100 100 100 100 100 
100 100 100 100 100 100 100 100 100 100 100 100 100 100 
##$ANAVPT= -1
##$AQSEQ= 0
##$AQ_mod= 1
##$AUNM= <au_zg>
##$AUTOPOS= <>
##$BF1= 200.13
##$BF2= 200.13
##$BF3= 200.13
##$BF4= 200.13
##$BF5= 200.13
##$BF6= 200.13
##$BF7= 200.13
##$BF8= 200.13
##$BYTORDA= 1
##$CFDGTYP= 0
##$CFRGTYP= 5
##$CHEMSTR= <none>
##$CNST= (0..63)
1 1 145 1 1 1 1 1 1 1 1 1 1 1 1 1 1 1 1 1 1 1 1 1 1 1 1 1 1 1 1 1 1 1 
1 1 1 1 1 1 1 1 1 1 1 1 1 1 1 1 1 1 1 1 1 1 1 1 1 1 1 1 1 1 
##$CPDPRG= <>
##$CPDPRG1= <>
##$CPDPRG2= <>
##$CPDPRG3= <>
##$CPDPRG4= <mlev>
##$CPDPRG5= <mlev>
##$CPDPRG6= <mlev>
##$CPDPRG7= <mlev>
##$CPDPRG8= <mlev>
##$CPDPRGB= <>
##$CPDPRGT= <>
##$D= (0..63)
0 2 0 0 0 0 0 0 0 0.06 0 0.03 0 0 0 0 0.0002 0 0 0 0 0 0 0 0 0 0 0 0 0 
0 0 0 0 0 0 0 0 0 0 0 0 0 0 0 0 0 0 0 0 0 0 0 0 0 0 0 0 0 0 0 0 0 0 
##$DATE= 1732019634
##$DBL= (0..7)
120 120 120 120 120 120 120 120 
##$DBP= (0..7)
150 150 150 150 150 150 150 150 
##$DBP07= 0
##$DBPNAM0= <>
##$DBPNAM1= <>
##$DBPNAM2= <>
##$DBPNAM3= <>
##$DBPNAM4= <>
##$DBPNAM5= <>
##$DBPNAM6= <>
##$DBPNAM7= <>
##$DBPOAL= (0..7)
0.5 0.5 0.5 0.5 0.5 0.5 0.5 0.5 
##$DBPOFFS= (0..7)
0 0 0 0 0 0 0 0 
##$DE= 6
##$DECBNUC= <off>
##$DECIM= 32
##$DECNUC= <off>
##$DECSTAT= 4
##$DIGMOD= 1
##$DIGTYP= 9
##$DL= (0..7)
0 120 120 120 120 120 120 120 
##$DP= (0..7)
150 150 150 150 150 150 150 150 
##$DP07= 0
##$DPNAME0= <>
$$ [...]
##$SW= 21.9926040160658
##$SWIBOX= (0..15)
0 0 2 0 0 0 0 0 0 0 0 0 0 0 0 0 
##$SW_h= 4401.40845070422
##$TD= 16384
##$TD0= 1
##$TE= 300
##$TE2= 300
##$TE3= 300
##$TEG= 300
##$TL= (0..7)
0 120 120 120 120 120 120 120 
##$TP= (0..7)
150 150 150 150 150 150 150 150 
##$TP07= 0
##$TPNAME0= <>
##$TPNAME1= <>
##$TPNAME2= <>
##$TPNAME3= <>
##$TPNAME4= <>
##$TPNAME5= <>
##$TPNAME6= <>
##$TPNAME7= <>
##$TPOAL= (0..7)
0.5 0.5 0.5 0.5 0.5 0.5 0.5 0.5 
##$TPOFFS= (0..7)
0 0 0 0 0 0 0 0 
##$TUNHIN= 0
##$TUNHOUT= 0
##$TUNXOUT= 0
##$USERA1= <user>
##$USERA2= <user>
##$USERA3= <user>
##$USERA4= <user>
##$USERA5= <user>
##$V9= 5
##$VALIST= <valist>
##$VCLIST= <CCCCCCCCCCCCCCC>
##$VD= 0
##$VDLIST= <DDDDDDDDDDDDDDD>
##$VPLIST= <PPPPPPPPPPPPPPP>
##$VTLIST= <TTTTTTTTTTTTTTT>
##$WBST= 1024
##$WBSW= 25
##$XGAIN= (0..3)
0 0 0 0 
##$XL= 0
##$YL= 0
##$YMAX_a= 2369146
##$YMIN_a= -1307206
##$ZGOPTNS= <>
##$ZL1= 120
##$ZL2= 120
##$ZL3= 120
##$ZL4= 120
##$ABSF1= 10
##$ABSF2= 0
##$ABSG= 5
##$ABSL= 3
##$ALPHA= 0
##$AQORDER= 0
##$ASSFAC= 0
##$ASSFACI= 0
##$ASSFACX= 0
##$ASSWID= 0
##$AUNMP= <proc_1d>
##$AXLEFT= 0
##$AXRIGHT= 0
##$AXTYPE= 0
##$AXUNIT= <>
##$AZFE= 0.1
##$AZFW= 0.1
##$BCFW= 1
##$BC_mod= 2
##$BYTORDP= 1
##$COROFFS= 0
##$CY= 7568.61572265625
##$DATMOD= 1
##$DC= 2
##$DFILT= <>
##$DTYPP= 0
##$F1P= 17.9538593292236
##$F2P= -4.03888763876832
##$FCOR= 0.5
##$FTSIZE= 32768
##$FT_mod= 4
##$GAMMA= 1
##$GB= 1
##$INTBC= 1
##$INTSCL= 1
##$ISEN= 128
##$LB= 0.03
##$LEV0= 0
##$LPBIN= 0
##$MAXI= 945.577
##$MC2= 0
##$MEAN= 0
##$ME_mod= 0
##$MI= -402.1523
##$NCOEF= 0
##$NC_proc= 0
##$NLEV= 6
##$NOISF1= 8.587773
##$NOISF2= 6.764455
##$NSP= 1
##$NTH_PI= 0
##$NZP= 0
##$OFFSET= 17.49637
##$PC= 1
##$PHC0= 109.4153
##$PHC1= 22.86143
##$PH_mod= 0
##$PKNL= yes
##$PPARMOD= 0
##$PPDIAG= 0
##$PPIPTYP= 0
##$PPMPNUM= 100
##$PPRESOL= 1
##$PSCAL= 0
##$PSIGN= 0
##$REVERSE= no
##$SF= 200.13
##$SI= 32768
##$SIGF1= 18.5376
##$SIGF2= -6.396296
##$SINO= 400
##$SIOLD= 32768
##$SREGLST= <1H.CDCl3>
##$SSB= 3
##$STSI= 0
##$STSR= 0
##$SW_p= 4401.40845070422
##$SYMM= 0
##$S_DEV= 0
##$TDeff= 0
##$TDoff= 0
##$TI= <>
##$TILT= no
##$TM1= 0
##$TM2= 0
##$TOPLEV= 0
##$USERP1= <user>
##$USERP2= <user>
##$USERP3= <user>
##$USERP4= <user>
##$USERP5= <user>
##$WDW= 1
##$XDIM= 8192
##$YMAX_p= 0
##$YMIN_p= 0
$$ End of Bruker specific parameters
$$ ---------------------------------
##NTUPLES= NMR FID
##VAR_NAME=  TIME,          FID/REAL,        FID/IMAG
##SYMBOL=    X,             R,               I
##VAR_TYPE=  INDEPENDENT,   DEPENDENT,       DEPENDENT
##VAR_FORM=  AFFN,          ASDF,            ASDF
##VAR_DIM=   8192,          8192,            8192
##UNITS=     SECONDS,       ARBITRARY UNITS, ARBITRARY UNITS
##FACTOR=    0.0002272,     1,               1
##FIRST=     0,             0,               0
##LAST=      1.8609952,     195,             -231
##MIN=       0,             -1307206,        -1307206
##MAX=       1.8609952,     2369146,         2369146
$$ Real data points
##PAGE= N=1
##DATA TABLE= (X++(R..R)), XYDATA
0 0 0 0 0 0 0 0 0 0 0 0 0 0 0 -7 64 -64 64 -64 128 -128 129 -192 193 -256 311 -326 385 -450 520 -627 705
31 705 -808 908 -1032 1171 -1320 1482 -1662 1859 -2071 2309 -2569 2852 -3159 3491 -3858 4260
47 4260 -4698 5183 -5708 6286 -6924 7633 -8423 9302 -10289 11425 -12709 14203 -15958
60 -15958 18057 -20613 23822 -27969 33576 -41608 54171 -76743 130158 -556514 169505
71 169505 957612 -359667 -706620 76883 509781 -425157 -960696 -391637 294556 37111
81 37111 -143013 454739 1021325 449403 -361992 -198410 529231 441721 -169599 -87813 645994
92 645994 698450 -78786 -536505 -195379 -12769 -505946 -896725 -437931 226749 165436
102 165436 -343917 -317399 192665 281586 -152427 -202750 352743 673524 374070 139528
112 139528 363333 469406 60800 -319893 -188319 52009 -118082 -383529 -210143 133595
122 133595 -3742 -447742 -437989 39873 202264 -137653 -266342 130641 441105 230440
132 230440 -67373 -4508 187094 136940 -21308 18478 164504 138357 -14703 -30129 73355
143 73355 25661 -183025 -240325 -70815 20670 -109539 -200743 -72822 66823 5222 -109612
154 -109612 -53295 105893 135413 35053 14631 138876 204277 84981 -35778 6714 83969
165 83969 20852 -94326 -90529 -32954 -53655 -105824 -83711 -37356 -58137 -88196 -33044 56469
177 56469 52558 -20455 -12702 90525 135079 52443 -20501 28131 94281 54082 -29582 -44885
189 -44885 -8782 -6300 -40277 -58087 -52411 -49799 -48046 -34822 -15434 -10383 -16861 -1371 40294
202 40294 60057 35132 15502 41203 67487 44603 5975 2667 20351 12123 -24516 -43891
214 -43891 -28716 -17791 -37323 -55523 -38910 -9329 -9437 -23339 -13980 9355 15289 13277 23327
227 23327 32131 23144 18830 34372 43025 18744 -9100 -4886 17058 13329 -20080 -41322 -23447
240 -23447 -6927 -18840 -40584 -41439 -23832 -12607 -9786 -3839 1902 6156 15800 30976 37046 27517
254 27517 21091 26759 35777 28540 8104 -6220 -3406 -1894 -16625 -31575 -30844 -22998 -23712 -28235
268 -28235 -19904 -9240 -3328 -6815 -993 12496 22136 18405 14397 20698 27519 24121 16025 14675
282 14675 11036 2466 -2083 641 -198 -14171 -22403 -15901 -6743 -11472 -24238 -23157 -9840 1895
296 1895 -3203 -6860 -497 10481 14393 15346 17039 15333 13611 14028 16746 14506 2790 -5460 -2681
311 -2681 1258 -4146 -15883 -18922 -13344 -8315 -11697 -14921 -9650 -4701 -2822 -2278 4695 8441 6958
326 6958 3310 6641 13374 11959 5740 1965 4473 6130 -542 -3754 -4254 -5643 -7554 -8918 -6135
341 -6135 -6036 -9853 -10736 -5137 2282 -565 -5037 -1828 6341 8881 4410 1655 3269 6735 5044 2102
357 2102 646 218 -4320 -3972 -941 -1047 -6131 -6634 -1972 2416 1761 -1738 -2262 3010 4714 2066 -894
374 -894 1126 1489 -545 106 1723 1550 -2590 -2399 821 4608 1143 -3941 -1565 3407 4598 349
390 349 -3435 -178 1788 -738 75 1647 1016 37 -544 4279 6503 527 -1551 113 3224 2626 -2243
407 -2243 -4143 -1855 -1516 -2040 -1867 -661 -467 -974 516 3692 4829 1987 1911 3992 5441 4365 -224
424 -224 -486 603 592 -2684 -4936 -3976 -4737 -5021 -3146 -631 -1260 -3544 -1873 747 3279 1474 -1103
441 -1103 1868 3887 3934 1223 1296 2247 2275 1101 -1071 -1090 87 -1052 -2115 -566 -1654 -1954 -3908 -2271
459 -2271 -585 -1434 -3274 -2273 141 883 1452 1109 1426 2857 2181 1781 4883 2918 1021 435 115
476 115 1285 328 -2911 -2160 -1275 -331 -2961 -3473 -2915 -880 -522 -1100 55 -460 613 493 2347 3229
494 3229 2337 -1037 1101 2987 1803 313 -1001 -207 1378 -343 -1741 -1927 268 -181 -542 -623 -245
511 -245 -1374 -486 -143 88 582 -194 846 372 1239 397 -221 -512 1188 877 -591 -350 -422 737 117
530 117 98 793 209 -1119 -1355 412 1992 -314 -1080 -2 289 -317 -938 75 -1783 94 1117 530
548 530 258 417 224 -102 668 1419 707 -312 800 1885 1829 -216 -597 -890 -355 909 -631 -311 982
567 982 481 722 15 -1490 -1389 -1025 -159 -881 -11 32 256 -278 1378 446 -404 761 1672 1905 1155 1819
587 1819 1426 1014 -200 -837 -1472 -1178 -1468 -1198 -1760 521 210 -1560 -482 -832 243 -625 374 426 2396
606 2396 990 1576 1673 -513 1577 254 257 -119 535 682 101 -433 -614 -116 -1177 -1062 -869 -377 -239
625 -239 -427 -432 328 103 -788 -925 -970 456 458 1313 1001 1543 2020 188 626 574 139 37 -367 404 -903
646 -903 650 -1077 -770 -1447 -663 -376 -511 -852 646 361 1230 307 1040 974 -344 -200 -133 100 -737 897
666 897 462 -747 -334 -432 -205 -167 -779 -1083 99 -413 -593 340 -84 -1310 590 -495 -425 868 -487
685 -487 -155 956 7 1087 468 834 323 622 197 363 385 -239 -1151 603 -558 -309 -188 -567 62
704 62 -524 -262 -366 -620 813 216 1103 626 -26 -239 214 1262 623 -276 -1669 -827 -8 5 1234 324
724 324 886 -493 -92 -399 831 182 -626 -518 234 -573 -1097 -925 914 1379 -137 -10 -308 -497 174
743 174 -609 -46 -132 431 272 -904 116 -473 -91 -879 -190 -26 1182 817 69 -916 -396 -91 146 291
763 291 -41 -22 -517 -50 1370 665 -817 961 106 -1017 161 -749 276 -392 431 370 144 191 -1
782 -1 233 -948 -660 -761 -1180 -524 -141 -261 621 282 919 -709 20 205 311 343 -170 -201 590 -117 126
803 126 -619 248 -949 -537 -12 101 404 54 -1682 -520 -458 1139 -852 -284 203 -504 -1051 -142 59
822 59 211 159 103 941 521 -519 5 -602 -10 252 -1532 -298 -246 633 362 588 -260 493 224 855 256
843 256 521 -607 -131 -109 420 -274 49 168 -214 -947 107 209 -665 -677 115 -388 -102 484 -1294 326
863 326 -362 687 389 -92 539 910 -753 273 312 -700 -625 -1321 353 -104 25 456 407 -55 265 302
883 302 702 -156 -839 -9 124 -439 897 38 245 1466 -34 360 -312 -16 108 383 -930 679 -1171
902 -1171 864 -409 -802 553 104 -47 503 -96 11 749 -35 513 953 -554 -297 1177 -315 -94
920 -94 367 -76 -518 -177 -659 1770 -136 259 -248 789 259 -889 1082 420 130 147 407 888 63
939 63 -552 345 -129 -722 -328 647 -382 -363 199 -1021 934 -412 -94 -2 -6 -61 106 1191 -694 -3
959 -3 543 129 229 -1072 -10 -82 93 -174 -648 -314 483 -620 252 -406 166 -253 249 -38 -299 91
979 91 -196 -143 116 -1336 523 528 463 -430 -718 -1424 -387 379 -882 867 316 485 261 334 539 288 508
1000 508 -208 -578 112 652 -397 -405 419 675 917 -168 -379 858 1036 437 -412 -408 -222 -491 -94 -862
1020 -862 -328 -57 800 736 301 -569 345 738 182 802 142 -242 147 -988 586 -370 -1197 -107 -865
1039 -865 -907 179 -275 -469 919 657 9 -422 327 314 85 -526 786 -83 92 301 316 169 -419 754
1059 754 -493 -444 -123 -746 263 81 -592 -13 865 655 -72 160 1283 -342 -666 231 -350 403 -697
1078 -697 211 56 254 225 -333 -25 278 -234 -1249 -440 -728 167 -363 678 -55 673 310 323 -312 815
1098 815 -459 -657 -265 100 789 -43 -192 77 723 1555 -64 -900 -185 429 990 423 457 24 -109 2
1118 2 -122 96 -68 -166 801 412 -419 -485 -505 -1202 -220 -80 4 -1361 348 455 -595 969 1005 1244 108
1139 108 -927 -579 -197 363 314 475 179 483 -319 -488 409 -457 -638 24 -529 -188 265 1293 110
1158 110 -188 -849 959 -384 -71 292 -54 392 1052 343 77 120 -233 -1321 -219 258 -587 700 304
1177 304 281 -453 -239 579 -130 195 -1157 429 -254 -592 641 230 -233 139 383 189 -442 96 708
1196 708 -148 -750 157 141 491 -200 1267 -759 -846 -109 -105 168 127 97 341 444 591 -1451 -110 299 276
1217 276 -114 508 -8 -1143 421 -355 -32 -650 -623 -984 1593 166 1121 -818 -213 -443 -17 -143 -135
1236 -135 737 538 -317 -473 -209 -56 1121 654 57 320 411 -883 -369 -302 -60 -227 -287 -101 -155 -397 382
1257 382 389 549 180 -798 63 -156 445 391 -325 850 369 -32 101 -677 -979 508 194 479 422 -201 441
1278 441 351 -1502 -441 819 487 -116 -441 -365 -217 -206 -183 485 -379 -66 926 -583 -234 -375 -433 -78
1298 -78 433 23 282 54 -776 735 -304 -273 -1075 14 -538 571 1336 -323 11 393 418 307 -375
1317 -375 639 678 861 -600 -282 -406 337 272 -652 1045 1475 -205 -201 616 -284 -397 135 -740 645 -440
1337 -440 -294 77 -364 -934 460 -608 1008 642 -790 633 1144 341 778 -121 -243 35 -159 -204 132
1356 132 826 -347 1301 -577 -304 -656 1331 -236 -522 1138 -235 -245 -801 225 -63 -586 276 103
1374 103 478 241 393 44 136 -69 -752 -390 1584 -795 -3 -33 417 518 313 139 -285 641 -528 -1505
1394 -1505 -776 715 453 166 -581 325 867 419 35 108 574 105 839 2 -784 76 257 -195 -1120 139
1414 139 360 -161 1393 -709 -569 -1142 75 232 12 36 528 465 -780 -130 631 110 198 -106 134 -191
1434 -191 -5 34 -87 -624 107 890 159 726 150 -419 165 163 358 -880 -220 549 107 -451 -504 250 -1234
1455 -1234 281 1111 -902 -150 -165 -144 -154 -727 -194 -121 -258 -1005 -59 -66 19 392 584 1578 416 -701 -519
1476 -519 -875 143 -1722 330 -103 454 -463 424 149 823 -195 13 -178 -27 553 214 -289 -627 476
1495 476 646 500 66 -1591 36 -245 484 -710 415 -132 -614 -1064 -113 1010 -778 -418 14 -175
1513 -175 210 290 -38 -386 877 909 -651 -126 700 121 325 -361 -284 7 297 349 480 504 -751 886
1533 886 294 -504 -732 -192 196 76 631 1159 -680 -705 1437 -238 -417 99 -293 -959 475 469 1343 -315
1553 -315 684 -118 -123 656 188 -319 526 723 455 -419 346 756 -6 834 -391 389 58 -617 421 -440
1573 -440 411 376 -376 693 119 171 -311 -360 -512 -11 550 -356 556 255 767 409 265 -554 172 -217 -734
1594 -734 764 273 625 809 359 247 -91 -323 -153 -30 51 64 -169 60 731 -535 608 243 -276 -566
1614 -566 -1173 34 1414 -538 416 93 13 39 -254 -731 -484 -676 -148 919 791 -642 1063 -126
1632 -126 -612 -445 -369 227 292 -297 -281 -555 -522 208 -139 780 -944 -1723 -443 -361 -646 968 -157 -387
1652 -387 1285 311 -1493 185 254 -118 -569 -19 386 326 522 289 523 691 -964 -1541 821 -544 -134
1671 -134 -64 -140 -796 -127 -43 225 604 -47 -701 -200 -149 932 -504 87 229 -700 101 -6 -1121 466
1691 466 -505 1689 -291 -150 968 629 451 -309 -257 115 -200 235 -219 1075 308 -735 144 800 190
1710 190 -380 -637 1289 92 -850 52 -407 -160 -100 -421 -526 134 -328 -565 -234 -729 -207 937 -266
1729 -266 665 278 -411 1206 764 228 -389 -665 33 -348 -453 77 1066 149 -11 323 -175 -31 -209 545
1749 545 -570 76 -163 -807 280 -491 -114 301 685 -598 42 309 408 62 426 -962 -68 509 -773
1768 -773 207 154 -711 287 885 274 634 262 -39 344 204 49 -350 -292 769 688 -1056 -656 194 537
1788 537 42 -150 788 190 -889 497 -206 98 747 -814 915 -39 -816 -946 104 230 376 39
1806 39 701 -1040 442 174 608 -653 -779 -488 932 -380 -636 538 -110 -236 -1520 1120 26
1823 26 -1394 243 135 -173 70 1044 76 115 -245 596 -72 24 -1168 -555 -1004 560 -69 -808 1363
1842 1363 -511 -96 -323 1001 -757 278 299 -674 -385 1118 -287 -69 -197 -896 975 -89 908
1859 908 124 -221 -664 -366 414 -218 -858 213 447 676 -618 208 568 -197 312 359 -1233 -721 -463
1878 -463 -6 92 -633 -601 -16 10 -938 -965 -120 -767 639 -99 -154 1163 341 -809 -171 462 141 -151 16
1899 16 -61 -162 923 -311 1013 -438 -740 575 -742 -1066 18 -722 -304 -8 -282 -1500 144 -106
1917 -106 532 -111 -803 -568 -143 569 -16 -756 324 -905 193 -222 -992 470 390 -296 -159 395 1031
1936 1031 128 -56 490 -485 207 -695 89 561 304 -411 -53 -1 -569 1134 36 -694 33 -206 799
1955 799 -191 1231 1081 439 467 -176 -747 -212 -708 277 -769 -168 -465 288 -663 411 -598 -549 -940
1974 -940 -228 487 96 531 -472 5 -741 -48 427 407 -446 188 -253 210 593 -74 -940 491 -2 -247
1994 -247 888 -485 -70 -968 729 529 102 1102 217 -43 -778 -320 -256 554 416 58 575 -460 -42
2013 -42 123 -240 27 365 -50 -407 1195 814 -1004 -453 553 -123 843 -364 163 504 24 -580 -39
2032 -39 238 198 -844 -314 733 127 101 10 393 -58 911 463 -226 -255 -124 -516 -84 435 622 -485 433
2053 433 762 -520 -307 -362 -24 758 -832 -600 176 -25 115 93 -769 -1099 -71 103 -1146 -54 434
2072 434 159 -1183 -683 -578 913 -701 -1146 -107 -342 342 397 -233 -580 -323 332 662 -237 212 -362
2091 -362 -594 -1508 -560 -1078 189 303 -237 732 742 -17 -482 -517 810 -6 626 -665 -498 -108 -385 206
2111 206 135 1264 -196 -778 936 174 137 153 -579 426 -197 523 26 -22 -270 -347 695 -898 -754 -50
2131 -50 159 -318 328 119 363 -463 -62 930 454 684 349 -193 469 -236 -424 -251 846 -137 -180 -190 690
2152 690 -870 -372 36 520 -226 -545 137 226 -255 -584 -174 261 -226 -498 1002 -1069 125 258 962
2171 962 -456 160 -331 -340 334 -752 -403 -233 -396 621 42 1107 709 -240 -990 -414 176 133 555 151
2191 151 -321 1038 -174 -10 202 947 -152 -433 368 -563 -21 340 -24 133 191 849 301 -182 -603
2210 -603 586 185 189 -734 -170 89 294 -290 341 496 210 -436 387 1700 -515 -409 -965 -758 787
2229 787 -324 523 34 -816 -62 -1049 -154 648 173 1285 150 -989 -116 -1229 -311 959 -763 -422
2247 -422 78 -542 -777 -21 223 -313 1637 -1322 228 326 -121 -842 -542 435 937 -220 476 -535 -415
2266 -415 -320 -496 741 -541 -193 440 -358 -372 28 -809 -677 2054 -573 39 114 -26 -552 721 150
2285 150 -303 -407 -320 1238 -1375 235 162 579 -335 110 189 12 22 88 -75 -66 156 461 855 -110 -408
2306 -408 -296 278 -887 -334 545 -154 -605 -829 -323 163 797 825 81 -329 -213 -314 206 -288 -1292 -159
2326 -159 -364 -233 703 1399 598 -1007 -39 -408 1111 -414 -264 -1115 763 -130 -157 579 -529 -1308 -355
2345 -355 36 430 277 320 656 453 63 508 331 -614 549 600 -703 -49 -106 606 -163 471 261 137
2365 137 771 -723 -20 -57 -18 -783 827 333 733 -1015 76 -263 81 170 907 114 200 560 63 -417
2385 -417 -850 -303 -260 -174 -208 -153 -191 -925 -82 309 -172 1539 99 -1120 -266 -136 117 -119 -1344 201
2405 201 -839 -623 -1092 386 213 160 -852 -477 -288 -1580 255 1031 -82 -42 202 -379 275 16 20
2424 20 -482 309 -216 -282 780 -350 210 -423 427 109 187 478 364 729 -860 819 -721 -418 764
2443 764 237 442 88 492 -525 223 -557 -353 -251 -521 404 -284 -246 -166 788 -557 -128 94 -1168 -287
2463 -287 154 -217 268 -35 49 275 -1008 292 1230 544 -838 -138 -85 498 90 -31 -1111 -486 487
2482 487 -695 177 126 1568 263 208 -1097 1013 1074 -413 -343 -573 -142 -426 -1021 -402 463 -609 -411
2501 -411 836 1370 -916 249 123 -640 690 604 -934 449 329 739 -13 -479 759 83 -186 350
2519 350 1006 1249 608 -611 -343 -841 105 319 843 -452 206 633 -651 -465 -994 -377 712 -895
2537 -895 735 76 -683 472 -52 221 464 -617 399 19 -223 48 199 298 1075 416 103 -6 -798
2556 -798 318 -220 339 392 -287 43 172 989 -268 289 -1411 -617 395 -225 1096 -449 313 308 -195
2575 -195 69 -539 -493 -185 -457 408 -586 331 -35 128 1122 -630 -471 -737 724 -221 -696 -478 -1011 69
2595 69 447 -484 972 -172 -557 -243 -214 -853 539 -46 -526 -274 -1155 -40 370 1341 -284 -209 -215 -1091
2615 -1091 513 770 219 -282 -579 710 1554 -1174 -929 -227 241 -546 -287 444 -259 388 -591 500
2633 500 -291 -146 911 -73 -452 734 183 1017 458 278 164 913 1640 350 310 102 330 -653 -86
2652 -86 -444 -330 130 180 48 -112 -866 -227 -215 -228 -538 -435 -12 633 -196 -137 -283 15 -300 -99 630 381
2674 381 -800 399 -542 -635 819 236 -1844 -730 212 549 -660 -237 3 905 131 465 -373 697
2692 697 593 -635 -1411 501 345 -393 -205 599 -434 -128 1740 640 -466 -221 -712 -337 -905 446
2710 446 -532 -1021 -430 -639 -247 -1476 976 -1621 362 -289 535 199 -718 190 -561 239 -697 -16 1166
2729 1166 -609 85 272 999 -550 184 172 -175 -818 -156 -341 -288 -187 484 -89 489 -798 -252 755
2748 755 -254 640 -343 -521 -22 71 -505 479 -543 -438 -587 258 -438 -439 -571 335 433 -803 -155 -416
2768 -416 -749 -274 -301 315 -308 575 -206 373 -505 -291 -1057 446 -67 -316 532 -294 -202 -324 -162 745
2788 745 231 -134 -390 -720 -94 613 -195 -423 1410 800 780 -243 50 27 -597 -328 -20 327 340 -257
2808 -257 -847 102 -367 706 160 359 -172 89 18 1429 705 -943 343 -542 -408 -806 -164 1552 -107
2827 -107 -22 9 -962 34 -1493 -366 359 -27 -83 -742 -17 -610 -154 -579 290 -180 326 96 -121 -187 222
2848 222 699 330 -321 -275 -538 49 -146 -167 1143 -513 208 -250 284 948 808 -899 -851 -79 -1566 -204
2868 -204 26 -578 411 536 673 231 247 307 -65 1106 937 -73 -568 710 -241 -151 -605 1124 545 -297
2888 -297 -141 721 -245 425 -854 -507 197 796 -906 453 -307 348 -174 238 540 633 212 -625 -662 799
2908 799 275 70 -19 -41 -316 32 -426 -353 414 856 224 246 -326 -863 -416 -226 -21 -694 252 -20 39 -321
2930 -321 228 157 721 137 412 -1055 -268 -971 182 362 183 294 -49 1294 -37 -124 364 44 -93
2949 -93 82 -1079 237 14 -282 -817 -249 -580 -339 372 -392 1014 568 303 -487 -50 405 143 475
2968 475 -1344 -144 -906 462 -401 -122 291 40 -404 147 67 -125 -301 -142 66 503 -261 -556 -153
2987 -153 310 -568 -386 200 739 -457 -554 1139 45 -195 -243 -302 53 -705 -466 -538 33 -84 -883 86
3007 86 -332 80 -939 940 340 -510 129 1021 121 167 228 -171 465 636 -315 775 321 608 -432 182
3027 182 703 -1008 -449 752 -230 -539 974 -596 -93 1100 -452 -535 170 -496 -151 242 -691 699
3045 699 -36 295 662 75 -1125 184 -86 778 112 110 -110 -465 452 240 -514 694 63 1253 -426
3064 -426 80 1420 -796 -168 954 -806 -155 -330 672 371 -280 -830 958 143 14 -467 -1088 503
3082 503 -953 456 -141 -291 176 150 -416 267 -1054 24 461 615 -171 597 -380 -226 317 513 229
3101 229 2 943 194 154 400 -967 524 -448 -348 427 266 729 632 809 -849 -303 -114 148 -544 -36
3121 -36 122 121 70 324 -313 -591 -99 -466 -138 853 185 300 479 164 -49 970 812 175 -378 115 607
3142 607 -197 1289 43 991 590 -661 350 -582 184 -168 565 -155 303 605 -596 -450 806 -453
3160 -453 1076 248 103 291 501 773 -155 1057 1511 -323 629 94 -1572 -1125 -1 167 187 266 306
3179 306 -272 -718 -534 -22 566 91 893 1099 -735 -247 1188 -1366 -1267 433 -429 -127 22 -1450 -526
3198 -526 397 589 -76 257 1140 -740 -691 597 88 -792 985 351 -276 319 -52 -248 -421 707 -760
3217 -760 -727 -370 -811 164 155 296 11 -1034 -445 549 -822 393 -23 -328 -1216 -526 537 -861 704
3236 704 203 368 -10 -630 449 -853 -715 365 -80 39 141 -913 -935 29 -377 431 130 661 -15
3255 -15 -463 169 855 167 29 309 -549 -619 -658 -409 -923 -711 142 580 333 -795 353 367 -392 803
3275 803 -430 -388 428 -295 926 -1140 -669 323 189 260 1020 -222 -796 161 -568 204 -33 870 -379
3294 -379 713 -127 365 273 253 493 -171 456 368 564 -50 -641 -294 289 669 -396 -672 457 93 149
3314 149 166 -128 341 -21 122 -461 371 -212 -413 1403 268 -679 -75 -235 -646 55 304 -532 -1198 242
3334 242 567 -115 47 583 567 189 341 713 511 320 798 148 -322 744 -644 -28 -275 -696 555
3353 555 -907 402 -301 -521 -367 -557 917 809 222 -714 -12 -633 267 -107 -608 375 65 17 136
3372 136 885 -621 765 -111 212 -353 488 -583 -97 424 -181 119 657 621 -335 44 -220 207 -1070
3391 -1070 62 -24 29 676 -317 173 245 143 -522 -324 -509 -42 -271 -1000 -1402 -688 -199 -581 -204 -350
3411 -350 -458 -168 -1012 -163 973 -641 979 -474 -662 -30 260 252 240 535 -769 58 398 39 -667
3430 -667 -55 -643 -823 -400 463 893 788 -706 -348 516 51 962 543 -1046 -715 417 883 620 -874
3449 -874 120 411 -202 -337 847 1196 303 -648 387 -867 377 -664 411 -705 61 -741 436
3466 436 235 -1099 -307 -735 573 -957 -343 33 -298 1323 408 -227 -610 -299 -800 139 -411 -349 282
3485 282 -119 140 -115 -94 395 263 232 135 -1576 253 -801 -362 -97 -854 956 -208 -297 -668 938
3504 938 -533 -270 1002 -486 304 39 645 159 -736 255 797 376 328 -428 841 -254 1513 -1107
3522 -1107 -378 216 -200 -1323 -1313 -273 1387 -326 1013 -488 376 -870 -50 253 -142 261 -556 -268
3540 -268 18 -482 99 67 578 36 1109 171 730 733 110 -100 -997 1296 -380 942 810 545 717 -412
3560 -412 1073 -584 -654 81 448 296 -321 217 -184 17 -280 83 -88 -226 -395 9 -1188 337 -117
3579 -117 -547 -1130 192 -498 -463 490 489 124 -6 -308 -522 583 -745 158 -367 984 -1044 387 517
3598 517 160 -296 89 -147 411 4 147 13 -440 102 141 141 -102 -40 -30 539 679 -357 227 -211 735
3619 735 -672 -211 86 382 -630 -302 167 -28 -419 -768 -453 -709 796 187 207 75 435 751 476
3638 476 421 -623 163 -410 325 -275 -413 423 578 779 378 -273 -250 493 322 1445 605 -261 -5 591
3658 591 -450 588 -617 -422 -251 157 60 270 -424 -173 -67 -141 223 37 -1051 303 -141 280 -139
3677 -139 1089 -324 266 -524 711 -1080 -81 1181 888 -57 -105 405 4 78 -586 -487 -408 -842 -1175 -127
3697 -127 175 -199 -1320 -108 58 -462 -235 1039 -128 -282 -244 -719 -391 -125 1047 1430 107 591
3715 591 216 -99 55 -668 -119 146 1016 -636 -394 -1292 -324 267 452 145 -205 647 110 -176 884
3734 884 -477 401 228 52 -962 -19 -30 -29 220 563 162 -1199 -165 283 780 -679 -1060 -58 20
3753 20 172 321 -742 -776 507 738 -262 -313 -362 -1057 -101 695 -335 -341 -494 -1415 579 655 93 112 275
3774 275 67 -495 385 534 155 500 -496 -768 376 760 -1373 452 63 383 -319 266 353 798 114
3793 114 298 -416 -186 -1094 289 73 -582 356 248 -29 -1070 -709 459 -203 325 -593 278 -1589 59
3812 59 932 -515 -151 348 -255 404 -16 13 -380 -455 112 498 645 78 -17 -1106 4 -835 258 -84
3832 -84 44 -92 71 -189 405 -298 574 -1137 219 -224 397 -822 459 472 -47 -148 -117 -389 416 1173
3852 1173 -358 -684 -369 162 310 440 -797 -520 -55 -353 292 -471 459 -443 -370 -390 -162 22 1000 -526
3872 -526 254 -298 -8 313 -180 -289 580 -565 549 -110 526 375 143 -811 20 91 793 836 261 -694
3892 -694 -717 -232 460 232 1643 1200 -663 324 292 -289 -118 567 68 -484 -229 262 -541 150 -612 1057
3912 1057 388 -87 -145 768 175 -596 -537 -374 -428 114 -1178 -530 -369 -259 -143 -83 -484 -1305 519 570 336
3933 336 189 -728 -1245 1169 -675 52 -168 -325 -222 410 -618 -90 -967 -59 1021 -104 387 -454
3951 -454 404 -270 224 -587 -143 628 614 349 -405 -284 951 209 284 735 -232 -57 19 544 -878 -4
3971 -4 19 168 551 -637 -396 -591 -342 -667 -263 1086 202 454 1132 240 -108 475 -83 351 -593 -111
3991 -111 711 468 -1029 91 -42 489 -243 -545 247 206 -269 18 -551 93 -660 -1060 -10 470 -510
4010 -510 -82 958 262 -269 -298 -731 474 487 -791 -216 -84 -626 -401 598 -793 -244 -226 -596 187 568
4030 568 206 -418 247 366 178 1111 532 -373 296 230 -761 -559 -151 178 -607 -537 -469 -207 432 -200 543
4051 543 317 16 -392 88 -405 -172 -168 -614 -390 -309 -29 1493 -55 385 -92 -356 -228 -471 306 356 958
4072 958 -192 -72 -68 -300 364 472 -538 286 -306 308 -158 484 -284 -218 481 -444 505 -312 277 -232
4092 -232 -358 390 565 783 641 241 104 -643 691 1118 -155 -140 1293 -1094 -817 -831 -71 -467 -449 -80
4112 -80 -257 767 138 -476 857 -603 -419 10 124 235 -234 -126 767 577 -305 -113 -397 -420 -654 222
4132 222 487 56 208 -342 315 353 509 -353 -340 -803 216 -127 -115 206 731 282 -33 -415 -219 406 147
4153 147 -74 -325 241 203 1157 -631 -352 698 441 37 -405 219 140 447 -285 105 -1002 -274 580 906
4173 906 -390 55 178 349 -11 635 110 -434 1100 1017 90 -917 -363 52 -514 -89 122 -220 1264
4192 1264 -292 90 966 182 176 749 144 -427 -1080 -862 170 -786 231 52 -536 -103 514 761 809 153
4212 153 -414 857 253 762 183 -192 411 1069 -126 587 1083 -320 -835 121 -628 261 -503 393 29
4231 29 -987 -243 912 677 696 423 -351 -178 163 639 -574 -730 182 -291 -1104 -860 474 386 -123 -304
4251 -304 1082 -275 -650 -190 -451 428 -1111 84 200 -189 112 675 -178 -39 63 -841 -280 -7 -222
4270 -222 119 -263 -158 -516 -486 -352 273 -457 289 -1045 -89 457 -129 -404 132 -338 427 -28 -436 -110
4290 -110 56 73 262 -113 347 -123 505 422 184 705 -963 -1796 -676 -46 -239 726 -1111 819 -625
4309 -625 862 -199 112 -907 -1064 -487 122 473 -332 521 -635 380 1198 -619 928 -756 -263
4326 -263 -492 -169 -911 1128 545 -676 674 -417 -870 387 -113 -800 -82 1044 -845 -763 351 -833
4344 -833 610 -598 -153 -930 128 -1133 -776 -322 524 320 1100 -783 109 -244 -174 761 -1093 -538
4362 -538 -379 163 438 -1385 -393 -1297 229 -421 -123 -26 272 -570 -655 178 50 -761 120 -551 33 167
4382 167 -665 -512 -170 255 797 44 566 1036 -105 -238 -792 -287 -630 827 340 -85 240 779 -16
4401 -16 -330 -13 144 -413 -579 -431 -370 435 -491 -440 382 128 1141 126 -540 -105 153 139 -503 -354 460
4422 460 -229 -502 1068 -1403 15 -733 -765 -148 -201 1407 761 115 -821 -542 -923 179 160 314 613
4441 613 330 -308 940 453 -485 -277 -633 -1113 807 -299 -427 -899 -309 -164 -12 515 349 248 772
4460 772 -327 116 331 -758 685 -87 -18 397 163 515 -405 -469 638 -239 -301 260 45 -683 -144 123
4480 123 241 -417 241 451 497 -6 -1032 82 805 -455 -666 422 14 -364 -28 -289 243 -572 -792
4499 -792 -66 -51 604 212 752 -806 -349 196 435 -755 -90 -61 -1076 388 -630 702 -427 -52
4517 -52 686 -278 843 717 258 -815 742 911 156 -555 83 294 -353 304 -93 -541 86 854 -722
4536 -722 476 146 -1084 248 -592 -53 1118 188 -355 -421 520 322 -36 236 430 -288 446 -597 -212
4555 -212 -9 -97 314 202 472 -1148 330 -624 -545 159 -719 -694 -92 167 -488 -91 775 768 -756 -420 -227
4576 -227 407 -499 -884 135 926 25 -8 394 -47 -47 331 546 -816 314 -570 337 -683 429 494 -682
4596 -682 508 93 519 -246 -610 17 -387 -554 1057 -229 105 184 864 -70 -1155 -292 -274 -134 1258
4615 1258 217 325 -19 -250 150 -697 -1047 221 -519 -798 -759 -243 485 352 -485 184 505 433 791 321
4635 321 -855 60 -125 -156 -1011 517 71 774 -351 283 491 6 -181 -701 15 -734 -224 1117 545
4654 545 516 -683 51 -163 -258 178 -313 -487 -698 -360 10 -815 676 -391 475 -1034 -905 353 -548
4673 -548 -1153 -388 -552 -126 -329 133 116 355 125 160 -533 -390 77 -510 -394 1115 250 1348 719 462
4693 462 -159 -176 1022 379 285 -598 -312 206 685 -833 -533 -155 -304 138 -298 133 246 892 -36 -782
4713 -782 202 348 1128 896 306 -678 -27 -1178 511 267 -288 1348 -181 919 -754 183 594 -52
4731 -52 -368 9 -855 546 -237 -210 -115 -1022 367 707 610 -775 248 -1314 841 -392 -1103 37 -548
4750 -548 64 -26 621 464 176 -794 -224 -490 -170 -14 -1087 -639 1195 272 -499 -19 97 -500 800
4769 800 508 -1043 -469 335 -213 -48 541 90 795 447 471 431 -123 78 -532 457 -79 -974 581 -332
4789 -332 -923 648 -520 1104 -1282 -211 677 316 -254 -450 -315 -458 158 -611 -172 -314 -1361 -261
4807 -261 -339 860 108 -615 692 108 20 -403 -22 -171 53 -1451 -1102 -248 268 -573 234 29 -421 317
4827 317 1751 680 210 -335 1012 -240 -19 607 -555 -215 281 647 529 18 735 -457 -765 -1064
4845 -1064 -828 -729 -193 367 -1274 466 299 66 322 367 -1947 102 1556 330 477 43 -575 665
4863 665 103 -204 -346 -564 -443 270 83 303 -364 453 -429 -1491 -1011 4 -1216 -220 662 694 -906
4882 -906 1134 -34 -644 525 -160 -222 -570 30 -148 1191 445 -362 -439 129 188 445 441 284 -177 237
4902 237 370 -71 307 278 -86 -959 234 -214 -604 481 -202 -332 280 -519 -209 -75 207 -577 -40 1010
4922 1010 -226 -77 640 51 388 -567 161 1098 -856 408 486 -665 -453 -961 1029 -746 359 -221
4940 -221 661 257 956 -6 62 169 1024 542 745 1295 762 -925 -173 164 142 -6 -841 -563 -313 -410 417
4961 417 -489 -1247 278 -250 193 683 -141 1 331 822 22 69 -304 391 -855 -1537 507 57 -677
4980 -677 302 -287 -573 -350 172 -472 578 551 -950 -85 -321 -83 -36 -371 -607 573 -832 167 214 -217
5000 -217 -416 691 401 41 -332 -42 -156 849 -616 -778 1266 -148 5 502 -471 239 -94 665
5018 665 -1189 -1088 1245 -265 588 -136 -338 242 -487 -237 -924 880 -90 -729 -843 -543 19 173 -253
5037 -253 977 1372 347 867 1021 -531 104 274 874 320 43 229 21 62 -433 64 923 -1080 205
5056 205 208 -197 591 -226 662 -922 -712 -118 -75 -205 310 326 -359 -146 -98 471 227 -164 1177 1020 -203
5077 -203 373 115 -201 366 90 -413 166 -586 -474 111 -179 293 129 540 130 523 222 513 121 -54
5097 -54 -350 104 -220 1275 624 991 -325 -166 -216 419 541 62 -685 433 229 531 -606 504 95
5116 95 -258 -312 876 454 287 -543 -84 526 -115 -331 519 -820 142 -409 -220 385 357 -791 326 288
5136 288 -351 -656 -690 -201 616 428 598 -303 -619 -55 -1385 1052 353 554 175 815 -291 -157 -317
5155 -317 -193 650 -115 413 1478 228 21 -718 -347 732 194 -117 -571 228 425 498 600 -1126 785
5174 785 -485 -410 749 -894 62 -520 -811 78 -100 -641 711 46 4 -1265 -588 -481 -1025 -159 770
5193 770 342 -903 -412 -285 124 430 643 -903 -314 -338 632 -377 -232 840 -156 519 -1071 -192 658
5212 658 -280 894 -497 -540 -835 557 77 260 -194 0 -300 53 190 235 -234 -1 -615 1555 -129
5231 -129 -297 492 -632 69 571 263 -486 68 447 1008 5 -204 95 -541 -357 316 -298 363 -204
5250 -204 299 631 1427 -1021 351 163 543 -80 627 -61 536 -458 96 -278 596 21 21 471 -167 341
5270 341 177 -339 -437 -250 392 740 -425 -242 623 471 264 -248 398 287 -497 -284 694 -343 -306 1218
5290 1218 452 -373 -250 -127 475 -138 700 -30 -255 404 12 -897 671 921 -388 -239 477 -221 -750
5309 -750 -90 44 761 540 -503 -752 -472 126 2 -201 1167 -769 416 -215 -165 293 -1130 699
5327 699 301 371 -166 758 -192 -391 348 20 427 320 67 -574 142 128 144 14 -134 153 284 -465 -336
5348 -336 212 -66 233 103 -7 -552 575 44 22 618 155 433 -111 -1437 410 294 86 650 -197
5367 -197 -932 -358 1249 -278 -635 255 438 797 -1199 291 217 56 495 -295 240 390 -604 -790 -121
5386 -121 -326 91 -241 816 -254 810 -191 -267 160 -463 -346 252 632 366 894 -559 -488 198 294
5405 294 -113 532 -714 1171 -150 -716 -456 -1 403 -921 906 -42 572 127 -506 -793 -844 198
5423 198 -1051 63 -318 -397 26 -552 464 92 1227 820 285 523 -399 -519 10 538 -643 -353 -88
5442 -88 713 -413 457 468 -755 388 28 569 -180 -111 1121 270 1706 231 317 -5 -558 389 -153
5461 -153 -509 -1122 -467 270 371 537 -282 391 299 -450 -652 369 323 -156 167 790 355 -123 147 615
5481 615 -964 75 493 -44 -1111 -655 51 1423 -1020 91 -122 12 103 -705 -43 -223 -228 -283 280
5500 280 -449 -41 -1155 510 83 170 246 -757 103 -187 447 -1084 -1847 542 -212 -671 380 -217 -115
5519 -115 768 701 -651 53 -443 547 724 -558 -30 -434 396 -299 -393 -526 -689 -206 -390 871 -185
5538 -185 -1245 829 -1049 190 843 456 -327 383 278 17 -318 -176 -246 202 151 882 151 230 -175 78
5558 78 -107 -133 -404 -639 -132 -594 299 -244 614 -114 -104 191 -265 225 -439 795 29 229 119 -930
5578 -930 -1053 -37 -706 -409 -79 296 1123 150 -392 -420 -296 268 -617 -232 -69 -1061 218 -807 311
5597 311 111 28 -355 -716 -721 197 117 1588 -389 -813 109 38 187 -597 94 -127 -117 1044 282 -272 528
5618 528 375 249 279 954 -306 -1033 958 637 444 -1101 -69 569 -582 -56 -589 -194 -157 75 631
5637 631 -231 1506 233 -231 -912 -439 55 517 -283 502 -260 -832 -694 -491 33 -305 -494 641 -557
5656 -557 276 -508 171 -279 -24 246 -851 15 216 244 383 -477 -63 -416 421 -386 -173 192 -271 319
5676 319 95 -508 -188 -474 441 -271 -462 129 -26 -453 -1135 39 448 -764 -444 -44 410 -957 -634
5695 -634 152 311 541 -966 1039 -658 635 -14 288 -158 -21 161 -193 -130 45 262 -767 841
5713 841 43 43 357 -378 418 -117 -256 33 -433 -699 -499 -103 -1 -656 -63 177 -483 -302 222 1010 -837
5734 -837 -1114 725 554 338 -412 376 17 523 571 301 799 819 29 -21 -411 426 -1140 -880 432 -172
5754 -172 153 347 -209 660 -703 192 1329 851 -491 1129 508 382 -242 -634 229 -418 413 1335 -63
5773 -63 273 394 21 870 -129 865 836 587 -46 349 275 -208 831 -525 20 -173 823 66 86 218 -271
5794 -271 -995 456 1324 -277 -808 206 665 -250 299 -119 -270 883 133 89 -768 -368 33 417 -190
5813 -190 431 441 108 -504 721 68 -581 591 -419 231 -1283 756 196 -196 203 -864 582 107
5831 107 599 194 804 -236 268 13 -79 149 -346 -828 -197 -78 532 463 -811 237 648 -827 102
5850 102 769 248 -1098 -274 119 -53 606 745 -128 -64 -182 186 523 -45 -297 888 196 -894 382
5869 382 -579 -1091 -726 542 -238 -490 -8 -256 -571 468 869 86 -1328 559 -924 -323 -144 -118 110
5888 110 -910 55 89 297 -365 263 281 -291 246 -338 75 -627 1 789 -364 -277 1449 185 -403 484
5908 484 -844 -133 -468 417 -1091 211 -141 -919 -393 -683 -45 432 -572 144 -526 -777 590 431
5926 431 652 459 -715 -1191 -267 291 620 -837 -1021 -457 568 426 -1134 -72 -438 -1086 353 -193
5944 -193 -678 -141 -118 894 -498 89 -51 959 310 -201 1172 -768 446 -808 13 -200 -473 911
5962 911 411 200 -273 -277 -462 161 1639 184 1033 177 -647 313 -571 -450 1385 499 49 135 128 648 -96
5983 -96 19 -597 157 352 314 -515 -510 -742 54 -569 -94 53 255 -392 -2115 -540 45 32 379 228 -198
6004 -198 -138 -235 -546 -1263 927 -47 -527 -4 603 -261 197 -784 -401 -434 -398 20 -338 12 168 -363 -406
6025 -406 129 -155 805 102 -269 495 104 1033 341 -13 299 755 460 1337 -552 -1156 355 210 -302
6044 -302 388 731 457 -5 577 545 -464 571 806 119 -560 141 -382 207 -971 -233 -841 280 -343
6063 -343 -832 -302 -811 -767 144 -209 -468 -196 -279 -127 -77 -342 30 -319 -281 -103 23 439 -261 -228 -129 92
6085 92 -252 1072 -128 355 -474 28 -128 -720 301 -1613 -567 346 385 500 -19 -97 -354 -149 -280
6104 -280 411 -995 825 -40 195 264 317 1564 -216 -511 302 684 281 284 -179 -670 1588 -381 854
6123 854 -272 348 409 112 366 -667 -344 -491 1398 -417 -326 -77 456 -578 -137 310 1116 -51 1127
6142 1127 -181 445 789 -415 -1221 -34 -784 -415 -165 204 443 -573 1375 -1113 358 1656 -1122
6159 -1122 142 232 243 -421 -1147 403 100 27 -524 250 957 359 524 348 11 -211 -57 184 -86 388
6179 388 -704 273 -272 274 213 -487 -173 -532 642 8 -501 -309 936 79 218 -872 -614 -6 -264
6198 -264 -302 -19 -403 58 -65 -310 128 -602 -1243 92 -532 -834 -301 -855 308 337 -356 214 904 172
6218 172 -38 -362 743 -160 -506 -143 344 -335 210 -1058 328 -119 -156 329 173 -225 393 -229 -1240
6237 -1240 -134 -1466 -473 758 1331 459 -172 -73 -630 8 1169 -343 143 115 827 -83 -340 -73 -485
6256 -485 249 -385 399 -80 417 529 244 -127 -188 664 -291 -115 421 -295 814 946 -346 152 -240 389
6276 389 370 86 -411 -684 341 321 -733 -652 721 -123 747 -470 158 -148 -569 189 512 556 -405 -626
6296 -626 -502 -300 229 85 1212 641 -775 284 -558 429 556 -571 -881 -546 -1 -474 21 689 -13
6315 -13 242 193 517 111 189 -633 520 313 568 135 101 -226 -973 -631 863 397 438 -154 -465 212 797
6336 797 316 -1134 -1250 -493 -340 -716 534 -361 -476 -251 348 528 -300 666 482 -346 -640 84 -438
6355 -438 -614 -218 -552 -110 -50 -123 -535 -290 938 646 -320 171 477 907 20 -181 -232 521 -161 706 303
6376 303 1029 -398 -436 -560 57 1249 -1324 -467 -263 201 -769 -204 85 -1239 243 1171 -35 -335
6394 -335 408 -87 11 109 -97 -765 -290 -42 14 -258 -774 144 216 -586 -876 -164 -388 -391 887 -938 252
6415 252 -338 -503 101 132 -44 163 -131 56 539 -133 -616 714 89 489 516 453 -604 -1709 689 8
6435 8 -588 67 -602 -30 -50 -806 -917 177 -619 1142 532 447 -636 97 359 -304 -28 239 576 -46
6455 -46 258 -940 -830 -849 465 1202 182 -1132 212 -1050 230 409 227 501 -39 -214 404 -905
6473 -905 -725 -465 -447 81 -332 -144 -169 -680 -580 883 74 -318 -783 -213 864 -253 387 575 282 -1054
6493 -1054 -126 171 -194 -1031 641 221 391 393 630 571 -576 -77 126 -320 -75 269 -344 804 0 -82
6513 -82 373 1237 -134 1550 -199 -168 -857 -291 -120 -189 -291 -233 30 559 -1083 -148 -151 215 -63 526 1035
6534 1035 1181 86 -956 160 -291 -936 277 -1157 378 238 -252 692 -164 -254 -744 21 -645 -150
6552 -150 631 565 384 -262 18 -425 153 124 -932 628 -405 159 1039 210 -985 -847 -351 13 39 762
6572 762 -294 -235 -172 356 31 -377 96 1080 502 374 113 985 531 498 -411 41 353 -934 534 706
6592 706 334 793 -58 473 -259 349 723 318 -200 -560 -770 -995 438 404 -375 -273 -602 617 535 152
6612 152 -30 292 -221 -1451 -192 -730 275 281 200 -1034 299 -141 588 -106 -110 -47 108 -435 -198 -161 354
6633 354 -94 -1201 -272 232 -219 279 -821 221 -92 -186 491 315 92 959 382 102 461 -36 1000
6652 1000 218 -121 76 -33 655 -227 -673 -1027 207 284 -319 -487 831 -216 -413 -188 -997 916 -911
6671 -911 -319 -610 -821 -321 -234 -933 -117 -115 -202 -861 386 -501 -840 -382 -65 -1391 422 -254 71 -181
6691 -181 -385 22 146 661 756 35 -104 722 -541 -78 -471 -832 21 -21 -359 -837 1032 -692 705
6710 705 -9 -631 -293 549 788 518 -554 112 -356 161 -274 -1264 145 -1082 -120 1057 -438 190
6728 190 1013 472 448 -234 -333 -509 485 -82 -476 42 -45 508 -106 -730 -346 462 -114 -174 386 808 -274
6749 -274 -601 -649 109 525 -1256 313 237 209 -697 -953 484 333 470 260 595 112 -386 -1170 -406 -626
6769 -626 -413 -77 55 244 566 58 649 -60 102 -1065 -347 26 275 -406 -482 -134 -956 172 -561 -1137
6789 -1137 261 88 -347 -235 585 -312 -1330 916 38 -356 493 -548 176 201 785 -962 -152 233
6807 233 -626 190 -864 551 -386 -793 327 163 886 -29 470 257 -821 -771 42 135 338 -1338 12
6826 12 339 -72 -1082 -832 577 -451 -221 -216 -481 -457 -223 -644 72 956 -227 15 907 58 282 623
6846 623 -8 778 258 -238 -629 -406 261 -174 248 996 644 518 -738 87 -397 -102 83 -361 210 589
6866 589 761 117 -149 -211 282 138 714 720 1124 -423 841 430 -300 -588 406 92 433 -401 556 -355
6886 -355 -32 -75 23 -276 793 -1102 -572 -337 436 175 -107 -312 124 774 -177 589 527 339 -27 -94 -488
6907 -488 -184 399 -865 259 -259 438 -624 -152 24 85 551 307 -41 301 22 232 708 -919 -911 772
6927 772 108 457 -175 -187 -414 53 247 -52 312 -508 1046 491 634 -99 53 -97 -50 -771 406 255
6947 255 -351 49 649 212 710 -468 -422 367 707 -173 603 597 -160 -315 -341 620 1040 -766 -455 -635 -576
6968 -576 576 71 1156 -689 248 1033 760 236 -218 -341 227 -1054 -377 -860 -366 -170 561 -693
6986 -693 -793 -814 379 -467 -626 609 -373 203 -360 243 79 -303 -922 363 -189 366 -64 824 -118
7005 -118 496 125 1051 -20 927 969 704 238 -119 -151 838 -154 -97 -574 -216 103 -1022 347 167 703
7025 703 445 180 232 -175 -1039 224 369 203 51 477 -468 -25 379 110 391 655 19 -170 -596 235
7045 235 836 418 -689 489 334 -213 -373 -315 -268 -483 779 -82 908 -747 351 -87 -347 -5 219
7064 219 122 83 -517 122 -639 42 128 338 -310 208 156 233 -303 -172 -437 170 -453 406 -1035 -33 756
7085 756 -886 -212 83 228 -571 232 -604 -400 -140 -315 -912 310 254 -553 311 289 9 302 -743 207
7105 207 11 497 554 337 258 -273 -383 334 37 682 -42 399 -130 1548 902 974 500 -453 386 -554 144
7126 144 1041 265 1278 421 -278 641 -626 -610 607 23 -159 307 -743 556 29 198 -196 -296 546
7145 546 731 999 -254 -839 -102 -573 159 1399 41 -96 -360 364 -54 854 447 588 77 -1062 55
7164 55 216 -179 -812 -338 1 -237 69 193 -43 50 -240 1897 -1373 -345 -96 716 127 -51 402 248
7184 248 478 -228 -581 -130 -986 785 437 85 134 -605 -24 -563 298 121 635 -1110 -183 586 777 -99
7204 -99 -4 -422 146 -414 455 -111 -700 -487 -251 -937 -17 -658 -801 -393 27 254 -408 -287 -777 779
7224 779 -233 -204 884 -231 -142 -300 331 318 -454 -839 1565 -722 -4 589 777 68 -165 418 -482
7243 -482 966 -2 -182 -452 733 -804 -173 233 531 354 -87 -309 309 -191 20 -68 -5 1560 -477
7262 -477 -30 -247 -354 -979 -256 227 336 -480 -1394 1536 403 402 -138 1291 -3 -440 493 -72 800
7281 800 442 -82 795 -301 81 -476 21 -1020 179 161 -52 -540 257 258 737 -64 -543 278 -94 -823
7301 -823 1434 -388 -486 -148 -16 928 -423 906 298 -210 358 -433 -220 -297 471 -401 240 -380 157
7320 157 -830 -31 372 -117 812 496 -372 21 770 75 208 -520 799 -929 246 335 1161 -1 -287
7339 -287 -935 -99 -764 300 219 701 -678 -990 -594 824 -544 -544 514 -125 -529 -774 -63 66 471
7358 471 -173 746 -291 125 -304 -438 -419 141 107 72 -1504 113 -745 -180 -363 231 -974 -363 1548
7377 1548 -753 -663 -421 -544 588 936 -931 -1163 -214 -365 -73 740 603 129 457 282 469 -184 -91
7396 -91 -496 -478 181 186 149 -200 148 193 -874 1355 -1204 -143 -80 1008 837 -792 -325 -807 -1113 7
7416 7 -67 218 583 -302 -920 716 -67 6 -77 -613 -382 -302 1300 -656 -1287 -135 -1158 -634 555 4
7436 4 442 582 -369 -476 -321 433 -524 711 -155 968 -389 -708 -116 -552 1263 -416 357 -508 -424
7455 -424 -803 206 -98 -172 62 110 327 -176 -585 242 -336 -190 -477 350 -1285 73 686 -735 758
7474 758 -944 105 45 331 1008 -3 -409 -313 521 14 865 -10 -495 -469 -467 328 864 1098 -330 556
7494 556 758 541 -833 659 -12 1414 44 358 -897 -676 617 84 -912 -894 229 -420 233 -564
7512 -564 220 -239 -462 1234 -860 -390 -449 -1089 -521 159 114 -159 728 -495 552 -726 169 784 -389
7531 -389 -373 1260 433 -385 -51 -828 -209 531 41 967 596 -310 13 566 617 -267 -356 407 -300 359 -65
7552 -65 -982 384 614 803 -22 -249 368 -103 -82 -694 134 582 -615 -1465 1000 -354 855 65 -187
7571 -187 -11 514 572 80 281 252 -206 1144 226 294 -101 679 -552 -796 -424 1099 -553 -1029 1347
7590 1347 837 171 -335 351 -347 409 -588 564 -330 231 -960 159 -415 789 -709 577 -1270
7607 -1270 201 1319 -228 -626 -180 940 -226 1412 17 -127 217 -479 -679 -495 530 466 -141
7624 -141 1387 -414 196 929 837 -393 -614 95 -333 -424 672 -174 117 222 -632 -280 -771 -209 513
7643 513 -883 609 -371 -914 -787 -758 374 471 -485 459 -623 866 -681 287 570 -269 -130 204 724
7662 724 163 555 -895 -212 260 -323 659 -44 -575 -299 -445 696 -604 260 250 299 -66 172 363 509
7682 509 -199 -435 628 -656 910 -22 703 -483 -1084 505 426 -742 -1000 341 924 -568 -374 -233
7700 -233 -258 466 347 -767 -50 -77 670 -940 -1386 -651 -214 510 -255 -221 -322 -768 -168 611 711 -67
7720 -67 346 158 637 21 1210 257 -592 357 638 339 -160 -154 387 -46 -1279 209 -481 1246 764 -416
7740 -416 -169 166 -98 259 -272 403 629 71 -615 -118 -467 524 82 169 1072 -95 398 -548 -538 -782
7760 -782 -122 -710 927 374 -705 17 -2022 -605 -58 113 313 -259 638 -27 406 265 -1126 -580
7778 -580 156 508 -13 174 -27 -315 505 450 -319 -606 253 -495 -445 -1771 -479 -209 -273 218 -552 -208
7798 -208 -316 -891 261 -38 560 396 -175 -405 -580 -489 -81 -297 -73 436 533 317 -619 -1359 -396 -534
7818 -534 -350 -644 -369 528 841 -648 230 555 -1311 -388 502 -242 -961 168 -209 -919 268 -598 341
7837 341 99 -215 575 474 -681 164 -328 241 -325 -661 241 -230 -1077 491 296 -632 -231 104 271
7856 271 -452 -400 815 193 -1449 317 355 808 902 196 310 -423 386 369 639 -627 141 -81 -549 441
7876 441 -345 -290 -338 569 -830 109 -279 322 -901 387 -26 314 762 -438 448 59 -323 195 -325
7895 -325 -969 -5 164 -465 445 475 -30 220 -726 -1354 1067 -508 384 -330 899 695 490 -146 177
7914 177 -358 -490 -432 184 145 117 -669 -474 507 -75 -93 400 -607 -528 -173 790 -461 36 220 629 -334
7935 -334 365 -238 -387 555 37 -253 -274 77 198 -521 416 565 809 1728 717 1169 804 -500 199 332
7955 332 -951 -743 -58 -163 -149 -105 -345 -589 -111 -182 -593 512 621 578 -162 181 762 -193 358 -714
7975 -714 -93 79 541 -24 70 413 -214 -483 -98 1333 429 77 -1191 184 190 -764 -488 -504 -322 280
7995 280 -272 889 601 -137 794 -647 -404 -583 1055 1408 589 83 858 102 -232 43 -478 223 239
8014 239 -735 -21 -1120 -525 208 507 143 -440 107 -286 698 828 509 -444 -82 -551 1054 870 542
8033 542 128 126 309 -90 744 52 -1194 74 309 710 35 -688 -399 110 400 368 360 -473 -171 -103 -229
8054 -229 -493 -337 773 -453 -155 127 135 -266 -21 -739 -684 487 579 192 460 -562 211 251 278 409 -1012
8075 -1012 1001 -599 396 437 531 -704 664 183 414 -488 -667 434 240 -357 -82 328 94 -708 21
8094 21 -175 -334 -633 -417 -1051 240 854 -1251 -121 853 796 -651 -6 -344 281 -161 53 774 269
8113 269 -198 140 1731 -113 390 -75 -508 -163 -137 628 -678 1131 914 -574 1158 125 -1127 -80
8131 -80 93 -170 -1001 -69 138 457 114 650 379 702 253 -825 -199 -1113 309 -564 317 264 282 81
8151 81 330 -939 198 -797 391 -660 -800 669 -39 30 25 -295 -228 690 832 321 28 -43 181 -523
8171 -523 877 -845 -204 -85 -13 -194 537 335 -597 -337 -268 0 542 -626 140 147 -491 908 202 195
8191A95
$$ Imaginary data points
##PAGE= N=2
##DATA TABLE= (X++(I..I)), XYDATA
0 0 0 0 0 0 0 0 0 0 0 0 0 64 -64 64 -64 65 -128 128 -186 192 -256 257 -321 385 -449 513 -640 705 -833
29 -833 961 -1089 1223 -1408 1594 -1790 2017 -2260 2535 -2826 3157 -3515 3905 -4329 4794 -5299
45 -5299 5858 -6457 7128 -7851 8644 -9524 10497 -11574 12774 -14119 15642 -17367
57 -17367 19362 -21682 24429 -27735 31806 -36964 43749 -53105 66880 -89300 132004 -242918
69 -242918 1150807 2369146 195787 -420758 138930 417387 -754914 -1307206 -698390
78 -698390 16869 -338663 -613734 -173169 254447 -333963 -894769 -389036 600996 623316
88 623316 93672 227871 936388 865457 28232 -358436 105196 338998 -114686 -441210
98 -441210 4644 465343 134160 -536636 -544407 -66125 -30398 -472030 -466718 121925 400673
109 400673 26773 -227145 43936 241004 -28684 -216235 97741 436840 299063 46577
119 46577 194772 442068 197161 -294331 -297015 117230 164350 -272735 -448244 -98130 114722
130 114722 -178689 -457029 -275264 29464 42187 -60667 52022 256945 254560 107211
140 107211 94852 196651 153849 -30647 -67374 87764 126231 -58468 -177670 -71902 19004
151 19004 -93880 -225394 -153912 7118 19096 -87072 -90772 48625 119405 21067 -55308
162 -55308 35525 141870 93254 511 29533 102508 68318 -10051 -10567 18349 -21081 -75765
174 -75765 -54144 -7134 -39193 -114647 -97620 2267 34841 -42716 -81005 9781 100509 69185
186 69185 -3443 13388 76613 83838 40419 13766 13020 6971 -8514 -16624 -20661 -35791 -54893
199 -54893 -48808 -20763 -11634 -38738 -48588 -11105 26435 16308 -5628 12327 48072 48043 23301
212 23301 18848 38726 44967 17078 -7195 -438 13138 -6255 -38999 -44396 -29689 -29883 -39899
225 -39899 -34530 -22677 -20516 -15589 9042 26547 16289 5928 27797 58962 55230 23655 9563
238 9563 27248 37905 11479 -20604 -24973 -14073 -15762 -26881 -32692 -31004 -29634 -22566 -9413
251 -9413 -6259 -11960 -7364 7200 24860 23848 12772 13302 26676 32690 22898 10619 14044 18880
265 18880 10205 -1604 -4916 -4497 -13905 -23325 -26664 -19279 -17374 -22695 -25136 -15560 -2693 -34 1272
280 1272 8295 15774 17307 20841 28816 28902 15791 7980 13208 17551 5233 -13535 -17017 -8299 -7157
295 -7157 -18873 -27950 -21703 -12364 -11023 -11929 -10175 -4711 -1629 4946 10196 11588 6762 5471 14226
310 14226 20574 13679 5372 2059 8763 7811 -1388 -9623 -9016 -6084 -11460 -14076 -11593 -9822 -12281
325 -12281 -12733 -7196 1750 1354 -1894 1552 9233 13160 9210 6937 7877 8835 4634 2818 2116 601
341 601 -4942 -6740 -2250 537 -5168 -10674 -6434 1282 1467 -3578 -6223 -999 3228 2833 933 1201
357 1201 2039 1432 3032 6702 5911 680 -1236 3674 7024 4619 -2922 -3301 1905 2635 -3647 -6246
373 -6246 -3246 -1617 -713 -1648 1704 2434 49 925 4605 7301 3229 -371 -181 3822 2123 -3025
389 -3025 -4966 -4463 -2311 -2967 -3299 -1678 -461 -121 1910 3859 6106 3155 1408 3865 6033 2509
405 2509 -1100 -3908 -454 -1559 -3858 -4516 -4011 -3113 -3876 -2900 -1164 -183 -808 -1186 2266 3288 2599
422 2599 -2469 672 2442 2707 289 -1143 338 846 1385 882 1611 17 -2258 -756 733 313 -4603
439 -4603 -5661 -2348 -911 -1617 -3904 -3042 103 1441 1545 1896 2316 2741 4609 3098 4431 3110 860
456 860 -564 -50 138 -1720 -5177 -4759 -3336 -2890 -3628 -2845 -1537 -55 -281 1559 1235 3017 947
473 947 534 2430 3264 1641 -1165 -220 1078 2016 150 -293 354 509 -70 -1112 -1096 -1483 -1889 -1813 -882
492 -882 -845 -2641 -3057 -600 649 1652 -597 -431 2798 2948 825 1643 1399 1830 2331 883 13 -1109
510 -1109 -1072 -1111 -324 69 -1416 -1794 -889 -1640 18 -1584 600 179 1572 1328 1018 331 1241 383 812
529 812 -20 828 -560 -1181 -1461 667 968 700 -1299 -1012 343 528 639 -828 143 -86 135 481 -705
548 -705 -980 -1835 -760 933 -177 -1074 -387 -214 925 506 -1095 -395 1250 614 925 950 398 1343 553
567 553 825 -1071 -1483 -735 -1046 -377 -322 -376 -413 209 -233 -1429 -593 -842 -602 1261 1491 131 -63 -373
587 -373 188 -896 426 730 298 262 1138 1093 121 212 -566 -1240 -650 333 -457 -387 -1585 -136 -737 -1611
607 -1611 -825 -1448 -1934 564 369 1630 239 790 814 653 1049 937 577 95 495 799 -470 569 -947
626 -947 -536 -571 -1382 -1720 -143 329 -576 232 -80 1223 96 146 237 795 52 -311 590 725 480 358
646 358 -1638 1054 723 -589 224 -268 -338 667 -63 37 -31 -186 282 -670 -93 423 -461 627 267
665 267 548 729 167 1386 819 518 1451 -249 218 -60 -1508 -829 -868 455 -255 404 -115 -255 -774
684 -774 235 -1232 445 387 658 -165 -122 218 344 306 -1122 -100 529 -310 1233 -52 309 -609 254
703 254 985 727 -728 -791 -1048 -802 305 -714 -542 -544 -613 285 736 250 -749 425 237 1187 549 -366
723 -366 741 354 124 149 -353 -253 -871 -1547 -459 171 -254 -290 -222 -750 836 533 470 -516 -125 -208 227
744 227 199 -1260 -1122 -40 -822 152 -13 408 360 674 -194 436 388 198 -84 -445 345 -873 -505 -447 -463
765 -463 -407 -88 -216 174 -188 627 68 -636 645 -188 -992 -338 -438 -33 488 507 -434 539 153 343 173
786 173 379 -283 511 1099 -215 723 474 -728 -672 548 70 461 -840 -874 332 513 618 192 -1122
805 -1122 421 294 -27 97 1077 -216 483 54 -1 -69 -4 87 -1857 -1178 459 271 -1441 1002 -591
824 -591 -634 -529 70 -378 -369 1078 842 1300 -1193 -712 -45 -357 -1012 -458 -271 571 -128 541 853 -656
844 -656 113 -588 1111 -338 229 427 -1252 1175 -417 116 1089 111 559 -44 -309 -370 105 404 508
863 508 -55 384 600 832 -681 -521 -737 157 -2 -610 52 -1192 185 -391 -321 -597 1046 -455 -1478
882 -1478 -211 1006 -871 758 -799 259 -265 235 496 -115 934 290 -83 -5 274 -340 -910 -106
900 -106 -104 -153 481 -264 -470 -645 859 -354 193 849 569 -81 -284 -625 650 11 -107 -277 -743 -373
920 -373 -663 951 -644 -522 -24 427 -659 -325 -570 681 524 -309 634 -172 -316 26 -131 -79 -293
939 -293 -747 -90 -341 550 -354 -383 403 694 189 -10 364 177 261 464 127 1090 -320 779 -251 -416
959 -416 322 -534 -672 518 242 -741 972 -784 -84 640 -369 -395 -565 -1534 692 747 316 16 -739
978 -739 272 -709 252 -140 969 266 362 -433 -306 -550 804 -878 384 1652 -454 651 -301 -216
996 -216 -82 -510 540 544 1101 -828 745 577 -334 -1027 1205 292 179 451 306 203 -250 237 -540 439
1016 439 182 -205 437 -354 854 579 68 -638 920 133 -736 -583 112 -210 -735 -490 213 -542 420
1035 420 182 -556 -540 -452 167 67 79 -270 501 -145 -659 -452 -715 708 -115 -364 344 -1747 -481 506
1055 506 134 309 915 756 1037 -909 -49 719 390 -381 612 -652 994 -346 294 554 144 394 -44
1074 -44 -252 550 -704 -206 -807 -151 81 -781 581 300 628 -116 -324 556 -793 -534 -358 -1041 1181
1093 1181 46 911 186 -297 629 666 321 -139 -733 49 -634 -231 -930 495 -155 -1181 -473 278 576
1112 576 548 27 -364 140 280 470 150 231 117 -97 -181 -120 -924 -638 -474 -258 -408 -641 195 539 342
1133 342 -496 -856 -563 -469 -667 -276 437 347 302 664 27 -426 490 -105 348 768 -817 417 278 -1016
1153 -1016 -74 -10 -827 221 -634 -1382 458 -351 -776 117 -863 -247 -215 307 -204 716 -511 -720 -278
1172 -278 370 -76 857 -770 -124 444 -219 822 142 717 639 794 294 448 -677 -1021 278 -702 -1004
1191 -1004 -1084 -720 -212 -255 -294 -166 -90 92 -544 836 373 -374 -235 -106 -1 165 31 -131 -608 733
1211 733 324 1144 479 16 -926 -385 -226 713 496 -275 -128 768 648 260 773 480 514 -65 -650 493
1231 493 -663 353 -565 868 -13 485 -59 -253 -362 -495 -55 459 505 731 -150 1031 -325 -943 -593
1250 -593 -90 -202 -1274 1152 -167 -265 -512 -264 227 -174 -94 -94 -438 693 453 -120 -642 -72 324 873
1270 873 1319 31 -412 -74 143 -680 348 102 314 520 1406 1189 458 -202 136 -309 364 421 226 73
1290 73 -865 -478 -306 -568 520 -68 -270 -609 538 354 -708 -737 -365 -132 -719 469 271 -123 7
1309 7 821 398 235 -497 566 -25 -57 215 -433 20 -482 1006 -793 -491 766 377 47 -743 -424 -150
1329 -150 -249 118 562 -127 -520 368 -13 584 -367 -181 123 270 -223 1197 1251 -298 -1070 -1107 547 -930
1349 -930 -259 -424 -567 107 -216 968 303 347 -38 -345 137 -281 -55 -49 -372 879 649 716 414 -551 -83
1370 -83 321 -124 -519 177 -685 254 812 -261 -425 357 -349 102 -189 723 -560 295 598 -305 -606 -618
1390 -618 705 1228 354 301 -49 -1224 214 -139 471 -1069 151 259 -463 -613 41 -85 -1009 532
1408 532 163 8 467 82 -184 -626 476 -285 -17 -163 -36 -181 -133 -312 -281 1015 -102 -315 -457 773
1428 773 -113 -344 133 168 121 877 -21 -545 148 179 -879 -664 789 -38 3 550 -61 -238 651 68 841
1449 841 193 -65 -674 -412 -174 -712 226 504 -246 213 323 -1097 -137 -431 -636 -199 133 5 -940 -628
1469 -628 284 -408 648 -423 833 96 740 -120 58 -507 -492 264 -493 259 -690 -276 499 109 212
1488 212 -126 -294 627 -1315 -560 313 384 672 922 110 282 -312 -689 584 85 -69 149 -490 648
1507 648 -380 201 358 218 268 -214 -35 365 -391 395 1012 -362 884 -1211 -27 207 943 -977
1525 -977 -330 -695 -303 884 616 210 -372 -1520 -133 1051 -693 122 -858 -673 -426 684 -64 -32
1543 -32 693 -6 -417 270 -496 473 -234 -606 535 183 -54 457 398 -125 -153 29 340 -727 53 486
1563 486 -203 153 176 -42 194 -174 1343 782 -420 -821 609 -585 -9 208 -370 -461 -942 22 10 200
1583 200 634 4 -263 -623 -1190 -14 -267 365 -792 -616 -1233 -375 30 -664 -46 -214 -145 -422 -233 -277
1603 -277 -400 -249 196 -486 319 -695 1433 348 -667 -730 567 -60 11 1028 -673 223 146 -523 -84
1622 -84 67 172 251 -14 218 -543 -1094 -333 -233 -422 -116 -704 54 51 -92 -885 482 -170 -91 -187 665 580
1644 580 402 -724 167 294 -364 -278 305 -501 -134 555 -270 -193 -225 577 -1116 57 -263 -717 -525 -1587
1664 -1587 588 759 216 347 511 53 326 997 254 118 -345 -69 218 108 -297 -77 -40 -686 604
1683 604 1267 -78 311 825 -60 -47 -200 -214 -827 982 235 -579 -166 -104 1262 -264 -291 -1050 -176 684
1703 684 -1194 1417 156 -96 -20 1288 -212 -1034 856 237 346 639 -530 218 316 234 673 -264 685
1722 685 400 -134 -59 -494 73 -440 -234 629 -78 -83 1575 -700 -988 176 -3 416 329 191 669 -308
1742 -308 -535 -81 -518 81 -1043 824 85 -642 214 1214 321 -158 416 -194 544 919 -1447 599
1760 599 553 245 -181 -431 -279 -228 -288 -312 486 170 -545 740 -408 -293 369 131 -1042 364 93 409
1780 409 208 -152 -1207 -516 -494 -521 523 -88 199 -696 146 -659 -472 -669 830 523 632 -481 -178
1799 -178 420 317 -246 -89 -355 598 102 -1078 583 451 -380 -379 551 -749 502 139 338 25 -335
1818 -335 -7 -193 181 -413 -688 350 371 1098 181 -680 229 235 -1023 67 -19 655 526 -376 358 270 -86
1839 -86 -561 82 -505 -367 478 545 716 -401 159 173 -362 611 947 313 -447 -468 89 185 -732 87 -403
1860 -403 71 -283 -1061 -11 482 -191 125 488 -640 -319 297 -342 -570 381 500 -990 -55 1674 -58
1879 -58 -220 -525 905 544 -673 471 -488 152 209 888 16 -346 604 709 -449 144 42 201 42
1898 42 -240 877 -211 711 -231 -159 174 -391 -775 270 -349 721 -584 151 248 -172 -443 -565 -1139
1917 -1139 -358 -228 203 -25 -1047 182 -188 624 -48 1795 522 366 301 -613 1323 35 -621 220
1935 220 -47 -579 -565 212 514 709 143 -726 -448 -295 514 -95 1223 -341 -1051 609 -283 669 658 -716
1955 -716 36 644 217 191 430 507 31 1016 -255 -820 400 -638 214 171 261 484 650 -860 45 658
1975 658 -1417 520 -310 1144 -881 -715 917 388 -683 -384 -331 -394 258 -243 1186 314 -327 621
1993 621 -203 -155 -486 178 836 144 526 -1175 97 -82 337 908 113 846 -13 -561 1151 -220 -861
2012 -861 106 -169 870 -645 -476 -342 521 -325 529 -289 -581 1055 21 1182 1512 663 715 972 538
2031 538 -542 -1250 -359 -623 273 -174 -305 -228 -355 -137 643 -1028 -980 -808 -361 214 1073 -536 -77 160
2051 160 976 347 -852 -557 -552 -186 246 3 54 196 69 3 984 -68 809 619 -38 -765 -559 440 -487
2072 -487 269 -217 -1138 -676 691 441 -360 -615 -277 -260 235 163 146 -1236 -500 -420 473 -1344 -254 -1504
2092 -1504 -499 144 -325 454 -587 -566 689 -247 -488 379 512 652 -255 -85 -385 -405 -152 85 -34
2111 -34 -407 271 595 -743 664 -256 -1549 152 -86 636 368 161 1457 298 -138 -948 393 211
2129 211 356 -1011 1255 -713 -531 1061 61 -281 -333 -427 637 498 -30 -661 -770 438 -1133 631
2147 631 248 704 226 -832 -296 -211 -426 -522 452 -785 -765 -474 -458 -666 -486 541 81 1213 130 -1087
2167 -1087 280 284 -765 306 535 -639 -152 85 32 1007 -58 720 328 462 -338 512 762 -696 -338
2186 -338 246 -214 280 -271 274 658 -408 1281 6 -101 710 462 831 -246 -485 66 1727 302
2204 302 554 417 -1133 -765 908 167 -1407 -904 270 -56 103 986 1016 -1120 -9 76 815 -301
2222 -301 67 -283 -542 426 966 -206 -1478 832 -3 40 -539 -597 -1216 227 -195 245 -1409 144 -144
2241 -144 -100 70 194 187 -234 -116 -1335 429 478 -443 -407 822 194 -196 -625 92 -1358 407 -226 152
2261 152 -1013 -763 58 202 212 -263 592 -265 -240 -273 -1031 -361 257 760 986 378 -789 -554 435 -1168
2281 -1168 -680 -13 1146 -759 -722 -1839 -655 -27 -129 -382 823 233 283 -1243 62 31 94 -539 -378
2300 -378 940 475 147 -199 -277 732 1241 -407 -513 -122 254 438 446 -44 1013 784 -54 -383 655
2319 655 924 -93 -136 -268 -187 -771 -1006 172 271 21 -18 -118 543 497 -441 121 172 329 -500 433 215
2340 215 -476 -751 959 295 -234 -309 -976 -778 35 684 -473 -1279 150 526 -411 52 42 910 -134
2359 -134 92 -651 70 -78 -247 688 -187 -403 -594 669 530 -192 477 938 -73 -176 -461 -149 -10
2378 -10 -307 -429 719 1160 -235 1210 -173 -156 573 429 1013 303 507 546 -314 400 -631 -70 319
2397 319 -1135 -425 -102 -478 -197 -941 376 -40 311 757 -489 -175 -46 218 -129 509 -374 -821 297
2416 297 1033 680 59 118 781 -209 174 -301 28 2 90 -393 -790 1068 318 619 971 273 120 -313 597
2437 597 -443 701 -557 263 -221 448 585 343 751 -167 -1252 -20 642 -757 9 -437 178 101
2455 101 15 -723 30 -137 563 586 727 1271 358 363 283 -144 -65 -1357 -1168 -460 40 258 1061 322 -206 -1506
2477 -1506 973 -212 -7 1428 528 -260 102 60 -1650 661 -418 67 -306 84 805 -355 191 245
2495 245 -205 366 365 31 614 -878 163 -350 452 66 82 281 866 -837 -476 264 -789 -869 -235 747
2515 747 101 332 -283 -831 443 595 420 1214 -178 355 -271 -640 698 -1577 -878 -235 277 -452 158
2534 158 393 661 103 435 641 -526 -317 463 118 254 424 77 373 377 -298 176 227 -110 1351 143
2554 143 368 -393 -34 -454 -1147 -298 -174 -92 -1192 -373 -482 366 -318 -315 1104 -76 -456 -70 258 -85
2574 -85 -297 47 331 -975 351 -75 606 -395 -1044 -824 142 -782 672 274 -467 695 -887 793
2592 793 139 -462 982 -702 -354 449 1057 -139 -245 -39 -1199 -746 -104 -995 692 -259 385 625
2610 625 -726 68 -573 148 921 -1295 -369 156 701 -60 388 641 -573 -730 -572 -133 245 574 -181
2629 -181 -350 371 305 -276 -415 532 277 -263 -627 212 -188 538 -623 -214 290 -647 -316 899 -198
2648 -198 414 -420 -25 1054 267 167 -467 739 505 101 544 266 305 -313 115 -269 -43 -1008 -520 -495
2668 -495 375 631 -596 -153 -566 -356 224 274 -63 948 217 668 129 -27 -787 314 592 -122 841
2687 841 1161 -219 -369 705 -228 792 265 165 -128 506 -313 -132 602 -1071 -283 963 -46 232
2705 232 -801 88 -165 -628 192 1181 939 -388 -961 129 -1051 -263 149 -36 731 -6 -226 -73 -763
2724 -763 469 478 -659 252 -672 743 13 -359 606 -296 221 472 750 444 32 702 610 -1420 -1082 -377
2744 -377 602 192 -95 -361 -619 -436 713 -92 35 -1065 -1217 122 85 220 503 2 28 132 -409 707
2764 707 -180 -34 308 251 -31 -247 148 -571 118 -242 -597 -1087 -566 49 234 -323 -607 128 -5 718
2784 718 407 -398 598 126 -538 -466 270 -194 366 687 21 426 720 283 311 -960 521 468 -1520 206
2804 206 -1286 -644 -175 116 652 -326 -123 422 104 -1272 883 -302 -53 -136 311 -521 -1104 678 -1731
2823 -1731 -466 -673 391 736 1504 -985 -632 187 213 266 -173 -711 -539 -580 -855 181 -109 102 202
2842 202 -1028 -168 -531 56 58 -155 255 76 -145 -686 163 -91 869 803 446 27 238 -79 423 -808
2862 -808 -756 -504 194 -680 127 469 -581 447 1033 230 708 1051 -146 -292 -1345 -913 -1556 168 18
2881 18 -533 -56 -585 1220 -306 -264 -143 -10 -1146 163 225 -137 288 122 37 -594 -697 129 -430 91
2901 91 -673 -212 57 -903 -100 607 343 -1123 -129 -1321 -214 159 309 98 -93 -485 -566 237 -317 646
2921 646 -169 -305 695 523 -456 -70 75 257 -50 118 808 448 -1094 384 347 829 -740 -256 210
2940 210 -68 -601 90 916 -5 965 173 -360 278 27 671 935 -517 351 -550 -613 -1270 883 146 -124
2960 -124 571 491 357 -671 575 798 -402 116 -878 -919 359 -240 108 176 -317 887 641 369 410 1436
2980 1436 650 -231 -382 -341 -316 1802 600 -283 14 474 764 -14 653 -506 769 1085 -958 604
2998 604 53 -1095 -244 -267 -121 133 533 110 -132 155 32 1322 -321 -38 -521 432 -609 170 536
3017 536 382 -195 563 207 -679 661 893 -381 -162 -305 157 -968 909 -472 873 446 -574 1123
3035 1123 -1029 536 -19 811 -65 -165 430 -150 -66 -1259 289 -309 -924 -91 -470 170 673 762 82
3054 82 -151 -58 329 455 631 -205 -359 -27 351 679 -504 149 -707 -86 -488 491 -172 2 22 -487 376
3075 376 246 -431 59 369 627 -92 -706 342 1161 410 -1477 142 -33 -67 137 74 -738 267 -226
3094 -226 -564 -149 615 93 92 824 32 92 -871 1089 245 -457 -23 -396 980 724 905 89 761 592
3114 592 -1505 -68 -188 -671 -439 -118 423 530 130 -804 -1338 351 1318 169 311 -194 -734 231 1390
3133 1390 566 33 294 206 -589 -528 -470 103 331 654 757 -751 113 600 -443 51 642 518 728 -214
3153 -214 208 -397 604 -1404 903 382 -54 -40 -981 -97 -76 784 336 -1055 746 -248 -314 -584 281
3172 281 -403 -808 376 980 615 201 999 -653 183 293 -234 -681 436 748 -65 547 831 68 1026
3191 1026 -385 -422 647 -565 226 263 -628 1218 426 -810 -317 656 196 369 -1350 247 -191 -642
3209 -642 -186 -162 -461 597 -56 293 376 -520 46 419 -296 -454 146 1032 -536 -133 -331 168 -475 226
3229 226 -234 -486 449 472 -234 -275 599 -74 1017 -1120 -67 1329 254 193 367 -276 1077 84 59
3248 59 -313 -915 65 -597 432 -1081 -1084 745 283 -185 816 429 290 790 -463 4 -75 -913 -102 -874
3268 -874 1002 330 381 615 523 -698 -142 -835 83 -481 183 -223 57 -785 496 -564 431 389 -478 230
3288 230 975 476 341 -662 -119 -932 -530 317 31 804 -242 -180 -153 474 2 384 184 381 -1081 -748
3308 -748 847 -202 -269 139 346 -289 -155 322 1383 161 136 -395 938 -814 735 -758 -237 642
3326 642 -148 546 -125 485 1243 414 750 364 -396 -1043 -142 -180 -230 -232 325 904 -62 1329 -401 -653 169
3347 169 654 -211 392 254 -148 286 37 -258 407 63 498 -716 -673 -67 102 -265 -1079 -423 733 -206
3367 -206 205 -887 -509 416 -33 473 337 771 -330 136 -385 -412 861 -532 487 -166 561 -1045
3385 -1045 171 250 84 85 -305 121 -369 -1035 778 47 386 657 -183 1160 -229 765 -116 -954 1078
3404 1078 -446 203 -248 53 206 1279 37 299 366 -61 357 735 -438 642 141 228 -459 652
3422 652 -1092 -305 -221 -1081 -168 172 104 -618 -117 427 790 -530 63 -373 -610 -255 110 1081 -253 378
3442 378 -342 693 209 -181 839 805 -181 -266 79 316 -418 268 391 -199 390 -556 -1226 388 1073 387
3462 387 -1214 -39 -209 -832 -816 -709 754 526 248 -42 -225 -81 -766 964 -82 264 566 -254 1058
3481 1058 505 269 665 416 463 -561 1179 468 -441 -587 997 -608 916 -608 -259 181 -554 -197
3499 -197 -891 -156 -179 -127 263 558 -767 36 -83 151 -211 478 63 -499 -548 -583 -92 -571 -694 158 270
3520 270 -485 182 -176 -952 347 -197 -493 62 632 914 268 761 347 171 754 -225 -423 484 -674
3539 -674 -636 72 108 -987 451 -444 139 -566 -444 331 -66 -112 318 766 -319 -521 277 -672 -60 -509
3559 -509 566 -79 355 -703 719 911 152 213 -192 -386 -330 511 675 -180 -182 -2 -424 -413 -122 215 85
3580 85 -340 -660 127 -209 122 -597 -723 226 149 -681 432 252 86 250 -759 798 644 -1349 140
3599 140 -617 175 -291 772 163 -512 471 1367 -302 174 -708 -603 125 -626 -108 -643 923 1149 699
3618 699 -610 -68 -753 -179 -181 348 1028 487 -198 440 14 -1338 -394 316 -165 -34 366 211 305 -402
3638 -402 120 39 -17 725 -15 -428 509 600 548 -359 298 -393 467 733 -58 -267 247 215 332 -1385 209
3659 209 392 -386 -880 342 737 768 -330 -700 -478 187 -178 -303 -550 1982 -296 -255 753 98 -1019
3678 -1019 1209 843 885 240 -1225 -174 -161 1150 -501 -507 -573 252 -90 -153 52 916 576 -475 -119 -363
3698 -363 -455 100 329 -286 -40 -1055 109 244 1132 -88 -104 201 91 -313 346 946 -146 436 -554
3717 -554 115 707 -430 797 -141 -78 495 681 -647 -901 80 -327 751 615 -54 -134 -261 -119 472
3736 472 596 848 531 -605 -296 86 536 -112 -62 -287 436 -178 698 -29 690 -501 -188 286 846 899
3756 899 -280 -221 -71 -44 86 546 -371 -456 34 -262 -298 364 68 -97 -872 579 -196 -80 968 -380
3776 -380 402 -150 -232 560 414 101 -294 -74 -195 -736 21 844 645 985 -433 -702 -991 169 -403 -577
3796 -577 -301 1094 -180 -259 -37 11 -330 1104 -467 544 285 412 -55 144 1021 -688 -33 236 -99
3815 -99 -827 -366 275 1048 322 -124 -367 528 10 -144 -34 -501 357 -391 -61 213 -60 -575 -259 1130
3835 1130 118 414 -137 148 -1121 -8 -48 -116 -180 -101 -955 452 62 991 31 -159 150 -1540 -986
3854 -986 -440 652 316 1102 -1159 775 -70 -294 -299 83 -975 -126 -418 572 331 -258 -31 570 217
3873 217 444 -693 -126 1165 -449 499 -574 897 -144 828 -609 -931 -747 -437 347 587 -1066
3890 -1066 249 -408 -344 -333 353 -423 -469 -144 -38 -270 -62 606 -62 -578 -1199 97 676 -139 -388 159
3910 159 445 -368 214 -519 75 -997 1341 913 198 -674 -364 -490 -751 -874 647 -640 -1096 -253 654
3929 654 -199 -256 -228 -383 -25 21 363 1312 -239 -437 -74 216 -224 -210 318 818 517 464 769 69 375
3950 375 -194 -151 -1300 17 405 -439 168 837 -366 264 893 57 -398 1803 -707 -116 769 -230 -94
3969 -94 -200 247 962 1015 366 471 -398 -233 -919 -73 869 205 806 -181 -471 -5 482 273 -473 -91 -1154
3990 -1154 -195 66 182 -354 -203 978 -178 -730 86 650 -336 478 -1028 -994 -938 -57 974 -245 545
4009 545 312 189 -820 346 -168 -364 -75 -1164 40 881 916 -28 356 520 -198 135 323 -1159 76
4028 76 -208 250 -359 -52 519 -649 -456 205 -756 377 -604 315 -182 86 -515 732 -838 471 472
4047 472 92 362 -352 1283 -713 -195 503 -627 680 352 452 -219 459 -88 -614 322 709 -113 -753
4066 -753 747 559 -580 -561 -81 622 -234 55 410 -738 -782 214 -256 -108 -260 -406 921 -268 -585
4085 -585 53 171 -40 -403 74 -131 -1074 -93 206 145 267 -179 361 261 445 1208 -498 221 128 192 -513
4106 -513 42 1056 -274 543 43 -828 -432 909 -58 312 282 -617 -213 -585 857 354 -272 -87 209
4125 209 -253 369 -140 555 -277 -195 786 428 704 -1046 -242 485 -148 508 105 -160 259 130 491 1289
4145 1289 20 257 470 -105 430 261 -788 -362 -304 422 755 -392 246 -451 -304 434 603 954 283
4164 283 162 264 503 930 -255 722 313 -298 235 257 -246 212 -63 -422 653 223 -176 42 133 -724
4184 -724 279 -856 -102 -359 327 572 202 -1036 -861 162 -369 1057 -405 -792 190 -428 -440 -496 -79
4203 -79 1236 502 394 -312 453 55 506 649 105 528 -262 -336 603 59 -497 140 190 988 580 640 77
4224 77 394 261 906 -648 -263 199 -194 331 800 247 -566 245 -1499 -289 -26 -530 61 -14 563 220
4244 220 -1252 512 -659 -682 5 571 -355 -223 362 -531 230 584 216 -218 1469 -15 41 1059 228
4263 228 397 -221 1003 345 -262 833 118 703 709 -62 -19 -237 103 282 -367 -29 -277 -539 -604 439
4283 439 546 -298 135 -440 -168 -29 617 367 1475 398 82 529 -109 -319 161 581 166 475 -571
4302 -571 45 -117 -162 -62 247 83 -138 -196 -128 -792 579 -446 -693 196 -517 531 -216 -70 57 483
4322 483 736 -193 437 1038 -547 -581 -608 768 359 1492 -874 323 659 -345 328 -651 -253 289 380
4341 380 394 -556 440 -454 87 -160 -1206 300 -98 402 932 366 0 123 668 738 -680 -135 -174 -195
4361 -195 -46 307 -158 -332 -34 -96 -728 -407 -450 605 632 328 -148 512 554 -190 640 369 1789 -604
4381 -604 -464 -152 -592 -44 -251 338 192 -783 893 35 -1341 788 656 -19 792 -1029 -815 -355 524
4400 524 -355 121 -652 -402 423 -626 -234 -158 -764 858 799 -764 -129 133 -66 -340 -1655 648 1432
4419 1432 126 303 442 -390 -312 -759 -1050 506 111 483 -134 590 39 -194 442 -134 619 663 921 -243
4439 -243 101 -850 1261 249 748 -255 -472 363 552 -254 355 -691 1317 -256 -477 316 679 -19
4457 -19 -709 -112 701 756 -521 906 243 169 -487 -253 -74 -529 234 -213 32 -604 -87 893 168 1180
4477 1180 576 146 1395 315 132 100 -205 428 578 379 402 344 54 673 790 36 757 280 -1145 63
4497 63 842 -212 584 936 639 132 -356 -671 -585 790 722 160 709 -559 53 -712 -116 601 -124 883
4517 883 -526 -148 907 1092 674 -237 -636 459 1287 64 328 63 -983 315 -295 -427 422 -170
4535 -170 177 585 673 752 513 139 260 -95 -87 182 -256 -553 -357 -502 -462 -246 97 866 292 -1541 -197
4556 -197 374 -30 1052 96 13 492 439 802 524 50 -227 311 1227 -121 -1246 -138 82 -513 -231
4575 -231 -240 -905 1073 -912 -419 865 -128 -280 500 112 -832 68 -1622 -848 -1195 280 66 86 75 887
4595 887 181 469 -540 25 87 -288 311 -63 609 -833 -85 86 148 -370 672 6 -388 169 -314 935
4615 935 23 -4 394 557 -1553 -686 -258 316 692 -498 258 -75 665 -871 409 -259 -550 -729 -293
4634 -293 506 509 -577 689 364 -167 1063 -345 212 -109 1385 -59 261 -863 567 534 499 370 -664
4653 -664 -264 1602 276 -272 637 601 658 -335 -330 236 286 -150 -675 323 -252 -763 -749 171 -144 -594 116
4674 116 338 87 -522 -59 332 137 336 -244 -416 -296 -605 410 857 -91 -568 -307 481 506 175 -48
4694 -48 -125 1075 983 248 281 -171 -831 1450 -1278 -540 -249 321 -11 713 -118 -267 -698 -99 403 1388
4714 1388 -188 443 811 321 86 837 -375 -424 656 -528 -493 246 268 -19 869 -1277 862 1031 -527
4733 -527 120 212 -371 951 106 785 130 269 -268 -453 -340 985 818 965 -483 -181 -85 -42 1738 629
4753 629 -309 -656 687 -1067 -11 101 464 213 571 109 118 210 311 446 -25 583 770 -586 -1629
4772 -1629 -1308 396 568 123 -273 518 -229 -23 1016 -152 -299 544 809 667 10 789 44 622 654
4791 654 104 92 633 -82 700 125 344 -340 -28 -301 618 762 221 686 77 -633 -1458 -342 -350 -60 91
4812 91 230 135 824 490 257 -229 382 847 309 322 26 -614 48 -755 700 -585 -94 -933 -451 622
4832 622 -63 170 -914 -553 -836 745 -55 -318 920 668 657 696 -320 -709 -187 -557 1294 -559 -923
4851 -923 302 -576 -438 428 -259 -514 -716 -666 433 -829 -374 338 -384 1156 -282 -353 1332 312
4869 312 -290 355 242 -76 -1556 -62 628 -110 892 260 165 754 577 -197 209 -98 69 -341 -697
4888 -697 157 57 723 -645 -678 519 274 384 -980 823 -1108 164 368 75 -377 255 -9 273
4906 273 782 732 -101 -30 178 -381 -1046 -925 -695 1213 239 -150 1136 -5 458 -1301 -162 643 661
4925 661 728 -405 -353 766 284 300 983 -202 597 -588 165 316 14 1307 720 -184 -38 684 415
4944 415 -163 -5 -173 498 1341 55 -159 245 424 -837 1099 396 -261 -508 68 402 472 -1113 144
4963 144 -775 -694 548 216 -709 -797 361 -731 -102 261 183 904 592 760 -308 1378 -693 345 560
4982 560 758 390 -508 1015 661 23 -57 -789 -339 760 -359 -99 680 -103 -329 252 85 -299 729
5001 729 -536 -72 89 403 -590 -259 323 328 573 -1096 -411 309 -764 122 -149 -156 370 -118 531 -429
5021 -429 443 835 -237 142 165 -346 -183 176 -1167 790 380 525 403 -311 -390 64 1050 246 -197 439
5041 439 -460 433 -105 450 643 -135 -864 825 -371 -545 -465 -616 1104 -109 -288 1336 -282 1235
5059 1235 1194 -783 220 70 141 783 1259 -453 130 -57 -458 413 -180 651 -437 -17 467 -292 693
5078 693 -295 -75 -1029 1034 396 891 -283 -422 -418 166 1052 803 12 515 491 -19 655 -533 491 44
5098 44 508 -136 408 765 -10 59 -699 396 -551 -769 76 541 608 185 388 -190 -23 -1124 548 276
5118 276 429 767 50 531 -170 -694 -60 -255 694 286 -752 0 -585 -264 40 39 385 -357 172 -685
5138 -685 -99 460 269 382 -93 -253 164 40 -429 -1286 -959 -1340 -542 215 776 -963 -665 -492 1148
5157 1148 -164 1221 -487 401 159 52 -447 142 -585 -12 642 -607 198 -674 430 -505 -791 -454
5175 -454 -509 460 -261 70 125 -1022 38 286 -883 -448 -116 181 -331 -815 -278 119 -305 151 -541 -192
5195 -192 273 -1005 84 -216 -122 96 -22 1111 -391 -539 -234 570 -157 662 -511 307 -857 295
5213 295 -291 115 412 -979 156 611 -295 -442 -549 -11 -308 -486 446 89 147 95 -202 1059 -668
5232 -668 -18 349 130 264 173 -1191 469 -652 -331 -570 -849 265 -852 -49 862 694 524 479 -412
5251 -412 1048 -1280 -29 -409 988 -203 929 -605 237 -64 723 -496 -128 579 26 365 42
5268 42 451 580 -189 -334 319 -346 68 -13 129 -806 320 299 -399 17 404 258 -295 302 -140 -733 1141
5289 1141 -362 -1100 -66 142 -2023 -645 200 -345 269 205 289 -197 286 18 -226 -221 -116 693 599 -499
5309 -499 365 -637 -140 121 -286 160 385 371 314 418 -216 -1012 -641 -19 -452 1042 -675 734 209
5328 209 454 16 -53 1295 1046 36 -183 306 492 -560 747 520 577 -614 141 -21 -12 3 154 -48
5348 -48 187 636 261 -438 -220 928 664 631 630 389 452 413 254 1070 -259 -455 -791 103 -10 -456 -720
5369 -720 314 807 -510 -534 552 -192 274 389 326 -323 4 -69 667 -291 -467 -1038 939 -50 70 201
5389 201 -220 293 393 446 124 56 -187 540 666 -1109 426 -993 -950 504 -341 257 -358 -199 -944 438
5409 438 -248 319 -15 395 -771 -447 301 90 -271 1006 -1058 -217 -298 904 -647 512 687 -110
5427 -110 314 -979 -586 -545 -744 509 183 -673 755 165 255 248 -1183 -165 -358 -273 -6 -361 -207 -357
5447 -357 -813 -373 -331 320 647 197 860 -385 -98 452 -675 1142 -588 81 419 -306 -922 706 871
5466 871 -496 748 -351 312 504 504 1480 462 -28 192 191 -250 -85 233 463 -779 -235 861 -438
5485 -438 378 482 -486 -183 -1108 -107 -370 638 -6 936 1524 -386 82 -122 380 58 -44 686 -211
5504 -211 -621 137 1550 172 396 -217 1515 -651 -655 610 -561 505 325 -837 -71 -60 -533 -1047
5522 -1047 -43 245 436 464 85 621 861 766 360 -865 -1101 272 -168 733 857 101 -1308 124 -394
5541 -394 -1404 470 83 -1005 403 -229 8 -178 -57 -764 262 269 -17 -423 495 339 494 -43 -662
5560 -662 1105 319 -156 -571 -850 -244 -111 126 -792 607 275 -149 392 307 -1467 -260 389 333 800
5579 800 -514 116 1038 740 -1268 -680 -555 -22 313 -341 -480 -158 -9 -85 864 -149 -812 -389 -79
5598 -79 -549 -204 722 -214 6 123 -38 -180 527 -1193 -803 -1414 604 -450 792 -777 65 -474 680
5617 680 -241 -450 62 812 -48 265 815 896 1299 468 -587 319 625 124 764 348 -994 57 -68
5636 -68 200 535 -465 481 518 336 96 -676 -491 646 -499 -447 -840 305 268 -119 -223 132 705 31
5656 31 959 -588 -86 -198 -241 750 55 204 -296 540 182 121 77 100 -194 -172 314 1042 584 -328 606 747
5678 747 -594 295 -57 -339 -522 108 114 -43 -922 1250 534 -428 9 -144 450 504 -981 -853 1175 479
5698 479 147 223 79 -966 -1129 630 991 319 545 -108 -165 -334 254 -810 120 -412 -200 -328 -220 744
5718 744 340 -15 257 -424 800 204 787 -670 932 1162 -233 928 677 -462 1107 -930 789
5735 789 -77 -496 208 938 -70 -492 160 -9 -7 470 52 -344 -449 -893 -1098 -561 -58 -95 -645 716
5755 716 -1093 -698 -309 -294 -33 -239 -567 -90 -96 112 -1200 -807 660 -901 1025 52 26 -966 -259 -6
5775 -6 1078 -130 170 921 332 -63 360 -506 553 -444 -427 27 -147 -8 315 -295 88 -267 -187 -455
5795 -455 -529 -264 1147 368 889 133 16 -373 -1126 -567 -368 342 388 -486 624 1043 -116 911 6
5814 6 -214 480 -685 -361 1103 -953 1143 779 825 -937 318 376 523 -235 -330 505 490 -166 -409 -69
5834 -69 -310 -1237 702 406 -429 -934 -434 -33 411 33 -250 215 479 -153 -575 -855 -106 -768 -1217 -460
5854 -460 242 413 -363 -520 755 -488 374 -776 -1023 319 -569 237 -42 216 -567 -714 -1165 -1005 -354
5873 -354 -27 773 -274 167 -131 -500 -335 -1509 -781 959 1208 268 -868 -63 210 -61 1141 -353
5891 -353 -25 -1522 -646 -490 355 175 -685 -497 -593 -509 -165 371 -466 128 -414 -341 107 579 54 430 357
5912 357 -92 -343 -329 -361 -36 348 -292 -533 -1391 286 -972 441 -134 -291 481 -676 -208 842 -784
5931 -784 201 -425 -907 -186 242 -690 -260 480 81 -332 -41 -227 3 -496 627 -458 -41 -68 -1054 30
5951 30 218 -386 -201 1182 1007 466 -904 -112 1297 -483 -116 377 1264 1301 148 -10 360 -86 73
5970 73 -3 -793 465 60 313 271 -1015 1187 13 702 561 -778 33 -583 -464 952 -70 -74 -1246
5989 -1246 -3 -914 -187 15 25 233 -455 90 -786 -254 62 434 640 -1170 -543 -457 101 -121 -679 -1273
6009 -1273 331 1092 -254 177 192 -390 -516 -203 -231 564 -343 -1027 111 -171 712 1179 303 -23 106
6028 106 943 -451 -475 1333 -374 -328 985 610 154 1464 727 420 -430 -646 813 -201 487 -371
6046 -371 -964 -145 -415 -555 215 -315 -46 -381 105 523 41 70 -180 418 -829 414 506 -398 618 -784
6066 -784 316 118 -185 -454 332 -900 149 1114 -39 177 -350 -354 -1050 212 596 386 423 -274 -143
6085 -143 688 337 -207 25 -130 -145 438 -522 -280 346 -299 -416 768 -528 455 -512 -819 -511 962
6104 962 998 539 -1124 117 930 635 246 -1233 67 -107 -135 108 -523 -180 23 -1309 1118 -436
6122 -436 386 322 98 -470 -442 -269 923 938 -294 110 -90 218 351 252 -27 56 -296 -588 133 516 497
6143 497 445 372 -438 -435 -5 -803 432 397 1064 1184 -355 -922 -517 -1145 120 -68 -300 982 -59 470
6163 470 -713 -110 60 -375 374 358 -668 519 -34 -155 109 628 327 177 -671 329 -55 -756 -266
6182 -266 513 -267 -25 634 177 708 -436 325 -82 191 477 -191 1450 202 -256 422 -696 -187 65
6201 65 -284 -242 834 -789 646 397 542 189 135 -13 292 816 440 247 209 -81 331 312 -793 -649
6221 -649 -176 330 602 10 -533 783 365 340 1241 -815 614 775 -528 145 334 974 68 -53 -579
6240 -579 -745 -347 -53 538 -340 666 -459 733 352 185 119 -671 -797 -9 628 -58 155 -154 -141 -130
6260 -130 71 -196 343 -671 -754 -62 72 -256 -193 180 194 312 352 -273 -132 436 -996 -110 409 430 21
6281 21 -986 759 705 34 493 -609 321 772 367 226 395 838 -135 -1080 -270 -200 -786 106 624 249
6301 249 932 207 191 -186 -24 -672 214 217 -809 -288 -176 133 194 -447 486 76 -18 -322 851 682 -122
6322 -122 -381 481 721 496 -816 1558 855 665 345 -523 292 -215 -108 -322 -86 -165 -657 -463 244 528
6342 528 1039 186 1199 802 -53 -50 -607 -375 -953 86 -110 285 63 545 557 101 699 1216 -226 -221 215
6363 215 -371 -383 -328 -797 290 118 535 693 -236 615 -1422 -144 253 -956 41 -277 325 -603 -342
6382 -342 258 -924 224 -239 1299 -222 297 433 -580 381 322 -60 1204 -229 229 649 -387 436
6400 436 -572 166 -179 937 235 -308 -734 -62 202 -147 -274 -82 1 -541 659 750 398 -902 687
6419 687 388 -143 -12 -3 608 -140 -130 -689 425 545 354 319 -456 53 101 -801 165 -416 200 522 -347
6440 -347 369 -29 102 111 8 110 -69 -139 -333 1012 -1116 414 -878 -40 366 -336 499 -722 860
6459 860 -850 993 -891 -91 -414 480 0 54 -723 -726 18 -927 161 -611 -104 54 128 -125 -329 -298
6479 -298 5 650 -1317 -179 324 -155 372 -659 -50 163 -813 -448 369 1526 53 -1325 -807 227
6497 227 -1036 325 -365 771 -65 102 917 -168 -592 203 62 -100 18 -280 -1110 10 -199 -95
6515 -95 -370 968 -156 1016 21 -463 -30 562 -307 -1406 481 -52 126 -3 385 265 387 178 -37
6534 -37 -722 223 760 -292 11 70 1175 20 -111 -69 -742 443 -647 -337 -820 738 -43 -604 -105
6553 -105 -660 -546 -767 364 89 -819 58 432 35 11 -548 -1072 -464 313 -1170 -500 263 -721 -90 -511
6573 -511 160 641 -1351 69 94 -44 192 1047 -201 -184 -494 534 105 315 993 1002 -73 -31 907 153
6593 153 442 -441 504 305 -854 621 -435 -578 -454 -527 -213 590 -27 52 -628 137 -280 -807 456
6612 456 -254 -18 276 972 -300 11 -326 -115 -199 -1706 -771 -726 -175 249 -593 11 -120 -174 499 297
6632 297 1418 -18 -81 -770 222 -89 -1311 127 -389 37 847 -137 102 799 -256 375 -918 52
6650 52 163 -174 437 99 41 -3 532 -79 -112 -13 365 507 -526 -130 39 423 -200 -300 748 -913 329
6671 329 -982 -344 -595 860 834 4 557 338 -56 -509 687 -553 371 164 -103 1000 733 -83 -592
6690 -592 311 385 -357 375 655 85 1545 -163 -121 491 111 -171 -266 797 -331 20 270 709 112 -195
6710 -195 252 304 81 -85 867 122 -434 -40 947 -217 -696 422 315 -482 227 177 1250 5 202
6729 202 -951 830 -59 88 662 933 -148 -215 -257 5 -540 -34 -705 828 374 13 1129 -992 -260
6748 -260 -533 287 -670 522 -413 445 148 -248 -934 -503 335 571 387 413 -666 379 -146 -179 -303 1110
6768 1110 32 303 289 -448 794 430 359 -237 -72 636 491 -701 -61 -994 42 -180 -231 -393 -761
6787 -761 -444 -367 -292 188 -236 -642 947 747 -547 -24 -1533 -90 691 -1274 279 672 998 -167
6805 -167 541 -322 124 1174 542 149 3 1107 168 329 399 544 440 805 46 645 -327 266 121 349
6825 349 -71 -480 247 176 -116 189 479 946 -225 -173 275 662 -381 -789 -393 -655 -392 305 -143 914
6845 914 -669 -424 930 -239 453 118 31 276 -348 29 -676 91 365 -771 -970 1734 -220 -149 -739
6864 -739 1051 320 1089 -257 -269 714 -720 -313 283 -843 -37 -319 1001 531 264 880 419 340 -458
6883 -458 509 -891 233 764 -254 -343 -26 867 -177 -275 234 207 568 250 -27 285 -139 -152 660 -524
6903 -524 749 293 -920 -1245 788 454 161 175 254 -417 -455 -223 -749 -294 -339 292 -807 -81 374 -70
6923 -70 17 -258 -299 -1416 -130 198 307 -48 305 -380 -210 523 334 -198 1130 315 -423 -772 734 569
6943 569 -975 -327 -674 81 -313 190 -735 974 -292 466 -995 652 -470 486 -406 638 -703
6960 -703 -227 -125 -658 -64 -524 390 -1061 35 311 -82 318 562 -713 -496 -284 -50 -129 -420 -646
6979 -646 127 -747 -575 248 -284 -938 -450 149 -379 104 -551 -635 259 28 -363 0 190 671 -376 565
6999 565 1166 1377 478 -1016 -248 354 91 -228 -443 783 -1383 96 6 18 843 -1189 -1305 -8 1196
7018 1196 301 -28 438 -411 377 -259 -1280 -575 -257 -487 -383 88 -406 44 654 659 -438 19 -366 984
7038 984 -303 69 -609 -423 900 -197 -867 34 188 -386 1036 -156 -209 38 -465 93 -164 -253 58
7057 58 1138 -365 15 -710 -822 145 71 -397 831 -156 641 -341 38 253 762 -1328 452 -429 557
7076 557 249 520 993 346 360 335 -163 -1302 -790 80 -187 1420 323 321 -24 48 -454 -5 842 204 520
7097 520 202 -1185 -253 -644 -95 234 1318 550 920 -556 482 -223 -61 547 -54 -263 -568 1253
7115 1253 -239 -57 -425 108 130 33 587 1138 -602 765 -254 663 -1141 -132 -120 -863 477 948
7133 948 328 -256 49 -300 -814 938 1465 -358 683 -1009 204 -196 180 -53 -1377 322 -822
7150 -822 656 -638 -519 504 -592 713 704 130 -125 -287 14 -432 623 393 565 40 413 -98 -25
7169 -25 339 638 1002 -1223 -231 1737 -96 -135 1075 -861 685 504 184 -916 -1640 -777 -182 -313
7187 -313 731 776 -725 415 -567 -483 534 47 542 136 5 273 -766 -646 114 -463 729 22 -270
7206 -270 -232 180 904 -335 -55 596 1449 -890 -76 -33 -39 -167 309 -477 810 -173 566 -720 -730 -479
7226 -479 -1175 1075 -436 401 -586 335 -512 170 -781 364 373 -8 321 30 -431 684 245 34 1 61
7246 61 167 716 -201 90 1251 -205 -36 -380 -471 349 -124 481 -902 -32 -228 -647 -548 -274 -723 317
7266 317 -65 -305 -815 -324 58 -576 870 -374 -750 -74 -186 538 221 53 -777 45 -497 751 517
7285 517 713 436 1224 61 7 -550 -13 -384 743 -385 479 1423 3 -395 -179 -194 -223 72 1158
7304 1158 179 90 -658 137 1156 600 975 -793 -59 -662 111 -78 230 -563 556 -506 -116 -296 -724
7323 -724 347 663 445 -112 684 -285 -824 -302 42 636 768 363 771 -60 -230 -178 -124 -169 -529 -1328 723
7344 723 629 -558 -246 31 315 629 255 -600 -1061 -122 155 364 403 -244 -1507 115 1180 -620 63
7363 63 -597 -95 -15 6 753 635 315 -688 -359 -149 -161 -496 936 -452 -1329 7 491 -233 -199 -572
7383 -572 335 -821 -248 245 -139 410 458 578 311 -847 -165 224 -416 -106 -810 -116 122 307 48 -313
7403 -313 1203 -183 532 112 -218 -129 221 -388 -1025 271 -410 115 -76 435 266 -114 422 -346 211
7422 211 1928 42 -284 -485 -200 -273 -552 184 -1351 920 50 44 -109 -413 -836 1089 311 -172 -878
7441 -878 -390 -377 -543 356 -376 -37 -205 282 -371 455 -696 -510 -407 883 302 164 -587 196 129 84
7461 84 259 -241 -465 -1255 258 523 281 -187 -375 -1198 -374 -45 -705 332 -479 180 449 662 396 789
7481 789 194 -82 509 -7 -1471 408 -365 502 604 -729 -65 43 -56 -668 209 491 777 -107 -642
7500 -642 154 -109 8 795 -706 -701 1075 1137 307 549 -240 -273 192 -101 -262 -210 -406 756 -433 -257
7520 -257 12 -434 1197 -132 -329 -641 -473 -351 282 -148 -413 -1595 177 -524 -291 -1630 187 571
7538 571 -155 508 214 83 -719 -520 -737 61 377 -127 -536 38 -429 -86 -738 304 -207 -24 -246 -911
7558 -911 338 128 384 609 -350 891 -657 -784 105 684 -475 330 -854 7 35 -1217 -586 -736
7576 -736 260 16 -454 584 -74 676 600 -905 -430 271 281 5 156 -425 -959 -16 -488 -131 654 -616
7596 -616 181 790 -181 143 236 65 -510 326 -445 258 943 -1008 901 -1213 -60 -43 -172 -686 65
7615 65 -83 361 -214 -201 570 -115 -879 58 -564 -505 -666 -139 -388 -1241 -143 562 -15 -376 321 -420 282
7636 282 -541 602 224 106 1003 429 -365 108 717 100 405 -171 700 302 36 413 -818 727 -625
7655 -625 939 32 -760 -1466 -100 15 12 -315 453 163 137 -124 -916 236 -258 -291 -797 367 482 1068
7675 1068 474 71 -638 585 542 560 -9 844 11 -1008 394 -886 237 -757 837 -537 756 211
7693 211 744 381 -818 -14 -67 1007 539 256 -591 542 656 886 -426 591 -598 -91 254 -654
7711 -654 -210 -124 523 476 -493 -65 1059 256 -87 372 147 1023 -676 294 -508 136 484 -765 -451 -477
7731 -477 -275 1124 514 -258 272 1436 48 495 -899 110 -980 308 -337 642 -1144 314 -89
7748 -89 -995 804 -260 -559 1198 453 149 959 -332 -553 -495 -139 126 -251 148 -160 236 -350 -152
7767 -152 91 250 1 145 357 846 923 -652 223 796 -416 505 -212 240 -517 -440 -252 360 -147 -793
7787 -793 -233 -512 -26 -79 518 691 -209 -294 -417 690 -114 -311 1551 -265 1190 324 -1679 1007 1148
7806 1148 499 -710 -137 40 -461 -434 -15 -253 -229 -203 62 379 622 -288 730 158 1944 -205 -387
7825 -387 205 -1223 896 -534 473 832 -464 -1619 -237 -1085 44 -483 -28 -479 -412 -1000 -57 274
7843 274 -381 -157 163 -67 1288 386 1083 -339 -524 31 843 -457 718 896 153 1500 -175 -270
7861 -270 -357 961 1091 403 -509 315 358 152 593 -452 627 207 -62 -622 805 727 -651 -873 -453
7880 -453 174 608 690 143 363 -1150 -311 863 -158 -724 -597 -336 -162 -60 -384 -162 533 -652 -793
7899 -793 -869 248 86 -134 -622 -42 -56 -1034 -1184 982 -853 50 1139 -208 -12 -256 741 92 437
7918 437 206 561 1726 -407 555 -587 -19 125 795 -20 -280 141 568 -546 -256 967 165 121 -790
7937 -790 -1713 14 -522 418 346 345 -291 -723 427 191 356 222 1376 -108 150 257 428 462 -385 -679
7957 -679 395 53 595 -303 -725 -3 -283 859 -227 -612 633 1036 -159 77 -320 -87 -289 82
7975 82 526 -1 281 -181 -325 -229 137 463 88 -772 -558 -97 -154 176 -547 36 -396 281 -516 553 -187
7996 -187 -369 787 -234 347 -117 326 270 708 1048 -88 216 497 596 314 179 127 -650 358 -307 836
8016 836 920 -1090 -125 767 -193 223 132 170 97 77 89 1059 -694 -526 -277 282 806 167 219 911 195 339
8038 339 680 -689 75 121 364 -896 288 -532 -720 783 -741 -445 -525 -184 74 -208 -321 882 551
8057 551 1182 -78 -98 234 90 -626 -360 -279 123 -111 -650 -89 736 -266 -463 248 508 883 391 164
8077 164 -124 -414 -444 283 -8 -152 462 -709 882 -631 -41 278 280 -45 -1628 267 -1053 294 854
8096 854 88 118 877 -694 -163 -236 -152 624 -272 -160 -993 -931 -592 220 949 275 1026 -249 -61 -261 550
8117 550 595 -609 593 -558 1373 -281 217 -1140 -832 -496 419 546 76 -492 155 -283 -1145 40
8135 40 -422 -414 -273 -151 129 -127 -336 -345 -949 397 -889 -282 -664 -131 754 -281 236 -1027 -714 -172
8155 -172 579 -289 466 279 -44 68 -96 197 32 459 118 -325 456 -333 685 769 -104 272 960 384
8175 384 545 745 506 201 -1290 -166 130 -375 -269 84 330 -764 -529 641 -489 -231
8191b31
##END NTUPLES=NMR FID
##END=
